##TITLE=1H_Ser 4645-Van2
 CDCl3, 8 sc, 
 29.1.2020
##JCAMPDX= 6.0         $$ Bruker NMR JCAMP-DX V2.0
##DATA TYPE= NMR FID
##DATA CLASS= NTUPLES
##ORIGIN= UXNMR, Bruker Analytische Messtechnik GmbH
##OWNER= root
$$ XWIN-NMR		Version 3.5
$$ Wed Jan 29 13:52:02 2020 Russian Standard Time (UT+4h)  she@DPX200
##.OBSERVE FREQUENCY= 200.1315
##.OBSERVE NUCLEUS= ^1H
##.DELAY= (6, 6)
##.ACQUISITION MODE= SIMULTANEOUS
##.ACQUISITION SCHEME= undefined
##.AVERAGES= 8
##.DIGITISER RES= 18
##SPECTROMETER/DATA SYSTEM= spect
##.PULSE SEQUENCE= zg30
##.SOLVENT NAME= DMSO
##.SHIFT REFERENCE= (INTERNAL, DMSO, 0, 15.7039)
##AUDIT TRAIL= $$ (NUMBER, WHEN, WHO, WHERE, WHAT)
$$ ##TITLE= Audit trail, XWIN-NMR		Version 3.5
$$ ##JCAMPDX= 5.01
$$ ##ORIGIN= Bruker BioSpin GmbH
$$ ##OWNER= she
$$ F:/spectra/data/she/nmr/H-F/1/audita.txt
$$ ##AUDIT TRAIL=  $$ (NUMBER, WHEN, WHO, WHERE, WHAT)
(   1,<2020-01-29 13:50:38.23 +0400>,<she>,<DPX200>,
      <created by zg, POWCHK disabled, PULCHK disabled
       configuration hash MD5:
       00 E9 B6 7A A2 85 ED C7 34 08 36 98 17 FE 4E 26
       data hash MD5: 16K
       5F 1B D8 93 8A 1D 54 FC D3 56 18 89 69 FF 38 9A>)
$$ ##END=
$$ 
$$ hash MD5
$$ F4 0A 98 23 1B E7 A2 83 A0 92 EF 83 C4 C9 E6 21
##$RELAX= 
##$RELAX= 
##$RELAX= 
##$RELAX= 
##$RELAX= 
##$RELAX= 
$$ Bruker specific parameters
$$ --------------------------
##$DU= <F:/spectra>
##$EXPNO= 1
##$NAME= <H-F>
##$PROCNO= 1
##$TYPE= <nmr>
##$USER= <she>
##$AMP= (0..31)
100 100 100 100 100 100 100 100 100 100 100 100 100 100 100 100 100 100 
100 100 100 100 100 100 100 100 100 100 100 100 100 100 
##$AQSEQ= 0
##$AQ_mod= 1
##$AUNM= <au_zg>
##$AUTOPOS= <>
##$BF1= 200.13
##$BF2= 200.13
##$BF3= 200.13
##$BF4= 200.13
##$BF5= 200.13
##$BF6= 200.13
##$BF7= 200.13
##$BF8= 200.13
##$BYTORDA= 1
##$CFDGTYP= 0
##$CFRGTYP= 5
##$CHEMSTR= <none>
##$CNST= (0..31)
1 1 145 1 1 1 1 1 1 1 1 1 1 1 1 1 1 1 1 1 1 1 1 1 1 1 1 1 1 1 1 1 
##$CPDPRG= <>
##$CPDPRG1= <>
##$CPDPRG2= <>
##$CPDPRG3= <>
##$CPDPRG4= <mlev>
##$CPDPRG5= <mlev>
##$CPDPRG6= <mlev>
##$CPDPRG7= <mlev>
##$CPDPRG8= <mlev>
##$CPDPRGB= <>
##$CPDPRGT= <>
##$D= (0..31)
0 1.2 0 0 0 0 0 0 0 0.06 0 0.03 0 0 0 0 0.0002 0 0 0 0 0 0 0 0 0 0 0 0 
0 0 0 
##$DATE= 1580291437
##$DBL= (0..7)
120 120 120 120 120 120 120 120 
##$DBP= (0..7)
150 150 150 150 150 150 150 150 
##$DBP07= 0
##$DBPNAM0= <>
##$DBPNAM1= <>
##$DBPNAM2= <>
##$DBPNAM3= <>
##$DBPNAM4= <>
##$DBPNAM5= <>
##$DBPNAM6= <>
##$DBPNAM7= <>
##$DBPOAL= (0..7)
0.5 0.5 0.5 0.5 0.5 0.5 0.5 0.5 
##$DBPOFFS= (0..7)
0 0 0 0 0 0 0 0 
##$DE= 6
##$DECBNUC= <off>
##$DECIM= 24
##$DECNUC= <off>
##$DECSTAT= 4
##$DIGMOD= 1
##$DIGTYP= 9
##$DL= (0..7)
0 120 120 120 120 120 120 120 
##$DP= (0..7)
150 150 150 150 150 150 150 150 
##$DP07= 0
##$DPNAME0= <>
##$DPNAME1= <>
##$DPNAME2= <>
##$DPNAME3= <>
##$DPNAME4= <>
##$DPNAME5= <>
##$DPNAME6= <>
##$DPNAME7= <>
##$DPOAL= (0..7)
0.5 0.5 0.5 0.5 0.5 0.5 0.5 0.5 
##$DPOFFS= (0..7)
0 0 0 0 0 0 0 0 
##$DQDMODE= 0
##$DR= 18
##$DS= 0
##$DSLIST= <SSSSSSSSSSSSSSS>
$$ [...]
##$SUBNAM2= <"">
##$SUBNAM3= <"">
##$SUBNAM4= <"">
##$SUBNAM5= <"">
##$SUBNAM6= <"">
##$SUBNAM7= <"">
##$SUBNAM8= <"">
##$SUBNAM9= <"">
##$SW= 24.9337058887773
##$SWIBOX= (0..15)
0 0 2 0 0 0 0 0 0 0 0 0 0 0 0 0 
##$SW_h= 4990.01996007984
##$TD= 16384
##$TD0= 1
##$TE= 0
##$TE2= 300
##$TE3= 300
##$TEG= 300
##$TL= (0..7)
0 120 120 120 120 120 120 120 
##$TP= (0..7)
150 150 150 150 150 150 150 150 
##$TP07= 0
##$TPNAME0= <>
##$TPNAME1= <>
##$TPNAME2= <>
##$TPNAME3= <>
##$TPNAME4= <>
##$TPNAME5= <>
##$TPNAME6= <>
##$TPNAME7= <>
##$TPOAL= (0..7)
0.5 0.5 0.5 0.5 0.5 0.5 0.5 0.5 
##$TPOFFS= (0..7)
0 0 0 0 0 0 0 0 
##$TUNHIN= 0
##$TUNHOUT= 0
##$TUNXOUT= 0
##$USERA1= <user>
##$USERA2= <user>
##$USERA3= <user>
##$USERA4= <user>
##$USERA5= <user>
##$V9= 5
##$VALIST= <valist>
##$VCLIST= <CCCCCCCCCCCCCCC>
##$VD= 0
##$VDLIST= <DDDDDDDDDDDDDDD>
##$VPLIST= <PPPPPPPPPPPPPPP>
##$VTLIST= <TTTTTTTTTTTTTTT>
##$WBST= 1024
##$WBSW= 4
##$XGAIN= (0..3)
0 0 0 0 
##$XL= 0
##$YL= 0
##$YMAX_a= 955161
##$YMIN_a= -486771
##$ZGOPTNS= <>
##$ZL1= 120
##$ZL2= 120
##$ZL3= 120
##$ZL4= 120
##$ABSF1= 10
##$ABSF2= 0
##$ABSG= 5
##$ABSL= 3
##$ALPHA= 0
##$AQORDER= 0
##$ASSFAC= 0
##$ASSFACI= 0
##$ASSFACX= 0
##$ASSWID= 0
##$AUNMP= <proc_1d>
##$AZFE= 0.1
##$AZFW= 0.1
##$BCFW= 1
##$BC_mod= 2
##$BYTORDP= 1
##$COROFFS= 0
##$CY= 11.3945322036743
##$DATMOD= 1
##$DC= 2
##$DFILT= <>
##$DTYPP= 0
##$F1P= 16.9975609425685
##$F2P= -3.02152046262296
##$FCOR= 0.5
##$FTSIZE= 0
##$FT_mod= 4
##$GAMMA= 1
##$GB= 0.15
##$INTBC= 1
##$INTSCL= 1
##$ISEN= 128
##$LB= 0.24
##$LEV0= 0
##$LPBIN= 0
##$MAXI= 10000
##$MC2= 0
##$MEAN= 0
##$ME_mod= 0
##$MI= 1.114404
##$NCOEF= 0
##$NC_proc= 0
##$NLEV= 6
##$NOISF1= 3.799351
##$NOISF2= 2.8
##$NSP= 1
##$NTH_PI= 0
##$NZP= 0
##$OFFSET= 15.70392
##$PC= 1
##$PHC0= -9786.798
##$PHC1= 11.20081
##$PH_mod= 1
##$PKNL= yes
##$PPARMOD= 0
##$PSCAL= 0
##$PSIGN= 0
##$REVERSE= no
##$SF= 200.130013532006
##$SI= 16384
##$SIGF1= 3
##$SIGF2= 2
##$SINO= 400
##$SIOLD= 16384
##$SREGLST= <1H.CDCl3>
##$SSB= 0
##$STSI= 0
##$STSR= 0
##$SW_p= 3612.71676300578
##$SYMM= 0
##$S_DEV= 0
##$TDeff= 0
##$TDoff= 0
##$TI= <>
##$TILT= no
##$TM1= 0
##$TM2= 0
##$TOPLEV= 0
##$USERP1= <user>
##$USERP2= <user>
##$USERP3= <user>
##$USERP4= <user>
##$USERP5= <user>
##$WDW= 1
##$XDIM= 8192
##$YMAX_p= 0
##$YMIN_p= 0
$$ End of Bruker specific parameters
$$ ---------------------------------
##NTUPLES= NMR FID
##VAR_NAME=  TIME,          FID/REAL,        FID/IMAG
##SYMBOL=    X,             R,               I
##VAR_TYPE=  INDEPENDENT,   DEPENDENT,       DEPENDENT
##VAR_FORM=  AFFN,          ASDF,            ASDF
##VAR_DIM=   8192,          8192,            8192
##UNITS=     SECONDS,       ARBITRARY UNITS, ARBITRARY UNITS
##FACTOR=    0.0002004,     1,               1
##FIRST=     0,             0,               0
##LAST=      1.6414764,     0,               0
##MIN=       0,             -486771,         0
##MAX=       1.6414764,     955161,          0
$$ Real data points
##PAGE= N=1
##DATA TABLE= (X++(R..R)), XYDATA
$$ [...]
2062B993M78k582k612j2L030K005n01k101j367N09J329m5k09L57R18q71k299j043
$$ 2993 3471 889 -1723 -1735 1295 3300 2799 698 -669 -160 1169 1124 915 1272 2190 1319 -980 -2023
2080b023J123L172J377j705k809p46J240J527j22m86N27j93r00j300P62K744J500
$$ -2023 -900 2272 3649 1944 -865 -1611 -371 1156 1034 548 1075 882 -18 -1318 -556 2188 3688
2097C688j325l226j343J424K447N79r82r44j32j3o42j55J230J353n56k303k038
$$ 3688 2363 -863 -2206 -782 1665 2244 1262 318 186 173 -469 -624 606 1959 1403 -900 -2938
2114b938J211K371J350j078k277m75L91M40nk93J164J109j035k181q12K133K210
$$ -2938 -1727 644 1994 916 -1361 -1836 -1445 -1005 -1010 -1303 -139 970 -65 -2246 -3058 -925 1285
2131A285k8j670k049L57J523J217j53m12M70k83j511q79J121K049J837k136k308
$$ 1285 1257 -413 -2462 -2105 -582 635 482 70 540 257 -1254 -2133 -1012 1037 2874 738 -1570
2148a570o61J920J997R8j375o42p1P66n31m0J519J043j0k274j423J262J834J032
$$ -1570 -2231 -311 1686 1784 409 -233 -304 462 -69 -109 1410 2453 2443 169 -1254 8 1842 2874
2166B874j045j540O8O26J48j49j37J093N63j838j456j92J733J948k04j696j385
$$ 2874 1829 289 357 983 1131 982 845 1938 2501 663 -793 -985 748 2696 2492 796 -589
2183e89K77J030M33m55J83j5k91j025m79J291J988J17j628k180j99J708J505l58
$$ -589 -312 718 1151 696 879 864 573 -452 -931 360 2348 2465 837 -1343 -1542 166 1671 1313
2201A313r47l85K74K95r19j60R85O14j85j538j436J282J816L16n50j192p4J11
$$ 1313 366 -19 255 550 -369 -529 456 1070 885 -653 -2089 -807 1009 1325 775 -417 -491 -380
2219c80n1n30M07J426N31j433j818J72K166J413p20j861q85O75R65J75j82K14
$$ -380 -431 -961 -554 872 1403 -30 -1848 -1676 490 1903 1183 -678 -1563 -888 77 252 70 284
2237B84M90r85j517r0J160J581J53j602j445N00J649N61p07q74L69O06n59p84
$$ 284 774 -211 -1728 -1818 -658 923 1076 -526 -1971 -1471 178 739 32 -842 -473 133 -426 -1210
2255a210K21J381J327m45j700q03R52J119O8j34n98J90L6m55j88J104Q98J81j835
$$ -1210 -989 392 1719 1274 -426 -1229 -277 842 910 776 178 368 404 -51 -239 865 1763 1944 109
2274A09j864N02K141J139p54j428p26P54O91k84n28O28N58n74j398L6J116J616
$$ 109 -1755 -1253 888 2027 1273 -155 -881 -127 564 280 -248 380 938 364 -1034 -998 118 1734
2292A734r8j248j093K36J176l6j70p3Q90L14j136j058m2J903P00l63k042n66N22
$$ 1734 1636 388 -705 -469 707 671 501 428 1318 1632 496 -562 -604 1299 1999 1636 -406 -972 -450
2311d50J497K92j27o02j42n15n52K61J123R78l73j244j088N05J725Q09r75r26
$$ -450 1047 1339 1212 610 468 -47 -599 -338 785 1763 1390 146 -942 -437 1288 2097 1122 196
2329A96l91L35O27j43J59N14J22n02j391k74Q50J191M95j496p83P5O87J50j16
$$ 196 -195 140 767 624 783 1297 1419 917 -474 -748 102 1293 1788 292 -491 -416 271 421 305
2348C05K43L11k59j035j192Q09J728R91j055j861p84J358J234J27n88j79j89m17
$$ 305 548 859 600 -435 -1627 -818 910 1901 846 -1015 -1799 -441 793 920 332 153 -36 -453
2366d53k08N34R57N86q78j405j359J210J763M03n92r11J97q9J84k28K29P42L10
$$ -453 -661 -127 830 1416 538 -867 -2226 -1016 747 1150 558 -353 -156 -245 -61 -289 -60 682 992
2385I92j083o68j22J160J298r7j148j421N11M18L69K82N13Qq31j080P2J026J464
$$ 992 -91 -759 -881 279 1577 1480 332 -1089 -578 -160 209 491 1004 1012 181 -899 -827 199 1663
2404A663K17j468j551M1J307J156n4m19m77j31q63J1Q55J061K35o78j099m34P98
$$ 1663 1880 412 -1139 -1098 209 1365 1311 892 415 284 -579 -568 287 1348 1583 905 -194 -628 170
2423A70J436J53q71q55k9K65j84J99Q31M00j07j357j347O28J325O45l78j265n89
$$ 170 1606 1759 888 33 4 269 85 284 1115 1515 1408 51 -1296 -668 657 1302 924 -341 -930
2442i30M04N14P28J72J43j89j010j055N51J229J595L0j510j236K94J003P92J39
$$ -930 -526 -12 716 888 1031 842 -168 -1223 -672 557 2152 2182 672 -564 -270 733 1525 1664
2460A664o56l35k76j88K94M87R44J50j286j512j21J131J125K80j048o29J17k32
$$ 1664 1008 673 397 209 503 990 1934 2084 798 -714 -835 296 1421 1701 653 24 141 -91
2478i1J31r0L04J054o75j200j113P37J837Q14m78j861m91K97O95O12J99L30n10
$$ -91 40 -50 254 1308 633 -567 -1680 -943 894 1708 1230 -631 -1122 -825 -130 482 681 1011 501
2497E01j158k44R1J270J374r42j421j107P36J179L94k94k54l15j70j37k8O98R46
$$ 501 -657 -901 -810 460 1834 892 -529 -1636 -900 279 673 379 125 -190 -360 -497 -525 173 1119
2516A119k62n99r22k58J056P39K15q94R1n80J83N9K11N87Q24r57j236l32P33J392
$$ 1119 857 258 -664 -922 134 873 1088 194 285 -295 -112 -53 158 745 1569 612 -624 -956 -223 1169
2536A169R1n65q93n43L56P22L54Ok72l74q78k83M45J346L97p28q45o28Q34O60
$$ 1169 1260 695 -198 -741 -385 337 691 697 425 51 -827 -1110 -665 681 1078 350 -495 -1123 -289 371
2556C71N29o53j12l50L88l05L7O50O06j50j059o79K4J191O55o19L9k68r2j36p1
$$ 371 900 247 135 -215 173 -132 -95 555 1161 1011 -48 -727 -703 488 1143 524 563 295 203 67 -4
2577dN84O99k1j333o21p4J181J319j19r89p03k63K17P66J7j41J47l25p55k4O47
$$ -4 580 1279 1258 -75 -696 -770 411 1730 1611 622 -81 -344 -127 639 656 515 662 337 -418 -442 205
2598B05P75L7q35q11j60Q69P32m27J37j46m99J63m14oO30L25L54r72p70K13J234
$$ 205 980 1017 182 -629 -789 80 812 385 522 376 -123 40 -374 -380 250 575 929 -43 -813 -600 634
2619F34J04R7p30l61j67Q6J2K34O81R3j101q35K46J010Q86m21r54o67L80N38M81
$$ 634 738 835 105 -256 -423 -337 -325 -91 590 683 -418 -1253 -1007 3 889 468 -486 -1153 -773 -235 246
2640B46j77r8J12l59n02l93O48J126m2m46n88R2M4N53J35k92K1N4k80m26O70N07
$$ 246 69 -29 83 -276 -778 -1171 -523 603 561 115 -473 -381 -337 216 351 59 80 134 -146 -572 98 605
2662F05P22m28j123n12L55P40M19K9m06m65q0j57L77N21L78l96o65n38K09R25
$$ 605 1327 899 -224 -736 -381 359 778 807 401 -64 -144 -301 76 597 975 579 -86 -624 -415 510
2682E10O22k84o89n10L11L83k00K01j13J32R1o25j28N49L00o5k90j15j14K40k8
$$ 510 1132 848 159 -351 -40 343 143 344 231 363 454 -171 -299 250 550 485 195 80 -34 206 178
2703A78m8M68J43k50o72o86M95J155K54m21o33k19L9Q50J02L3l01k82k78l41M23
$$ 178 130 598 741 491 -181 -867 -372 783 1037 616 -17 -236 -197 653 755 788 487 205 -73 -414 9
2724IP10J28j64p30n21N1O42K54k49m63k6K28p4j65L68M1pn9o71k3K56N34K92
$$ 9 719 847 683 -47 -568 -517 125 379 130 -333 -359 -131 -205 -370 -2 39 32 -27 -698 -721 -465 69 361
2747C61k49o42k06K70J31J9N37L9j78o23m05L89J196L69o10j040n32O31P37J29
$$ 361 112 -530 -736 -466 -335 -316 221 260 82 -541 -946 -557 639 1008 398 -642 -1174 -543 194 323
2767C23l49Rk00l24L91l5M97K76k72o51m33L29R49J1L2l84P3O0j74m45N22O06
$$ 323 -26 -17 -217 -541 -150 -185 312 588 316 -335 -768 -439 510 521 553 169 242 302 128 -317 205 811
2789H11o3l19m11l1K37O00R9m87m13m64K28M74L24J33p2l27n55j51L07P29K21
$$ 811 748 429 18 -13 224 824 923 436 23 -441 -213 261 585 718 646 319 -236 -387 -80 649 870
2810H70o87m37k35J000J96J90l45nn30Q0J6K39L82K49l75j36o45K08L80K56j11
$$ 870 183 -254 -489 511 707 897 552 547 17 97 113 352 734 983 608 472 -173 35 415 671 560
2831E60k81J5m35K8L3L84M56o7m99q16l11R00P41k08n01k36n43M45O29O2J82l96
$$ 560 279 294 -141 -113 -80 304 760 693 194 -622 -933 -33 708 500 -1 -237 -780 -335 294 356 538 142
2853A42l26o42L99M68P20o9m92r00p3N02M31Jk84m8o3m05L01J43M48J21l80n95
$$ 142 -184 -826 -427 41 761 692 200 -700 -773 -271 160 161 -123 -171 -234 -639 -338 -195 253 374 -6 -601
2875f01k00K31O28K06L9l94l66L7l78L98O44J64o9q14m96J72J193M01k11n83p39
$$ -601 -801 -570 58 264 303 -91 -457 -420 -798 -400 244 408 339 -475 -971 -799 394 795 584 1 -738
2896g38J87M41M34N6M08m69o71n41K90Q74N52j24o70n68J3Q07J49L20k83m31p9
$$ -738 -551 -110 324 380 788 319 -352 -893 -603 271 823 699 29 -539 -526 281 430 750 467 36 -43
2917d3n26K89l4J119k02j47n52p71P95N26K88k08m83l78P3J88N49K52M51k25p91
$$ -43 -569 -280 -314 805 603 456 -96 -867 -72 454 742 534 51 -327 -254 -66 483 735 1186 961 170
2938A70n36K82R08P40n97m54l88o7M23n0M56l6l61o45j42K34P93O68n90n29o71
$$ 170 -366 -84 824 1564 967 513 125 58 481 431 887 851 490 -155 -297 -63 730 1398 808 279 -392
2959c92L0L93K24o9L40l99l24l40j40P94M06O2o67l80m10O65O01J11k61o27j09
$$ -392 -362 31 255 186 526 127 -197 -537 -677 117 523 585 -82 -462 -872 -207 394 505 244 -383 -492
2980d92l9k6P47M95m40m86n37j75M54Q99J43o16q03N4n7M86K00L50l11j21m82
$$ -492 -531 -557 190 685 245 -241 -778 -953 -499 400 543 -73 -876 -822 -879 -393 -193 157 -154 -275 -757
3001g57p2L89M37J71k43m86k41J53M08L45l1k4m38j49q0K11K94P54J01r31k24
$$ -757 -829 -440 -3 168 -75 -561 -802 -649 -241 104 73 49 -389 -538 -618 -407 -113 641 742 -189 -413
3022d13l2O41M25j03j02o45j65k16N46L76J76O0o91p64O05K20Q71m55m98k25j3
$$ -413 -445 196 621 518 416 -229 -394 -610 -64 312 488 548 -143 -907 -302 -82 789 334 -164 -389 -402
3043d02L47M30j60n7l10k0k2k43M90P2N57k58p19j26M19K20J79k24n4n31L82k08
$$ -402 -55 375 215 158 -152 -172 -194 -437 53 125 682 424 -295 -421 -2 218 397 173 119 -412 -30 -238
3065b38J42N51M2p9o55m75K23Q03L72l0n15O0m72N7L96L45K53m81k53l98N03L64
$$ -238 -96 455 497 418 -237 -712 -489 314 686 656 141 201 -271 -214 182 527 780 299 46 -352 151 515
3087E15L26k37l52m07L56m10M17L8m5K38m20j39j4J75K08k29j54m28J47J84K99
$$ 515 841 604 252 -155 201 -209 208 246 201 439 19 -120 -134 41 249 20 -134 -562 -415 -231 68
3108F8M4J72l45l28j86j27O0P30J83l10n85k63L55P58J63k43m78jn7J32K13N13
$$ 68 112 284 -61 -389 -575 -702 -642 88 271 -39 -624 -887 -532 226 389 146 -332 -333 -390 -258 -45 468
3130D68k25k67j35j93N7J62M98o65K72j37L6J05K8n8o2K16k45k33l2J68M28O8
$$ 468 243 -24 -159 -352 -295 -133 365 -300 -28 -165 -129 -24 4 -54 -116 100 -145 -378 -410 -242 186 254
3152B54r5p95Q9J7L78lQ8o6l38l91N68N72j31K38m10m54k6L93J61M51l45l06J01
$$ 254 159 -636 -547 -530 -152 -155 -67 -133 -471 -862 -294 278 147 385 -25 -479 -505 -112 49 500 155 -151 -50
3175e0q8j39K70K52j04K19n42p3K2L56m7m6j84R6n6j11j38j17P86j72k36l68J33
$$ -50 -138 -277 -7 245 141 360 -182 -255 -233 123 76 30 -154 -58 -114 -225 -363 -480 306 134 -102 -470 -337
3198c37L39J42K75n00j54Q8m6N06L6M6k59o3r2L9P7K29M14o88r3j78J17K89N2
$$ -337 2 144 419 -81 -235 -147 -193 313 349 395 136 73 -19 20 97 326 740 52 -41 -219 -102 187 239
3221B39k62M8j76m6J45J16K50j25N3j22m50K83q1R4p6L94m46J26j57qN95k25K18
$$ 239 -23 25 -151 -197 -52 64 314 189 242 120 -330 -47 -128 -34 -110 284 -162 -36 -193 -201 394 169 387
3244C87n44k7r0J43M14K19k53l88k55L0M06j22J73j92k50PK30J29J82k4j95m36
$$ 387 -157 -184 -274 -131 283 502 249 -139 -394 -364 42 -80 93 -99 -349 -342 -112 17 199 175 -20 -456
3266d56l76P16q2N21j59j99P2l84lj19M91Q5j10r7k82J21L07k57M54l41j52m69
$$ -456 -832 -116 -198 323 164 -35 37 -347 -350 -469 22 107 -3 -100 -382 -261 46 -211 243 -98 -250 -719
3288g19J25P6O72j23j29m55o1k85N72N96j83m63RK6J10O2L15Q7l95L0j20p5J65
$$ -719 -594 -518 154 31 -98 -553 -614 -899 -327 269 86 -377 -368 -342 -232 -170 145 232 -163 -133 -253 -328 -163
3311a63L84m85J0k08O8K97r1L18Ro4k60k6%K56J92L51k43n66mJ9L43QJ47J03o00
$$ -163 221 -264 -254 -462 -394 -97 -188 130 139 75 -185 -211 -211 45 237 588 345 -221 -225 -206 137 145 292 395 -205
3336b05P8L94Q1l1L13m91J04o44O05K48M8o4l71j71K2k41M01J99J9q2l44Q4J71
$$ -205 -127 267 348 317 630 139 243 -401 204 452 500 436 65 -106 -84 -325 76 275 294 212 -132 -48 123
3359A23P6J61j73K5k94k01q2K61N44J8k43l06j50k23M06N6L53m22l22j38P8M65
$$ 123 199 360 187 212 -82 -283 -365 -104 440 458 215 -91 -241 -464 -58 -2 351 -71 -393 -531 -453 12
3381A2N05q1n01k06k49J60O6N35M5l54j98m21N40J51k0m4o49K98J77j07j28L83
$$ 12 517 436 -65 -271 -520 -360 -294 241 286 -68 -266 -687 -147 4 -16 -60 -709 -411 -234 -341 -469 -86
3403h6l5J97j26n89K74J0N67p8l63j70J7L11kM2J45J15q07O9J14P7R05j73l08
$$ -86 -121 76 -50 -639 -365 -355 212 134 -229 -399 -382 -71 -73 -31 114 229 -578 -509 -395 -318 587 414 106
3426A06l50l40K57L81L04k25m02l02K28J43M63j20K14k09q51J50j06O39M24o5
$$ 106 -244 -584 -327 54 358 133 -269 -571 -343 -200 263 143 357 148 -703 -553 -659 -20 404 339
3446C39m33j87K50o8Q4K0K89k45n38J17L18L45J32lm03k71j39M62K76j43K75m95
$$ 339 -94 -281 -31 -99 -15 5 294 49 -489 -372 -54 291 423 420 17 -254 -393 69 345 202 477 -18
3468a8k66j69M48M34J87l55m45l31Q0K98P12k26k65m64J51o0J65J47n7K1Pk80
$$ -18 -284 -453 -5 429 616 261 -184 -515 -435 -137 575 349 84 -380 -229 -289 -124 23 -34 -13 -6 -286
3490b86o0L39N18k33m08p7p6k76L65K06J69j29l6m59qK75L90j59R5n24q6J54M2
$$ -286 -346 -7 511 278 -130 -207 -283 -559 -194 12 181 52 16 -443 -451 -176 214 55 150 -374 -460 -306 -264
3513b64M83Nj35o56k04J87M39L21M0m08j71m03J78L57M90l6m86l5n8J14K47l4
$$ -264 219 224 89 -567 -771 -584 -145 176 216 -192 -363 -766 -588 -231 259 223 -263 -298 -356 -242 5 -29
3535b9L14k84j47l21M94j2J00K78k3l84l20j87K07P03k50J67l13p30O08KM53L24
$$ -29 285 1 -146 -467 27 15 115 393 370 -14 -334 -521 -314 389 139 306 -7 -737 -129 -127 326 650
3557F50m52l15l19K81L09n7M39l15j97k44L48l7L75k20Q3j53m33L96O8L07J21
$$ 650 198 -117 -436 -155 154 97 536 221 24 -220 128 91 466 246 329 176 -257 139 207 514 635
3578F35k37n65R3K50R1Q6nl20J06l06k1M62j73L04k2n83M1l7K66J85J32j93q0
$$ 635 398 -167 -74 176 267 353 348 28 134 -172 -193 269 96 400 378 -205 -164 -201 65 250 382 189 109
3601A09m66p5O45J82j50l15m1m8j11K49L32J89n18l08j67K53K25J08k22J47l81
$$ 109 -357 -432 213 395 245 -70 -111 -159 -270 -21 311 500 -18 -326 -493 -240 -15 93 -129 18 -363
3622c63j18K19P8J08j35N1j09J11k13K37Q1J61j5m43n3K66M6L58k87k21K13k65
$$ -363 -481 -262 -184 -76 -211 -160 -269 -158 -371 -134 -53 108 93 -350 -403 -137 -91 267 -20 -241 -28 -293
3644b93q6M41O9J81j62o07P8K54pN88m45j62J81k76J38J53K76j35l68Oj42L03
$$ -293 -379 62 131 312 150 -457 -379 -125 -132 456 11 -151 30 -246 -108 45 321 186 -182 -176 -318 -15
3666a5j14K94M7k30J09m07M57j44J52p4J2j71q7P7j57N0L28K38k33o2q1J24QK75
$$ -15 -129 165 212 -18 91 -316 141 -3 149 75 87 -84 -171 -94 -251 -201 127 365 132 70 -11 113 121 396
3690C96p2l36j52J49j11L06J55k83l47J27J50O2J51k20j84j7K54l50M30J38k35
$$ 396 324 -12 -164 -15 -126 180 335 52 -295 -168 -18 44 195 -25 -209 -226 28 -322 108 246 11
3711A1j05k10O1J21j09j03K28P7l79K24P5K07k10j55K13r4k51Rj33Q20n3O4n37
$$ 11 -94 -304 -243 -122 -231 -334 -106 -29 -408 -184 -109 98 -112 -267 -54 -148 -399 -390 -523 297 244 308 -229
3734b29r3j69M42Q0nj59o4j44k9N22o2k77J43q4k69K71J98J96m6o3m77K63J30
$$ -229 -322 -491 -49 31 26 -133 -197 -341 -370 152 90 -187 -44 -128 -397 -126 72 268 222 159 -318 -55 75
3757G5k93K5L76Kl17n43M70M0K74q2J93n16J07K28j12M26Nj54m52J33k23K24M02
$$ 75 -218 -193 183 185 -132 -675 -205 -165 109 27 220 -296 -189 39 -73 353 358 204 -248 -115 -338 -114 288
3780B88j22K0j79m31M49J29J31L02r10M71r5k18J6P9K28J47j25m28M55k50K6j57
$$ 288 166 186 7 -424 25 154 285 587 -323 148 53 -165 -149 -70 158 305 180 -248 207 -43 -17 -174
3802a74K27l96L19Q9j56K73J29j85l46j72j58L41M8K18n9k49K5N1P6L97l0n8k77
$$ -174 53 -343 -24 65 -91 182 311 126 -220 -392 -550 -209 -161 57 -2 -251 -226 -175 -99 298 268 210 -67
3825f7q6N3o8M74k05l32P1l74R7K73K09Q4k37o4j5K78qR7k1j37l31K81Q1J76J2
$$ -67 -153 -100 -168 306 101 -231 -160 -534 -437 -164 45 129 -108 -172 -187 91 83 180 159 22 -309 -28 53 229 241
3850B41j75K07l00J36m68J70K94K40m2k68l68k19P61ml17L13l40J69j39J27L18
$$ 241 66 273 -27 109 -359 -189 105 345 303 35 -333 -552 209 205 -112 201 -139 30 -109 18 336
3871C36q8j06l45K7J40K54K04l41O3j21J67q0J0M38l71J41k28m23R5N76k71M24
$$ 336 248 142 -203 -176 -36 218 422 81 144 23 190 110 120 558 187 328 100 -323 -228 348 77 501
3893E01m33k70K9K93n7N1J14l68K03l06J99L13kJ86j19n86j99K60M1K71L5m22
$$ 501 68 -202 -173 120 63 114 228 -140 63 -243 -44 269 267 453 334 -252 -451 -191 -150 121 156 -266
3915b66l53K77k1O73j26Ll19q6j6RJ39o9K37n35K86k55n7L37n1L22n50K09k2J45
$$ -266 -619 -342 -363 310 184 187 -132 -218 -234 -225 -86 -155 82 -453 -167 -422 -479 -142 -193 129 -421 -212 -234 -89
3939h9p9J66K03j29n33J74r8L89L22Nk78m61J70Q0m1M14q2j84Q5p5J41J35o6K24
$$ -89 -168 -2 201 72 -461 -287 -385 4 326 331 53 -408 -238 -158 -199 215 133 -51 34 -41 100 235 169 393
3963C93k84m32Q5L10L04O2j63j85k51j6K45J90k57L01l33k90L29P7J30R7j2r9
$$ 393 109 -323 -238 72 376 438 275 90 -161 -177 68 258 1 302 -31 -321 8 85 215 312 300 201
3985B01k08LR5nK40K70l35m26R6K95k24j42J76J90m04k4J26M65j27j58k09l5O3
$$ 201 -7 -4 91 86 326 596 261 -165 -69 226 2 -140 36 226 -178 -202 -76 389 262 104 -105 -140 -77
4008g7L47k36K47j20j27r8r9J20K68l3o5nj27m57K95K86L2L08m47l87O0L31R0
$$ -77 270 34 281 161 34 -64 -163 -43 225 192 127 122 -5 -462 -167 119 151 459 12 -375 -315 16 106
4031A06J35k78p1j56lk6n9N66o4m11j52k17L21M62N9m10J5l28O0L41M06k67q0
$$ 106 241 -37 -108 -264 -267 -293 -352 214 150 -261 -413 -630 -309 153 212 -198 -183 -511 -451 -110 296 29 -51
4054e1J4l64J23L58k30N5Q7n30K03J57K91p8J66k19j70J5J43k5J90l68L65r1m44
$$ -51 -37 -401 -278 80 -150 -95 -8 -538 -335 -178 113 35 201 -18 -188 -173 -30 -55 135 -233 132 41 -403
4077d03M58J3j42L70k71j69Q4j99N2M14k97l9L72l44o4J90L76k95O6k85K18j96
$$ -403 55 68 -74 296 25 -144 -60 -259 -207 207 -90 -129 243 -101 -165 25 401 106 172 -113 105 -91
4099i1K16L4K08J83n18j88j02L36N2j4J77k89o4Ok5M42o1l31K17l19OJ95M8p2
$$ -91 125 159 367 550 32 -156 -258 78 130 116 293 4 -60 -54 -79 363 302 -29 188 -131 -125 70 118 46
4123D6K75j03k75j59J64K10m6j85L09k89j37L31K27m5k17L8j08q2J51j10O3j28
$$ 46 321 218 -57 -216 -52 158 112 -73 236 -53 -190 141 368 323 106 144 36 -46 105 -5 58 -70
4145g0Qr7J68j9K26l73K74l43J17M38k72Q0k35J27J41q1k50J99j97R3J94q7k52
$$ -70 -62 -159 9 -10 216 -157 117 -226 -109 329 57 137 -98 29 170 89 -161 38 -159 -66 128 41 -211
4168b11l0K01J40pj91k29J14l9K30J58r9O1j68j84J48j04K55J24n00N2K16P2L9
$$ -211 -241 -40 100 93 -98 -327 -213 -252 -22 136 37 98 -70 -254 -106 -210 45 169 -331 -279 -63 9 48
4191D8j44J58j92Q6l39MM94m7K76k68j80j10K93j45LK12Q0m64O1j47M02J56k58
$$ 48 -96 62 -130 -44 -383 -379 115 68 344 76 -104 -214 79 -66 -63 149 229 -235 -174 -321 81 237 -21
4214b1M12k73j95j39K71K85j49L0o70M24j09K94J70k22j76j37J65j70K62j76K91
$$ -21 391 118 -77 -216 55 340 191 221 -449 -25 -134 160 330 108 -68 -205 -40 -210 52 -124 167
4235A67Mj12Kl48L42J09k39K02l59K04j68J74R0J0r0N2k37K50j47J14J37Q5j34
$$ 167 171 59 61 -287 55 164 -75 127 -232 -28 -196 -22 68 78 -12 40 -197 53 -94 20 157 242 108
4258A08l7k24L7L06M3j14j36J36Q8Q3k57J85j53k10O0j71N27J28k68o5K18k88
$$ 108 71 -153 -116 190 233 119 -17 119 207 290 33 218 65 -145 -85 -256 271 399 131 66 284 -4
4280dj69K19j06n8K9N9k59O41j98j24o1n9M9p5P5J98n6Or4N4K17n59L44P1k48
$$ -4 -173 46 -60 -118 -89 -30 -289 352 154 30 -31 -90 -41 -116 -41 157 101 107 13 67 284 -275 69 140 -108
4305a08K54j50j34j22%L29J60l77j38JK23j3K2J13k81j98K81p5K40Q5p6n4l45
$$ -108 146 -4 -138 -260 -260 69 229 -148 -286 -285 -62 -75 -53 60 -221 -419 -138 -213 27 112 36 -18 -363
4328c63M27J5J9J2j17oJ5l00K87J32j49K45j57J69l26l06K52n8o8K15j72N0P5
$$ -363 64 79 98 110 -7 -13 2 -298 -11 121 -28 217 60 229 -97 -403 -151 -209 -277 -62 -234 -184 -109
4351a09l3L60k0k9k78j04J71j6j45M22k23M3j61J07J59j91K0k5j9M6J54R8l9j53
$$ -109 -142 218 198 169 -109 -213 -42 -58 -203 219 -4 39 -122 -15 144 -47 -27 -52 -71 -25 129 227 188 35
4375C5J45j32J73l74M53p4l82K21r4K8l14K97L5J74Q1l65L66p6k0K16j43O0k84
$$ 35 180 48 221 -153 300 226 -156 65 -29 -1 -315 -18 17 191 272 -93 273 197 177 393 250 310 26
4398B6Kk4L01J85l49P3k58L1K4J30K86k72R4k26r3Q4n9L51j58k50N7jJ83k18J58
$$ 26 28 4 305 490 141 214 -44 -13 11 141 427 155 249 23 -70 14 -45 306 148 -102 -45 -46 137 -81 77
4423G7j86r0j41L05k19L78J53l77j1l4q1l9J59j08J20m9J59m87K38P1J44J76r7
$$ 77 -109 -199 -340 -35 -254 124 277 -100 -111 -145 -226 -265 -106 -214 -94 -143 16 -471 -233 -162 -18 158 61
4446F1l49K28m5j23K60M3j75k07Nr4M02j15K35k38j53J73k8J52j18j7k20n5L32
$$ 61 -288 -60 -105 -228 32 75 -100 -307 -302 -396 6 -109 126 -112 -265 -92 -120 32 -86 -103 -323 -378 -46
4469d6k31J02j0J1L43l37N0l2J0K09J65k86J70j10k31K50L50k18j22K22P0j67
$$ -46 -277 -175 -185 -174 169 -168 -118 -150 -140 69 234 -52 118 8 -223 27 377 159 37 259 329 162
4491A62q8M17l52O5j20j46J84O2j06K7k69J98q0L1K57K64n94k0j7L08j67K04J
$$ 162 74 491 139 204 84 -62 122 184 78 105 -164 34 -46 -15 242 506 -88 -108 -125 183 16 220 221
4514B21k75M2j08K08K07m18K40R8m8k96j0J17J73k37J81k16k72J81M13J85m66
$$ 221 -54 -12 -120 88 295 -123 117 215 167 -129 -139 -22 151 -86 95 -121 -393 -212 201 386 -80
4535h0J4r9K54m33K56J15R9o2n10L45J11L5o9j40K34l62p9J24J95j60K85k15J16
$$ -80 -66 -165 89 -344 -88 27 126 64 -446 -101 10 45 -24 -164 70 -292 -371 -247 -52 -212 73 -142 -26
4558b6J62m89L09j61K81l69J83J78k49k79L16O5j64q2L06j18j20l4K21K27m91
$$ -26 136 -353 -44 -205 76 -293 -110 68 -181 -460 -144 -79 -243 -325 -19 -137 -257 -291 -70 157 -334
4579c34J42N3J46K3k2lk00r8O01k22K39Ll44L3j76L88l46J14l3J24k5J1l25K72
$$ -334 -192 -139 7 30 8 5 -195 -293 308 86 325 328 -16 17 -159 229 -117 -3 -36 88 63 74 -251 21
4603B1J95j55j47L10m64K90M7k50M91k24r1K74m63M34K20m98Q2L40N6m32kJ20
$$ 21 216 61 -86 224 -240 50 97 -153 338 114 23 297 -166 268 488 -10 72 412 468 36 34 154
4625A54J35j24j69J38j26j0R1J81K11l37l73M12n3l29K94L5J7j61J3NR6o3qOJ34
$$ 154 289 165 -4 134 8 -2 89 270 481 144 -229 183 130 -199 95 130 147 -14 -1 4 100 37 29 35 169
4650A69O3j24j06J4K5K42n14O7K72J75p9k84K38O2n03L42j85m9J70k93L75k50
$$ 169 232 108 2 16 41 283 -231 -164 108 283 204 -80 158 220 -283 59 -126 -175 -5 -298 77 -173
4672a73J35Mj01J2k22J38L33k74K14K4k53J22j48R8K8K1j05k0J19l14K16N4m5
$$ -173 -38 -34 -135 -123 -345 -207 126 -148 66 90 -163 -41 -189 -91 -63 -42 -147 -167 -48 -362 -146 -92 -137
4695a37o4N49k29ol56K39k08J38J88J85o10oL64J67J1l51K46j91Jj24K43Q8l24
$$ -137 -201 348 119 113 -243 -4 -212 -74 114 299 -311 -317 47 214 225 -126 120 -71 -70 -194 49 137 -187
4718a87L29L2l15J20n2L20k01j53K23Q2l09L26m5k02K95j84j46l20K63K02rp3
$$ -187 142 174 -141 -21 -73 247 46 -107 116 198 -111 215 170 -32 263 79 -67 -387 -124 78 69 -4
4740dK71j89k70K10N49n43k20n9J52J24Jl6J41nl8k79L94m9k77k4J88n4j0K8q3
$$ -4 267 78 -192 18 567 24 -196 -255 -103 21 22 -14 127 122 84 -195 199 150 -127 -151 37 -17 -27 1 -82
4765h2K98k43k66K66K2l8J82p0N6k88PK88o2j50K30j89k1K86l48r4J47J46j77
$$ -82 216 -27 -293 -27 -5 -43 139 69 125 -163 -156 132 70 -80 150 -39 -60 226 -122 -216 -69 77 -100
4788a00j09L14l01L56r0j43L83k73k45K31J98j30p1J11m74R3K32M6J13O3k63k44
$$ -100 -209 105 -196 160 70 -73 310 37 -208 23 221 91 20 131 -343 -250 -18 28 141 204 -59 -303
4810c03L15n5L4J0Q8O0j57n6M6k23P4L57r1k40J63J01k85N4K85l02j3j76L35l1
$$ -303 12 -43 -9 1 89 149 -8 -64 -18 -241 -167 190 99 -141 22 123 -162 -108 177 -125 -138 -314 21 -10
4834a0J40J76p33K09N1J57P2n7j08M33l91k15J34K01K44l04j04J6o1mN09l32J3
$$ -10 130 306 -427 -218 -167 -10 62 5 -103 330 -61 -276 -142 59 303 -1 -105 -89 -150 -154 355 23 36
4857C6K1k61J13j05L5K02k90L83l16K66K3r2j5K37j79J9j05M8J21j20J06j20m7
$$ 36 57 -204 -91 -196 -161 41 -249 134 -182 84 107 15 0 237 58 77 -28 20 141 21 127 7 -40
4880d0Nk04R6N35J8o38K67l10K74K96m79K89j38J86n19K77K84K2j9j35l03J14
$$ -40 -35 -239 -143 392 410 -228 39 -271 3 299 -180 109 -29 157 -362 -85 199 221 202 67 -236 -122
4902a22q6K01K67j09j70K55O5q2l64J3K50r5k34J56q7J10J34L2j85MN8R0M6l14
$$ -122 -208 -7 260 151 -19 236 301 219 -145 -132 118 23 -211 -55 -142 -32 102 134 -51 -47 11 101 147 -167
4926a67M96m08j34K70k70J05MK87n10L47k61J30K24j16j67K5n0K13j29J14j48
$$ -167 329 -79 -213 57 -213 -108 -104 183 -327 20 -241 -111 113 -3 -170 -145 -195 18 -111 3 -145
4947a45K32j26jL8k44L71k6p7r9O9J4P7Oj88K05J07n42j20K39J31Q6j30R0O5k88
$$ -145 87 -39 -40 -2 -246 125 99 22 -77 -8 6 83 89 -99 106 213 -329 -449 -210 -79 7 -123 -33 32 -256
4972b56L58j90l6Q8P4k22J33J92j27O2J24l75l9j36M05p3j40o8M6J39j39K53k6
$$ -256 102 -88 -124 -36 38 -184 -51 141 14 76 200 -175 -214 -350 55 -18 -158 -226 -180 -41 -180 73 47
4995D7J25k38l4K69J57m43OO9J73l9K01m73N20o7m81K82j08J23P8l72M94j45L76
$$ 47 172 -66 -100 169 326 -117 -111 -42 131 92 293 -180 340 273 -208 74 -34 89 167 -205 289 144 520
5018E20o01RL14k21R1J82n3j24l12L21j76L04j74j11m0l1J79j7o7K4K70qm44L53
$$ 520 -81 -72 242 21 112 294 241 117 -195 126 -50 254 80 -31 -71 -102 77 60 -7 17 287 279 -165 188
5042A88m02M81k02P0r3J96j00m79K43J05J02j30l09O32k07O2J60j99lj79j6q6
$$ 188 -214 267 65 135 42 238 138 -341 -98 7 109 -21 -330 302 95 157 317 118 115 -64 -80 -166
5064a66R6k2j17k3n9j8J00K17K54k34k57K34J5j8Q4j5k10o9K35q5R8K3M2k76k3
$$ -166 -70 -92 -209 -232 -291 -309 -209 8 262 28 -229 5 20 2 86 71 -139 -208 27 -58 40 63 105 -171 -194
5089a94j21j00M91O6l35n8M02k61j84m6K35L7M5J91jr0r2K31j70J8o2K20k12Q0
$$ -194 -315 -415 76 142 -193 -251 151 -110 -294 -340 -105 -68 -23 168 167 77 -15 216 46 64 2 222 10 90
5113I0J45k83P5K88l36J33m9l5J60l26K49rn0Q8j50J05M8j78K01n9n5K9Qj43J11
$$ 90 235 -48 27 315 -21 112 63 28 188 -138 111 102 52 140 -10 95 143 -35 166 107 52 81 89 -54 57
5138E7j81K80k12J56j50J39q8j05J63K14o6P8l59J28Pm1j03J23oK31o34N30k49
$$ 57 -124 156 -56 100 -50 89 1 -104 59 273 207 285 -74 54 61 20 -83 40 34 265 -369 161 -88
5161h8QK31P4k48K3j12K86N5j42N4n6n81P46n21J67J37j20L0M1M7k80j3M19j38
$$ -88 -80 151 225 -23 0 -112 174 229 87 141 85 -496 250 -271 -104 33 -87 -57 -16 31 -249 -262 157 19
5185A9M4j55J89j95%L2j5L48m91K4O6K45j2l63J67l8j00R6J64j96r6J65r7n3L29
$$ 19 63 -92 97 -98 -98 -66 -81 267 -224 -200 -134 111 99 -264 -97 -135 -235 -139 25 -171 -267 -102 -199 -252 77
5210G7p0J2j49n0L4J48l7L1j88J27M0j5M7l0j09NJ43j62j2j04J77J73j53L18J
$$ 77 7 19 -130 -180 -146 2 -35 -4 -192 -65 -25 -40 7 -23 -132 -127 16 -146 -158 -262 -85 88 -65 253 254
5235B54k33m31M66j9J40n9J28j57n6j13L01J92l58l8j44M61m3k02J18q9M0l4j32
$$ 254 21 -410 56 37 177 118 246 89 33 -80 221 413 55 17 -127 334 291 89 207 118 158 124 -8
5258hj60K92j75L03j0k21j50Q7O4K53J9P0n00OK78j56r5N3K98k52n4o6%J82M8
$$ -8 -168 124 -51 252 242 21 -129 -42 22 275 294 364 -136 -130 148 -8 -103 -50 248 -4 -58 -124 -124 58 106
5283A06L0k59j34L35j44o9K37k32J90q7J68j16J63o4k45K42j72J76r7j27J01P7
$$ 106 136 -123 -257 78 -66 -135 102 -130 60 -27 141 25 188 124 -121 121 -51 125 28 -99 2 79
5305G9J59r2l94K41q8N3R0p3L0J00j54k06q0L58j00k09K26pR3p2K69l32K47k42
$$ 79 238 146 -248 -7 -95 -42 48 -25 5 105 -49 -255 -335 23 -77 -286 -60 -67 26 -46 223 -109 138 -104
5329a04J27J04O3L5J09j96j03j53R2J09K46m17r9L04j8j7J88j70k16J19J55k60
$$ -104 23 127 190 225 334 138 35 -118 -26 83 329 -88 -187 117 99 82 270 100 -116 3 158 -102
5351a02j96N68l94jj55J44k6L04m67L73q4o1k9n5J70J19j91r1K39k46M55m8N9
$$ -102 -298 270 -124 -125 -280 -136 -162 142 -325 48 -36 -97 -126 -181 -11 108 -83 -174 65 -181 274 226 285
5374B85l83K33j67j57J05J09J40p5J55l71J60R0l74J47J14j40K58k65P8J82k23
$$ 285 -98 135 -32 -189 -84 25 165 90 245 -126 34 124 -250 -103 11 -129 129 -136 -58 124 -99
5395i9K56q5K50j78J91j51J6k59j0k5r1L04k30R8K54q0l57K27q5L6l7j06J14K27
$$ -99 157 72 322 144 335 184 200 -59 -69 -94 -185 119 -111 -13 241 161 -196 31 -54 -18 -55 -161 -47 180
5419A80k76L81j59j48R3L7J6j76Q9j3M5J30R8k08L13k06j71k66L68o7j36J08m7
$$ 180 -96 285 126 -22 71 108 124 -52 37 24 69 199 297 89 402 196 25 -241 127 60 -76 32 -15
5442a5Q5m0r6j00J68k15L24k28L58j92k12R5j46j13N04j31R6O0l98M04k85J35
$$ -15 70 30 -66 -166 2 -213 111 -117 241 49 -163 -68 -214 -327 177 46 142 202 -196 208 -77 58
5464E8J17K5k31Ko6OK73j37j17J49k3q5J43K30l94j84K22L5L97n66p2L41k11q3
$$ 58 175 200 -31 -29 -95 -89 184 47 -70 79 56 -29 114 344 -50 -234 -12 23 420 -146 -218 123 -88 -171
5488a71J90m97L21J86K0l2Q3j9j12R3K48l08n8j52O0O0N6J69k00J97k07L63m40
$$ -171 19 -478 -157 29 49 17 100 81 -31 62 310 2 -56 -208 -148 -88 -32 137 -63 134 -73 290 -150
5511a50K76j27K56k31p9P2j44M13n55J24K78n1j43O4J12J66k56oR4p6P9j1J4j47
$$ -150 126 -1 255 24 -55 17 -127 286 -269 -145 133 82 -61 3 115 281 25 19 113 37 116 105 119 -28
5535b8K04j23q5j2p8J09J33o2J54j77j38j8N5J50j21J68l51K43Q3o4J3l80l0K01
$$ -28 176 53 -32 -44 -122 -13 120 58 212 35 -103 -121 -66 84 -37 131 -220 23 106 42 55 -325 -355 -154
5559a54P3J28m44M09J86l29J0L20l03q5K86l15L85l58L3K51k89L98m72M35k32
$$ -154 -81 47 -397 12 198 -131 -121 199 -104 -189 97 -218 167 -191 -158 93 -196 202 -270 165 -67
5580f7J66r4j32N2n1j27J06k2J66R1ok62K18j25j75L48j62L06k37L7j02P0k18
$$ -67 99 5 -127 -75 -126 -253 -147 -169 -3 88 82 -180 38 -87 -262 86 -76 230 -7 30 -72 -2 -220
5603b20M75O7l85J38k66j89M94k03Q0P6p5%l44M37l67M29m9j77K55j01n1Jj17
$$ -220 255 322 -63 75 -191 -380 114 -89 -9 67 -8 -8 -352 85 -282 147 98 -79 176 75 24 25 -92
5626i2J17J76m61K32r7K18l53L65j1l08L04k61K21M6ML4oj98Q0M9o3Q1l8J43k46
$$ -92 25 201 -260 -28 -125 93 -260 105 94 -214 90 -171 50 96 100 134 128 -70 10 59 -4 77 39 182 -64
5651f4K53p2N0m3l01K01k35L60p6k40K2J65l31L03j25J52L13k36j35L9k72N99
$$ -64 189 117 167 124 -177 24 -211 149 73 -167 -145 20 -311 -8 -133 19 332 96 -39 0 -272 327
5673C27K3o50N52k51q3l35L36P5K21k91q0J79N8k97L75k98M20k07l30K68J69q6
$$ 327 350 -300 252 1 -82 -417 -81 -6 215 -76 -156 23 81 -216 159 -139 281 74 -256 12 181 95
5695I5k36K56k13j56L22k77J37l92L24J2L7k0K30J9n8k43k20L87r9J78N3J44k16
$$ 95 -141 115 -98 -254 68 -209 -72 -464 -140 -128 -91 -111 119 138 80 -163 -383 4 -95 83 136 280 64
5718F4o8j21L70l15J20L0j25k8K63l10J58N2k53k44J10M86l86J26k05K77Q3k13
$$ 64 -4 -125 245 -70 50 80 -45 -73 190 -120 38 90 -163 -407 -297 189 -197 -71 -276 1 84 -129
5740a29J05J2j22j04J23l3K38k7j0J99j51j87J92k01M14pr9j4m25L24j63J22j79
$$ -129 -24 -12 -134 -238 -115 -148 90 63 53 252 101 -86 106 -95 319 312 213 199 -226 98 -65 57 -122
5763a22K51l04K56K58k13j66k59N60l9n8l57K1J23K10k60L26j49r9R7j18J28K0
$$ -122 129 -175 81 339 126 -40 -299 261 222 164 -193 -172 -49 161 -99 227 78 -21 76 -42 86 106
5785A06j86j00J79J47K44j02l16k1L27l76j9M0j8K02k11O3l11N30m42J06K23k6
$$ 106 -80 -180 -1 146 390 288 -28 -49 278 -98 -117 -77 -95 107 -104 -41 -352 178 -264 -158 65 39
5807C9k88L7L30M4j58K45k14l6J20p5j78L8K07p4m2L8O2K1j03J21k21p8J18J7
$$ 39 -249 -212 118 162 4 249 35 -1 119 44 -134 -96 111 37 -5 33 95 116 13 134 -87 -165 -47 -30
5831c0p6J73r7K12j82L05j58j82R7j93K03J23l96lK46Q6l51J90R1p0n2j50J97
$$ -30 -106 67 -30 182 0 305 147 -35 62 -131 72 195 -201 -204 42 128 -223 -33 58 -12 -64 -214 -17
5854a7k27J34RL93p7k58j21L26K07j13k3m32kK27k00J36J64l22M0n1L00n2k49
$$ -17 -244 -110 -101 292 215 -43 -164 162 369 256 233 -199 -201 26 -174 -38 126 -196 -156 -207 93 41 -208
5877b08J91M5P1L3j2m8k00J27J63k44j4K51l22M64l0j20k79K18M0m0r3J44j15
$$ -208 -17 28 99 132 120 72 -128 -1 162 -82 -96 155 -167 297 267 147 -132 86 126 86 -7 137 22
5900B2K56k82j8J09K0k9k10J32k64J23R8J9j54K41P3k52j1j43N55k42P0j42l8
$$ 22 278 -4 -22 87 107 78 -132 0 -264 -141 -43 -24 -178 63 136 -116 -127 -270 285 43 113 -29 -67
5923f7k29M40j36M2J06L0J40m91M13M4m89L88j99J54j21k93L07p1J8l8j24M22
$$ -67 -296 144 8 50 156 186 326 -165 248 292 -197 191 -8 146 25 -268 39 -32 -14 -52 -176 246
5945B46j13l46L21l37R1o9K81j38r8J83j50K91j76k44L60j56j22L40k45M1J85
$$ 246 133 -213 108 -229 -138 -207 74 -64 -162 21 -129 162 -14 -258 102 -54 -176 164 -81 -40 145
5966A45l70K42N4j19m0J0N23l66J76k25J32j65k63P58n48M6k22J28Q9l5q9J63
$$ 145 -225 17 71 -48 -88 -78 445 79 255 30 162 -3 -266 492 -56 -10 -232 -104 -15 -50 -139 24
5988B4J76k05J44k32L01j71K5k84K54O7J31k80l7J63mJ05k69J48J03R4r6n31M66
$$ 24 200 -5 139 -93 208 37 62 -222 32 99 230 -50 -87 76 72 177 -92 56 159 253 157 -374 92
6011I2q5k69K35J12R3k58L86PJ4m97J51J55m41K69J45J16l16P9m1pM0M6K01m45
$$ 92 7 -262 -27 85 178 -80 306 313 327 -170 -19 136 -305 -36 109 225 -91 -12 -53 -60 -20 26 227 -218
6035b18L48k04K30J22k95J25j71r4k8J60j79K54P2J42j04k77R7P5n9k81L83r7
$$ -218 130 -74 156 278 -17 108 -63 -157 -185 -25 -204 50 122 264 160 -117 -20 55 -4 -285 98 1
6057Ak62J90LR9j79J65K02n2m14J65j3J26j53J35J38k24L01m38K31Qj31P5L2J3
$$ 1 -261 -71 -68 31 -148 17 219 167 -247 -82 -95 31 -122 13 151 -73 228 -210 21 29 -102 -27 5 18
6081A8K55l52P4k50K57L9k75K73j12J60r0j31J08k10L24J12j91K30k74J90l00
$$ 18 273 -79 -5 -255 2 41 -234 39 -73 87 -3 -134 -26 -236 88 200 9 239 -35 155 -145
6102a45J20k59K21o7J1N5q2O7K65k64O5R6j1J1O6r6j55j78N35k31j21K86j07j50
$$ -145 -25 -284 -63 -130 -119 -64 -146 -79 186 -78 -13 83 72 83 149 53 -102 -280 255 24 -97 189 82 -68
6126f8j72L48j30m6O6k13J08L42l05j8L26l73L12r4j06J62l4n8j77K79k63k1j01
$$ -68 -240 108 -22 -68 -2 -215 -107 235 -70 -88 238 -135 177 83 -23 139 105 47 -130 149 -114 -135 -236
6149b36J34j5K53k16k3J15J3J51k31l3Q6R5P9J13j34j15P9j30J25j11j36J30L1
$$ -236 -102 -117 136 -80 -103 12 25 176 -55 -88 -2 93 172 285 151 36 115 -15 110 -1 -137 -7 24
6172B4J13L4M4j88nK9J55n30N49n4k36K18J42l79Q6l4J55Jj12L6l43J44R5K34
$$ 24 137 171 215 27 22 51 206 -324 225 171 -65 153 295 -84 2 -32 123 124 12 48 -295 -151 -56 178
6196A78j17j24J58n9J11j68N2j49K53J18k63N6K0m09K28L53r9m15K38J43j45J28
$$ 178 61 -63 95 36 147 -21 31 -118 135 253 -10 46 66 -343 -115 238 139 -276 -38 105 -40 88
6218H8k70Qj28L2Q8K01p1J93k00K17l12L37j89k45K59m3P4m8O3j86J66J01l44
$$ 88 -182 -174 -302 -270 -182 19 -52 141 -59 158 -154 183 -6 -251 8 -35 39 -9 54 -132 34 135 -209
6241b09J70j2K05l33K85l24J98N2l44K61NR2Q4K6J8k90J38J56j81L15o9q4k44
$$ -209 -39 -51 154 -179 106 -218 -20 32 -312 -51 -46 46 130 156 174 -116 22 178 -3 312 243 159 -85
6264h5K62j95N2j38J36K00n3j18J20k03o9O3L84k22J58n46K12n6Q5j20K99J3r1
$$ -85 177 -18 34 -104 32 232 179 61 181 -22 -91 -28 356 134 292 -254 -42 -98 -13 -133 166 179 88
6287H8q4N9P4j82R4P9j08J9N2j8J14j89K30j43R7k36J17K9j51r9K40q1P3j31K19
$$ 88 4 63 137 -45 49 128 20 39 91 73 187 -2 228 85 182 -54 63 92 -59 -158 82 1 74 -57 162
6312A62j38l80L39j29K74j43K7k76k2J62O5m7K30j72J55j70j84K74K09k51K13
$$ 162 24 -356 -17 -146 128 -15 12 -264 -286 -124 -59 -106 124 -48 107 -63 -247 27 236 -15 198
6333A98k09o6j2k1L69j74j11j10j70K37J50j64P3j13K11K6j45j66P2J25L0N6l5
$$ 198 -11 -77 -89 -110 259 85 -26 -136 -306 -69 81 -83 -10 -123 88 114 -31 -197 -125 0 30 86 51
6356E1n3K75l77Q4J11l01J21J80O7o5J10j67p8q9O00l42j66pm9j09J75J6k0j00
$$ 51 -2 273 -104 -20 91 -210 -89 91 158 93 203 36 -42 -131 469 127 -39 -46 -95 -204 -29 -13 -33 -133
6380a33R7j51K08j54N1l9K00j15Q0M3m30L52j06J42j15l4r8L27j31J43j04J9K5
$$ -133 -36 -187 21 -133 -82 -121 79 -36 44 87 -343 9 -97 45 -70 -104 -202 125 -6 137 33 52 77
6403G7j74K4O1k93J34K8O7J41k43K24k9J42lj07k47n8L58J67n8l68J16j8O4kr3
$$ 77 -97 -73 -12 -305 -171 -143 -76 65 -178 46 17 159 156 49 -198 -256 102 269 211 -157 -41 -59 5 3 -90
6428i0j46N00l55K17j61K11k50r0L28m86L13M81m99K55k70k80K42K77l52K13j57
$$ -90 -236 264 -91 126 -35 176 -74 -164 164 -322 -9 472 -27 228 -42 -322 -80 197 -155 58 -99
6449i9o6L01J0k11k9L76k64J65m26L70J12l83J93o4K5P0j3O2k29K57m28M13o8
$$ -99 -165 136 146 -65 -94 282 18 183 -243 127 239 -144 49 -15 10 80 67 129 -100 157 -271 142 74
6472G4O0j8R2j79m8j36J35Q6j89J20j29J1O5l1K00O4L3j3J22j06n16J44J57K12
$$ 74 134 116 208 29 -19 -155 -20 66 -123 -3 -132 -121 -56 -87 113 177 210 197 319 213 -303 -159 -2 210
6496B10j66QJ27l28J41k12K74K9j25k17J68J90j37N6o3J12l42J51K58p3m1l62
$$ 210 44 52 179 -149 -8 -220 54 83 -42 -259 -91 99 -38 18 -45 67 -275 -124 134 61 20 -342
6518c42Q75p62K67J83k30J24k13K9J39R8j38k61K8L25Q4j36K74m51r6K87j40J03
$$ -342 533 -229 38 221 -9 115 -98 -69 70 168 30 -231 -203 122 206 70 344 -107 -203 84 -56 47
6540D7J6q8J59j22k45K29P8K25k66J27l1Q7k79L2O2j7L6J17k73J02m1J97k66R2
$$ 47 63 -25 134 12 -233 -4 74 299 33 160 129 216 -63 -31 31 14 50 167 -106 -4 -45 152 -114 -22
6564b2m8L85k02q4J77l23l3J88O0L4j65J7J27K7k43j9L02j18j69R6j00R6J23J50
$$ -22 -70 315 113 29 206 -117 -150 38 98 132 -33 -16 111 138 -105 -124 178 60 -109 -13 -113 -17 106 256
6588B56l07l69P10l51j40J75j1J34k08J39m9j06l00J45N41l05K77k26p6N3j16
$$ 256 -51 -420 290 -61 -201 -26 -37 97 -111 28 -21 -127 -427 -282 259 -46 231 5 -71 -18 -134
6609a34j39J19M33n28L89k21k53N3M15oj80k27K94J10j01P4j61K12Jj68k43N68
$$ -134 -273 -154 279 -249 140 -81 -334 -281 134 128 -52 -279 15 125 24 98 -63 149 150 -18 -261 307
6631C07l42J66k34Q8K35m75L88l84J34J86k03J71L07l84L37k42k01J11M0Q6J61
$$ 307 -35 131 -103 -15 220 -255 133 -251 -117 69 -134 37 344 -40 297 55 -146 -35 5 91 252
6652B52l4l67J68P1m87L83J7k81L78j63j01o3J76j02j54L63JN7j95j11j03J86
$$ 252 218 -149 19 90 -397 -14 3 -278 100 -63 -164 -227 -51 -153 -307 56 57 114 -81 -192 -295 -109
6674a09J64K11n14L62j76p6K98r1J94j33j91K16k42O2j90K9J20J77p3j04M8r2
$$ -109 55 266 -248 114 -62 -138 160 69 263 130 -61 155 -87 -25 -215 -186 -66 111 38 -66 -18 -110
6696a10J77l28K62P8Pj62L5K60k38J67K6l10K25j10J62k91j9J42P2j49Q9L1J25
$$ -110 67 -261 1 79 86 -76 -41 219 -19 148 174 -136 89 -21 141 -150 -169 -27 45 -104 -15 16 141
6719A41k08L42p6n09J25R0K64m00nL33j95K82l48K63J77l33j79J50K90k88j0j
$$ 141 -67 275 199 -310 -185 -95 169 -231 -236 97 -98 184 -164 99 276 -57 -236 -86 204 -84 -94 -95
6741i5K2Rk05J03K10l7n2K7J13N0K05l19k20N1J78k12M19m84L6J6N7L6j50O1L09
$$ -95 -73 -64 -269 -166 44 7 -45 -18 95 145 350 31 -189 -138 40 -172 247 -237 -201 -185 -128 -92 -242 -181 128
6766A28k96K15l3j9j41K10j51j38M92l05L20o42K93K2J18j5Mk96K67j22J79o7
$$ 128 -168 47 14 -5 -146 64 -87 -225 267 -38 282 -360 -67 -45 73 58 62 -234 33 -89 90 23
6788B3pj33J56L2J68k91M3n1j12K85k78L22j92J13l8M1q2R9j27r8P2k8M34l70
$$ 23 16 -117 39 71 239 -52 -9 -60 -172 113 -165 157 -35 78 40 81 -1 98 -29 -127 -55 -83 351 -19
6812a9J90j83j20m6J30J24l03J74J21K81k98j72J14k7r0M7K8L29j49m5R2J9j20
$$ -19 171 -12 -132 -178 -48 76 -227 -53 68 349 51 -121 -7 -34 -124 -77 -49 280 131 86 178 197 77
6835G7r6RO1j79N8K79l43K91o6r6n2J03P1j20r1M23j20l9r9k47J62j29P1j08Q1
$$ 77 -19 -10 51 -128 -70 209 -134 157 91 -5 -57 46 117 -3 -94 329 209 170 71 -176 -14 -143 -72 -180 -99
6860i9L05j52j20j31L61k23j47J41K83l33P3n3K09j96P3j20P6L1j19J46n4L3J68
$$ -99 206 54 -66 -197 164 -59 -206 -65 218 -115 -42 -95 114 -82 -9 -129 -53 -22 -141 5 -49 -16 152
6883A52r4R6j24r2j90L50k27j28J44j4J09L0j26K50J69l3l35l3K53p8R7l00L78
$$ 152 58 154 30 -62 -252 98 -129 -257 -113 -127 -18 12 -114 136 305 272 -63 -96 157 79 176 -124 254
6906B54r5j55J56P3j98k61L59k08J90J38k48K2q8L19k99k68K88k8J17o8q3p5L2
$$ 254 159 4 160 233 35 -226 133 -75 115 253 5 27 -61 258 -41 -309 -21 -49 68 0 -83 -158 -126
6929a26P4l18P48k82J05l59K12J86m51K99k07n7J03M42l35L85o04O4K77k31J44
$$ -126 -52 -370 378 96 201 -158 54 240 -211 88 -119 -176 -73 369 34 419 -185 -121 156 -75 69
6950F9K13j64m9mm9j85K83j21K0j16J09p7K3K03L6m60L80j05n8p9L86j29l81J28
$$ 69 282 118 69 65 16 -169 114 -7 13 -103 6 -71 -48 155 191 -269 111 6 -52 -131 255 126 -255 -127
6974a27K47l4K95j68l92k4R4K1Q9j5O1k20J91k15K92j03L67k30j39N4J52l27m9
$$ -127 120 86 381 213 -179 -203 -109 -88 1 -14 47 -173 18 -197 95 -8 359 129 -10 44 196 -131 -180
6997a80K40P9k65k30M31K16l78L11k99J08%l13K86Q7n6k26l0L42kl42K16J07j35
$$ -180 60 139 -126 -356 75 291 -87 224 -75 33 33 -280 6 93 37 -189 -219 123 121 -221 -5 102 -33
7020c3L22n43J15L51k14K41k75M6j95K08k89K08M6k37P7M02m33K29o0J23O9k24
$$ -33 289 -254 -139 212 -2 239 -36 10 -185 23 -266 -58 -12 -249 -172 230 -203 26 -34 89 158 -66
7042f6R4j46J93N3j1j93j67L8P5R5Q2j18M5k3K68j75k00L00J71k45L9o6k06JL1
$$ -66 28 -118 75 128 117 -76 -243 -205 -130 -35 47 -71 -26 -49 219 44 -156 144 315 70 109 43 -163 -162 -131
7067a31M1J74L7ok1j81K74n3m29J21L6J51M70m96p6J44J84O2l49J83k41L88m8
$$ -131 -90 84 121 115 94 -87 187 134 -295 -174 -138 13 483 -13 -89 55 239 301 -48 135 -106 282 234
7090B34l78Q2o8L73K3k67L3j79K09j38O5p4k00J36o9o3J03K28rk62K74n9K04k19
$$ 234 -144 -62 -130 243 266 -1 32 -147 62 -76 -11 -85 -285 -149 -218 -281 -178 50 41 -221 53 -6 198 -21
7114b1m48L18K6m0Q2L4q4k29K93Q1J16k27j23J77J52j22k18J63J16k7l7p4j8r8
$$ -21 -469 -151 -125 -165 -83 -49 -133 -362 -69 12 128 -99 -222 -45 107 -15 -233 -70 46 19 -18 -92 -110 -208
7138b08P1J25m7J25k70M08l91P2j21M10k19r2P2O7J53m49K74k07J29r6K95l57
$$ -208 -137 -12 -59 66 -204 204 -187 -115 -236 174 -45 -137 -65 2 155 -294 -20 -227 -98 -194 101 -256
7160b56O6J40K00j34p6j68j52L37j7l12M79M1r7jk06J99j81p5J25p2K20j67j21
$$ -256 -190 -50 150 16 -60 -228 -380 -43 -60 -372 107 148 51 50 -156 43 -138 -213 -88 -160 60 -107 -228
7183b28J38l6K80j92n6J36k4P5j03j7j33K57l4p5m4J14k14L51j71OK7j67N3K81
$$ -228 -90 -126 154 -38 -94 42 18 93 -10 -27 -160 97 63 -12 -56 58 -156 195 24 30 57 -110 -57 224
7207B24O9k80k63K66o2Q4j34j11K13Mo4j13J02L23j57k65L5J73j27J48P0q7J89
$$ 224 293 13 -250 16 -46 38 -96 -207 6 10 -54 -167 -65 258 101 -164 -129 44 -83 65 135 48 237
7230B37k90J85O3l25J47OJ1Oj3J30j2m11M44k45K4L47k80k1k05j07O02l96j81
$$ 237 -53 132 195 -130 17 23 34 40 27 157 145 -266 178 -67 -43 304 24 3 -202 -309 293 -103 -284
7253b84M03m1q1N4j60O9J85J1l02r6L28k38K92m04K18j38R2K14k10L3K52Ol88
$$ -284 119 78 -3 51 -109 -40 145 156 -146 -242 86 -152 140 -264 -46 -184 -92 122 -88 -55 197 203 -185
7276a85NJ41K9j51K87r3j10J75k46j30J66M09k83J26r7K8k00J31J8n9L1j93L26
$$ -185 -180 -39 -10 -161 126 33 -77 98 -148 -278 -112 297 14 140 43 71 -129 2 20 -39 -8 -201 125
7299A25l05K35Mkj94M14l93j00M1M29j27L8k78L6j57L85M6k46J04M34o39L52o2
$$ 125 -180 55 59 57 -137 277 -116 -216 -175 254 127 165 -113 -77 -234 151 197 -49 55 489 -150 202 140
7322A40j03J58l73J80J61p9k12L23n28O16j51r6j38J55J80m36P3L23p5k69J91
$$ 140 37 195 -178 2 163 84 -128 195 -333 283 132 36 -102 53 233 -203 -130 193 118 -151 40
7343D0k26J18K76j06k06M28n77M89q7k13n6J77J61j88J18Qm7l12NL38j13l77L92
$$ 40 -186 -68 208 102 -104 324 -253 236 149 -64 -120 57 218 30 148 156 109 -203 -198 140 27 -350 42
7366D2K0j12j82n7J30K09m5J27R3m33J80l2Pj69N17k60r9O2j08O5J8o8j17K56
$$ 42 62 -50 -232 -289 -159 50 5 132 225 -208 -28 -60 -53 -222 295 35 -64 -2 -110 -45 -27 -95 -212 44
7390D4P3om6j04N8K1n1j04K16j70R7J47n25J5M20k73mK56m19M64k53J26OR8j66
$$ 44 117 111 65 -39 19 40 -11 -115 101 -69 28 175 -350 -335 85 -188 -192 64 -355 109 -144 -18 -12 86 -80
7415h0Q4J92o9j97J19N2l68q7L64p3rJ31j60K51k54K34k30J90j03J16q4j71K35
$$ -80 4 196 127 -70 49 101 -267 -354 10 -63 -72 59 -101 150 -104 130 -100 90 -13 103 19 -152 83
7438H3k74K24j99K87Qk36J38l50K07m5K37m8j96J46m6N1K88k81O2j9kJ20l3K0
$$ 83 -191 33 -166 121 129 -107 31 -319 -112 -157 80 32 -164 -18 -64 -13 275 -6 56 37 35 155 122 142
7462A42m87L29L63l05K75k94k5r1K52j45j0L76m05J7j6j42J33J13j81k65N75J7
$$ 142 -345 -16 347 42 317 23 -2 -93 159 14 4 380 -25 -8 -24 -166 -33 80 -101 -366 209 226
7484B26j62m82K83K39n7j86L2J7N2M9r5j16R0K52l24N1K6j52K21j9Mj32N3J71
$$ 226 64 -418 -135 104 47 -139 -107 -90 -38 11 -84 -200 -110 142 -182 -131 -105 -257 -36 -55 -51 -183 -130 41
7508D1j94K08m03M19N9j96pJ08J67p3l38K66j35M3r1J59k14K36m23K29J09o4M01
$$ 41 -153 55 -348 71 130 -66 -73 35 202 129 -209 57 -78 -35 -126 33 -181 55 -368 -139 -30 -94 307
7531C07l30J30j58J93k94J36J99k47N07o59J74K50k63K69j92P3k83Q5L38k43Q6
$$ 307 -23 107 -51 142 -152 -16 183 -64 443 -216 -42 208 -55 214 22 95 -188 -103 235 -8 78
7552G8k13m7M1J45j1K94k66L5k5j6J2O6P9k09J7J31p7l4m4K23k70J02j30r6M88
$$ 78 -135 -182 -141 4 -7 287 21 56 31 15 27 93 172 -37 -20 111 34 0 -44 179 -91 11 -119 -215 273
7577B73m38L18l64K1L45p5O2j56n8o3K30j15K92o08L15l9J73k16NJ26k61L42q0
$$ 273 -165 153 -211 -190 155 80 142 -14 -72 -135 95 -20 272 -336 -21 -60 113 -103 -98 28 -233 109 29
7600B9n1j46K64j05k41N6K63J25l18L9j88L98K5k60K70r1M2j04p6m3K36Ko3k27
$$ 29 -22 -168 96 -9 -250 -194 69 194 -124 -85 -273 125 150 -110 160 69 111 7 -69 -112 124 126 63 -164
7624a64K10J11L8k46n6J18J7j20p5L41m32K88j09K06k89k3L25j10l02r5K54j5
$$ -164 46 157 195 -51 -107 11 28 -92 -167 174 -258 30 -79 127 -162 -185 140 30 -272 -367 -113 -128
7646a28O7n3K24k34J89o3J05M0k92J62Q6k62M02l76O39m66Q1l7RO8j28N0j31K58
$$ -128 -61 -114 110 -124 65 2 107 147 -145 17 103 -159 243 -133 506 40 121 84 93 161 33 83 -48 210
7670B10l82Q9P6j11k19J12L95j10k5kL15k78l26K0J54j2j81K60k08J89J86j55
$$ 210 -172 -83 -7 -118 -337 -225 170 60 35 33 348 70 -256 -236 -82 -94 -275 -15 -223 -34 152 -3
7692ck11M61l88l7K81m89L25L3K66l27L67m40k3M1K83m30M71r3j31J77p9L47l64
$$ -3 -214 247 -141 -178 103 -386 -61 -28 238 -89 278 -162 -185 -144 139 -291 180 87 -44 133 54 401 37
7715C7j65P4K38J5r5p8j68J88j24J70n8J6j03O4K05j60J35k78rJ11k42M65k05
$$ 37 -128 -54 184 199 104 26 -142 46 -78 92 34 50 -53 11 216 56 191 -87 -96 15 -227 238 33
7738C3j52J83j44K78j96j5J01j14J13qO8o7jQ2L7j46k07L42k35J2q1K09k65J6
$$ 33 -119 64 -80 198 2 -13 88 -26 87 79 147 80 79 161 198 52 -155 187 -48 -36 -117 92 -173 -157
7762a57K63O9k22J14m5k75M58j10j98L8j53K08m1K5R3k63L97r0j66J99j06l25
$$ -157 106 175 -47 67 22 -253 205 95 -103 -65 -218 -10 -51 -26 67 -196 201 111 -55 144 38 -287
7784b87K66L83k74k29J92k48L4J55K48j08l11K06r2kJ35p2J2M2m5p6L47k32l8
$$ -287 -21 362 88 -141 51 -197 -163 -8 240 132 -179 27 -65 -67 68 -4 8 50 5 -71 276 44 6
7807FJ93k11j27K06j47J72P3j26N6J21k69P7r4M7J85j78J90j43n6r8k17J85k8
$$ 6 199 -12 -139 67 -80 92 165 39 95 216 -53 24 -70 -23 162 -16 174 31 -25 -123 -340 -155 -183
7830a83L51Q9l27J36n9l2j46L06J04o5r1K4k11J61l07L92k67M0J92r6m8K20l34
$$ -183 168 257 -70 66 7 -25 -171 135 239 174 83 107 -104 57 -250 142 -125 -85 107 11 -37 183 -151
7853a51L09k11P6O6j17K37m61K98j49M5K56p7k9j43J00m11L52j34L03m55K4L66
$$ -151 158 -53 23 89 -28 209 -252 46 -103 -58 198 121 92 -51 49 -362 -10 -144 159 -296 -272 94
7875I4k64J11j54L86p9j41K4j84J00L9%J51q3rQ8l25J74K50J08n46K16j5J14j04
$$ 94 -170 -59 -213 173 94 -47 -23 -207 -107 -68 -68 83 0 -9 79 -246 -72 178 286 -260 -44 -59 55 -49
7899d9J73J19k20p4O1J01k5k07n7J96Q4P1j14j36J03J59j66k11J76j29K68k08
$$ -49 124 243 23 -51 10 111 86 -121 -178 18 102 173 59 -77 26 185 19 -192 -16 -145 123 -85
7921h5J76Mj16Q3K78l58m67M92j00J0K45l08L21j56j11K35J32j54K06l38J03j08
$$ -85 91 95 -21 62 340 -18 -485 7 -93 -83 162 -146 175 19 -92 143 275 121 327 -11 92 -16
7943a6j99J86k68N56k68J41J3l9j08K46m27M1QJ30lR2N9l13L67l27Q7l8K49j03
$$ -16 -215 -29 -297 259 -9 132 145 106 -2 244 -183 -142 -134 -4 -7 85 144 -169 198 -129 -42 -80 169 66
7967F6k76Q8M9QJ54j09J67m93N83l98J49k02j62K47J53n3K5j69J34j57K39K29
$$ 66 -210 -122 -73 -65 89 -20 147 -346 237 -161 -12 -214 -376 -129 24 -29 -4 -173 -39 -196 43 272
7989B72k14j08j40L93j72Ok53K58L6r4j5N0j39J80m3Pl5R7o1j80k00L48Q2j69
$$ 272 58 -50 -190 203 31 37 -216 42 78 -16 -31 19 -120 60 17 24 -11 86 25 -155 -355 -7 75 -94
8013i4q1M46j30k51J96k73j14M84j60k22K41q3j30K18R8P4q1k02K26j96J45j59
$$ -94 -175 271 141 -110 86 -187 -301 183 23 -199 42 -41 -171 47 145 219 138 -64 162 -34 111 -48
8035d8J93k03J04l18L36j00M4L2o2m2p6K71l86J20J33J63j51j31l2L12j96j29
$$ -48 145 -58 46 -272 64 -36 8 40 -22 -64 -140 131 -255 -135 -2 161 10 -121 -153 159 -37 -166
8057a66J26p1K35k35N3k15K85J60k85J67k19J38j19L54k07p3M85l13j54J27Pj52
$$ -166 -40 -111 124 -111 -58 -273 12 172 -113 54 -165 -27 -146 208 1 -72 413 100 -54 73 80 -72
8079g2J90o0j05R4O9j59J20j56j29L6L82j1j32p6q2J84j78j5J99m49N60j74K5
$$ -72 118 58 -47 47 116 -43 77 -79 -208 -172 210 199 67 -9 -91 93 -85 -100 99 -350 210 36 61
8102F1J02l85K87o6k48lJ91P5k9o3Q4J31j74P7Q0k33N6Jj31L88k1l75K76j10J2
$$ 61 163 -222 65 -1 -249 -252 -61 14 -15 -78 6 137 -37 40 120 -113 -57 -56 -187 201 180 -195 81 -29 -17
8127a7J5J88j41j23K00k07K91k66N1J57k61J60K65k18p9l48L09l31L34K76l45
$$ -17 -2 186 45 -78 122 -85 206 -60 -9 148 -113 47 312 94 15 -333 -24 -355 -21 255 -90
8148i0r8J96k1k39L14mj40J03j17K21k71L83k58J2K18k29L9j33p7K4N01m50J32
$$ -90 -188 8 -13 -252 62 58 -82 21 -96 125 -146 237 -21 -9 209 -20 19 -114 -191 -167 334 -116 16
8171A6J01k97L28l46M84k56k37K76k1k68L54l66J95K67o8nQ5m90J29j76
$$ 16 117 -180 148 -198 286 30 -207 69 48 -220 134 -232 -37 230 162 157 242 -248 -119 -295
8191b95
$$ Imaginary data points
##PAGE= N=2
##DATA TABLE= (X++(I..I)), XYDATA
0@%%%qJ6j6K4l9M7n6P2r0J14j43J75k14K57l02L60m27M99n83O77p82R00j031J180
$$ 0 0 0 0 -8 8 -8 16 -23 24 -32 40 -50 64 -79 96 -118 139 -163 197 -230 269 -314 363 -419 481 -550 630
27F30j342J521j723J941k182K451k740L058l413L798m220M686n194N756o376P055
$$ 630 -712 809 -914 1027 -1155 1296 -1444 1614 -1799 1999 -2221 2465 -2729 3027 -3349 3706
43C706p811Q655r596J0656j1863J3242j4836J6712j8955K1687k5104K9526l5503
$$ 3706 -4105 4550 -5046 5610 -6253 6989 -7847 8865 -10090 11597 -13507 16019 -19484
56a9484M4078n7511Q1729j39074N13857N31566q33921l26342K30643L49147j23791
$$ -19484 24594 -32917 48812 -90262 423595 955161 121240 -205102 25541 374688 250897
67B50897p4728J19905M7236k98594j38953K32264K55795j47871k33787N736J15579
$$ 250897 176169 296074 343310 44716 -94237 138027 393822 245951 12164 17900 133479
78A33479j03684j29309J11997K35062l654j97780j30051K9896N4161P7149J30540
$$ 133479 29795 -99514 12483 247545 243891 46111 -83940 -54044 117 77266 207806
89B07806O7223j53768k38330n5186J79762J95208L4624j29847j76258p4337J19455
$$ 207806 275029 121261 -117069 -172255 7507 202715 237339 107492 -68766 -143103 -23648
100b3648J88231K4759j55773r3948O8055L4358j13658m8683J69740J54128j23395
$$ -23648 164583 189342 33569 -60379 7676 42034 -71624 -120307 49433 203561 80166
111H0166k33821j2073J71775O4069p5170Q22Q7031l7756j66931m5168J50473J24302
$$ 80166 -153655 -165728 6047 70116 -5054 -4232 82799 45043 -121888 -167056 -16583 107719
123A07719m4737r1888j8664n671k9088M1546J18097K6133j38713j21354N3300
$$ 107719 62982 -28906 -47570 -53241 -82329 -40783 77314 103447 -35266 -156620 -103320
134a03320J24462K2601m5785J1317L7096n1684j01874M202J31626J01237l9683
$$ -103320 21142 43743 -2042 9275 46371 -5313 -107187 -102985 28641 129878 90195
145I0195j05781l6680N1370N9201Q641k4389j2113J3691Q489k3456k8161K4884
$$ 90195 -15586 -52266 -896 58305 66946 42557 30444 44135 52624 29168 1007 25891
157B5891P2868L5125o2992j04913l3906O9765R1607J6693o1205o4448j5048J9236
$$ 25891 98759 133884 70892 -34021 -67927 1838 93445 110138 48933 -15515 -30563 -11327
169a1327J7611J5586K2892Q8n3876o7072R354R0927N7778n4667q9473l924P0398
$$ -11327 6284 21870 44762 44850 -9026 -76098 -66744 24183 81961 27294 -62179 -66103 4295
182D295L6580l2801l8012M069K2598J1403l657k0104k4545J5013O3038L1345p0354
$$ 4295 40875 8074 -29938 -25869 -3271 8132 4475 -15629 -40174 -25161 37877 69222 -1132
195a132r4526J5521J08958M6059p2168o6773L3230O0011r865m1756O993L1326
$$ -1132 -95658 -80137 28821 74880 2712 -64061 -30831 29180 19315 -22441 -15448 15878
207A5878j8951m6448J4294P2967L0748n6692o7712O376O3157M0338k8658o3447
$$ 15878 -3073 -49521 -35227 37740 68488 11796 -55916 -49540 13617 53955 25297 -38150
219c8150k6771M3230O3094N733n6316m3090J7886L6032o423l1830j659L3423J7227
$$ -38150 -64921 -21691 41403 47136 -9180 -52270 -34384 1648 -4775 -36605 -38264 -4841 12386
232A2386k0938l0773p981K0032L6203K2668k2931m8298r994M7829M4017q736k2858
$$ 12386 -8552 -39325 -47306 -27274 8929 31597 8666 -39632 -49626 -1797 42220 33484 10626
245A0626J2983J6972l0813l5190M1151Q3991N734r3794o5991M7886Q6107R438
$$ 10626 23609 40581 9768 -25422 15729 99720 105454 11660 -54331 -6445 79662 89100
257H9100n5020l1397J5356O314k6931j8360K1445L3854K796l3151m0440j4555
$$ 89100 34080 2683 18039 24353 -2578 -20938 507 34361 37157 4006 -36434 -50989
269e0989K5631M3449J4648l7059m7087m771L4087K6564J110J048J0841q798m2000
$$ -50989 -25358 18091 32739 -4320 -51407 -56178 -22091 4473 5583 6631 17472 8674 -33326
282c3326k9404L3587P0673K8315m5628o4253j0793M5024M1210n384l0503j2171
$$ -33326 -62730 -29143 41530 69845 24217 -40036 -50829 -5805 35405 30021 -482 -12653
294a2653P826n932k2561N08M3002L9690k0494o5907l7294L3312O1417K2458k6773
$$ -12653 -4827 -10759 -33320 -32812 10190 49880 29386 -36521 -73815 -40503 20914 43372 16599
307A6599k9185j223J0951J721K225K2864L2117J458m5179m7736Q403O4792N4051
$$ 16599 -12586 -13809 -2858 -1137 1088 23952 56069 57527 12348 -35388 -26985 37807 91858
320I1858j2579o0469m1546J2501L6839J5536q057n199j455k0615l4767m095M6379
$$ 91858 79279 18810 -22736 -10235 26604 42140 34083 28884 27429 6814 -27953 -32048 14331
333A4331N1656p083o4220n3092J2492N4150L3373r128k3184q485J246p038p492
$$ 14331 65987 58904 -5316 -58408 -45916 8234 41607 32479 9295 810 2056 -4982 -12474
346a2474J5903L7657J6635l4584n5291j1888M9453N7208K669m8902m2358J062
$$ -12474 3429 41086 57721 23137 -32154 -44042 5411 62619 65288 16386 -25972 -24910
358b4910K2281Q606r79R375J1850j4058l7887k1844K7334N0899J7966l7528n0787
$$ -24910 -2629 5977 4998 14373 26223 12165 -25722 -47566 -20232 30667 48633 11105 -39682
371c9682p254L8841L8011J210k0095o854P209n810j9811J409L6532L0314j9101
$$ -39682 -46936 -8095 29916 31126 11031 4177 11386 5576 -14235 -12826 23706 54020 34919
384C4919m9740k1396L2305M2171K217l4841k6026N346J3773l316j3162L972K3529
$$ 34919 -14821 -36217 -3912 38259 40476 5635 -20391 -15045 -1272 -4588 -17750 -13778 9751
397I751J0824k5295l6431p56L8545K9454j5048l3708n480K6616J9257q165j1566
$$ 9751 20575 -4720 -41151 -41907 -3362 26092 11044 -22664 -28144 -1528 17729 9564 -2002
410b002J2197J9841m826k9536j3765K4586L6560Q382k7079k7055L624K4081R113
$$ -2002 10195 30036 25210 -4326 -18091 6495 43055 51437 24358 -2697 927 25008 34121
423C4121j7593j4780R707J5136q494k4496m389K7057K4585j3885l6939j3927K2273
$$ 34121 16528 1748 11455 26591 18097 -6399 -10788 16269 40854 26969 -9970 -23897 -1624
436a624K4872l101j9250k421J8529J0355j6652k1877O307L1932J5396k3669l3963
$$ -1624 23248 20147 897 -1524 17005 27360 10708 -11169 -4862 27070 42466 18797 -15166
449a5166j11L2189K2258j3317k3871j034J4135k288k1210p847K3395K5636p869
$$ -15166 -15277 16912 39170 25853 1982 948 15083 12795 -8415 -16262 7133 32769 24900
462B4900l5993k0681J9404L3350N136k5662k0125O914J6825j20j1741L653K3260
$$ 24900 -11093 -31774 -12370 20980 26116 454 -19671 -12757 4068 3948 -7793 -4140 19120
475A9120J0821k3605l3103m01L4274K7742q268k7497j1424J2701J1757m290o385
$$ 19120 29941 6336 -26767 -27168 7106 34848 26580 -917 -12341 360 12117 7827 1442
488A442R753J4430r327l1561j7389K4783M5093J3778l3244m1745m771K8873K4288
$$ 1442 11195 25625 16298 -15263 -32652 -7869 37224 51002 17758 -23987 -28758 115 24403
501B4403j348j1812k320J221j0212j2511Q610L1663J9345k1242m3529j8928K5362
$$ 24403 23055 11243 8923 10144 -68 -12579 -3969 27694 47039 25797 -17732 -36660 -11298
514a1298L8964J1069k1460k1645l038L195n925k326J8171K4296m943l9450l2612
$$ -11298 27666 38735 17275 -4370 -7408 -4213 -10138 -12464 5707 30003 25060 -14390 -47002
527d7002J5756N0670K9713j9715m2354j8736J5529K3177R654L426O935J000j9752
$$ -47002 -31246 19424 49137 29422 -12932 -31668 -16139 7038 16692 20118 27053 28053 8301
540H301k7491J722L8297L7105p250m4924l5391R504L7036K3286o943j9848j3684
$$ 8301 -19190 -17468 20829 57934 50684 5760 -29631 -20127 16909 40195 33252 13404 -280
553b80r124j0747k119K0171K9266L623l5411m1590k056L9613L6502l649l2543
$$ -280 -9404 -20151 -22270 -2099 27167 30790 -4621 -46211 -48267 -8654 27848 24199 -8344
566h344k2675N443J5337Q055O649J4776J0336j4783l2660j4168K7137M3507J4649
$$ -8344 -31019 -25576 -10239 -2184 4465 19241 29577 14794 -17866 -32034 -4897 38610 53259
579E3259k8386l6860o755K2834K1228J171o698l120p281k0729j6806J3433L8730
$$ 53259 24873 -11987 -18742 4092 25320 26491 19793 16673 9392 -11337 -28143 -14710 24020
592B4020K2323k3019m6707k0808K3618L7127J1982j6388j9091l621M355J848N278
$$ 24020 46343 23324 -23383 -44191 -20573 16554 28536 12148 -6943 -10564 -6209 -4361 917
605I17J8825J9943o198l3843k5975J3787M2366K6298j4282l1137j2603J0362J1811
$$ 917 19742 39685 33487 -356 -26331 -12544 29822 56120 41838 10701 -1902 8460 20271
618B0271J393J062Q011J221j9139k6240j447L2235L3081l996l7697l1089M485
$$ 20271 21664 22726 30737 31958 12819 -13421 -14868 17367 50448 46452 8755 -22334 -17849
631a7849K7854J7366m320j0567k413k323j0262o942J4880K6509O177k7542l5693
$$ -17849 10005 27371 23051 12484 10071 7748 -2514 -9456 5424 31933 38110 10568 -25125
644b5125l759L0870K9278l118k5082j7154J581M622k437o37J0915J0305j0948
$$ -25125 -28884 1986 31264 28146 3064 -14090 -12509 -7887 -10324 -10961 -46 10259 -689
657f89k7970j2649K1058L1397N988k4560k3872Q57J8651J1709k393n30R801M462
$$ -689 -28659 -41308 -20250 11147 17135 -7425 -31297 -30440 -11789 -80 -2473 -3003 6798 11260
671A1260j1841j6834M311K7911K2346q876k8697j2497J7523K5130O051j2011q697
$$ 11260 -581 -17415 -13104 14807 37153 28277 -420 -12917 4606 29736 35787 23776 15079
684A5079J569J380p341m383J2070J9074R25k2867k0781M695K3758J2658j3001
$$ 15079 16648 18028 10687 6304 18374 37448 38373 15506 -5275 -580 23178 35836 22835
697B2835j9640k217J2290M792r320n622J0726J2454q805k3828j0678J6414K2729
$$ 22835 3195 978 13268 18060 8740 3118 13844 26298 17493 -6335 -17013 -599 22130
710B2130M51k0328j3723O854J2369m42j1281l078J0804O279j1499j6339K147K1530
$$ 22130 22581 2253 -11470 -4616 7753 7311 -3970 -7048 3756 10035 -1464 -17803 -15656 5874
724E874J4500j0611k1876n772J3462J2031m559r836K518J0401m20j4074q741J0443
$$ 5874 20374 9763 -12113 -17885 -4423 7608 3049 -6787 -4269 6132 5712 -8362 -17103 -6660
738f660J5389p46j9583j5505O217J6924L885j2913j0962M696Q810n038j6279n494
$$ -6660 8729 7983 -11600 -27105 -20888 -3964 -79 -12992 -23954 -19258 -10448 -15486 -31765 -37259
752c7259J4740J6082m712j9065q732J3296J6886N26j2561m336R255Q286m913o273
$$ -37259 -22519 -6437 -11149 -30214 -38946 -25650 -8764 -8238 -20799 -25135 -15880 -7594 -12507 -18780
766a8780Q305J8582O961j4351j7108K533K0660J3275p993j4110k52J1208M737
$$ -18780 -10475 8107 15068 717 -16391 -13858 6802 20077 12084 -2026 -2278 8930 13667
779A3667q400n675P532J0709n300j9570r612J4030K0639K143j7514j2996N343
$$ 13667 5267 -408 7124 17833 12533 -7037 -16649 -2619 18020 20163 2649 -10347 -5004
792e004J1867o41r548J96J2412O206j1728j4655M115K1904J4584r929k2169r183
$$ -5004 6863 6222 -3326 -3130 9282 15488 3760 -10895 -6780 15124 29708 19779 -2390 -11573
806a1573J1493J6113L318p069m315J968j404q531m297R828J3821l426k0588j4967
$$ -11573 -80 16033 19351 12282 7967 9935 8531 0 -4297 5531 19352 15926 -4662 -19629
820a9629P480K0315Q253j1603j4548k079O004K6o528Q69J3182Q344j0859k0398
$$ -19629 -12149 8166 16419 4816 -9732 -11811 -5807 -5781 -12309 -11440 1742 10086 -773 -21171
834b1171n169J8511K0523k486k0963j4125O608J3676L046m713o56M886j454j4024
$$ -21171 -26340 -7829 12694 10208 -10755 -24880 -18272 -4596 -1550 -6263 -6919 -2033 -3487 -17511
848a7511r949R167J9537P106j3567j8932k252J4845J3997j000q541k440L646j106
$$ -17511 -27460 -18293 1244 8350 -5217 -24149 -26401 -11556 2441 1441 -7100 -9540 -5894 -7000
862g000o825K787J7584J5774p486k2674j0699J5412K3405M556j4073j1957L372
$$ -7000 -13825 -11038 6546 22320 14834 -7840 -18539 -3127 20278 24834 10761 -1196 2176
875B176Q606J545l575J591Q249K110j3184j5475J214J8011J4502n109j7515r535
$$ 2176 10782 12327 8752 10343 18592 20702 7518 -7957 -6743 11268 25770 20661 3146 -6389
889f389N665Q659O99l270K477L777n495j1993l725J3735J8899J056j9364j8493
$$ -6389 -724 7935 8634 5364 7841 11618 6123 -5870 -9595 4140 23039 24095 4731 -13762
903a3762J942J7510J1295m931j0117j762L720k256p981L87J3249Q386j1004k0125
$$ -13762 -11820 5690 16985 12054 1937 175 3895 1639 -6342 -5955 7294 15680 4676 -15449
917a5449n332J6103J6787o98j3696q687L619M973k505l178O163J0467O18j3383
$$ -15449 -20781 -4678 12109 11411 -2285 -10972 -7353 -2380 -4885 -8063 -1900 8567 9185 -4198
931d198j2485M603J8758J0479r106j6911n358Q919Q547m80k742K957K783p950
$$ -4198 -16683 -12080 6678 17157 8051 -8860 -14218 -5299 3248 2768 26 2983 5766 -2184
945b184j3575j890J5016J4786l226j7620j1323O974J4940M833o941o607J657L801
$$ -2184 -15759 -17649 -2633 12153 8927 -8693 -20016 -13042 1898 6731 -210 -6817 -5160 -1359
959a359l602n429M321J4547Q371r568j7190l417J4140J3248j748j0720m160M896
$$ -1359 -4961 -10390 -6069 8478 16849 7281 -9909 -13326 814 14062 12314 1594 -2566 2330
973B330L243l842k505O708R061l491j5543j0959P741J7080P850r701j2603j329
$$ 2330 5573 1731 -774 5934 14995 11504 -4039 -14998 -7257 9823 17673 7972 -4631 -5960
987e960O938L507l625o19O116L879p898j1954N75J6004J3930n856j7459r884P229
$$ -5960 978 4485 860 241 6357 10236 2338 -9616 -9041 6963 20893 15037 -2422 -12306 -5077
1002e077J1438K428n407k586K642M11p133o627N222J2428L230j1946j4996m30
$$ -5077 6361 8789 3382 796 3438 3849 -3284 -9911 -4689 7739 10969 -977 -15973 -16403
1016a6403J3363J0755k278r131k458L023j027n157M03J1005R804n013j5590p994
$$ -16403 -3040 7715 5437 -3694 -6152 -3129 -4156 -9313 -8910 2095 11899 6886 -8704 -16698
1030a6698J0792J6959L788j1317j2172j17P345L525j549R91N541M76j0848j1265
$$ -16698 -5906 11053 14841 3524 -8648 -8765 -1420 2105 556 1547 7088 7564 -3284 -14549
1044a4549K630J5084J0279p707j5512n124Q749J0037k67n126m70K719j601q311
$$ -14549 -11919 3165 13444 5737 -9775 -14899 -6150 3887 3620 -1506 -1976 743 -858 -9169
1058i169k488R814J3973J166j3281j2734K681J2928P832m026p532r75K243j439
$$ -9169 -11657 -1843 12130 13296 15 -12719 -10038 2890 10722 6696 -836 -1811 432 -1007
1072a007l792L513J0021M987j0169j5878l475J2869J5190J258j2291r483J860
$$ -1007 -4799 -1286 8735 13722 3553 -12325 -15800 -2931 12259 13517 1226 -8257 -6397
1085f397O717K131j997K244M115j286j0185o824P625J6152O064j0823j4750k920
$$ -6397 320 2451 454 2698 6813 5527 -4658 -11482 -3857 12295 18359 7536 -7214 -10134
1099a0134R250Q614j296m517L25J827l277q430j211J0055J0540l502j5700j0551
$$ -10134 -884 7730 6434 1917 2242 4069 792 -7638 -8849 1206 11746 8244 -7456 -18007
1113a8007O258J4580O422n909p493o93J325j734j507O159R872K106j0884j1553
$$ -18007 -11749 2831 9253 3344 -4149 -4842 -3517 -5251 -6758 -599 9273 11379 495 -11058
1127a1058K256J4973J0746m148j2238o721M445O421J209j700K295K964l763j0652
$$ -11058 -8802 6171 16917 12769 531 -6190 -1745 4676 5885 4185 6480 9444 5681 -4971
1141d971n767P880J2507J903j1489j1830M49R585N801k723m340l2Q06l576n331
$$ -4971 -10738 -2858 9649 11552 63 -11767 -11318 -1733 4068 1345 -2995 -3027 -2221 -5797 -11128
1156a1128K248J1475Q257n089j3330n835Q483J1705K351p101n351J999K991j881
$$ -11128 -8880 2595 10852 5763 -7567 -13402 -4919 6786 9137 2036 -3315 -1316 1675 -206
1170b06j056N330P339j347j1756r775L796J3684P447p021j1009k594O484M176
$$ -206 -1262 4068 11407 10060 -1696 -11471 -7675 6009 13456 6435 -4574 -7168 -684 3492
1184C492k253l751K091L841l315q205k089Q734J0120j108j0540p626L075P211
$$ 3492 1239 -2512 -421 3420 105 -8100 -10189 -1455 8665 7557 -2983 -10609 -7534 -323
1198c23K010l884j590L263J580m682n517K691R656M363p141j1512j737R803Q881
$$ -323 1687 -2197 -3787 -524 1056 -3626 -9143 -6452 3204 7567 426 -11086 -12823 -3020 5861
1213E861j015o675k342L377J753k674k149M387O975q34p960n223N226J0317L157
$$ 5861 4846 -1829 -4171 -794 959 -1715 -3864 523 7498 6664 -1296 -6519 -1293 9024 12181
1228A2181p633p794J271O568J816m410k189M818M672l534q655k614P169P439j768
$$ 12181 4548 -3246 -1975 4593 6409 1999 -190 4628 9300 5766 -2889 -5503 1666 9105 7337
1243G337q966l609N057N738q68m002m12M120J157n653n944L905R990L489p241
$$ 7337 -1629 -5238 -181 5557 4689 687 275 4395 5552 -101 -6045 -2140 7850 11339 4098
1258D098q697M82Q227M092m571n844O58N143k66n157k584M490N739j074q560n761
$$ 4098 -4599 -4117 4110 8202 3631 -2213 -1555 3588 3322 -1835 -4419 71 5810 4736 -3824 -9585
1274i585L626P841J226n446l558K766L832j575n068J0O175M084m609p473p32P926
$$ -9585 -5959 1882 3108 -2338 -5896 -3130 702 -873 -5941 -5931 244 4328 -281 -7754 -8486 -560
1290e60O542k031o927k381L406K447k411l112L063N810n78p859n529M348Q781
$$ -560 5982 3951 -2976 -5357 -1951 496 -1915 -5027 -1964 3846 3268 -4591 -10120 -5772 3009
1305C009K589p604q025J243P270L223k968k353K038L715j996n638j082P066O880
$$ 3009 5598 -2006 -10031 -8788 -1518 1705 -1263 -3616 -1578 2137 141 -5497 -6579 487 7367
1320G367j174p551l356M638O849Lm319j404L098J197m385l701L744Q219K450p802
$$ 7367 6193 -1358 -4714 -76 6773 6776 2457 1053 4151 5348 963 -2738 1006 9225 11675 3873
1336C873r589n65Q310N755k784o477k446K933J685k017q37L482L307l247p986
$$ 3873 -5716 -6281 2029 7784 5000 -1477 -3923 -990 695 -1322 -2159 1323 4630 1383 -6603
1351f603l356O506R050J392o618o330J018N022J378k965n96K691J645m379n674
$$ -6603 -9959 -3453 5597 6989 371 -5959 -4941 81 1459 -1506 -2102 589 2234 -2145 -7819
1366g819P99Q495O028m823r488m180M595O194j57k510n84J825j517m383k163O151
$$ -7819 -7020 1475 7503 2680 -6808 -10988 -6393 -199 -356 -2866 -3450 -1625 -3142 -7525 -9688 -3537
1382c537P283k47r195p116L105R774N535l239o309j335J894P79j476Q12N667K690
$$ -3537 3746 3499 -5696 -12812 -9707 67 5602 2363 -3946 -5281 -3387 -2608 -4084 -3272 2395 5085
1398E085m757p225j618P838P756j583p221n198K111M711J471j390Q32L214j34
$$ 5085 328 -6897 -8515 -677 7079 5496 -1725 -6923 -4812 -101 1370 -20 812 4026 3892
1413C892o305n043L770R195M107m690q251j878O093N686j57k920q24K38j575l680
$$ 3892 -2413 -7456 -3686 5509 9616 4926 -3325 -5203 890 6576 6419 3499 2675 2913 1338 -2342
1429b342M05O694O329k271r850o101M083Q552K996n099n662k62K362N23j085J214
$$ -2342 -1937 4757 11086 8815 -1035 -7136 -3053 5499 8495 3396 -2266 -2528 -166 357 -728 486
1445D86M131M12o336o796J164P694O111k217p223l829L091L142n42j043J035J831
$$ 486 4617 5029 -1307 -8103 -6939 755 6866 4649 -2574 -6403 -3312 -170 -712 -1755 -720 1111
1461A111j477n951k784N121Q003J910p377p835j53N500M537m26k751r0O12j849
$$ 1111 -366 -6317 -9101 -3980 4023 5933 -1444 -9279 -9432 -3932 605 179 -2572 -2662 -2050 -3899
1477c899k739J933O525L678m296p769k932O119Q607J486n118m587Q20K304m07
$$ -3899 -6638 -4705 1820 5498 1202 -6567 -9499 -3380 5227 6713 1595 -2992 -2172 132 -275
1492b75q68K079M104k60n547n234K163P544M431l929p014k092L222L529J0q09
$$ -275 -1143 936 5040 4780 -767 -6001 -3838 3706 8137 4208 -2806 -4898 -1676 1853 1863 1054
1508A054J747J996k921n849j083O746O895j32p274n861K563O129L430j744k749
$$ 1054 2801 4797 1876 -3973 -5056 1690 8585 8453 1179 -4682 -2119 4010 7440 5696 2947
1523B947n20j79j941j691L052N515K144n466p561j071N867N458j170m857l369
$$ 2947 2427 2248 307 -1384 1668 7183 9327 3861 -3700 -4771 1096 6554 5384 527 -2842
1538b842J587J669j002j95K422K575j433o467l741L010P226L159m098n597q64
$$ -2842 -1255 414 -588 -783 1639 4214 2781 -3686 -7427 -4417 2809 5968 1870 -3727 -4591
1553d591L180J752p52o04J632N25l599m609N31P208N430k730q135m392K619N956
$$ -4591 -1411 341 -411 -1015 617 1142 -2457 -7066 -6535 673 6103 3373 -4762 -9154 -6535 -579
1569e79K099k115k176P20j0k135j118L095M861J193n633o330J410O929M986j869
$$ -579 1520 -595 -2771 -2051 -2061 -4196 -5314 -2219 2642 3835 -1798 -8128 -6718 211 5197 3328
1585C328m101j560J519K74p50m32L382K956k216n680k314M623O166O16m645m655
$$ 3328 -773 -2333 -814 -540 -1290 -1722 1660 4616 2400 -3280 -5594 -971 5195 5811 1166 -3489
1601c489j82L178J534l02N19K168J4m103m118J738O632M311l466o309k399M261
$$ -3489 -3671 -493 1041 739 1258 3426 3440 -663 -4781 -3043 3589 7900 4434 -1875 -4274 -13
1617a3M970O55k245j710J41M1k090q13L414M404l47n626m323J860N037K314k827
$$ -13 4957 5612 3367 1657 1798 1839 -251 -1064 2350 6754 6407 781 -3542 -1682 3355 5669 2842
1634B842l763mJ900n6j789N75L777J888l058n826j747N084N801j11m774k582Q54
$$ 2842 -921 -925 975 919 -870 -295 3482 5370 2312 -3514 -5261 -177 5624 5513 739 -1843 -989
1651i89K518L31q93M76J177p76l434l109L248N381J628m231n617r89L963L032
$$ -989 1529 1860 967 1443 2620 1844 -1590 -4699 -1451 3930 5558 1327 -4290 -5279 -1316 1716
1667A716p38k691q4J414l56k394p20L299L347j088n249k731K921M868J235k050
$$ 1716 978 -1713 -1797 -383 -739 -3133 -3853 -554 2793 1705 -3544 -6275 -3354 1514 2749 699
1683F99k840J137J239p66j965R39L627J356k629m927J26M650L928j038n243j924
$$ 699 -2141 -1004 235 -531 -2496 -1557 2070 3426 797 -4130 -4004 646 4574 3536 -1707 -3631
1699c631J857K601k87j100J320J744q37l632j751K862M615O99m119l923J683M027
$$ -3631 -1774 827 540 -560 760 2504 1667 -1965 -3716 -854 3761 4460 341 -3582 -1899 2128
1715B128J499j747j999Q37J509j057k862P9L416L073j949m072j614K642L090m65
$$ 2128 3627 1880 -119 718 2227 1170 -1692 -1613 1803 4876 2927 -1145 -2759 -117 2973 2508
1731B508k432j310J301J291j032j622J719L078O55l612l884O57M761K610j482
$$ 2508 76 -1234 67 1358 326 -1296 423 3501 4156 544 -3340 -2683 2078 4688 3206
1746C206l116n89J559K009j042j162Q89J514j187l006j033K753L654n79l676k451
$$ 3206 90 -499 1060 3069 2027 865 1754 3268 2081 -925 -1958 795 4449 3870 194 -2257
1762b257J078K846j9k505p60K061J542j525l238k8L710K475j964m441p97K603
$$ -2257 -1179 1667 1648 -857 -1617 444 1986 461 -2777 -2805 905 3380 1416 -3025 -3822 -1219
1778a219K882j12j540o34J176K59k348j416K617L062j1l624k835J439M243J301
$$ -1219 1663 1551 11 -623 553 812 -1536 -2952 -335 2727 2716 -908 -3743 -2304 1939 3240
1794C240k429k782O9J857j04j443m49K715J624j293l418j388K544L101j03k784
$$ 3240 811 -1971 -1902 -45 -149 -1592 -2041 674 2298 1005 -2413 -3801 -1257 1844 1741 -1043
1810a043j637J519J905n71j446N55K112M53l179k755P90M297K113j842l731p35
$$ -1043 -2680 -1161 744 173 -1273 -718 1394 1847 -1332 -4087 -3297 1000 3113 1271 -2460 -3195
1826c195K055J722l61j439P35J081p88k058p38L309L418o64l673k658J572L637
$$ -3195 -1140 582 221 -1218 -483 598 -190 -2248 -2986 323 3741 3077 -596 -3254 -1682 1955
1842A955J456k168j238O51J216n05j634N20K474J420k077l809n19L159K730l24
$$ 1955 3411 1243 5 656 1872 1367 -267 253 2727 4147 2070 -1739 -2258 901 3631 3307
1858C307k487j168Q09n24l41n09J652K250p87l160k579J850M038J601k803l085
$$ 3307 820 -348 461 -63 -404 -913 739 2989 2202 -958 -3537 -1687 2351 3952 1149 -1936
1874a936n40K147J781J41o71Q30L41j416k266N58K869K660j425l392j893J996
$$ -1936 -2476 -329 1452 1593 922 1752 2093 677 -1589 -1031 1838 4498 3073 -319 -2212 -216
1890b16L031J87j846q63N61P0j291j079J628K369J391l181l397l49L321K276o44
$$ -216 2815 3002 1156 293 854 924 -367 -1446 182 2551 3942 761 -2636 -2985 336 2612 1968
1907A968k495p15Q10K10p65L81K078J099k085l783j065K508M250N18l057l124
$$ 1968 -527 -1242 -432 -222 -987 -606 1472 2571 486 -3297 -4362 -1854 2396 2914 -143 -3267
1923c267r8K301J176n82m39M32K41j401j599J347L538J554j856l675r26K440K520
$$ -3267 -3365 -1064 112 -470 -909 -477 -236 -1637 -3236 -1889 1649 3203 1347 -2328 -3254 -814 1706
1940A706M14j308m04R14j3j758QK196K321n99l042l193J477L422K139j106k515
$$ 1706 2120 812 408 1322 1309 -449 -441 1755 4076 3477 435 -2758 -1281 2141 4280 3174 659
1957F59j042K26K95k85N12J841N14k501k988l0L885K824r34l201k660J002K393
$$ 659 -383 -157 138 -147 365 2206 2720 219 -2769 -2799 1086 3910 2976 -225 -2885 -1883 510
1974E10J068k59k91O83l54k369j289K175K840J068k828k842l66K656K148n00j170
$$ 510 1578 1319 1028 1711 1357 -1012 -2301 -126 2714 3782 954 -1888 -2254 402 2550 2050 880
1991H80p37j91n95j218L43K695K415j187l821k151J892L465J029j291k240q27
$$ 880 143 -48 -643 -1861 -1518 1177 3592 2405 -1416 -3567 -1675 1790 2819 1528 -712 -1539
2007a539M63Q41K42J083J471n52k938k541J149L391K413j034l123j589J255J902
$$ -1539 -1076 -235 7 1090 2561 2009 -929 -3470 -2321 1070 3483 2449 -674 -2263 -1008 894
2023H94M27o31m60O43p43j706m96K240L073L49l086k641K88K544J523n12q24J67
$$ 894 1321 690 230 873 130 -1576 -2072 168 3241 3590 504 -2137 -1849 695 2218 1706 882 1049
2041A049K21j155n86R42K499J012k016l544j021K147L466L26j730j893l63O32
$$ 1049 1270 115 -471 471 2970 3982 1966 -1578 -2599 -452 3014 3340 1610 -283 -646 -14
2057a4Q5L25Q00M86o09k206j677J607L239J045k093k398q07J626J124J9j51K64
$$ -14 71 396 1196 1682 1073 -1133 -2810 -1203 2036 3081 988 -1410 -2217 -591 533 552 401 665
2075F65Q07j423j565j13J798J908k4k437k305P00K292J016n48o79n49k7j266l49
$$ 665 1472 49 -1516 -1629 169 2077 2053 -384 -2689 -1989 303 1319 771 92 -457 -484 -1750 -2099
2093b099J042K751K77k045k809k88K670K082m44j972j323O10O33M47j65J201N50
$$ -2099 -1057 1694 1971 -74 -2883 -3171 -501 1581 1137 -835 -2158 -1548 -915 -468 -633 568 1118
2110A118q56k314p58J411K210R09j667k055J46J767O52m51o74Q84Q7q35j600O76
$$ 1118 262 -2052 -2810 -1399 811 1720 53 -2002 -1856 -89 563 112 -562 322 409 -426 -2026 -1350
2128a350K048J826m79k521j239M07K222P34n92p6j26m30j97o0J476J533l09k126
$$ -1350 698 2524 2045 -476 -1715 -1308 914 1648 1056 980 854 424 227 167 1643 3176 2867 741
2146G41k108N77K493J602p09j849p15L92P21m93n24Q46R66r15j884l82J692J956
$$ 741 -1367 -790 1703 3305 2596 747 32 424 1145 652 128 974 1940 1025 -859 -1241 451 2407
2164B407k04j867j584K11J091M72k01J10P08J09j428j383N55J919J186j419j772
$$ 2407 2203 336 -1248 -1037 54 526 325 435 1143 1252 -176 -1559 -1004 915 2101 682 -1090
2181a090j240J767J219J52n10o20j49m51o64j82J665J172m69k100r71R92J857
$$ -1090 -2330 -563 656 808 298 -322 -471 -922 -1586 -1768 -103 1069 600 -1500 -2471 -1479 378
2198C78J226j540j478QP64J98K1n4R83L85j009j508l08J467J385k04j247q39L64
$$ 378 1604 64 -1414 -1406 -642 -444 -423 -477 506 891 -118 -1626 -1934 -467 918 714 -533 -1372 -1008
2217a008N77P6j21r8P63j2j528j239J194K210R54j199k063n25J229J254O4l38
$$ -1008 -431 -355 -476 -574 189 177 -1351 -2590 -1396 814 1768 569 -1494 -2019 -790 464 528 190
2235A90j59L02m44n93J88J138J356n42k051j050J062J639K94p88n26J8K22l37
$$ 190 31 333 -111 -704 -516 622 1978 1436 -615 -1665 -603 1036 1330 542 16 34 256 -81
2253h1n56K56J324L75r10j860K92J904O97K33j058r08J41K77J02j58J081N87l39
$$ -81 -637 -381 943 1318 408 -1452 -1160 744 1441 1674 616 -292 -151 126 228 70 1151 1738 1399
2272A399j755j029J444J722K74j479j483j92J357O55j47n43n0Q5p04q06K15J189
$$ 1399 -356 -1385 59 1781 2055 576 -907 -1099 258 913 766 223 173 258 -446 -1252 -1037 152
2290A52J300n63j600l33P48R48P1q08k84P99k16q39j43O13J691N62j405j610o8
$$ 152 1452 889 -711 -1044 -296 652 723 -85 -369 430 214 -625 -768 -155 1536 2098 693 -917 -985
2309i85J251Q94J23j226PJ63l23n4J40Q80K14j145j221o78J853J423o2j216j227
$$ -985 266 1160 1283 57 64 227 -96 -150 -10 870 1084 -61 -1282 -1960 -107 1316 1254 38 -1189
2328a189K00L45P53m54k26P10l48j85j063O63J063J021j173r51o02M86P06L4N01
$$ -1189 -989 -644 109 -345 -571 139 -209 -394 -1457 -794 269 1290 117 -834 -1436 -950 -244 -210 291
2347B91l26L43n59r15j26J049J442p8j477j251J31J630J383l96j372l65q4L21
$$ 291 -35 308 -251 -1166 -1292 -243 1199 1121 -356 -1607 -1476 154 1537 1141 -231 -596 -680 -359
2365c59k34O46Q83M02j066j646J24J669J151n4j473q83J30O03P04k56M85K7n1
$$ -359 -593 53 936 1338 272 -1374 -1250 419 1570 1516 43 -840 -710 -107 597 341 826 853 802
2384H02j237n30O37J367Q97r77j538J72N24O97K29j35K00n61m02p91N04J292J176
$$ 802 -435 -965 -328 1039 1936 959 -579 -407 117 814 1043 908 1108 547 145 -646 -142 1150 2326
2403B326q76j729r60O38J440M86l18j105j13k9J51K53L63P44l72j174j121L34
$$ 2326 1450 -279 -1239 -601 839 1325 1007 -98 -211 -240 -89 164 527 1271 899 -275 -1396 -1062
2421a062J686Q06m52q10r67M27O22j01J77J69K61m37j058m20J185J762j94r29
$$ -1062 624 1430 978 168 -799 -372 250 149 326 495 756 319 -739 -1159 26 1788 1594 665
2439F65j602k07N51J132K05K7k18p31n70k32N85J251P63r43j756o91J242J423
$$ 665 -937 -1144 -593 539 744 771 553 -178 -748 -980 -395 856 1619 676 -1080 -1771 -529 894
2457H94P92j084p44l30j06R2M42L78O48k59j245o73N44J279M69p71r57o93N33
$$ 894 1686 602 -142 -472 -578 -486 -44 334 982 723 -522 -1195 -651 628 1097 326 -631 -1324 -791
2476g91J85M54q4N65o6o86j453q9P93J583K83j412j116j22J153P89L91k16k43
$$ -791 -606 -152 -236 329 263 -423 -1876 -1965 -1172 411 694 -718 -1834 -1956 -803 -14 377 161 -82
2495h2p68m87K10J193J188M75j573j295j32J077J385j94m04q44J75M04j69j71
$$ -82 -850 -1337 -1127 66 1254 1729 156 -1139 -1271 -194 1191 997 593 -251 -76 328 159 -12
2513a2R17nn12r51o90N08J127O01n21r90k23j22M69k8K89K28K1r31q37O41J034
$$ -12 905 900 388 -563 -1253 -745 382 983 462 -528 -751 -873 -404 -432 -143 85 106 -825 -1662 -1021 13
2534A3J029k41j222q81o1R71P41J59l97N6l54p97L40P64R97j39j346q19J26J018
$$ 13 1042 801 -421 -1302 -1363 -392 349 508 111 167 -187 -984 -644 120 1117 978 -368 -1187 -1061 -43
2554d3J193k23p31l81pk60L18L9N78L35m69q62l75P92P67K95o57o43l89J44N03
$$ -43 1150 927 196 -185 -192 -452 -134 -95 483 818 349 -513 -888 -96 671 966 309 -334 -723 -579 -76
2575g6L7O39l4l12j042n32M89J049P68p67j086m46M21Q91M97k49o02q1l47j48
$$ -76 -39 600 566 254 -788 -1320 -831 218 986 219 -867 -1313 -892 -1 496 247 -355 -436 -783 -931
2595i31K33O15O90l11r83l21K33Q97L77n02p46J77l76N92k08M3M05L90o65r80
$$ -931 -698 -83 607 296 -687 -1008 -775 122 499 -3 -749 -572 -948 -356 -564 -521 -116 274 -391 -1371
2615a371J78N03P57J95n01l90k94J02M87K57J48J48o51o87j7L82J274L26l10j265
$$ -1371 -1193 -690 67 262 -239 -629 -923 -821 -334 -77 71 219 -432 -1119 -1136 -754 520 846 536 -729
2635g29m06O70O32M81n03k39J02n10J85L38K08K55k55o30l76M27Q13K73k10m21
$$ -729 -1135 -465 167 648 145 -94 8 -502 -317 21 229 484 229 -401 -777 -350 463 736 526 105
2655A05j33J12k64q3M31N31L24o14o52m06N34P81K49m78p65j81R4L79K82K51k81
$$ 105 -28 84 -180 -263 168 699 1023 409 -243 -649 -115 666 915 437 -328 -509 -415 -36 246 497 216
2676B16n02l40l62O04P84O8n26n74k37P14O37k34k84j13O0j20m56L10P18L04j09
$$ 216 -286 -626 -988 -384 400 468 -58 -632 -869 -155 482 248 -36 -149 -89 -209 -665 -355 363 667 558
2697E58r32l53K86P01k75L11r1k87k21K9l21L83P01rr14n81l38R71N54L85p53
$$ 558 -374 -727 -441 260 -15 296 205 -82 -303 -274 -595 -212 489 480 -434 -1015 -1353 -382 172 557 -196
2718a96k65l67J09J09J14N34j46n60p01K55N68P81J69p02l77k10K39O6L2N47l57
$$ -196 -461 -828 -719 -610 -496 38 -108 -668 -1369 -1114 -546 235 404 -298 -675 -885 -646 -580 -548 -1 -358
2739c58K02n4o57J98N66K16J7n23k17K42K00N31j21p4L1m61n08K69P32O59o1o28
$$ -358 -156 -210 -867 -669 -103 113 130 -393 -610 -368 -168 363 242 168 199 -262 -770 -501 231 890 829 201
2761B01m65k19M23Q50j51m92j75k05J00P1M50J27qm08k45m12O58KL89k90m16j11
$$ 201 -264 -483 -60 790 639 147 -28 -233 -133 -62 388 515 507 99 -146 -558 100 102 491 201 -215 -326
2783c26J57L39l5J24K91j88n29n91N74N06Q96l47r66Lk02J92N41j32j08j53l64
$$ -326 -169 170 135 259 550 362 -167 -758 -184 322 1218 871 -95 -92 -294 -102 439 307 199 46 -318
2804c18%o6P76L52o5j034o55L57N40N64k81k27m45L2p3N7K25K68K9n95m31K84
$$ -318 -318 -384 392 744 679 -355 -1010 -653 -113 451 170 -57 -502 -470 -543 -486 -261 7 36 -559 -990 -706
2826g06M27K38J30k68o4l17R7K6O7J63K16k84m94l24LJ251k01j58o78n02k2Q74
$$ -706 -279 -41 89 -179 -243 -560 -463 -437 -370 -207 9 -275 -769 -1093 -1090 161 -40 -198 -876 -1378 -1400 -526
2848e26N10q5j14m89m83n5N09Q03N4j75q45j65Q5Q07N41l18k77m11j22K31J64
$$ -526 -16 -101 -215 -704 -1187 -1242 -733 70 124 -51 -896 -1061 -976 -169 372 54 -223 -634 -756 -525 -361
2869c61L35L81rl30p93J55L39L25J30j09n08k02J46J39M18K88J36o71q44p7O76
$$ -361 -26 355 346 16 -777 -622 -283 42 172 63 -445 -647 -501 -362 56 344 480 -191 -1035 -1112 -436
2890d36O16N28l15r12k24K73L66N55L4l65l71l40m1O67P01j07k66o45n31N20N71
$$ -436 180 708 393 -519 -743 -470 -104 451 485 120 -251 -591 -632 35 736 629 363 -282 -813 -293 278
2911B78N50k14m56m83mJ34L33O87J00n61m45n03J63N67M10J55p99m64P0k19L03
$$ 278 828 614 158 -325 -329 -195 138 825 925 364 -81 -584 -421 146 556 711 -88 -552 -482 -701 -398
2932c98O97K03k12o32n62R6P18P06P9j014q02L01J31Q87K11L2m11l79l38J4M79
$$ -398 299 502 290 -342 -904 -808 -90 616 695 -319 -1121 -820 -689 198 409 441 30 -349 -687 -673 -194
2953a94O42J65p99o06K74K69P19m00m2p8m92l30J52M69K48R6j52m68p78M17P44
$$ -194 448 613 -186 -792 -518 -249 470 70 28 -50 -542 -872 -720 -251 -3 93 -59 -527 -1305 -888 -144
2974a44M64k01m32p10L90L9M92J08O16p36o35m41N77Q73N5L42r87o4%N90L47j58
$$ -144 320 119 -313 -1023 -633 -594 -102 6 622 -114 -749 -1190 -613 260 315 657 -330 -394 -394 196 543 385
2996C85O1m12k95nK32L69K00N6n53n94P3N85R3L95l62J77n82J74J94n9N76j81
$$ 385 446 34 -261 -266 -34 335 535 591 38 -556 -483 102 195 590 228 405 -177 -3 191 132 708 527
3018E27k86n25m78J281K48K08j86r20k22J66L24L47J27Q3p01l72J93L34N92O1
$$ 527 241 -284 -762 519 767 975 789 -131 -353 -187 137 484 611 694 -7 -379 -186 148 740 801
3038H01l12j011L24n37P46N62ko30l0m84L07K28L79O6k8k33m80O5K16M05J61J07
$$ 801 489 -522 -198 -735 11 573 571 -59 -89 -573 -266 -38 341 407 379 146 -334 -269 -53 352 513 620
3060F20p74j46J83k75P32M69m96l21p10K6P01N34o9n06n86O1R1R9L23K51j00o58
$$ 620 -154 -300 -117 -392 340 809 313 -8 -718 -692 9 543 474 -32 -618 -557 -466 -367 -44 207 107 -551
3082e51j25l67R26K87j30p0m92k44N57k2N4J05k91j86l09J91L48M05k14K00j90
$$ -551 -676 -1043 -117 170 40 -30 -522 -766 -209 -231 -177 -72 -363 -549 -858 -667 -319 86 -128 72 -118
3103a18p80L50J19K84M39p0n71n25m9L86P96j32m2n12k96j13Q75M10n7n79m53
$$ -118 -898 -548 -429 -145 294 224 -347 -872 -921 -535 261 129 87 -425 -721 -834 41 451 394 -185 -638
3124f38J29k4N09M6P7k43ok26p3O69l10K85k27m55j44N80L5R4Pj2k01J59j96R6
$$ -638 -509 -533 -24 22 99 -144 -150 -376 -449 220 -90 195 -32 -487 -631 -51 -16 78 85 73 -128 31 -165 -69
3148f9J17K26o6j41o25M67J27k6K43J24n31l74L6O0L57L18l66j4m01K3L85K42
$$ -69 48 274 208 67 -558 -91 36 10 253 377 -154 -528 -492 -432 -75 243 -123 -137 -538 -515 -130 112
3170A12K59o62R1l61K09L15J11J59j96Ko2l52K81J81l8L1j91j86L00J8p6P5J53
$$ 112 371 -291 -200 -561 -352 -37 74 233 37 39 -23 -375 -94 87 49 80 -111 -297 3 21 -55 20 173
3193A73p6j59l04J77M47P4k73k40j99R7RN27j97k18N4R8m37J67O68P7m77k10l0
$$ 173 97 -62 -366 -189 258 332 59 -181 -380 -283 -274 253 56 -162 -108 -10 -447 -280 388 465 -12 -222 -252
3216b52O7N03j49Q4l74N5p3j25L05l82K59j21m2J27j48K76L4k21Oj03l38K20J3
$$ -252 -185 318 169 253 -121 -66 -139 -264 41 -341 -82 -203 -245 -118 -266 10 44 -177 -171 -274 -612 -392 -379
3239c79K7L15J18m78P5l43M08M4N62k82m90m8J19K09K68l4j95k80j0j66L04N98
$$ -379 -352 -37 81 -397 -322 -665 -257 -213 349 67 -423 -471 -352 -143 125 91 -104 -384 -394 -560 -256 342
3261C42l70N2r9r2J89K6J32l10O6j16j84L12j59K93k51P4K62p78J04L28J73J91
$$ 342 -28 24 -75 -167 22 48 180 -130 -64 -180 -364 -52 -211 82 -169 -95 167 -611 -507 -179 -6 185
3283A85J25n02l35K17L87k41J42J34j65j36m48L66O00L8l79m7j12K24J31K48Q3
$$ 185 310 -192 -527 -310 77 -164 -22 112 -53 -189 -637 -271 329 367 -12 -59 -171 53 184 432 515
3304E15n61L36m59k2J48O4N77k41l92m2q1K45N5L59O9l47k99j6j06M35K86m48
$$ 515 -46 290 -169 -191 -43 21 598 357 -35 -77 -158 87 142 501 570 223 -76 -92 -198 237 523 75
3326G5J41n57r9M72M14J45k43p44Oj06M05N2J30r9kl67l8L49M84k25k28n01K62
$$ 75 216 -341 -440 32 446 591 348 -396 -390 -496 -91 -39 91 -8 -10 -377 -415 -66 418 193 -35 -536 -274
3349b74J26J53M07J2k89n05m5O9J25J69L49r7n52j81k07J13N71l2K43l49j55k6
$$ -274 -148 5 412 424 135 -370 -415 -346 -221 -52 297 200 -352 -533 -740 -627 -56 -88 155 -194 -349 -375
3371c75kL14O30m35p17J20j76L11M03K41j45o29j74M2N29L29k67J50m36m28L04
$$ -375 -377 -63 567 132 -585 -465 -641 -330 73 314 169 -460 -634 -592 -63 266 -1 149 -287 -715 -411
3392d11K10M46J52l77k22k35K5M45P3J64j55Kn21p1L27M24K44k55l77l26kK52
$$ -411 -201 245 397 20 -202 -437 -412 33 106 270 115 117 -404 -475 -148 276 520 265 -112 -438 -440 -188
3414a88K5P46k01j73p65J25M04J55L86k61k10l45K49J78J13J64l81k7m49J59L40
$$ -188 -163 583 382 209 -556 -431 -27 128 514 253 43 -302 -53 125 238 402 21 -6 -455 -296 44
3435D4L18K12n37l08N5K58J98L71l25l54j14O1N5J4N55k10j23k08k41J1J92L84
$$ 44 362 574 37 -271 -216 42 240 611 286 -68 -182 -121 -66 -52 503 293 170 -38 -279 -268 -76 308
3457C08J69m8o07J12k25L69K53n0j13o27l90Q53l2M06K21m57l49k33O8M41L69
$$ 308 477 429 -178 -66 -291 78 331 281 168 -459 -849 4 -28 378 599 142 -207 -440 -372 69 438
3478D38m66l2m24KL16j56L98j01l66R0j82L74o9M19p4o84K36j73O4J07M36K4n11
$$ 438 -28 -60 -484 -482 -166 -322 76 -25 -391 -301 -483 -109 -178 241 167 -517 -281 -454 -390 -283 153 177 -334
3501c34O8j89O5M11N12k78k20m62p3M86K31N00p45J82o50M07K57K15L9k51k57
$$ -334 -266 -455 -390 21 533 255 35 -427 -500 -14 217 717 -28 154 -496 -89 168 383 422 171 -86
3522h6k37k34M02M18K50k06k77m20K02J99OO39j43n00o4j03K40L34k80J01k76
$$ -86 -323 -557 -155 263 513 307 30 -390 -188 11 17 656 513 13 -51 -154 86 420 140 241 -35
3543c5m3M5L7L90K48j96k71k02k34K34J42L04j29L2o13J22L61L01M2k54J00n41
$$ -35 -78 -33 4 394 642 446 175 -27 -261 -27 115 419 290 322 -291 -169 192 493 535 281 381 -160
3565a60m4K22J86M25k85l23k73K11k37O23R3k05k59l90L94J50J6K56K5j67n21
$$ -160 -204 18 204 629 344 21 -252 -41 -278 345 438 233 -26 -416 -22 128 144 400 425 258 -263
3586b63L60l41K49J46N2k45k17lK66K01K86l98k66Pj39R2N24Q0m01p3n12K87K63
$$ -263 97 -244 5 151 203 -42 -259 -262 4 205 491 93 -173 -166 -305 -213 311 391 -10 -83 -595 -308 -45
3609d5Q0J96j06k36m6l1M16j82J6P0l67k3K13K00K3J57k48J04j67K3o6J57P0J89
$$ -45 35 231 125 -111 -157 -188 228 46 62 132 -235 -258 -45 155 178 335 87 191 24 47 -19 138 208 397
3633C97j21k09k88K96P3J54o2n43p1J15J8O14K8n6l40l13R5L09Q3J4k69L6o5K4
$$ 397 276 67 -221 75 148 302 240 -303 -374 -259 -241 373 401 345 5 -308 -213 96 179 193 -76 -40 -105 -81
3657h1L80M8l88K79n14k48J69M41j36L49J38m84o3K06OL3o3j1Q0K5n2k78L72R
$$ -81 299 347 -41 238 -276 -524 -355 86 -50 299 437 -47 -110 96 102 135 72 61 141 166 114 -164 208 217
3681B17j33q1k97J55J42J91j40K70k70k19r1M58j89K2l93K28j17N0knJ96p4o4
$$ 217 84 3 -294 -139 3 194 54 324 54 -165 -256 202 13 35 -358 -130 -247 -197 -199 -204 -8 -82 -146
3704a46l63L86OK51j03l49L94k75l34N11l00L85J52j68l22j54N9J90K48j24M08
$$ -146 -509 -123 -117 134 31 -318 76 -199 -533 -22 -322 63 215 47 -275 -429 -370 -180 68 -56 352
3725C52m18o8L98k35oJ9R4l56N8K34K39N0n25m9n2J47L95j77K03k24k00j0M6r
$$ 352 -66 -134 264 29 23 42 136 -220 -162 72 311 361 -164 -213 -265 -118 277 100 303 79 -121 -131 -85 -94
3749i4K16j5L59n07J5l8M6J19k25K6QK67l89J42k4K12J9J0m29J97j80J35M44j30
$$ -94 122 107 466 -41 -26 -64 -18 101 -124 -98 -90 177 -212 -70 -94 118 137 147 -282 -85 -265 -130 314 184
3773A84m67J35j39L62j15L96j73m49J70j87P6O61l45j16j09J4L0J59k2m9J49n17
$$ 184 -283 -148 -287 75 -40 356 183 -266 -96 -283 -207 454 109 -7 -116 -102 -72 87 65 16 165 -352
3795c52J06k23M11M18k49j77R9j41j64O2K40J36j19j71O7q6K18j09J37J25l4j38
$$ -352 -246 -469 -58 360 111 -66 33 -108 -272 -210 30 166 47 -124 -57 -143 75 -34 103 228 194 56
3817E6k90J15K31J90j34k73j98K91l9L15%j35p9j18J91P1j9J31j7m58k3J2J69
$$ 56 -234 -119 112 302 168 -105 -303 -12 -51 264 264 129 50 -68 123 194 175 306 289 -169 -192 -180 -11
3840a1jP22n61n5M8l75J75K38Ok22J11k16M9J84m8K60Nj58k08m3K37n8K86J24
$$ -11 -12 710 149 94 142 -233 -58 180 186 -36 75 -141 -92 92 44 304 309 151 -57 -100 137 79 365 489
3864D89m27l97J5O10rRn9k72q0L11J55N5q1R2o95J48O0l0J20P5r6l51J48J30j18
$$ 489 62 -335 -320 290 281 290 231 -41 -121 190 345 400 319 411 -284 -136 -76 -106 14 89 -7 -358 -210 -80 -198
3889a98J26K40k92pm29M1L13J27PK73k94l39N4K62j49J75J1k91j71K30m4N61O1
$$ -198 -72 168 -124 -131 -560 -519 -206 -79 -72 201 -93 -432 -378 -116 -265 -90 -79 -370 -541 -311 -355 206 267
3912B67l16j87J16m5P1R5O9j56J8j44p6L08K86m64L04j34k03K81k36K07M08l57
$$ 267 -49 -236 -120 -165 -94 1 70 -86 -68 -212 -288 20 306 -158 146 12 -191 90 -146 61 469 112
3934A12k42n6K63k4NK46q1j82J47o10N86J68l55L99k70k68R4J04J95J39m6k82
$$ 112 -130 -186 77 53 58 304 223 41 188 -422 164 332 -23 376 106 -162 -68 36 231 370 324 42
3956D2k99M28J38J59J8m05j96n9R8L30M8l6m25J74n1J8K59K90J21m85l03K0K42
$$ 42 -257 171 309 468 486 81 -115 -174 -76 254 302 266 -159 15 -36 -18 241 531 652 167 -136 -116 126
3979A26m2K08j68L17k47j82Mm8K83Rj53j70k5n3K94K77j33k18k75J4J99K7M51
$$ 126 84 292 124 441 194 12 16 -32 251 260 107 -63 -88 -141 153 430 297 79 -196 -182 17 44 495
4002D95l15k29j93p4j1K02J32p6k86J03k00O02j18R5j88r3j55K59l22M70N9l01
$$ 495 180 -49 -242 -316 -327 -125 7 -69 -355 -252 -452 150 32 127 -61 -154 -309 -50 -372 98 157 -144
4024a44j83J28L11o8K5NJ9l13O1L1l3L23k2K8r2j66j92k4L29J79j02k13j93Q8
$$ -144 -327 -199 112 44 69 74 93 -220 -159 -128 -161 162 140 168 76 -90 -282 -306 23 202 100 -113 -306 -218
4048b18L09J9R8m4j85l43L18j31N13J03P2m62J9J45j03J92qj13m5j05j85N92l93
$$ -218 91 110 208 164 -21 -364 -46 -177 336 439 511 49 68 213 110 302 294 181 136 31 -154 438 45
4071D5M97l86J9j53j85K49n5PP4n9j87K9J38RM1L77l76m10M21J47m3k8m9j29j36
$$ 45 542 156 175 22 -163 86 31 38 112 53 -134 -105 33 42 83 460 84 -326 95 242 199 171 122 -7 -143
4096a43J28J51K9J40m38J55j09L6p0M67k64j01M6l7jK65j19k12OJ1O2j28n3J09
$$ -143 -15 136 165 305 -133 22 -87 -51 -121 346 82 -19 27 -10 -11 254 135 -77 -71 -60 2 -126 -179 -70
4120g0K19l8R5k02l24L83L34j59m93K73q3k74K7K57K36k85j26J92K74m31J0K96
$$ -70 149 111 206 4 -320 63 397 238 -255 18 -65 -339 -312 -55 181 -104 -230 -38 236 -195 -185 111
4142A11j37l23K22K5L2K47k65K20n18N7L05k81N29k44M0R3l4k39K04q1K78j97
$$ 111 -26 -349 -127 -102 -70 177 -88 132 -386 -329 -24 -305 224 -20 20 113 79 -160 44 -37 241 44
4164D4j63J06j10j82M39o8M0j16J23j96l7J88j90K95l02J79k33j16K79J20j15
$$ 44 -119 -13 -123 -305 134 66 106 -10 113 -83 -120 68 -122 173 -129 50 -183 -299 -20 100 -15
4185a5l09K66l7k8N32j78l5J13n32K92J5p1j37M24j59M5K8j43j21N6J62j70Rj07
$$ -15 -324 -58 -95 -123 409 231 196 309 -223 69 84 13 -124 300 141 186 214 71 -50 6 168 -2 7 -100
4209a00L61k32Q2j29J08k38l04J91M25J01j03J23m95J01K79r8K62N5m72j91L85
$$ -100 261 29 111 -18 90 -148 -452 -261 164 265 162 285 -210 -109 170 72 334 389 -83 -274 111
4230A11j38J51r4J38j26J98k63jK38j97L65l84k91J11M81k77l7J80j00k66J16
$$ 111 -27 124 30 168 42 240 -23 -24 214 17 382 -2 -293 -182 299 22 -15 165 65 -201 -85
4251h5O1n9L8RJ87k65Q7k00J27j68P23n45Q3l45K37L5Q6L8n1m53N4J40N1K52l9
$$ -85 -24 -83 -45 -36 151 -114 -27 -227 -100 -268 455 -90 -7 -352 -115 -80 6 44 -7 -460 -406 -266 -215 37 -2
4276bn1r0k32J0M65j00r9J64k10N8O9K1k5oLq4QO8k62L08o4K84l11J05L9k00L24
$$ -2 -53 -143 -375 -365 100 0 -99 65 -145 -87 -18 3 -22 -28 -25 -109 -101 -33 -295 13 -51 233 -78 27 66 -134 190
4303A90j79lm11J71J87K23k51M6oo9J6j11K36J8j22q1r0M2R1P8L30k20l07L24
$$ 190 11 8 -403 -232 -45 178 -73 -27 -33 -102 -86 -197 39 57 -65 -146 -236 -194 -103 -25 305 85 -222 102
4327A02l49L78l94K74M8j37J60j67q3L23k54L0N6J87k79J44K00j64NR8k17J8p
$$ 102 -247 131 -263 11 59 -78 82 -85 -168 155 -99 -69 -13 174 -105 39 239 75 80 178 -39 -21 -28
4350b8J16J75Nk85j34K46m3J59q3k29M8nM8q8K02P9j73p5j07J20J13M8K1l25K39
$$ -28 88 263 268 -17 -151 95 52 211 128 -101 -53 -58 -10 -98 104 183 10 -65 -172 -52 61 109 130 -195 44
4375D4m6J28j4j09J37J44m33M20k59J36k35n3N2L09l81j09M20l31K71l8p3k62
$$ 44 -2 126 112 3 140 284 -149 271 12 148 -87 -140 -88 221 -160 -269 151 -180 91 53 -20 -282
4397b82k0J23K09R8l29j07JoL83m28L65j96K0j15L99%j28L79n09K36k70J25j99
$$ -282 -302 -179 30 128 -201 -308 -307 -313 70 -358 7 -189 -169 -284 115 115 -13 366 -143 93 -177 -52 -251
4420b51M01J98l91j11j0L5l3M76k97J13j82l49K98n6M20k98K08m12r5J31N39r1
$$ -251 150 348 -43 -154 -164 -129 -162 314 17 130 -52 -401 -103 -159 261 -37 171 -241 -336 -205 334 243
4442B43J39l38k76J69j30J13J21L29m13k45K80k0J63j5K03k64l25L90j78J13p6
$$ 243 382 44 -232 -63 -193 -80 41 370 -43 -288 -8 -28 135 120 323 59 -266 124 -54 59 -17
4463a7J62K48j91k23N1J97j06j31J87l86K73p5J45j2r6K87j49k97j12J56K10K40
$$ -17 145 393 202 -21 30 227 121 -10 177 -209 64 -11 134 122 26 313 164 -133 -245 -89 121 361
4485C61j72l11J28l3J35J83o8j4l40J3L06Q6o0r1J19k39j20P5j17L18p5J35l59
$$ 361 189 -122 6 -27 108 291 223 209 -131 -118 188 274 214 123 242 3 -117 -42 -159 159 84 219 -140
4508a40J25k97L77j1n7L8k65K31l84L20J71O0k03o4o1j74O29l22J97m54J16M6
$$ -140 -15 -312 65 54 -3 35 -230 1 -383 -63 108 168 -35 -99 -160 -334 295 -27 170 -284 -168 -122
4530a22k33K8O98k45k44j45q6K42J71j39J73n56M24m9O0K05m08M3N3j29k0L81
$$ -122 -355 -327 371 126 -118 -263 -349 -107 64 -75 98 -458 -34 -83 -23 182 -226 -183 -130 -259 -279 102
4552A02K0m43Q6L10k32K7K20l11M3K47J63k47q8M0j53M16O0l02j47J9K01r0K27
$$ 102 122 -321 -235 75 -157 -130 90 -221 -178 69 232 -15 -103 -63 -216 200 260 -42 -189 -170 31 -59 168
4575A68k45L12k44K1M2l8L13o7l17o0J65j09J84Q0q6P7j16L8k86N15k71n9J69
$$ 168 -77 235 -9 12 54 16 329 262 -55 -115 50 -59 125 205 119 196 80 118 -168 347 76 17 186
4598A86k38J2O5m0j34J57K28q4J04j69K59p1k40J11m97L78j05K30Qr1%l19K48
$$ 186 -52 -40 25 -15 -149 8 236 152 256 87 346 275 35 146 -351 27 -78 152 160 69 69 -250 -2
4621bl6j09L7K37l80J11jJ30k5J02L45l69k05J41j8%L1jj68K86p2oj1j83j17L57
$$ -2 -38 -147 -110 127 -253 -142 -143 -13 -38 64 409 40 -165 -24 -42 -42 -11 -12 -180 106 34 28 17 -166 -283 74
4647G4j50M4j66J08J29J29l83j57J83K62k03l0p0K83m73L25k2K4L01l32j35K32
$$ 74 -76 -32 -198 -90 39 168 -215 -372 -189 73 -130 -160 -230 53 -420 -95 -117 -93 208 -124 -259 -27
4669b7j35L39l35N0J15L38n13j39L77j77O4k22K14J45k91K39Pj24L61k40m1k72
$$ -27 -162 177 -158 -108 7 345 -168 -307 70 -107 -43 -265 -51 94 -197 42 49 -75 286 46 5 -267
4691b67J84J98K5k7k00P5j11J11Q9J92m60N5R2j53K37J53J06p4J35l83q8K1K97
$$ -267 -83 115 140 113 -87 -12 -123 -12 77 269 -191 -136 -44 -197 40 193 299 225 360 -23 -111 -90 207
4714B07k79J45mK91m25K78j98j33K17k14r2M48kj84j0m4j66n6M0L78k29j10P1
$$ 207 -72 73 69 360 -65 213 15 -118 99 -115 -207 241 239 55 45 1 -165 -221 -181 197 -32 -142 -71
4737g1l25M11k55L50J47j04j25o7r1J43k35K58j4J92j77j69M51r5j96K57k63P4
$$ -71 -396 15 -240 110 257 153 28 -39 -130 13 -222 36 22 214 37 -132 319 224 28 285 22 96
4759I6J13l21l8K14k57L72l24q2L71l23M57l86J16J27j86K1J38k07O1m0J0r5Q0
$$ 96 209 -112 -150 64 -193 179 -145 -227 144 -179 278 -108 8 135 -51 -30 108 -99 -38 -78 -68 -163 -83
4782h3L1R5n5o1J59l1o8q8K80m3m21K60M2l17N0M70j49j95J98j61k11K45L5K2
$$ -83 -52 43 -12 -73 86 55 -13 -101 179 136 -285 -25 17 -300 -250 220 71 -124 74 -87 -298 -53 -18 4
4806DJ72m05o0K21M4l52N96j82k61J50M9l0K52j03N8k96Q4j52JK05L00j21k57
$$ 4 176 -229 -289 -68 -24 -376 220 38 -223 -73 -24 -54 198 95 153 -143 -59 -211 -210 -5 295 174 -83
4829h3R5j49K25K17k36j51J03L4j66r6L42jN5l22J18k21L19%M2o9M4k74J96n0
$$ -83 12 -137 88 305 69 -82 21 55 -111 -207 135 134 189 -133 -15 -236 83 83 125 56 100 -174 22 -28
4853b8%m4N0n7k7p8K8L38j21r7R0j77J38J59Lq6J05n2j63q5j27L42L22j46j33
$$ -28 -28 -72 -22 -79 -106 -184 -156 182 61 -36 54 -123 15 174 177 91 196 144 -19 -104 -231 111 433 287 154
4878A54k01J6n1J7j01J21r4O3J16r4L97l02J85J3l07m9N26n10O6L64l30M1J54
$$ 154 -47 -31 -82 -65 -166 -45 -139 -76 40 -54 343 41 226 239 -68 -117 409 -101 -35 329 -1 40 194
4901A94r2R8p8j03L4J81l56k5J19O6j74J80J3r2j26J51j06J68l3j96K28j60K09
$$ 194 102 200 122 19 53 234 -122 -147 -28 38 -136 44 57 -35 -161 -10 -116 52 19 -177 51 -109 100
4924A00j23l01L99n50J86L01k37K57R2l34o7J17J84J36l9j25j34J95j82K22J21
$$ 100 -23 -324 75 -475 -289 12 -225 32 124 -210 -277 -160 24 160 121 -4 -138 57 -125 97 218
4945B18j26j32R3j05n5j03K62m4MNk32N6L23n6J57j70j18Q2j18q5N4J37j30K93
$$ 218 92 -40 53 -52 -107 -210 52 8 12 17 -215 -159 164 108 265 95 -23 59 -59 -144 -90 47 -83 210
4969B10m17N7J83J15l6k87k3M25q5j81o6K80j40J50j78K93l75n1K43J9k34K85
$$ 210 -207 -150 33 148 112 -175 -198 227 142 -39 -105 175 35 185 7 300 -75 -126 117 136 -98 187
4991A87k35K04k22L07k54P9K89j71k07K82j83R7k28K12l6k77K20l3J83k14R5k67
$$ 187 -48 156 -66 241 -13 66 355 184 -23 259 76 173 -55 157 121 -156 64 31 214 0 95 -172
5013a72J55m5O9J44o1j26O0n4L53k33k27N2L0j21J67n9K85k97p4M1L74j99M8l8
$$ -172 -17 -62 7 151 90 -36 24 -30 323 90 -137 -85 -55 -176 -9 -68 217 -80 -154 -113 261 62 110 72
5037G2k83K88m8m90N65k90P0J07j72J73r2mK57n6o9m7j36j40J35L19M2m63p7J68
$$ 72 -211 77 29 -461 104 -186 -116 -9 -181 -8 -100 -104 153 97 28 -19 -155 -295 -160 159 201 -262 -339 -171
5061a71m3lJ91k6J11l94J51J60LR7J21l64K5K51m1P3J14m29J00J8r4M41l32J43
$$ -171 -214 -217 -26 -52 59 -335 -184 -24 -21 76 197 -167 -142 109 68 141 255 -174 -74 -56 -150 291 -41 102
5085A02J63l37L29j27j10j13K3Q3M4Pp1R8J78j7k12J81k41K76Qj06N5l67P2K97
$$ 102 265 -72 257 130 20 -93 -70 13 57 64 -7 91 269 252 40 221 -20 256 264 158 213 -154 -82 215
5109B15l70k5K53p9j09K41l1j78R3j17L05j21J47k36n5R7K13l45J90k47R3L34
$$ 215 -155 -180 73 -6 -115 126 95 -83 10 -107 198 77 224 -12 -67 30 243 -102 88 -159 -66 268
5131B68j84M03l17J17l27P5K25q4P6J64m34j14K93o5l12K29p2k7J50k7N0J16l22
$$ 268 84 487 170 287 -40 35 260 176 252 416 -18 -132 161 96 -216 13 -59 -86 64 37 87 203 -119
5154a19Q5O4j15k17J67J02J21q6J55l64J52k6K25q2j47K63m02M27j25j17J1o5
$$ -119 -34 30 -85 -302 -135 -33 88 2 157 -207 -55 -81 144 62 -85 178 -224 203 78 -39 -28 -93
$$ [...]
8191i7
##END NTUPLES=NMR FID
##END=
