##TITLE=1H_Ser 4645-Van
 CDCl3, 8 sc, 
 28.1.2020
##JCAMPDX= 6.0         $$ Bruker NMR JCAMP-DX V2.0
##DATA TYPE= NMR FID
##DATA CLASS= NTUPLES
##ORIGIN= UXNMR, Bruker Analytische Messtechnik GmbH
##OWNER= root
$$ XWIN-NMR		Version 3.5
$$ Tue Jan 28 16:31:48 2020 Russian Standard Time (UT+4h)  she@DPX200
##.OBSERVE FREQUENCY= 200.1315
##.OBSERVE NUCLEUS= ^1H
##.DELAY= (6, 6)
##.ACQUISITION MODE= SIMULTANEOUS
##.ACQUISITION SCHEME= undefined
##.AVERAGES= 8
##.DIGITISER RES= 18
##SPECTROMETER/DATA SYSTEM= spect
##.PULSE SEQUENCE= zg30
##.SOLVENT NAME= CDCl3
##.SHIFT REFERENCE= (INTERNAL, CDCl3, 0, 15.7039)
##AUDIT TRAIL= $$ (NUMBER, WHEN, WHO, WHERE, WHAT)
$$ ##TITLE= Audit trail, XWIN-NMR		Version 3.5
$$ ##JCAMPDX= 5.01
$$ ##ORIGIN= Bruker BioSpin GmbH
$$ ##OWNER= she
$$ F:/spectra/data/she/nmr/H-F/1/audita.txt
$$ ##AUDIT TRAIL=  $$ (NUMBER, WHEN, WHO, WHERE, WHAT)
(   1,<2020-01-28 16:30:44.45 +0400>,<she>,<DPX200>,
      <created by zg, POWCHK disabled, PULCHK disabled
       configuration hash MD5:
       00 E9 B6 7A A2 85 ED C7 34 08 36 98 17 FE 4E 26
       data hash MD5: 16K
       9A FE EE 04 C5 B2 69 BC B9 47 0B C4 74 C4 CB A8>)
$$ ##END=
$$ 
$$ hash MD5
$$ 0E B5 FE 43 08 EF 5A 03 1E 5B F0 77 0E 34 B1 B1
##$RELAX= 
##$RELAX= 
##$RELAX= 
##$RELAX= 
##$RELAX= 
##$RELAX= 
$$ Bruker specific parameters
$$ --------------------------
##$DU= <F:/spectra>
##$EXPNO= 1
##$NAME= <H-F>
##$PROCNO= 1
##$TYPE= <nmr>
##$USER= <she>
##$AMP= (0..31)
100 100 100 100 100 100 100 100 100 100 100 100 100 100 100 100 100 100 
100 100 100 100 100 100 100 100 100 100 100 100 100 100 
##$AQSEQ= 0
##$AQ_mod= 1
##$AUNM= <au_zg>
##$AUTOPOS= <>
##$BF1= 200.13
##$BF2= 200.13
##$BF3= 200.13
##$BF4= 200.13
##$BF5= 200.13
##$BF6= 200.13
##$BF7= 200.13
##$BF8= 200.13
##$BYTORDA= 1
##$CFDGTYP= 0
##$CFRGTYP= 5
##$CHEMSTR= <none>
##$CNST= (0..31)
1 1 145 1 1 1 1 1 1 1 1 1 1 1 1 1 1 1 1 1 1 1 1 1 1 1 1 1 1 1 1 1 
##$CPDPRG= <>
##$CPDPRG1= <>
##$CPDPRG2= <>
##$CPDPRG3= <>
##$CPDPRG4= <mlev>
##$CPDPRG5= <mlev>
##$CPDPRG6= <mlev>
##$CPDPRG7= <mlev>
##$CPDPRG8= <mlev>
##$CPDPRGB= <>
##$CPDPRGT= <>
##$D= (0..31)
0 1.2 0 0 0 0 0 0 0 0.06 0 0.03 0 0 0 0 0.0002 0 0 0 0 0 0 0 0 0 0 0 0 
0 0 0 
##$DATE= 1580214643
##$DBL= (0..7)
120 120 120 120 120 120 120 120 
##$DBP= (0..7)
150 150 150 150 150 150 150 150 
##$DBP07= 0
##$DBPNAM0= <>
##$DBPNAM1= <>
##$DBPNAM2= <>
##$DBPNAM3= <>
##$DBPNAM4= <>
##$DBPNAM5= <>
##$DBPNAM6= <>
##$DBPNAM7= <>
##$DBPOAL= (0..7)
0.5 0.5 0.5 0.5 0.5 0.5 0.5 0.5 
##$DBPOFFS= (0..7)
0 0 0 0 0 0 0 0 
##$DE= 6
##$DECBNUC= <off>
##$DECIM= 24
##$DECNUC= <off>
##$DECSTAT= 4
##$DIGMOD= 1
##$DIGTYP= 9
##$DL= (0..7)
0 120 120 120 120 120 120 120 
##$DP= (0..7)
150 150 150 150 150 150 150 150 
##$DP07= 0
##$DPNAME0= <>
##$DPNAME1= <>
##$DPNAME2= <>
##$DPNAME3= <>
##$DPNAME4= <>
##$DPNAME5= <>
##$DPNAME6= <>
##$DPNAME7= <>
##$DPOAL= (0..7)
0.5 0.5 0.5 0.5 0.5 0.5 0.5 0.5 
##$DPOFFS= (0..7)
0 0 0 0 0 0 0 0 
##$DQDMODE= 0
##$DR= 18
##$DS= 0
##$DSLIST= <SSSSSSSSSSSSSSS>
$$ [...]
##$SUBNAM2= <"">
##$SUBNAM3= <"">
##$SUBNAM4= <"">
##$SUBNAM5= <"">
##$SUBNAM6= <"">
##$SUBNAM7= <"">
##$SUBNAM8= <"">
##$SUBNAM9= <"">
##$SW= 24.9337058887773
##$SWIBOX= (0..15)
0 0 2 0 0 0 0 0 0 0 0 0 0 0 0 0 
##$SW_h= 4990.01996007984
##$TD= 16384
##$TD0= 1
##$TE= 0
##$TE2= 300
##$TE3= 300
##$TEG= 300
##$TL= (0..7)
0 120 120 120 120 120 120 120 
##$TP= (0..7)
150 150 150 150 150 150 150 150 
##$TP07= 0
##$TPNAME0= <>
##$TPNAME1= <>
##$TPNAME2= <>
##$TPNAME3= <>
##$TPNAME4= <>
##$TPNAME5= <>
##$TPNAME6= <>
##$TPNAME7= <>
##$TPOAL= (0..7)
0.5 0.5 0.5 0.5 0.5 0.5 0.5 0.5 
##$TPOFFS= (0..7)
0 0 0 0 0 0 0 0 
##$TUNHIN= 0
##$TUNHOUT= 0
##$TUNXOUT= 0
##$USERA1= <user>
##$USERA2= <user>
##$USERA3= <user>
##$USERA4= <user>
##$USERA5= <user>
##$V9= 5
##$VALIST= <valist>
##$VCLIST= <CCCCCCCCCCCCCCC>
##$VD= 0
##$VDLIST= <DDDDDDDDDDDDDDD>
##$VPLIST= <PPPPPPPPPPPPPPP>
##$VTLIST= <TTTTTTTTTTTTTTT>
##$WBST= 1024
##$WBSW= 4
##$XGAIN= (0..3)
0 0 0 0 
##$XL= 0
##$YL= 0
##$YMAX_a= 285799
##$YMIN_a= -119739
##$ZGOPTNS= <>
##$ZL1= 120
##$ZL2= 120
##$ZL3= 120
##$ZL4= 120
##$ABSF1= 10
##$ABSF2= 0
##$ABSG= 5
##$ABSL= 3
##$ALPHA= 0
##$AQORDER= 0
##$ASSFAC= 0
##$ASSFACI= 0
##$ASSFACX= 0
##$ASSWID= 0
##$AUNMP= <proc_1d>
##$AZFE= 0.1
##$AZFW= 0.1
##$BCFW= 1
##$BC_mod= 2
##$BYTORDP= 1
##$COROFFS= 0
##$CY= 11.3945322036743
##$DATMOD= 1
##$DC= 2
##$DFILT= <>
##$DTYPP= 0
##$F1P= 16.9975609425685
##$F2P= -3.02152046262296
##$FCOR= 0.5
##$FTSIZE= 0
##$FT_mod= 4
##$GAMMA= 1
##$GB= 0.15
##$INTBC= 1
##$INTSCL= 1
##$ISEN= 128
##$LB= 0.24
##$LEV0= 0
##$LPBIN= 0
##$MAXI= 10000
##$MC2= 0
##$MEAN= 0
##$ME_mod= 0
##$MI= 1.114404
##$NCOEF= 0
##$NC_proc= 0
##$NLEV= 6
##$NOISF1= 3.799351
##$NOISF2= 2.8
##$NSP= 1
##$NTH_PI= 0
##$NZP= 0
##$OFFSET= 15.70392
##$PC= 1
##$PHC0= -9793.669
##$PHC1= 25.20081
##$PH_mod= 1
##$PKNL= yes
##$PPARMOD= 0
##$PSCAL= 0
##$PSIGN= 0
##$REVERSE= no
##$SF= 200.130013532006
##$SI= 16384
##$SIGF1= 3
##$SIGF2= 2
##$SINO= 400
##$SIOLD= 16384
##$SREGLST= <1H.CDCl3>
##$SSB= 0
##$STSI= 0
##$STSR= 0
##$SW_p= 3612.71676300578
##$SYMM= 0
##$S_DEV= 0
##$TDeff= 0
##$TDoff= 0
##$TI= <>
##$TILT= no
##$TM1= 0
##$TM2= 0
##$TOPLEV= 0
##$USERP1= <user>
##$USERP2= <user>
##$USERP3= <user>
##$USERP4= <user>
##$USERP5= <user>
##$WDW= 1
##$XDIM= 8192
##$YMAX_p= 0
##$YMIN_p= 0
$$ End of Bruker specific parameters
$$ ---------------------------------
##NTUPLES= NMR FID
##VAR_NAME=  TIME,          FID/REAL,        FID/IMAG
##SYMBOL=    X,             R,               I
##VAR_TYPE=  INDEPENDENT,   DEPENDENT,       DEPENDENT
##VAR_FORM=  AFFN,          ASDF,            ASDF
##VAR_DIM=   8192,          8192,            8192
##UNITS=     SECONDS,       ARBITRARY UNITS, ARBITRARY UNITS
##FACTOR=    0.0002004,     1,               1
##FIRST=     0,             0,               0
##LAST=      1.6414764,     0,               0
##MIN=       0,             -119739,         0
##MAX=       1.6414764,     285799,          0
$$ Real data points
##PAGE= N=1
##DATA TABLE= (X++(R..R)), XYDATA
0 0 0 0 0 0 0 0 0 1 -8 8 -8 8 -16 16 -17 24 -31 32 -40 48 -56 65 -75 88 -99 115 -131 150 -169 193 -217
31 -217 243 -273 306 -340 380 -422 470 -522 578 -640 709 -785 869 -964 1069 -1185 1319 -1476
49 -1476 1653 -1861 2109 -2416 2798 -3289 3956 -4914 6409 -9107 15524 -65354 13321 126239
63 126239 -23179 -119739 -90648 -24245 -48599 -42750 22978 53917 -32988 -98442 -48661 36484
75 36484 25310 -18095 -806 45309 18796 -36958 -26890 45292 81439 59114 23333 4647
87 4647 -9990 -3324 42571 91863 78137 7792 -45105 -35497 9415 46437 49508 13796 -30687
100 -30687 -33883 3940 21850 -6759 -26233 995 22926 -10712 -50503 -26490 29946 34204
112 34204 -11786 -30634 -8099 -5205 -29972 -22072 24769 38971 -4806 -42269 -27481 4295
124 4295 8744 2036 7486 8456 -12947 -27890 -6221 22606 17971 -4490 -4523 9571 4317 -14387
138 -14387 -11686 12706 23552 4499 -15849 -10590 7567 10523 -3251 -11520 -4173 2406 -4133
151 -4133 -17633 -20700 -6401 12211 12572 -8360 -29014 -28230 -10436 4455 5639 -3300 -6946 -1505
165 -1505 2822 -957 -5180 1260 12621 13831 5927 3439 12145 17808 11438 9425 24297 32775 12751
180 12751 -15035 -9271 25727 46333 32859 6274 -7900 -6580 4861 22650 33050 18525
192 18525 -8098 -12777 8886 21828 8303 -812 16502 29045 7735 -21213 -17165 14956 33584
205 33584 23357 7680 1793 -3818 -12460 -3696 24608 39052 15211 -21925 -33080 -7286 27198
218 27198 39987 21329 -10015 -26343 -15804 5978 18636 18969 15023 11355 3154 -7983 -6082
231 -6082 12636 30801 30488 15011 -3002 -10945 1299 28333 45456 32777 2868 -14372 -8225
244 -8225 7331 18130 24689 24923 8891 -18542 -27371 -2587 25521 21393 -6674 -21599 -13933
257 -13933 -5286 -6968 -6403 5437 14535 3665 -18345 -25803 -11811 8407 18994 15647 755
270 755 -12913 -11139 4446 18090 18573 9922 1952 -2739 -4913 -2011 10459 24638 22077 1938
284 1938 -14881 -12722 2122 11790 10500 4055 -67 -2112 -5502 -7609 -1919 9843 13141 1939
298 1939 -14156 -18100 -5061 11828 15130 3885 -6340 -8050 -6314 -6578 -4246 2969 8419 3239
312 3239 -9824 -18092 -11521 3563 9982 1208 -12352 -17320 -10574 -502 2378 -998 -1456 1694
326 1694 408 -6822 -9887 -1476 9471 11180 3319 -2852 798 8078 8697 4836 4616 7929 7789 2459
342 2459 -2548 -347 8774 15575 10723 -987 -6297 -1305 4887 4660 527 1242 7361 9478 2647
357 2647 -4640 12 10069 13698 7319 -271 -663 5625 11566 11778 9478 9724 10520 6005 -1337 -3052
373 -3052 4677 15664 16795 5035 -7297 -5813 3711 8549 5361 1107 -529 -2589 -6111 -6732 1784
388 1784 12976 15174 2914 -11563 -13221 -1259 12360 15122 6757 -1794 -1928 1821 2788 3776 7444
403 7444 10300 3942 -8037 -13507 -5082 9829 14190 3746 -9340 -13352 -8953 -3540 -961 -595
417 -595 -103 -1398 -5748 -11264 -9288 1419 9472 5447 -6366 -12871 -8377 2627 8209 5335 2003
432 2003 1100 -1045 -5686 -7238 -1617 6853 9027 509 -10198 -11232 -844 7730 5404 -2194 -6983
447 -6983 -5662 -2592 -2235 -1032 4320 9702 6603 -3614 -8727 -3078 7537 12300 6448 -1078 -1719
462 -1719 3335 5618 3549 3093 5646 5268 -1528 -8233 -6669 3670 11021 7519 -3677 -9141 -4549
477 -4549 1835 3463 361 -1121 1544 4832 2672 1226 4937 11689 12281 5683 593 4228 12168
492 12168 16015 12124 7710 9260 13729 12481 6856 2828 4525 9687 10574 4864 -709 -37 4798
507 4798 4333 -1311 -5612 -4430 -1851 -3065 -7808 -8079 -2625 2064 -1255 -7704 -9120 -5484 -2034 -2270
523 -2270 -4563 -3486 1441 4159 121 -4969 -3106 4510 7858 2456 -5117 -4818 3527 8613 5987
538 5987 1632 2518 4427 2319 -2616 -2909 3348 9719 8314 579 -4648 -877 5962 7921 3864 -1286
554 -1286 -2255 -287 679 88 1484 6168 5703 -1552 -9064 -8003 -447 5099 2275 -5038 -7861 -3940
570 -3940 -318 -1243 -3660 -3598 -1825 -2130 -6057 -9283 -5003 3635 6537 443 -6441 -7046 -1778 2060
586 2060 1521 -618 818 3417 1643 -2993 -3106 2691 7359 4297 -3525 -8256 -4184 3733 5515 1343
602 1343 -2003 -1232 -607 -3579 -6434 -4302 1819 4699 -204 -7277 -7286 -903 4097 2476 -2496 -4814
618 -4814 -3038 -1219 -2284 -2281 2116 6277 3162 -4918 -8718 -4139 3927 6364 1359 -4802 -3902 727
634 727 2984 1716 761 1700 2389 766 -2027 -1260 4879 10708 9079 2924 -425 2792 7057 7187 4001
651 4001 3203 6496 8088 4895 190 984 5211 6543 1821 -4588 -6308 -2795 190 -2107 -4711 -4101
667 -4101 -3156 -5531 -11406 -13446 -8725 -1673 -1140 -7872 -12482 -9387 -2144 555 -2088 -5204 -4463 -1851
683 -1851 -986 -2173 -1249 4156 8450 5448 -602 -3514 19 4824 5885 3017 976 2703 2252 -846
699 -846 -1979 1277 4828 3856 -3038 -8902 -7060 899 6229 3369 -2689 -4580 -2674 -1317 -2223 -2472
715 -2472 1254 5468 3345 -3979 -6064 -376 7336 8927 3146 -3008 -3980 879 4805 6036 6274 6486
731 6486 5134 1394 -1144 1126 7984 12813 10181 3458 1553 6260 11676 11653 10323 10284 11125 8975
747 8975 4345 4283 11117 18463 17715 9170 1636 1672 8092 13921 12626 7479 4277 5050 4664 4064 4840
764 4840 7924 9133 5501 -1662 -5096 -306 7543 9717 6025 1633 -496 -510 -23 653 3683 6339
780 6339 5657 -1115 -6549 -4051 3837 9049 4659 -3798 -8461 -5926 -1483 -64 97 1405 1015 -3346
796 -3346 -8508 -9008 -3131 3648 3834 -2597 -8289 -7001 -1155 3378 2805 -17 -1560 -1731 -2627 -4036
812 -4036 -2812 2851 7129 4392 -2614 -6659 -4324 956 2703 535 -1553 -1192 -2003 -4027 -3663 833
828 833 5613 4650 -1851 -7603 -6102 1820 7767 7084 3478 1558 1604 2249 2826 3970 7123 10210 7668
845 7668 1795 -1234 3104 10184 12910 8292 1202 -2117 329 4113 4581 5250 5966 4734 31 -4268
861 -4268 -3851 1987 6837 4838 -1810 -4885 -2152 1559 2398 1733 2632 3595 439 -5112 -6316 172
877 172 8309 9039 2565 -4672 -6098 -1521 3865 4794 1930 -1149 -1795 -2329 -2640 -874 3161 5363 2646
894 2646 -4080 -7811 -4704 1741 5197 3635 1443 -377 -1967 -3188 -1588 2506 6308 5663 -419
909 -419 -6387 -5018 2421 8480 7473 728 -5007 -4901 -1433 579 1104 3103 4246 1557 -4278 -7191
925 -7191 -3450 2947 5945 1586 -4248 -5879 -2868 1253 3172 3432 2887 887 -2671 -5885 -4171 3392
941 3392 8993 6697 -1029 -5616 -4128 963 3752 2910 1444 43 -2802 -5355 -4156 1413 6226
956 6226 5414 -726 -8498 -9344 -2719 4307 5800 1867 -1954 -3794 -2949 -1569 114 3088 4669 1518
972 1518 -4573 -6402 -2128 4639 7150 3648 -2051 -4700 -3837 -1715 -304 1696 3905 2680 -1799
987 -1799 -6269 -6050 65 5465 4605 -1200 -5852 -5093 -864 2465 3866 4008 2608 -632 -4605 -5325
1003 -5325 -691 6739 9108 3601 -3533 -5284 -974 4408 5449 2722 212 -622 -2324 -3262 -438
1018 -438 4566 6736 3596 -3020 -6765 -4230 1671 5293 4647 1452 -748 -1479 -1818 -777 2139 5354
1034 5354 5296 383 -5434 -5121 1458 6810 6688 1792 -2928 -4231 -2736 -1455 557 2841 3557 700
1050 700 -4355 -6521 -3718 2200 4880 1563 -4720 -6255 -3762 -528 1619 2234 2239 755 -2840 -6701
1066 -6701 -5802 444 5928 4951 -1202 -5656 -5704 -2086 1423 1534 -224 -2180 -4660 -6245 -6448 -1787
1082 -1787 3111 3818 -1354 -8245 -9701 -4438 1529 2660 653 -1641 -2802 -3169 -2599 -435 2542 5111
1098 5111 2987 -2750 -5975 -2785 3627 7071 5135 870 -2463 -2762 -1418 -562 1599 4338 4048 -540
1114 -540 -5287 -5270 -418 5184 5370 441 -4810 -5400 -2399 998 3413 4458 3298 129 -3914 -5344
1130 -5344 -974 5530 7377 3341 -2438 -4300 -1520 2758 4470 3213 1370 -174 -2096 -3560 -1733
1145 -1733 3058 6206 4724 -908 -6107 -4917 382 3790 3075 1339 -125 -1186 -1623 -1062 1792 4867
1161 4867 5277 723 -4200 -4693 -42 5135 6300 3312 -1205 -2882 -2184 -1319 348 3023 4179 1254
1177 1254 -3586 -5546 -3113 2306 4801 1822 -3759 -5923 -3794 -1076 323 810 1127 455 -2411 -5659
1193 -5659 -5927 -1311 3452 3066 -1277 -5215 -5586 -2247 1639 1543 -141 -1666 -3188 -5067 -4444 -1143
1209 -1143 3497 4443 980 -3769 -5154 -1653 2184 2619 1224 243 132 -508 -863 -79 2377 4794 3236
1226 3236 -1325 -4882 -3290 1479 4885 4229 190 -2578 -2718 -2145 -1958 -513 1186 1344 -1153 -5010
1242 -5010 -4857 -1624 2683 2895 -892 -4202 -4647 -2653 -488 1179 2414 2373 1110 -2360 -4156 -1535
1258 -1535 3416 5509 2846 -1307 -2397 160 2825 3683 2037 1436 1358 96 -2102 -1915 1480 4542
1274 4542 4640 931 -3310 -3396 -539 2155 2367 701 -48 -779 -1515 -1838 -173 3014 3972 842 -3935
1291 -3935 -4933 -1458 2751 3825 1953 -997 -1876 -1962 -1516 -1124 954 2051 760 -2253 -4040 -2301
1307 -2301 1510 3615 1831 -1983 -3553 -2188 -904 -361 798 1860 2196 276 -2809 -3687 -786 3116
1323 3116 3468 368 -3018 -3052 -939 803 1103 299 -722 -2039 -4042 -5122 -3478 226 1920 -411
1339 -411 -4989 -6459 -4651 -1808 -1325 -2420 -3041 -3368 -3928 -4432 -4206 -1950 1026 739 -3077 -6488 -5603
1356 -5603 -1126 1728 1755 -226 -2008 -1703 -1575 -825 89 2041 2457 592 -1897 -2037 384 4024 4490
1373 4490 1798 -453 -872 149 1294 2001 2713 3473 3196 1207 -749 -223 2978 4358 2808 -193
1389 -193 -1205 315 2445 2613 1644 1302 1624 1033 -1359 -2107 -157 3004 4088 1823 -1101 -1726 797
1406 797 2305 1980 1484 1726 1109 270 282 1064 3572 5236 2966 -715 -2095 363 3234 3641 2515
1423 2515 745 427 815 42 -662 -139 1152 1116 -1043 -2980 -2437 -839 1222 380 -1738 -2645 -2344 -2185
1441 -2185 -2708 -2063 -716 530 -123 -2394 -4455 -3227 -387 833 -827 -2392 -2797 -1691 -647 -648 -513
1458 -513 -159 98 -1538 -3408 -2945 -502 1569 1570 -837 -2419 -1231 58 185 -352 -276 694 442 -593
1476 -593 -1175 -279 2176 3243 1320 -1255 -1723 60 1428 1605 887 929 1360 555 -893 -1359 648 2224
1494 2224 1888 -988 -1936 -1088 1584 2492 1509 20 -175 123 -370 -379 239 1760 2992 1993 -251 -1020
1512 -1020 806 2480 2192 976 260 248 1065 963 887 1543 2707 1756 -472 -2079 -1167 1102 2455 1978
1530 1978 -758 -984 154 584 127 -79 252 724 4 -1141 -902 192 2008 1873 -587 -1728 -735
1547 -735 177 405 -3 -242 422 1107 -37 -1880 -1607 388 1271 31 -1360 -1961 -771 655 981 155
1565 155 -82 198 -449 -1746 -1902 -147 2130 2035 317 -1935 -2072 426 1398 661 -315 -970 -367 47
1583 47 -160 6 842 1283 -1 -1841 -2316 -895 428 990 -210 -1094 -345 196 -517 -1752 -860 548
1601 548 930 23 -1682 -1814 344 1942 1361 -175 -1009 -970 -538 -133 2 686 1453 1086 -765 -1846
1619 -1846 -569 1452 1994 148 -1534 -1300 598 1274 937 102 854 831 -60 -1411 -1205 734 2423
1636 2423 2178 520 -804 -107 824 1223 974 755 629 166 -183 -164 551 2419 2530 396 -1683 -1717 -61
1655 -61 1701 1565 179 132 700 669 -447 -523 891 1847 1694 -286 -1315 -448 1780 3111 1789 847
1673 847 -68 124 -148 516 1511 2304 2612 1144 -620 -971 952 2018 2042 387 -1078 -576 499 952
1691 952 673 1204 1597 461 -1488 -2167 -831 1294 2242 765 -1410 -1716 -580 333 406 -70 -438 -613
1709 -613 -842 -1552 -1278 -54 1469 604 -1336 -2863 -2312 -967 27 -7 -297 -185 -292 -1551 -2047 -948
1727 -948 1058 1599 698 -1999 -2535 -308 2161 2188 909 -474 -962 -1120 -684 17 1006 1964 1133 -1186
1745 -1186 -2043 -1093 1025 1443 412 -1143 -2187 -1554 -520 -234 -185 609 921 -793 -2574 -2587 -753 1374
1763 1374 1581 354 -980 -1281 -222 59 676 931 982 358 -837 -1348 -31 2233 3525 2160 -53
1780 -53 -1405 -577 980 2198 1631 1468 1442 570 -552 -124 1408 2419 2098 250 -1163 -1128 847 2422
1798 2422 2433 1399 419 -491 -732 -1051 161 1622 2148 1062 -1616 -2275 -858 1270 1766 632 -1335
1815 -1335 -1856 -966 -469 89 822 1969 853 -1430 -2543 -1338 929 2336 1696 174 -877 -488 268
1832 268 584 905 1092 1077 -95 -1456 -1697 159 2255 2319 774 -1392 -1872 -1603 -212 561 465 23 -811
1851 -811 -2258 -2777 -1650 385 1175 -89 -2814 -3737 -2406 -68 1018 208 -750 -1760 -2029 -2268 -1557
1868 -1557 -160 1159 955 -1025 -2153 -1660 238 1402 1142 -66 -536 -722 -436 -252 753 2176 2550
1885 2550 1201 -1167 -1908 -337 1814 3023 2296 314 -193 -31 161 975 1770 1734 675 -1237 -1964
1902 -1964 -1294 1547 2922 1472 -716 -1781 -2120 -674 391 886 658 179 -819 -1681 -1536 246 1935
1919 1935 1547 89 -1885 -1664 -8 1548 1891 2042 1021 516 -444 -358 379 1745 2949 1882 -48
1936 -48 -1155 -135 1778 2745 2045 486 -637 -756 -524 114 1553 2142 1765 -262 -1999 -1725 78
1953 78 1216 1166 -74 -1242 -1377 -1078 -651 207 573 145 -857 -2519 -3020 -1525 686 1626 15 -1750
1971 -1750 -2924 -2344 -1280 -243 260 -221 -1161 -2187 -2798 -1660 362 1217 640 -1895 -3213 -2612 -312
1988 -312 679 870 249 -904 -1709 -2123 -1790 -561 723 882 -737 -2688 -2459 -1342 247 793 -196 -1133
2006 -1133 -1766 -2388 -1598 -887 936 1399 386 -2309 -3036 -2050 183 1949 1146 -429 -1615 -1325 -439
2023 -439 456 1693 2092 900 -921 -1864 -986 1592 3017 2523 631 -833 -633 269 1135 1517 1684 1401
2041 1401 546 -853 -674 943 2379 2809 1116 -1155 -2027 -841 936 1752 2274 1057 22 -890 -1691
2058 -1691 -752 920 1960 1290 -1127 -2385 -1531 304 1659 1528 167 -1034 -1788 -1779 -805 812 1637
2075 1637 1244 -842 -2336 -1995 -743 1296 1359 22 -1203 -1617 -902 -267 483 1119 1232 -203 -1727
2092 -1727 -2354 -1338 709 1951 749 -908 -2233 -1977 -1241 244 396 282 -873 -1921 -2311 -1716 94
2109 94 1014 521 -1269 -2736 -2842 -1194 126 643 650 30 -1395 -1908 -1533 -721 794 881 -58 -1860 -2158
2128 -2158 -1064 378 1116 1125 -49 -1360 -1588 -1421 -592 1312 1995 955 -960 -2242 -1193 719 2284
2145 2284 1338 68 -1089 -719 -266 557 1879 2023 1245 -447 -1532 -784 732 2393 2410 946 -165
2162 -165 -796 -297 478 787 1388 1044 542 -1148 -1251 431 1561 2423 1360 -622 -1573 -844 273 1521
2180 1521 1714 1416 479 -871 -1071 -252 1162 1884 1621 -642 -1790 -1210 47 1493 1468 722 -357 -1343
2198 -1343 -1505 -710 217 1430 925 -192 -1404 -1743 -566 616 1214 257 -878 -1251 -1079 -491 75 1268
2216 1268 1213 311 -1629 -2321 -1825 210 1339 662 -239 -1276 -1768 -1173 -143 155 175 -535 -1385 -2352 -1545
2235 -1545 -138 1293 903 -199 -1864 -2267 -1286 38 470 867 5 -625 -1512 -1255 -239 661 1237 281
2253 281 -1474 -1744 -847 386 903 1123 75 -719 -1474 -1298 -849 714 1329 605 -702 -1718 -1170 74
2271 74 1247 555 -42 -814 -833 -801 -302 1011 1373 1044 -89 -834 -1414 -175 1659 1751 841 74 -174 46
2291 46 394 952 1098 1057 578 -541 -1102 115 1639 2221 1637 245 -669 -808 224 857 1352 1440 375
2310 375 -734 -811 -252 741 1662 641 -281 -1828 -1186 288 1001 1219 408 -253 -809 -1051 -875 -314 484
2329 484 634 -389 -1074 -1408 -711 54 622 189 -713 -863 -966 -1112 -56 409 1236 208 -763 -1865 -1250
2348 -1250 -118 703 552 -154 -873 -1108 -654 99 318 107 -94 -1194 -1652 -1421 -297 448 663 -349
2366 -349 -1446 -1754 -1278 -667 -205 -10 -488 -1019 -1176 -1344 -1039 -340 82 -242 -1447 -1994 -1401 -589 -152
2385 -152 57 -368 -1012 -1443 -1470 -1404 -317 238 524 -429 -1266 -1102 -684 639 729 254 -183 -562 -487 52 299
2406 299 1385 1102 735 202 -787 -247 729 1091 826 338 82 -190 306 394 806 735 365 28 -1094 -316
2426 -316 615 1458 916 262 -567 -800 -246 190 353 798 571 -47 -242 -319 589 824 1136 537 -423 -494 220
2447 220 789 947 1149 737 355 -121 -411 -277 564 1058 565 411 -358 -624 287 545 235 66 -357 -722
2467 -722 -1104 -714 -4 500 388 -445 -1682 -1674 -904 -105 -61 -705 -1044 -1077 -902 -682 -281 -590 -528 -674 -1456
2488 -1456 -1334 -598 -72 223 334 -675 -702 -614 -578 -326 -136 303 223 -48 -853 -459 37 447 583 -27 -585
2509 -585 -1047 -583 -191 203 62 11 -341 -856 -1261 -770 -288 -42 -509 -947 -900 -466 -176 47 -656 -439 -662
2530 -662 -1023 -920 -835 -175 263 89 -376 -990 -1070 -613 -117 -9 -30 -88 -309 -186 -147 400 960 799 507 -30
2552 -30 -103 549 958 1385 1211 816 311 326 461 555 1287 1078 712 542 500 385 556 1008 861 291 119 260
2574 260 -162 25 491 647 593 127 -197 -923 -450 195 404 84 -600 -661 -843 -403 -61 -146 -212 -490 -975
2595 -975 -1182 -399 22 501 359 -536 -1104 -679 -400 102 -294 -293 -183 -438 -430 -622 -435 126 -12 -817 -734 -1021
2617 -1021 -849 -409 -295 -28 -562 -708 -1115 -1307 -1072 -450 -247 -145 -1176 -981 -820 -364 72 67 -648 -874
2637 -874 -1193 -723 -503 130 352 209 -530 -688 -980 -359 158 166 145 -609 -494 -135 243 37 127 -41 50 -243
2659 -243 -660 148 83 736 355 57 -166 -348 -244 18 122 433 -101 -421 -623 -151 466 692 617 -354 -664
2680 -664 -470 -78 614 828 278 54 -133 -96 36 350 754 809 297 -142 78 463 712 758 710 699 62 42
2702 42 665 538 1011 1102 699 346 -230 -119 400 643 844 560 -46 -166 -6 361 678 698 246 -324 -560
2723 -560 -679 90 374 721 136 -178 -240 -577 -298 -366 181 15 168 -642 -958 -532 292 437 -271 -638 -1003
2744 -1003 -1000 -514 162 391 330 -53 -579 -1008 -466 -226 220 279 -135 -800 -568 -1 591 250 204 -213 -509
2765 -509 -631 -337 64 342 858 234 -544 -689 -276 53 631 289 107 -161 -292 -29 103 442 900 430
2785 430 -307 -485 -249 392 1229 1025 462 -211 -403 173 160 586 1004 472 -53 -554 -509 745 968 1062 551
2806 551 -71 -483 -269 736 1064 1183 507 509 -54 -206 413 1073 1184 687 263 -163 93 631 1083 851
2826 851 908 280 -163 -427 68 718 1045 1010 185 -575 -655 -162 396 780 492 -115 -710 -508 81 536 877
2847 877 585 18 -374 -767 -259 638 1229 573 -56 -545 -487 -183 -207 339 330 -25 -353 -796 -535 64 642
2868 642 357 -306 -725 -1435 -764 84 308 139 -85 -563 -1208 -1080 -142 226 616 -96 -782 -1010 -396 195
2888 195 243 587 89 -534 -1193 -1030 -376 36 333 403 -98 -810 -443 -111 80 498 245 -57 -503 -468 -182
2909 -182 711 1127 965 305 -833 -512 38 897 937 1016 114 -415 -105 19 702 901 705 -91 -484 -345
2929 -345 166 660 1181 1043 53 -340 -225 232 784 864 823 726 -49 -249 149 696 1323 895 466 242 -257
2950 -257 278 838 1230 1193 769 16 -199 -105 228 1123 1217 451 -122 -424 145 806 902 1097 532 -291 22
2971 22 271 780 1014 1043 814 -41 -257 -244 471 1129 1014 370 -318 -172 -454 114 266 400 -22 -534 -710
2992 -710 -844 -203 564 527 -35 -910 -1203 -1068 -595 -47 422 -193 -494 -892 -1232 -116 180 460 -170 -654
3012 -654 -890 -730 168 527 550 449 63 -591 -792 -221 187 590 588 95 -486 -529 -271 539 465 180 -164 -785
3034 -785 -718 -486 368 1029 640 38 -761 -854 -326 260 825 516 -324 -448 -351 -175 716 600 396 -93 -431
3055 -431 -677 -23 245 997 462 316 -514 -399 -135 447 867 783 724 292 -226 -368 180 856 935 155 76
3076 76 -436 128 577 1034 1055 617 -217 -463 -211 297 971 884 395 -453 -686 -196 328 723 695 428 -344
3097 -344 -730 -423 323 557 759 306 -414 -315 -623 235 334 641 493 79 -675 -444 -246 637 808 160 -268
3118 -268 -542 -585 -117 873 895 710 -181 -954 -796 -225 254 574 377 210 -670 -604 -263 305 630 316 -429
3139 -429 -1396 -735 -205 -66 540 32 -376 -947 -1351 -697 -379 394 296 -518 -1105 -1055 -456 47 482 487 -459
3160 -459 -664 -889 -198 157 941 784 252 -459 -574 -529 287 1015 1032 684 -89 -118 210 582 970 995 402
3181 402 -149 -272 47 171 1022 1146 647 185 -228 -478 80 301 1021 604 277 -594 -377 151 914 632
3201 632 197 -537 -628 -149 169 953 734 401 -240 -505 -351 -16 390 776 507 -153 68 127 639 952 664
3222 664 835 411 -226 -191 127 818 730 632 229 -131 -118 -107 576 1025 354 229 -301 -417 200 506 853 377
3244 377 -115 -494 -712 -221 292 700 361 -38 -867 -577 -383 131 392 424 -193 -937 -813 -265 352 80
3264 80 295 -241 -1091 -760 -400 -89 73 284 -293 -650 -801 -468 -400 207 165 44 -425 -378 -540 -142 308
3285 308 182 -86 -543 -979 -673 -345 413 405 -282 -634 -750 -605 24 32 205 -94 -203 -265 -632 214 436 485
3307 485 205 -183 -357 -444 -75 610 657 628 354 -233 -214 42 558 910 749 342 60 -77 476 747 1050
3328 1050 823 -91 -49 86 404 576 783 766 112 37 -297 199 436 734 706 177 9 -214 367 425 628
3349 628 774 104 -144 -42 -258 548 798 738 272 79 -126 38 301 713 415 -103 -110 -461 -246 495 518
3370 518 835 369 -311 -578 -339 493 410 562 189 -42 -219 -219 272 318 217 -312 -338 -279 -260 64 641 -42
3392 -42 -79 -404 -767 -152 -212 215 64 14 -256 -396 -287 -702 27 231 97 -514 -390 -483 -342 132 267 -74
3414 -74 -500 -817 -445 -274 301 527 90 -448 -338 -256 -36 263 285 18 -136 -674 -98 74 363 566 272
3435 272 10 -513 -306 -99 107 237 398 78 -78 180 344 179 522 389 161 -197 -98 -29 656 607 669
3456 669 294 7 -287 218 405 681 629 304 164 15 -65 542 352 368 208 -46 -12 20 135 667 510 243
3478 243 46 -169 -233 -42 367 464 516 62 52 67 -13 452 315 245 -21 -86 -193 208 178 546 99 -340 -559
3501 -559 -453 48 172 69 109 -54 -111 -351 -188 -137 -107 -158 -478 -381 -547 -776 -182 142 111 -381 -401 -462 -515
3524 -515 -655 -314 -19 -239 -703 -476 -621 -166 -1 28 -583 -800 -465 -730 -371 -67 -238 -429 -411 -370 -639
3545 -639 -153 85 -162 21 -292 -478 -360 -237 -366 -310 -37 -343 -405 -319 162 -269 220 -102 10 -451 -359
3566 -359 -357 -59 83 314 172 -140 94 -14 -253 157 329 -73 -36 46 20 586 643 325 249 395 -14 11 60
3589 60 486 502 285 414 49 99 464 402 365 33 -108 183 245 67 381 383 56 -111 -201 -57 234 328 358 578
3613 578 -54 -296 -313 -130 213 20 -161 -123 -239 34 92 10 46 138 -283 -362 -282 -354 -245 192 153 126 -85 71
3637 71 -564 -198 124 14 -138 27 -516 25 56 307 199 -71 -347 -394 -89 39 69 68 131 -367 -466 47 -151
3660 -151 -60 -135 -326 -401 -231 -128 52 286 -150 -65 -609 -594 -195 -254 -112 -276 -82 87 -31 -112 -174 -38 351
3683 351 -65 -30 -167 -169 73 552 570 276 223 -32 16 87 520 688 510 265 -24 48 103 523 486 460 69 42
3707 42 -82 424 674 358 665 193 142 -243 181 264 382 506 337 171 50 -140 464 344 164 271 228
3728 228 61 152 338 626 457 240 -42 49 233 169 615 489 261 61 -150 468 170 271 292 14 -167
3749 -167 -207 -115 168 264 232 159 -108 -430 -294 -78 -56 331 -71 -269 -461 -430 -121 31 -25 -135 -534 -810 -468
3772 -468 -424 0 217 -398 -282 -726 -446 -565 70 57 -124 -102 -353 -281 -209 91 175 -103 -209 29 -425 40
3794 40 -137 77 115 67 -518 -521 -120 199 61 436 12 -417 -415 -202 -239 118 218 -203 -368 -638 -394 69 220
3817 220 152 -261 -474 -598 -440 131 94 -28 32 -330 -431 -539 -13 516 13 3 -347 -347 -316 194 703 488
3839 488 267 177 -356 -314 123 488 410 456 190 -209 -96 245 503 345 532 145 -151 -90 380 301 677 348
3861 348 137 -350 -238 236 347 531 334 -82 66 -191 452 283 570 287 -64 -226 -207 -195 305 495 216
3882 216 -161 -422 -649 -159 -52 246 8 -454 -380 -363 -262 78 462 439 213 -460 -329 -202 -123 186 253 -192
3904 -192 -129 -493 -419 -299 -129 -268 -15 -429 -498 -492 -11 201 43 -308 -537 -362 -562 -240 31 129 61 -226
3926 -226 -652 -511 100 134 170 201 -353 -613 -198 -70 68 237 110 -118 -624 -399 40 394 454 50 -98
3947 -98 -361 -430 -98 224 41 -178 -211 -502 -274 -22 482 338 47 -130 -315 -236 -251 276 458 402 149 -148
3969 -148 -379 -147 368 393 580 -109 -236 -293 -212 415 629 302 23 -347 -471 6 431 599 591 116 -336 -352
3991 -352 -150 254 187 295 208 414 -190 12 546 667 303 -124 -317 -74 -210 179 392 419 69 -239 -225
4012 -225 -153 176 202 251 126 -119 -374 -504 154 77 113 124 -453 -345 -568 17 321 334 170 -94 -402 -347 75
4035 75 141 157 -114 -13 -336 -161 -80 44 -121 -37 -459 -888 -500 -110 60 99 24 -425 -720 -522 -513 67 283
4058 283 135 -467 -462 -185 -378 -52 434 115 -160 -365 -223 -409 111 353 213 -268 -330 -524 -170 30 203
4079 203 38 -219 -216 -546 -119 244 165 350 -93 -276 -575 -28 257 295 289 291 -101 -415 101 243 521 167 359
4102 359 21 -66 5 559 639 622 293 28 -70 -8 315 379 934 185 409 69 -127 399 461 445 -78 -328 -136
4125 -136 -76 1 529 222 239 -104 -340 -289 -195 479 612 -35 -148 -214 -100 -33 129 391 159 -138 -498 -371
4147 -371 186 405 172 321 -187 -291 -554 -55 -116 483 184 -391 -278 -283 -6 -113 191 166 76 -499 -172 -295
4169 -295 144 169 -84 -195 -776 -514 -266 -72 401 -60 -313 -347 -364 -633 10 122 -319 -190 -519 -288 -287 168
4191 168 62 -51 -272 -395 -730 -398 337 535 282 94 -523 -589 -150 101 -80 308 305 -247 -197 47 350
4212 350 390 413 311 -119 -162 -24 8 433 163 468 85 -206 -106 383 577 444 271 -132 -182 149 342 449
4234 449 428 222 -212 -189 124 210 330 242 303 -283 -254 117 40 366 459 245 178 58 95 143 265 570 413 170
4258 170 -4 -316 80 54 565 559 544 8 -148 -207 343 436 46 146 -318 -557 -5 319 212 38 -227 -275
4280 -275 -429 -414 -121 247 -2 -130 -399 -503 -142 186 105 21 -357 -304 -560 -463 -340 58 304 -31 -599 -394
4302 -394 -98 -330 -150 101 17 -526 -405 -479 -133 289 63 145 -256 -457 -277 330 144 494 134 -437 1
4323 1 -228 -84 141 277 118 -571 -359 -448 -4 41 -163 -86 -117 -183 54 119 20 435 -76 -105 -383 -149 172
4346 172 420 311 127 9 3 -189 390 595 324 210 264 135 137 250 131 638 559 225 -138 -102 270 489
4368 489 353 346 -4 19 230 152 265 519 243 129 62 -122 -299 -19 498 436 37 -365 86 -87 143 260
4390 260 -10 102 -249 -22 -138 126 472 -78 177 -3 -436 376 272 206 155 -189 -130 -562 -237 334 108
4411 108 77 143 -41 -341 -108 -271 90 146 125 -427 -290 -165 -52 170 235 195 -342 -350 -285 -77 169 186 -300
4434 -300 -315 -370 -284 -318 265 -34 -100 -262 -460 -506 -40 -87 -35 164 -348 -95 -64 -357 184 202 0 6 -377 -255
4458 -255 165 24 -60 -24 -347 -381 -316 63 213 193 223 201 149 -283 129 -143 -120 150 52 -194 -149 -247 247 115
4482 115 428 -148 -166 -16 -148 71 96 123 -261 -173 -63 41 -115 325 249 261 49 188 40 12 307 425
4504 425 193 -215 -194 327 296 215 399 307 13 45 173 441 -35 358 279 -157 -4 26 132 264 -116 7
4526 7 -44 -11 -96 -267 10 -2 -35 -115 -395 -59 194 -6 5 93 135 -154 -591 -266 -110 19 -160 -191 -247 -360
4550 -360 -477 141 133 -13 46 -127 -300 -428 59 122 -10 -352 -257 -53 37 -125 251 -171 -60 -381 -290 21
4572 21 -73 70 -84 -229 99 -270 -315 47 -281 -321 -83 -234 -189 -71 -18 -119 225 -327 -157 -121 -344 -141
4594 -141 -46 -165 230 231 -224 -27 -92 -10 290 116 158 -231 163 19 100 161 143 105 -319 -314 5 -6 266 279 5
4619 5 -84 38 -274 273 11 98 139 114 175 99 31 294 244 345 140 208 142 132 250 82 180 94 -88 -100 174
4644 174 125 56 351 11 217 -29 110 208 24 135 -266 -206 -127 -124 82 -23 -37 -4 -321 -30 -82 125 189 131
4668 131 -157 -58 -175 -197 268 10 103 48 -153 -203 -346 -133 62 -178 -33 -111 -119 -229 -85 -80 90 -352 -486
4691 -486 -140 -57 -30 -124 18 -104 -316 -529 -472 -246 -33 -16 211 -150 -79 -282 -234 -260 219 125 -424 -268 -275 -37
4715 -37 165 -125 -145 -414 -317 -120 -2 213 135 -23 86 -54 -244 50 236 241 174 255 -13 -118 -55 23 21 195
4739 195 -19 9 -98 255 313 -61 279 76 344 173 -40 75 466 127 363 54 2 -196 408 389 62
4760 62 69 -143 197 123 185 158 393 338 116 195 298 97 478 230 -134 -152 -132 167 74 255 321 -99 -39 -412
4784 -412 -237 -3 201 116 276 -105 26 -103 104 -12 6 97 -149 -430 69 123 238 -3 -358 68 -271
4805 -271 -48 -205 -153 21 -76 10 -546 -263 -264 43 -37 -211 -48 -495 -153 -199 -274 126 55 -134 -323 -60 -304
4828 -304 -18 306 159 -97 -253 -213 -265 -143 92 97 -438 -680 -391 -143 294 416 45 -83 -272 -343 -32 -173
4850 -173 176 76 -35 128 22 -211 282 249 76 73 118 -271 -149 357 133 194 179 -48 -181 -212 187 32
4872 32 131 100 284 126 -96 -129 418 352 213 67 55 37 204 560 305 96 152 73 116 -45 152 236 130 373
4896 373 3 -93 9 117 209 248 86 -72 -218 392 132 263 -72 68 -254 7 63 57 137 159 4 81 -212
4919 -212 230 247 184 93 19 -114 -354 134 348 18 71 -209 -243 -277 -196 20 269 49 -36 -18 -519 -246 -52
4942 -52 -228 57 -233 -123 -296 -100 -206 120 23 -174 -289 -465 -75 -293 273 -193 -272 -103 -349 -354 -144 53
4964 53 -74 -247 -188 -202 -368 51 276 250 -77 36 -471 -207 -29 186 57 178 120 52 26 339 229 -91
4986 -91 196 101 -220 -165 162 -43 395 34 -247 32 -310 -117 -8 261 224 314 -7 -2 -11 303 268 362 3 -126
5010 -126 82 171 245 301 265 47 -134 158 10 -74 216 119 -113 45 -68 75 49 441 43 163 -33 166
5032 166 -34 152 530 655 144 -199 -319 -233 -126 296 7 212 -126 -393 -514 157 243 261 9 -28 -373
5053 -373 -118 -60 -112 200 17 -181 -465 -174 -253 10 -268 -80 -475 -6 -131 294 -176 248 -137 -233 -299 -128
5075 -128 -111 -56 133 11 -139 -306 -193 -120 109 65 152 -160 -85 -642 32 391 30 -87 221 -120 -280 -241
5097 -241 135 19 -205 -164 -164 -314 -263 126 287 107 -206 -18 -291 16 70 19 8 -57 -213 -51 -114 78 290
5120 290 -64 -6 -82 -14 -82 277 69 246 -194 -100 -62 -170 241 139 615 -119 -176 87 173 221 315 243 -40 -124
5144 -124 -32 296 65 321 122 280 -98 -60 231 -97 361 246 64 -190 -205 -245 331 75 219 70 123 -379
5166 -379 -274 177 275 207 281 -236 -454 -336 17 268 298 136 -254 -50 83 175 90 15 30 149 -193 -64 -314
5189 -314 -11 8 63 -13 54 -285 -370 238 207 -17 103 -128 -352 -241 -50 177 48 -483 -178 -453 -151 -160 134
5212 134 -248 -51 -351 -312 -11 -262 138 -161 17 -313 -381 -344 -2 165 -249 -39 -82 -210 -266 -89 -54 468
5234 468 99 -328 -226 58 -15 -34 51 -122 -178 -407 228 121 338 17 157 -190 -107 1 -118 -49 265 89
5256 89 -186 -16 86 -153 -96 460 67 -57 88 114 132 333 130 -80 160 61 140 161 113 166 -143 33 8
5279 8 197 55 416 -23 -52 71 175 113 367 191 208 163 428 78 -105 167 128 320 292 -149 15 -37 79
5302 79 77 295 164 118 -125 -94 154 -35 76 200 50 15 -198 -193 -206 132 -295 145 46 0 -98 -266 245 57
5326 57 -15 -5 -226 -73 -24 265 49 -199 -97 -278 -223 72 -214 46 -92 -347 -203 -147 39 -10 1 -203 -262
5349 -262 -327 -46 112 1 -204 55 -136 -229 -170 -41 -209 -74 -158 -33 -112 -407 -141 -101 29 62 -184 -83
5371 -83 -432 -195 153 154 315 -99 -55 -24 77 32 234 -41 -51 118 -19 280 115 -245 252 84 64 -58 -248
5394 -248 83 164 315 185 -30 -173 -321 51 314 101 395 4 220 -289 36 72 411 167 -86 58 6
5415 6 43 356 -103 191 123 -83 168 -30 244 106 10 -221 42 111 196 -111 197 6 -13 29 -65 163 259 323
5439 323 117 98 40 -69 350 294 -2 20 25 36 -26 -23 68 20 216 -86 47 -212 -276 -175 -229 -109 -324 -248 -292
5464 -292 -143 -37 211 -200 -53 -111 -259 -200 -187 -135 -304 -116 163 -270 -9 -424 -340 -45 -295 -292 -295 -301 -70 -249
5488 -249 -87 -103 -189 -141 -75 154 -47 269 -77 -235 -51 -32 -127 95 -57 -124 -186 63 -114 10 -74 37 -93
5511 -93 -161 244 192 104 88 -52 89 172 -4 -15 -75 108 140 281 103 66 242 220 69 67 274 230 254 301 152
5536 152 276 280 166 -85 -44 434 -172 26 47 80 -14 18 14 16 238 242 259 -49 -53 152 -155 247 241 6 51 -112
5562 -112 145 -124 -126 111 33 108 34 -94 73 23 136 100 118 -20 -51 -240 42 -28 220 -318 -158 -156 -88 -89 -88 -221
5588 -221 48 219 -132 -96 68 108 -152 -69 99 130 -154 -482 -148 -100 -21 -302 -161 -408 169 -35 -576 -30
5610 -30 56 -74 -115 82 -27 216 -128 -179 11 33 -107 4 174 -237 -293 -151 -115 -140 -120 -172 -88 -90 112 163 96
5635 96 194 312 25 -35 -132 -45 -48 100 435 231 80 285 443 31 190 65 290 -17 69 -103 80 -114 258
5658 258 116 -30 -45 -118 229 -45 210 149 266 137 65 101 233 674 37 -82 63 64 32 342 -194 85 -190
5681 -190 134 189 -136 -42 54 -38 -80 168 120 153 -170 193 38 -192 124 -195 11 160 317 38 -241 113
5703 113 -228 -92 -106 -98 -141 -163 132 -218 -312 -230 -123 -29 -52 52 -374 16 -227 -28 -152 -81 339 -135 -376
5726 -376 -152 -272 59 102 -236 -250 -188 -387 73 38 -246 39 16 -128 212 -177 -71 27 -66 -76 251 203 -44
5749 -44 -172 -116 -19 74 77 -412 -72 -109 -42 209 51 -126 -204 -217 179 66 196 6 -163 -217 158 -67 10 -57
5773 -57 -272 32 -38 -189 -135 236 199 145 -13 69 276 277 321 101 255 292 -12 54 377 243 198 196 191 -61 163
5798 163 408 438 156 8 -84 216 -333 15 215 142 -38 -28 138 -44 35 181 87 126 -59 28 -353 140 257
5821 257 242 79 -436 -93 -38 18 207 44 74 -150 3 51 -85 221 -189 -249 -155 -244 80 -115 164 -82 25
5844 25 -207 -357 -115 -191 -12 -181 188 -145 14 -299 -63 -161 -40 -66 -16 -172 -352 114 -10 -117 -86 -197
5866 -197 -308 -305 -222 -195 -22 213 -228 36 103 167 -87 -145 196 9 21 -360 -139 -304 139 96 116 -189 -180 21
5890 21 177 206 179 311 -232 -178 -71 11 58 426 -246 -333 9 34 171 388 -62 -23 -64 77 -188 34 355
5913 355 8 116 136 -131 -64 -55 24 -33 355 141 175 165 230 327 402 268 413 87 -7 425 153 435 349 336 3
5938 3 16 280 445 55 61 318 78 -37 203 407 224 68 64 -394 143 154 136 -87 -76 -51 -264 -336 71 -42
5962 -42 -66 20 -154 -94 -54 -66 -140 23 57 133 46 -260 -92 78 -147 76 33 -22 31 -37 -32 -35 -325 -65 193 25
5988 25 261 -134 31 -346 -120 -143 -14 34 66 32 45 -226 60 -112 -61 -170 189 -84 -83 91 67 101 3 122
6012 122 144 257 -356 -147 -24 -149 188 -98 406 -85 -174 -72 152 180 187 -263 7 30 -10 61 316 175 138
6035 138 158 -486 -263 268 -37 92 -115 -92 -219 351 -82 53 -188 62 282 73 -29 -104 154 -146 6
6056 6 53 -78 313 -116 210 318 -69 -27 85 96 -78 180 -29 214 119 -251 151 -239 34 261 -167 -50
6078 -50 21 154 21 259 456 156 -291 -93 41 221 39 83 19 -161 -142 178 41 103 -259 183 67 30
6100 30 -186 -48 275 -60 20 -47 -113 23 194 249 -164 12 -421 -204 131 -24 100 110 54 -89 88 45 175
6123 175 -228 111 -316 92 -44 48 -53 -31 -35 264 213 -361 -81 88 370 -43 27 -145 95 189 -3 172
6145 172 -108 -57 279 228 -390 -99 392 91 -201 127 -103 -107 82 -110 -198 106 4 79 450 -162 44 -95
6167 -95 93 367 143 101 197 231 57 82 126 72 181 90 -119 371 84 66 26 -68 59 -83 275 183 -104 248
6191 248 -30 -28 -94 111 -31 189 220 -95 193 25 121 205 67 -89 -22 -78 141 21 -26 -142 -97 -121 -143 -26
6215 -26 310 32 118 -7 -178 32 -143 -7 4 57 -37 -224 6 -79 -123 -106 -159 -31 -134 -189 -235 -114 42 -6
6239 -6 -48 -93 95 -297 -138 -108 -77 -187 -116 -182 -137 -61 15 -261 55 -102 -58 -114 -68 -554 -131 -15 100 -113 -278
6264 -278 -120 -56 -127 -68 -5 -120 2 189 55 58 -5 -221 -238 -182 5 -242 -73 289 -121 -170 -21 157 34
6287 34 42 276 146 52 -74 -229 -124 188 136 -239 233 -135 -180 140 109 72 65 305 -118 -49 2 97 -108 -215
6311 -215 -134 -237 -43 -269 -84 135 -5 -386 29 128 66 33 -110 142 278 -215 -37 -55 174 296 -208 0
6333 0 65 -12 -158 241 37 157 -141 -114 86 -215 57 -230 11 -96 -180 136 1 -192 -103 67 -195 -88
6355 -88 -330 171 131 277 -83 66 64 47 -56 -166 -55 -21 -66 -236 -228 -224 -71 46 333 13 -151 -53 77 43
6379 43 -78 -143 -129 -32 -202 145 105 -76 37 -23 188 -265 -114 -84 -255 230 -93 72 -97 -26 -247 -29 -28
6402 -28 -274 -71 -341 37 130 -28 285 47 112 97 -215 70 98 -105 335 75 -206 15 -42 142 74 285
6424 285 239 -103 17 -152 152 127 280 34 -25 34 -195 -112 32 87 38 -275 271 234 -178 -129 134 178 -43
6447 -43 416 -99 75 -58 -5 71 -60 -160 273 -44 89 288 -267 -203 -104 148 -26 -10 -374 294 192 191 215
6470 215 257 48 37 -129 -230 183 37 -226 229 -91 196 -55 -134 204 94 17 -115 422 -35 -97 43 125
6492 125 -202 -81 -38 89 -12 -205 -316 105 12 -161 -211 57 -246 19 77 306 116 -245 -26 -81 -199 69
6514 69 248 -142 -86 -214 3 114 -27 -95 11 -18 -106 -85 45 98 -277 -289 -120 -25 195 340 129 124 240 118
6538 118 212 -75 -228 403 166 51 228 -194 -35 -193 -49 113 11 122 -173 24 -230 229 75 -152
6558 -152 543 -122 -50 53 -24 101 267 -39 -121 152 127 245 31 135 9 300 -23 174 67 -34 95
6579 95 -6 -77 301 -22 99 78 195 193 344 -138 50 57 50 -30 -27 -22 218 52 217 -77 132 -132 -51 57 -81
6604 -81 56 63 -155 -75 33 87 -165 98 69 -109 -262 153 -40 182 -242 -193 26 -281 -173 -180 187 -183 32
6627 32 -226 49 -255 -211 -61 -5 8 -129 31 75 96 30 -284 -74 -118 -133 66 -19 24 88 281 65 -184 -76
6651 -76 -124 -142 -42 123 -190 19 187 204 372 3 -46 -173 -257 174 77 -264 -41 -79 213 288 78 131 195 -67
6675 -67 124 131 -51 -193 -19 91 -324 108 -47 191 154 46 366 56 45 -7 17 43 -109 82 293 -56 -99
6698 -99 -99 -12 202 -110 123 12 -39 335 -169 -98 114 14 161 49 -229 22 127 323 -185 -240 -81 1 164
6721 164 162 461 -191 144 -98 -97 17 -125 -263 145 -6 125 189 -79 -30 100 -220 125 -135 87 66 -162
6743 -162 -277 75 -46 -51 188 -144 139 41 145 -81 -83 -255 -2 -83 -39 21 131 -18 22 99 -180 99 17 -238
6767 -238 -83 100 -100 58 -119 -193 -136 38 -261 58 -37 -23 -88 430 2 -52 23 -218 48 -155 65 6 -8
6790 -8 52 218 -111 17 -93 -289 -158 172 51 21 20 155 -14 342 43 156 149 -156 83 12 126 27 -86
6813 -86 49 -49 -122 341 -157 -64 -59 -166 90 296 152 113 136 294 387 -169 -130 -117 303 58 204 327 34 81
6837 81 207 -3 -137 181 292 151 55 -355 -194 52 168 -364 -60 -78 -90 159 224 -93 -207 66 -245 -197
6859 -197 38 251 233 -282 12 -69 -110 110 -28 17 -18 -9 309 -225 152 138 179 -4 -125 -155 -171 89 -147 -107
6883 -107 -185 -197 -470 -332 103 -183 90 -117 -111 -158 -9 23 99 -83 -383 -24 149 -43 -147 -159 -41 -65 -52
6906 -52 -103 -224 -76 -248 4 -339 318 -94 -53 59 42 32 55 165 199 152 -52 -206 -126 167 29 -99 155
6929 155 7 -204 69 98 161 144 46 -288 -89 19 124 114 304 -30 273 13 202 62 49 44 160 -62 -42
6952 -42 -24 349 84 143 -100 -209 -12 36 7 -204 -155 258 -46 -317 18 277 254 -40 -59 -133 131 125 75 174
6976 174 50 144 -81 502 -34 16 -58 -308 157 328 -44 -68 -154 -98 11 154 242 -166 45 47 -40 169 108 -82
7000 -82 -28 145 326 -361 -73 -128 -321 -2 125 316 50 -155 -21 -155 -171 -149 131 -171 268 32 -291 4
7022 4 -140 -154 -207 -85 -126 296 136 38 85 -130 58 117 0 -21 -163 -94 -198 27 -238 63 -61 9 87 53
7046 53 -53 104 217 -176 74 142 93 10 261 -120 12 155 161 4 243 110 78 179 -178 2 -106 29
7068 29 -259 -6 -63 260 101 128 322 -94 -3 15 -57 116 -137 86 37 -96 -88 -159 75 151 -155 75 -189 455
7092 455 -149 51 29 84 176 317 73 -101 -139 105 -223 268 167 50 -201 243 359 -35 163 -369 71
7113 71 -30 10 105 -156 -49 88 111 -168 -81 128 139 50 204 -77 113 -90 95 77 152 114 123 41 -42 18 -66
7138 -66 -4 -19 -94 -140 14 51 -199 206 -207 -52 -11 -481 56 128 109 -74 -76 99 173 15 -71 17 166 59 -15
7163 -15 127 -67 -6 40 -173 -146 -102 282 212 -235 120 -90 -119 31 22 -89 -67 173 -212 44 64 120 -16 -65
7187 -65 14 -239 43 53 91 -80 67 -14 -174 -320 41 -248 26 155 -141 -42 -93 -67 185 241 -30 526 160
7210 160 220 -75 -271 96 189 128 -145 160 -75 -59 158 -23 -25 199 -39 277 114 178 81 52 -34 148 9
7233 9 -250 -29 54 82 -206 -12 6 -17 -90 13 205 149 32 27 -157 0 -165 154 56 164 68 -280 48 -179
7257 -179 -176 -63 -209 110 -28 -89 -75 -79 -89 -165 11 -417 -366 164 -129 196 -60 103 147 -214 -108 -156 138 -205
7281 -205 -104 -419 55 40 -583 -18 41 -207 39 -188 -241 75 178 3 181 134 190 -57 -111 -112 15 94 -30
7304 -30 -70 246 162 104 164 -154 31 -114 43 -12 -27 315 -13 -59 -35 67 -275 79 36 56 -94 -278 76 165
7328 165 119 45 173 53 -57 98 244 -235 107 68 193 139 -149 536 -100 48 -111 10 55 83 25 86 352
7351 352 -50 225 100 -24 -32 -70 17 206 -91 -34 33 -150 45 -322 -8 77 -26 115 63 128 375 140 -302
7374 -302 103 252 -10 71 -2 -72 -133 -147 -62 -200 201 -33 305 -295 -60 -205 18 14 -184 -58 188 91 -241
7397 -241 290 155 28 -45 182 -93 -78 15 192 -82 5 -63 -22 6 -163 288 -41 85 -3 27 233 115 -222
7420 -222 152 165 -199 9 -80 71 -323 -265 -271 -24 -121 -79 -23 227 -342 26 61 -175 -20 -175 -240 -177 81 55
7444 55 -73 99 -59 233 139 211 84 282 102 -67 20 193 134 -15 66 -102 -41 297 -3 130 234 187 398
7467 398 245 82 180 -53 -57 -89 -279 85 63 165 230 22 -263 96 -67 -57 -241 -226 97 -83 11 -60 16 84
7491 84 119 210 321 -7 -83 47 383 118 313 -269 -127 -153 13 -14 86 -109 109 -65 66 303 -47 261
7513 261 102 92 -142 -444 182 -148 102 90 119 -112 -67 -58 -228 -7 -153 -64 -157 -135 109 -50 -109 -200 27 130
7537 130 122 -138 160 -40 227 -195 259 74 10 -199 10 98 -78 119 -85 -68 -15 202 86 236 -143 46
7559 46 -45 -68 76 -186 151 -148 70 -18 64 268 2 -66 121 -41 -134 33 -109 25 -3 370 40 -268 -59
7582 -59 249 -4 -81 -266 85 -156 -100 -25 225 -44 98 5 28 -97 12 -43 -48 288 -130 326 39 100 79 16
7606 16 114 -1 212 -117 -92 -178 -67 156 172 -64 -145 150 -91 -46 156 -45 36 240 -26 272 -8 -143 -72
7629 -72 104 -229 -18 113 150 45 -29 -147 157 -153 117 128 -120 -70 4 41 161 -47 22 133 -122 -286 -123
7652 -123 133 115 249 25 8 -74 -3 28 -115 -110 58 -68 -54 -173 -310 175 104 -2 -31 146 105 107 159 -176 95
7677 95 135 85 -156 -3 183 -71 316 -33 -237 133 59 -89 96 -240 36 -70 122 51 44 -208 115 -146
7699 -146 72 -191 -268 -185 79 302 -240 26 72 -290 246 224 39 27 -72 291 106 64 168 155 73 -62 -40
7722 -40 50 156 24 77 136 157 90 5 62 -60 -84 86 -111 -266 -188 200 210 -249 83 -112 12 -4 -35 -223
7746 -223 -122 188 -203 100 172 4 89 172 -170 -36 60 120 56 3 -30 -119 48 116 -72 -11 -89 -8 7 -115 -21
7771 -21 -175 -31 4 105 -71 -139 -52 244 349 68 -126 -14 -233 5 198 -131 -13 149 -144 19 83 -202
7793 -202 -46 -79 -144 -151 -128 110 -148 -12 -178 27 -90 137 28 -38 50 -71 -47 -132 81 5 -90 -50 -78 -8 -183
7818 -183 -129 208 -23 -252 14 -192 193 213 -96 -232 -137 -266 -63 -71 28 46 293 84 -179 -49 -78 121 133
7841 133 33 -63 208 99 -19 92 267 -39 81 -62 83 211 -27 109 10 -134 111 202 144 -52 154
7862 154 174 118 168 -171 -184 -19 199 182 43 14 10 -143 427 135 123 69 28 -6 -71 140 -30 171 68 167 -176
7887 -176 -36 127 277 165 183 399 70 20 88 144 -31 145 -94 -235 -67 75 81 299 -148 -151 -52 -225 134
7910 134 -128 -88 190 217 87 69 -139 25 -91 86 -111 -135 -10 77 -318 -315 -25 -137 276 -219 -21 230
7932 230 38 -74 -146 -76 228 -46 -1 37 -112 144 41 -1 32 306 -274 -41 -9 -255 -150 17 -55 98 155
7955 155 -16 58 -23 -355 66 55 -197 -51 15 150 6 34 -254 58 -194 14 8 -91 -103 -128 287 -111 258
7978 258 -5 218 177 163 300 -100 99 -55 249 72 -18 -57 251 -130 97 153 -162 68 -107 6 -287 14
8000 14 105 -3 61 56 38 23 98 53 486 -60 -28 -66 -195 111 232 -1 97 -332 32 -115 -167 188 -88 166
8024 166 -302 194 -164 -124 89 -87 165 -141 -268 33 -259 -38 -103 -141 7 20 -95 180 -54 -36 1 -397
8046 -397 53 -9 -69 -83 -485 -79 -18 -177 216 31 -83 -14 -171 24 -200 -98 14 -187 -74 190 113 -180
8068 -180 72 104 133 -91 8 -63 22 -69 -12 56 39 139 -95 -157 22 286 34 -8 -57 24 12 -150 138 12 -232
8093 -232 -233 36 106 -222 -32 -37 145 -49 -264 89 -109 133 53 354 41 -232 352 26 11 370 39 -9 -39
8116 -39 163 -236 -201 -157 106 110 382 -198 0 -7 -4 123 99 91 169 69 2 109 128 275 227 -119 -244 -138 -215 45
8142 45 -73 70 -266 372 269 310 4 -22 -192 205 -58 -14 -32 -47 78 192 -168 119 -13 -17 142 65 9
8165 9 22 326 -302 259 56 -149 -139 333 -84 77 -20 119 -254 -21 -263 144 -15 16 174 -119 -117 -280 -302
8188 -302 176 18 10
8191A0
$$ Imaginary data points
##PAGE= N=2
##DATA TABLE= (X++(I..I)), XYDATA
0 0 0 0 0 0 0 0 8 -8 8 -8 15 -16 17 -24 29 -32 40 -48 56 -68 80 -92 108 -124 141 -162 186 -211 237 -268
30 -268 302 -341 382 -425 475 -531 588 -654 727 -804 892 -986 1092 -1209 1339 -1485 1652
47 1652 -1840 2056 -2311 2611 -2971 3415 -3977 4716 -5737 7242 -9693 14382 -26625 126343
61 126343 285799 52701 -43889 11203 108280 77835 61028 93044 100241 4485 -46524 14401
73 14401 93364 58415 -6353 -192 44838 21410 -21906 2193 74019 85764 32632 -14858
85 -14858 -17837 -5226 18791 58200 82873 45927 -22388 -47211 -4114 50365 67089 40932
97 40932 -3159 -31932 -14260 32307 46986 13479 -8350 14184 29055 -5850 -37359 -5822
109 -5822 45833 37064 -15767 -29697 2665 14121 -7715 -4815 29360 28077 -21251 -47565 -14534
122 -14534 25626 24762 4349 -620 -3191 -21774 -30108 -6396 18061 6999 -17953 -16110 1696
135 1696 -912 -17430 -13274 8746 12041 -9503 -23030 -6071 18546 21234 6385 672 9448
148 9448 14594 6761 -2572 2092 19576 33548 26326 3879 -9314 852 19862 25984 15397
161 15397 507 -3126 4273 9996 6479 3014 7792 12980 7227 -4909 -8510 308 6898 2734
175 2734 947 12312 16287 -3682 -23500 -9890 22670 30506 4022 -22662 -22799 -5609 12285
188 12285 22696 19023 -3187 -26644 -23650 2233 14204 -270 -9230 6550 15820 -5345 -27247
201 -27247 -12681 20032 28720 7034 -11362 -9020 -1364 2542 14704 34111 32784 393 -29624
214 -29624 -22128 14382 42893 37561 6611 -21432 -22024 -141 19731 20605 6982 -5858 -11198
227 -11198 -14517 -16051 -6650 11454 18925 5311 -17017 -29288 -24169 -3594 19226 24092 3222
240 3222 -22356 -25032 -4226 16335 20856 15533 6441 -7899 -20807 -12531 19656 40983 24196
253 24196 -9021 -19284 -4312 7954 5201 2587 9606 12611 -1205 -18415 -16782 2493 16991
266 16991 13910 -1549 -17520 -22166 -10528 9777 19112 11587 -2505 -10049 -9681 -5840 878 11235
280 11235 18168 10622 -7833 -15622 -2922 14286 18159 7604 -3843 -7770 -5769 -3760 -882 5941
294 5941 13507 9540 -5158 -18236 -15153 1145 14093 10324 -3755 -10752 -5580 2400 5089 5847
308 5847 8746 7989 239 -9198 -9074 4158 19405 20150 6300 -6879 -7324 2704 10066 8503 2009
323 2009 568 3772 4015 -686 -1198 6504 12802 7808 -3131 -7113 293 9696 10804 7297 7474 9894
339 9894 8731 2784 -16 4287 12605 16001 9305 -392 -907 7541 13115 8708 1062 -731 2921
354 2921 2761 -3498 -7012 228 9570 8041 -3031 -10733 -8644 -1774 2352 1285 -1538 -316 1468
369 1468 -499 -4260 -2757 5406 11316 6059 -6381 -12968 -4040 9254 11998 4774 -2184 -4789 -6226
384 -6226 -8498 -7083 -174 6515 2843 -10205 -19290 -13575 796 8338 2535 -10339 -17484 -12643
398 -12643 -3186 1323 2159 4276 4109 -3002 -11843 -11142 1218 13152 12146 -1271 -10531 -7181 3118
413 3118 7986 6490 1485 -1591 -3905 -6598 -7530 -1510 8587 11600 2690 -9466 -12042 -3669 6444
428 6444 8144 2458 -1550 -151 1802 843 1902 7208 11901 7917 -2770 -9697 -4778 8597 15222
443 15222 9145 -1148 -4083 -1714 818 605 -320 2425 4701 677 -6791 -6580 2827 11631 10541
458 10541 643 -6288 -3803 4964 9139 8352 8238 11113 10136 4232 708 4620 13374 16423 8620 -1623
474 -1623 -2070 6407 12553 10105 2744 -1849 -1714 -823 -2942 -4485 -1069 3958 1459 -6093 -9835 -5469
490 -5469 377 759 -5394 -8523 -4291 1871 1837 -2222 -3181 512 4430 2832 -2889 -5965 -1982 4681
506 4681 5271 525 -1857 264 2439 -603 -5389 -5532 -154 2631 -1489 -6495 -5247 -111 2044 -963
522 -963 -4847 -4930 -1207 836 -2517 -4897 109 7741 8457 974 -5615 -3047 4995 8998 3939 183
538 183 2204 6093 4360 363 1261 5502 7447 2733 -5057 -6775 298 7909 7656 909 -4551 -5154
554 -5154 -1899 -855 -2181 -968 1986 1385 -4555 -7694 -2981 4652 6557 -575 -8230 -8583 -1821 3195
570 3195 2084 -96 -128 1348 -232 -3962 -6129 -1578 4978 4790 -2070 -6451 -2834 3890 5931 2762
586 2762 -882 -1013 653 -463 -2185 378 6906 9637 4267 -3710 -5897 140 6650 5619 -411
601 -411 -3162 -337 1827 481 -1584 151 3411 2370 -4166 -9587 -5991 2596 6676 2984 -2594
616 -2594 -3792 -1668 616 -40 -511 2831 5720 2216 -3053 -2836 4222 10779 8807 392 -5322 -2802
632 -2802 3331 5035 2620 1272 993 917 -2172 -5210 -4919 -1094 1879 -2651 -8874 -9399 -4099 306
648 306 -1861 -6335 -7811 -4972 -3896 -6886 -8366 -4627 600 1782 -2915 -7835 -7227 -2098 186 -2139
664 -2139 -5020 -3511 -1058 -2509 -5863 -5990 -986 2466 -1152 -9275 -12383 -6265 1247 2168 -2565 -4955
680 -4955 -3960 -1747 -1752 -3474 -2318 2276 5147 1743 -2241 -847 4989 9605 8180 3444 1332 3416
696 3416 4772 3627 4831 8444 10697 7057 87 -3207 287 7313 8721 2809 -2741 -2844 1134
711 1134 3642 2123 1074 2525 3806 -303 -5630 -3940 4612 11874 10009 3066 -1766 65 5574
726 5574 9433 8554 7093 6749 6077 4723 5413 8589 13299 13543 7569 -182 222 6516 11604 10212 6840
743 6840 6169 5481 3289 48 926 6331 10421 5846 -2638 -6705 -1585 6217 8786 3298 -4365 -7185
759 -7185 -4879 -3035 -2940 -1801 272 -269 -5272 -10866 -11166 -5478 140 -1078 -6788 -10305 -9109 -5699
775 -5699 -3276 -1855 -910 -488 -3117 -8104 -10105 -3508 5912 8801 2108 -5293 -6352 -817 4560 4227
791 4227 1824 1530 950 -2336 -4263 -997 4937 7686 3331 -5221 -9313 -5426 1795 4617 2983 -803
807 -803 -2345 -1420 -915 -1536 263 4388 5848 2167 -3232 -2813 3340 8867 8894 4170 883 854 1435 1175
825 1175 2717 6965 9464 5716 -1632 -4557 -901 5748 7689 2970 -2297 -3371 -1051 1031 2008
840 2008 2544 3536 2901 -989 -6328 -5891 759 7275 7288 490 -5407 -5383 -947 2180 1099 -474 -1561
857 -1561 -2839 -5685 -6537 -3540 2017 3102 -2433 -10210 -11931 -6807 -2357 -2232 -3719 -3489 -3553 -6168
873 -6168 -9635 -8025 -1650 3736 893 -6835 -11045 -7010 851 5758 3895 -1598 -4790 -4439 -3151
888 -3151 -2182 193 3520 3882 -114 -5445 -7014 -1972 3562 3322 -1760 -4902 -5469 -4536 -2731 -577
904 -577 2345 3094 -1055 -7384 -10559 -5854 2942 6191 2329 -4322 -7465 -3991 641 1784 346 -98
920 -98 -396 -3133 -6543 -5201 360 5683 4499 -2705 -8285 -7817 -2660 1335 2172 891 -1180 -2717
936 -2717 -4513 -4892 -1502 4007 5574 29 -7036 -7561 -1862 4871 6103 2726 -682 -3004 -3939 -3951
952 -3951 -1264 3963 6603 2780 -4098 -8206 -5227 2460 6798 3128 -3467 -7004 -5471 -2049 512
967 512 2004 2438 1618 -2821 -7593 -7001 -169 5834 5179 302 -4236 -4011 -887 2033 2612 2528 1667 -445
985 -445 -4046 -4806 -886 5053 7884 3175 -4223 -7393 -3839 732 2855 2423 1039 -734 -2818 -4079
1001 -4079 -2904 2162 6251 4125 -3047 -8274 -5316 1796 6787 5574 761 -2501 -3288 -2910 -2582 453
1017 453 3975 3858 -708 -6405 -7233 -2201 2941 3435 -1210 -5768 -6927 -5431 -3235 -867 1233 1721
1033 1721 -519 -6394 -9825 -6138 1061 4615 1670 -3789 -6307 -4099 -1000 954 1039 1176 -595 -4031
1049 -4031 -6431 -5475 -445 4365 4561 -1440 -7797 -7562 -3248 726 634 -145 -1480 -2323 -4634 -5727 -2759
1066 -2759 2911 4718 343 -6109 -7991 -3836 2581 5018 3363 -403 -2782 -3389 -3507 -1765 2636
1081 2636 5233 3081 -2763 -6808 -4891 1857 5877 3589 -1533 -3990 -3762 -2079 163 2592 4410
1096 4410 4641 857 -4012 -4417 467 6579 7494 3767 -790 -1471 1231 3551 4695 5114 4984 2443
1112 2443 -2142 -4314 -1300 4664 8036 4749 -2363 -6847 -5200 -1096 1533 1581 112 -2024 -3952
1127 -3952 -5702 -4174 429 4511 2839 -3362 -8044 -6028 -491 4310 4310 1560 -867 -1527 -1749 -1640
1143 -1640 870 4784 5616 2102 -2583 -4473 -263 5048 6355 2896 -1476 -2900 -2651 -1295 860
1158 860 2733 4251 2309 -3129 -6883 -4915 592 4152 2271 -2600 -5818 -5273 -2300 -163 607 533
1174 533 -772 -4990 -8111 -6895 -1703 3233 3446 -1324 -6656 -6662 -2802 342 393 -281 -886 -1413 -2308 -3041
1192 -3041 -1185 3754 6114 3139 -2474 -4869 -1486 3459 6391 5020 1996 233 -520 -756 161 3232
1208 3232 5035 3281 -1127 -4366 -2720 1916 4618 2567 -1231 -3034 -2976 -2632 -2212 -136 1900 2772
1224 2772 170 -4260 -5612 -2297 2366 3912 1021 -2966 -3757 -1403 1313 2184 2283 2329 1062 -1973
1240 -1973 -3891 -1589 3092 5995 4506 -114 -2883 -1638 1360 2698 2871 2495 1328 -60 -1153
1255 -1153 -913 2325 5987 5020 169 -3948 -3092 1108 3924 3585 1347 440 198 -707 -1913 -1262 1452
1272 1452 2733 450 -2974 -4885 -2831 886 2458 660 -2370 -3656 -3932 -3306 -2230 67 2394
1287 2394 1817 -1740 -5308 -3834 683 3682 2664 -435 -2413 -1741 337 2210 2817 3268 2847 355
1303 355 -2606 -2929 230 3746 4565 1450 -2491 -2920 -1094 146 -21 -636 -916 -1524 -3145 -4475 -3758
1320 -3758 -227 2192 328 -3914 -7018 -5329 -1804 517 181 -1060 -1731 -2338 -2895 -2593 -672 1896
1336 1896 1848 -882 -3799 -3433 766 3741 3205 1090 -83 -157 -188 -170 967 3468 5179 3576 -196
1353 -196 -1860 1079 4499 5906 3300 779 -262 1080 2657 3598 3527 4223 3090 204 -1498 -434
1369 -434 2417 4545 3896 696 -1619 -586 1384 1765 1191 996 603 181 -1042 -1720 663 3664 3728
1386 3728 968 -2413 -2407 139 2090 2043 553 633 1148 580 -1027 -986 1006 2830 1821 -1208 -3499 -2163
1404 -2163 774 2112 885 -1024 -1735 -2176 -2847 -2586 -1310 883 1265 -1418 -4000 -4206 -869 863
1420 863 -130 -2517 -3581 -2414 -1209 -923 -1363 -647 195 -649 -3419 -4009 -2924 -608 784 -578 -2348
1437 -2348 -2474 -1701 -1205 -1515 -1412 -421 -228 -1222 -2575 -2540 -327 2533 2353 -299 -1860 -1776 12 1338
1455 1338 1741 1455 1892 1896 807 -136 585 2814 3504 1714 -667 -1220 878 2897 2807 1207 547 1139
1473 1139 292 -592 -831 884 2297 2868 644 -1469 -694 1742 2240 1426 245 91 801 822 -60 628
1491 628 2474 3261 1543 -1174 -1887 -92 2251 2495 921 -361 247 624 462 -188 245 840 928 -648
1509 -648 -2138 -1189 962 2640 1407 -573 -1333 -828 -163 13 -201 650 1276 641 -1770 -2354 -333 1055
1527 1055 1142 -540 -2781 -2799 -399 626 19 -777 -847 -498 -1257 -2387 -2333 -195 1594 222 -1596 -1994
1545 -1994 -740 626 579 -741 -1220 -352 -69 -602 -1203 -23 1520 1992 156 -1772 -1967 -438 561
1562 561 774 23 -469 226 -424 -1440 -1148 47 1112 905 -1867 -2833 -1342 1280 2086 774 -1142
1579 -1142 -1272 -772 -422 -95 -157 486 1235 16 -1015 -723 646 1668 922 -712 -1252 -331 461 249
1597 249 -267 402 1579 1145 -761 -1984 -1001 1316 2403 1371 -432 -727 208 899 869 761 1008 926
1615 926 172 -748 -583 1480 2884 2145 -169 -1455 -843 854 1532 846 231 562 985 -149 -719 -212
1633 -212 1199 1444 15 -1436 -1768 122 1475 1929 813 -45 -188 -325 -738 -597 858 2286 2111
1650 2111 -542 -1681 -686 1459 2005 1075 -323 -1070 -230 463 19 -138 1040 1691 398 -1623 -2155
1667 -2155 -509 1124 1709 182 -967 -960 -66 66 -73 309 229 -116 -1073 -2482 -1258 1080 2167 552
1685 552 -1733 -2709 -1908 -341 -334 -1030 -654 -303 -1099 -2442 -2274 -510 662 125 -1973 -3448 -2722 -491
1703 -491 718 353 -417 -1115 -1387 -1251 -1274 -1079 312 1736 594 -1117 -1769 -302 790 888 413 -473
1721 -473 -813 -710 -1029 -522 790 1832 1467 -608 -2624 -2475 -40 1714 1476 -629 -1381 -871 39 16
1739 16 578 614 895 -492 -2122 -1978 178 2332 1972 355 -1115 -1388 -726 382 467 519 721 600 -463
1758 -463 -1569 -523 1153 2204 1421 -1076 -1964 -715 1023 1624 1806 1492 952 257 -550 -1275 746
1775 746 2463 2673 563 -1293 -1347 635 1939 1968 699 -378 -1007 -969 -1034 -248 1272 1772 430 -2016
1793 -2016 -3041 -2069 -96 926 185 -1316 -1659 -1290 -1242 -717 -113 608 341 -1642 -3286 -2363 439 2135
1811 2135 1488 -557 -2023 -2097 -817 -109 227 646 558 -797 -2042 -2015 -380 1435 1572 -232 -2664 -2411
1829 -2411 -1092 125 421 331 453 -512 -1856 -2369 -2273 -229 1282 608 -1388 -2636 -2057 -554 824
1846 824 341 -540 -1647 -1877 -2302 -1751 297 1603 1568 -614 -2569 -2962 -720 1618 1609 259 -520 -664
1864 -664 -383 367 1350 2094 2022 884 -676 -1553 333 2388 3371 1984 677 -414 40 548 766 1274
1882 1274 1931 1645 47 -1453 -1126 838 2227 1711 -306 -2032 -2174 -1123 393 778 926 302 -896
1899 -896 -2101 -2280 -923 1465 1767 -358 -1831 -2145 -937 494 1121 460 -248 -1239 -1395 -1108 -442 1274
1917 1274 2657 1397 -1272 -2226 -1608 905 1901 939 234 -310 -537 -683 -7 751 1871 1274 -200 -2235
1935 -2235 -2621 -244 1326 1730 216 -1395 -2362 -1920 -1258 -669 -134 -209 -1468 -2891 -3428 -1798 25
1952 25 469 -646 -2611 -3637 -2715 -1426 -514 23 233 -817 -1881 -3146 -2533 -455 997 974 -990
1969 -990 -2412 -2040 -482 835 1318 324 -822 -1520 -2082 -1779 -52 1934 1913 152 -1990 -2537 -916
1986 -916 973 1517 63 -703 -1136 -1262 -580 394 1044 1625 338 -1193 -2196 -1101 876 1992 1691
2003 1691 349 -761 -567 -158 245 1034 1964 1699 -118 -1431 -1020 996 2725 3119 1313 -622 -1542
2020 -1542 42 876 2145 2984 2042 121 -938 -1020 482 2573 2337 1162 -975 -1503 11 1030 1839
2037 1839 1528 323 -463 -1399 -1878 -1101 590 1832 921 -840 -2261 -2197 -610 739 624 -331 -1452
2054 -1452 -1679 -2061 -1246 -78 1163 911 -793 -2816 -3225 -837 1099 1659 511 -996 -1907 -1911 -734
2071 -734 132 734 872 -287 -2057 -2586 -1046 1187 2124 574 -1071 -2325 -1723 -644 202 806 779 47
2089 47 -866 -2004 -1508 107 1420 1251 -379 -1887 -2047 -653 833 1336 1003 71 -894 -1756 -1943 -357
2107 -357 1479 1804 576 -1111 -1874 -912 906 1534 1277 295 -508 -722 -570 550 1890 2462 1683 -57
2125 -57 -1532 -724 1126 2321 2388 1314 299 -273 -9 525 1498 2262 1749 83 -1505 -1124 413 2423
2143 2423 2982 1122 -647 -1303 -968 148 1118 1797 1318 304 -1057 -1130 -88 1564 2049 993 -899
2160 -899 -1357 -736 158 1503 1259 829 -141 -798 -1725 -1049 232 1381 1317 -53 -1668 -1943 -782 614
2178 614 1218 488 -568 -1272 -1870 -1315 229 1265 1555 128 -1821 -2886 -1056 608 1026 480 -821
2195 -821 -1555 -1599 -911 24 670 585 -566 -1875 -2550 -1630 281 1398 966 -510 -1994 -1896 -1382 -258 308
2214 308 583 304 -494 -1478 -1426 -121 1350 1284 -161 -1249 -1634 -872 496 1234 1221 846 -424 -1298 -1434
2233 -1434 -425 1127 1599 554 -610 -1482 -734 461 1179 977 274 -505 -1122 -1073 -78 857 1732 1409
2251 1409 -190 -1423 -1196 327 1708 1489 962 93 -437 -109 476 951 1640 1616 230 -916 -1117 386
2269 386 2067 2405 1386 -46 -574 -338 651 759 1516 1183 665 -31 -787 177 1422 1931 1514 40
2287 40 -751 -722 13 1115 1612 1130 475 -110 -1367 -1101 262 1427 1175 138 -996 -1442 -426 348
2305 348 971 146 -707 -1345 -1814 -1235 -55 731 1014 122 -1483 -2016 -1164 -72 677 38 -823 -1312 -1146
2324 -1146 -458 -239 254 489 -91 -1039 -1763 -1129 -215 688 674 -49 -742 -1258 -993 -784 -104 537 565 -128
2344 -128 -756 -1457 -323 978 1005 177 -1080 -1489 -1231 -293 671 630 62 -620 -1398 -1880 -1119 172 314
2363 314 -152 -861 -1683 -1376 -257 529 87 -321 -675 -1102 -1197 -633 199 882 1138 189 -736 -838 326 586
2383 586 1026 840 329 256 166 271 686 1394 1764 865 -380 -772 160 1274 1604 1666 644 18 -100 26
2403 26 289 882 1168 308 10 -278 -56 733 1349 1300 128 -390 -414 12 319 851 1079 505 179 -794 -453
2424 -453 -48 650 1016 378 -828 -759 -503 429 673 567 192 -481 -695 -972 -58 533 836 459 -669 -1213
2444 -1213 -798 -7 310 285 -213 -612 -722 -741 -368 -4 365 625 -219 -1165 -1314 -657 -328 637 -87 -228
2464 -228 -676 -1352 -1004 -376 83 56 -80 -1096 -1357 -1059 259 815 380 -720 -964 -1076 -318 517 600 712
2484 712 203 -155 -452 -277 525 1122 570 179 -107 -198 396 914 600 875 532 457 -206 -418 214 873 1081
2505 1081 1022 -168 -563 -229 106 362 453 170 116 -334 -259 94 122 897 266 -500 -744 -656 81 397 586
2526 586 493 185 248 -90 394 415 704 1137 616 371 352 645 1292 1601 966 1051 822 459 864 890 1268 1686
2548 1686 1676 674 220 337 694 1073 524 418 -332 -169 538 411 417 328 556 -96 -818 -444 -354 333 571
2569 571 124 -378 -578 -573 -347 -444 -408 -176 -371 -479 -1145 -741 -152 194 -6 -1138 -1227 -1200 -504 -11 115 12
2591 12 -271 -591 -886 -479 33 232 26 -151 -800 -569 71 416 223 186 -75 -289 -486 -259 32 306 253
2612 253 280 43 -404 -272 18 87 17 134 -35 -8 -277 -248 273 631 749 -329 -534 -376 292 912 1237
2633 1237 597 157 140 110 576 727 1064 543 540 344 463 616 1212 1484 888 341 13 396 619 1278 899
2654 899 794 598 728 -176 99 641 646 1006 472 -48 116 -16 1223 718 892 413 199 -244 158 448
2674 448 1286 1294 1015 -124 -63 259 337 793 967 159 -45 231 161 699 1010 892 748 -21 -281 -159 686
2695 686 803 1211 521 464 -5 -31 378 389 708 267 -36 -753 -799 -100 610 662 -105 -854 -779 -545 -42 -158
2717 -158 -24 -159 -71 -1036 -867 -525 -180 423 -293 -552 -864 -690 154 260 45 377 -60 -518 -529 -682 128
2738 128 756 863 229 -410 -509 -231 294 372 478 54 -194 -363 -55 586 900 1058 347 -295 -330 -135 618
2759 618 1507 1116 136 174 4 67 580 710 922 512 358 -348 89 428 1094 876 602 142 90 -208 261
2780 261 1058 984 826 509 -114 -253 270 849 1091 811 182 -641 82 710 1131 1298 927 224 -440 -201
2800 -201 144 926 1282 569 85 -114 -503 214 458 533 533 -58 -635 -471 -104 692 1014 397 -302 -660 -853
2821 -853 -126 315 568 640 171 -281 -565 -460 -9 290 480 -186 -757 -1011 -396 473 921 403 -549 -1043
2841 -1043 -1245 -858 -365 211 261 -130 -469 -1229 -1236 -385 254 157 -404 -829 -1148 -659 -129 543 217 -11 -729
2862 -729 -877 -755 -228 471 729 218 -256 -471 -847 79 659 371 13 -430 -875 -518 -57 1057 698 118
2882 118 -539 -1165 -616 -90 716 469 218 112 -339 -483 -234 237 614 258 -5 -468 -223 55 734 1056
2902 1056 859 410 -95 -235 -68 678 975 1120 405 53 -328 334 887 963 907 219 -507 -286 59 822
2922 822 1290 882 269 -322 -505 -149 207 827 595 31 -485 -320 -168 320 530 338 -112 -392 -520 -382
2942 -382 186 547 667 433 -128 -502 -408 167 662 850 631 -114 -398 -417 297 625 708 381 -745 -1039 -632
2963 -632 90 395 668 220 -732 -1290 -629 -205 217 363 -236 -672 -1239 -312 -214 -37 335 -204 -958 -1321
2983 -1321 -881 -373 -42 277 0 -313 -823 -1333 -633 -5 694 17 -241 -796 -431 -194 333 813 167 103
3003 103 -754 -495 -283 666 1232 517 141 -354 -351 274 848 908 801 647 220 199 170 859 944 874 417 -245
3025 -245 -588 209 616 1444 1272 243 -246 -398 -222 430 972 1098 157 -59 -615 -201 535 1103 1013 155
3045 155 -348 -532 -65 348 915 816 144 -50 -334 -250 391 993 927 473 -64 -86 -223 718 1072 1076 447 65
3067 65 -552 -421 376 683 916 424 -71 -460 -611 -66 349 686 475 -178 -719 -784 -218 584 386 11 -965
3088 -965 -1202 -1381 -618 527 627 224 -746 -1125 -869 -290 188 501 355 -486 -1053 -790 -338 337 446 255
3108 255 -356 -1000 -578 -562 120 459 380 28 -1046 -1135 -838 84 371 494 -699 -595 -1001 -497 16 9 28
3129 28 -704 -964 -1295 -832 -200 452 219 -290 -1038 -863 -661 -130 307 401 -199 -534 -793 -325 29 708 533
3150 533 -72 -373 -535 -102 446 918 940 406 -91 -449 -401 114 1153 1039 744 -9 -297 90 645 760
3170 760 969 584 6 -523 -324 234 619 1187 433 159 -459 -279 42 397 671 31 -83 -589 -577 -67
3190 -67 107 621 130 -154 -675 -945 -213 262 797 401 -221 -935 -728 -160 596 758 351 -159 -686 -654 -287
3211 -287 685 667 645 -54 -678 -817 296 665 785 875 10 -395 -528 -217 -219 61 366 71 -582 -880 -503
3232 -503 -144 239 381 -456 -925 -743 -1045 -235 257 190 -179 -893 -960 -909 -469 396 -37 -295 -617 -921 -545
3253 -545 87 557 -51 -26 -801 -969 -608 74 479 551 -362 -425 -442 -130 45 259 341 -185 -425 -641 -414 60
3275 60 691 408 541 -400 -481 -222 -47 -13 493 339 -297 -450 -318 -50 328 544 335 -241 -560 -300 182
3296 182 633 807 604 -5 -269 -274 130 471 922 660 370 39 89 260 508 791 749 488 182 1 354
3317 354 802 1178 571 359 -263 -623 118 531 553 610 410 -480 -148 87 173 418 350 -178 -553 -456 -296 167
3339 167 379 260 -38 -363 -902 -684 -335 207 -27 65 -460 -551 -170 -315 38 93 -4 -538 -412 -393 14 408
3361 408 346 24 -455 -740 -622 -447 175 241 189 -312 -777 -414 -75 99 180 -480 -764 -814 -715 107 262 119
3383 119 -274 -792 -938 -711 -251 80 -138 158 -737 -449 -582 -333 83 108 30 -17 -401 -284 123 27 526
3404 526 530 -312 -575 -653 -116 237 540 320 -104 -314 -455 27 559 182 547 -202 -142 -412 13 591 710
3425 710 480 45 -239 -452 36 349 579 648 68 97 -252 255 353 140 482 130 -260 -192 -86 252 672
3446 672 250 295 -92 -435 -206 19 99 607 186 62 -24 -146 82 224 218 -234 -480 -125 -289 115 454 542
3468 542 188 -233 -435 -355 -65 174 228 -29 -91 -91 -330 -287 107 154 -48 -358 -544 -472 -301 4 285 -255 -127
3491 -127 -539 -866 -495 -98 128 -200 -75 -340 -448 -544 -1 -222 -50 -465 -663 -290 -461 121 -135 83
3511 83 -187 -117 -401 -479 -270 178 -78 21 -320 -276 -347 -140 212 90 -248 -256 -245 -258 78 230 246 151 -109 -201
3535 -201 -295 -320 384 478 42 -190 -77 -299 307 129 254 134 -42 204 -101 448 447 559 687 223 233 148
3557 148 192 313 156 283 488 198 87 413 848 258 284 -143 162 79 88 379 453 836 316 -21 59 235
3579 235 47 599 342 216 194 -51 67 39 431 306 -15 -317 90 -261 82 65 340 43 -309 -215 -767
3600 -767 -372 153 -181 -304 -198 -316 -312 -431 -470 -337 -453 -485 -656 -879 -754 -135 -306 32 -241 -620 -665 -285
3622 -285 203 119 -182 -226 -464 -399 -15 41 204 252 -320 -259 -482 -179 73 219 -142 95 -160 -406 -365 -565
3644 -565 62 105 47 -18 -584 -404 -243 7 -88 -293 -153 -411 -685 -386 267 207 -192 -140 36 -205 100 3
3666 3 173 -13 -105 -167 -65 131 60 408 224 225 -231 -52 199 528 471 660 377 310 142 167 419 184 436
3689 436 389 187 235 99 380 591 115 74 -124 -312 63 467 370 627 42 -419 -483 -43 37 200 396 133
3711 133 -271 -332 -295 108 385 83 258 -120 -330 -148 -66 443 453 173 -140 -427 -290 98 -44 124 -32
3732 -32 -388 -466 -102 -196 175 82 44 -225 -624 -305 -202 353 -3 -18 -583 -602 -666 -104 -293 57 -73 -515 -683
3755 -683 -465 -106 -205 -218 -89 -164 -516 -520 -404 -279 73 -38 -143 -445 -490 -200 -131 195 -6 -390 -526 -126
3777 -126 262 173 359 60 172 -348 -280 223 446 495 657 44 -336 -339 -109 326 -22 236 246 251 -166 -93 180
3800 180 371 138 67 -560 -222 -532 98 112 573 387 -57 -235 -43 6 476 400 127 132 -242 -64 308 847
3822 847 555 102 -303 -190 -68 94 607 457 310 198 108 131 -131 306 370 285 176 -217 -165 112 640 392
3844 392 373 348 -46 -19 -257 111 303 338 -458 -367 -346 -99 44 230 387 -244 -413 -581 -150 237 397 103
3866 103 -214 -586 -650 -327 3 255 294 -317 -464 -307 -324 -39 392 -106 -261 -501 -246 -245 -59 558 26 -119
3888 -119 -365 -531 -660 68 242 -66 150 182 -494 -585 79 -76 170 -30 -211 -498 -450 0 363 65 -67
3909 -67 -194 -461 -648 -81 314 225 -38 -5 -177 -265 231 161 266 147 158 -80 -235 -5 294 87 262 153
3931 153 -118 73 -120 600 353 471 -176 -133 -65 68 525 261 629 187 -77 -284 55 255 384 571 242
3952 242 -163 -59 -5 394 640 255 226 102 -70 -223 -92 561 50 -56 -129 165 55 226 328 191 173
3973 173 -43 -280 26 276 502 541 215 -277 -171 -239 53 191 357 188 -412 -545 -186 192 432 99 -383
3994 -383 -379 -413 -66 -203 47 176 -219 -385 -148 -44 -143 78 236 -86 -500 -510 -302 -101 110 94 -194 -492
4016 -492 -539 -371 -257 155 164 236 -226 -262 -459 -256 -434 237 238 -572 -416 -190 -86 188 56 -56 -555 -614 -693
4039 -693 69 73 199 226 -249 -156 -384 48 63 132 187 -303 -194 -322 -492 -31 476 460 130 -501 -130 -136 396
4062 396 416 385 302 40 20 174 415 517 419 323 -52 -232 156 291 665 476 232 -88 -130 15 218 559
4084 559 492 172 -244 125 178 172 356 608 373 104 -75 87 376 247 633 235 -401 18 -146 180 399
4105 399 386 -58 -168 -294 -160 255 678 184 -69 11 -291 -81 -129 291 129 34 -455 -398 -303 -95 -359 143
4127 143 91 -234 -440 -461 -291 89 -17 -61 -116 -568 -697 -97 -53 17 354 -180 -561 -354 -67 47 -109 -14
4149 -14 -297 -591 -549 -232 182 280 154 -63 -501 -612 -366 375 295 141 -71 -468 -648 -214 247 477 210
4170 210 -245 -259 -181 -152 115 210 178 -146 -76 -442 -317 270 526 633 -128 -406 -535 -93 316 605 608 385 361
4193 361 -311 -89 169 348 327 329 78 182 -272 272 611 404 658 110 211 -106 251 401 442 394 107 56
4215 56 167 48 47 489 435 78 -119 -234 -10 283 347 55 -169 -373 54 78 324 314 60 39 -424 -106 234
4238 234 258 28 268 -21 -579 -228 43 -68 332 279 -27 -200 -380 -77 20 193 127 -303 -371 -357 -315 -17
4260 -17 239 -167 83 -500 -352 -35 98 281 -121 -330 -382 -589 -310 -111 242 -256 -280 -484 -331 -95 -97 156
4282 156 -15 -45 -300 -512 -291 43 40 183 -48 -40 -370 -252 16 324 -8 41 -62 -241 69 42 84 417 104
4305 104 -296 -175 -137 12 368 563 303 5 -265 -179 -204 48 459 112 -322 -74 -171 -84 449 231 262 -95
4327 -95 -325 -97 4 251 260 199 -74 -128 2 -342 175 393 -75 114 -118 41 203 191 456 95 -199 -187
4349 -187 -104 93 25 132 461 112 -123 -160 233 273 54 -111 -117 -434 -270 378 61 299 -254 -30 122 -561
4371 -561 140 -93 -118 405 97 -149 -397 -423 -278 -342 -10 -136 -321 -554 -365 21 145 121 -146 -184 -425 -377
4393 -377 95 295 -72 -303 -125 -309 -530 18 244 -117 -203 -467 -393 -106 56 39 -261 -143 -197 -474 -77
4414 -77 -230 -71 -129 75 -258 -509 -144 -149 -153 5 192 -246 -308 -296 -99 165 216 113 -156 -353 -189 -47 -37
4437 -37 405 397 -138 -191 -427 158 468 127 108 -79 163 79 79 344 332 156 123 68 -33 144 297 384 338 218
4461 218 386 -76 78 189 423 -26 167 34 20 -35 298 251 168 153 73 -67 -82 288 243 231 54 150 -10
4484 -10 -215 145 261 18 7 -218 62 -175 360 214 44 131 -15 -229 -205 101 -82 375 29 166 31
4505 31 -408 -52 -215 131 142 -301 -177 189 -259 -199 -192 -3 -91 -142 -337 -133 71 38 -144 -150 -25 -422 -194
4528 -194 -62 -428 -294 -102 -55 -257 -267 37 -49 -96 -286 -274 -303 -207 111 94 -96 -185 -339 -441 -228 -52 -25
4551 -25 449 -3 -184 -420 -217 -28 387 164 268 1 -424 16 33 16 291 126 108 2 219 125 -5 -98
4573 -98 36 116 -439 -238 -20 98 51 269 -11 -67 15 -156 75 -172 -179 131 32 50 -67 143 332 247 40
4596 40 -345 356 113 289 333 432 16 -80 90 356 216 382 627 301 -74 242 262 148 257 85 217 213
4618 213 128 -120 110 135 444 236 -281 167 -40 119 248 130 294 73 -24 112 -293 242 191 0 -322
4639 -322 -38 -66 -123 52 149 -60 -302 140 -370 73 213 -51 72 -344 -338 -68 175 -97 26 -114 7 -282
4661 -282 -183 -148 -330 -9 -58 -216 -183 -147 -449 19 139 -36 -48 -143 -275 -86 43 -18 -47 -331 -107 -407 -226
4684 -226 40 -271 40 -42 -274 221 -349 -470 236 272 155 -27 115 102 -231 -82 184 36 -82 -79 -18 -12 9
4707 9 196 87 -67 -130 -23 223 255 196 75 88 -26 220 308 140 58 319 -22 236 92 157 417 606 142
4730 142 85 169 86 119 -59 204 280 198 -6 443 -20 18 216 287 266 142 -138 -52 -84 488 341 100 142 -341
4754 -341 -155 -234 327 297 10 108 -120 -60 -158 -45 169 1 -211 -239 69 75 -27 -161 -341 -425 -472 -233 -291 -128
4778 -128 -122 102 -154 -60 -147 -204 -354 137 15 -85 -247 -208 -423 -61 -3 32 -222 -431 -397 -129 -85 10 104 -127
4802 -127 -435 -318 -321 -87 363 -190 -190 -136 -55 -112 292 -16 115 23 -94 -151 -11 -28 217 117 -2 -19 95 110
4826 110 14 199 548 399 -145 97 119 8 395 595 122 32 -148 -189 207 167 272 -11 -82 -90 200 289 161
4849 161 120 288 26 -136 150 -7 70 595 134 204 51 182 65 174 341 352 334 29 -21 126 310 379
4871 379 137 -84 9 -105 155 333 160 273 168 32 -318 -305 357 157 44 184 -127 109 235 -42 101
4892 101 75 -317 -296 -140 -6 -34 -34 252 -96 -466 -308 -197 -197 -135 79 -258 -121 -367 -268 -302 115 -93 -102 -580
4916 -580 -395 5 -268 186 240 -257 -513 -545 -493 -177 20 175 -177 -191 -46 -394 -128 26 -139 -279 -375 -351
4938 -351 -185 -134 -227 88 -79 -90 -288 -295 -211 231 -141 -222 73 -118 64 201 14 142 137 76 -137 85 -115
4961 -115 343 220 168 153 -102 325 106 524 305 220 183 -122 91 283 298 411 282 -18 48 -54 64 342
4983 342 -72 322 213 44 -142 195 325 82 -3 42 46 -103 39 124 224 -38 76 -287 -206 -213 222 429 -218
5006 -218 -247 -299 -134 93 78 63 69 -17 -438 -164 97 -185 -50 232 -245 -407 -81 279 81 -89 125 -103
5028 -103 -321 -32 -54 -41 51 186 244 -54 -160 43 119 318 205 -38 -499 -157 -305 -171 173 -156 -111 -378
5050 -378 -416 -261 -292 -159 -34 -94 -135 -461 -184 -26 201 -1 -302 -200 -227 -140 55 240 279 -174 -84 232 -285
5073 -285 -236 202 254 -21 -7 -164 62 -195 -21 386 164 176 -16 -128 39 299 64 344 -61 51 9 228
5095 228 295 335 307 61 53 -241 -46 8 452 133 92 -31 -142 -11 140 364 285 -12 -163 52 219 538 90
5118 90 215 70 208 17 254 156 282 44 313 120 116 -175 170 299 395 484 -306 12 -173 -71 106 -84
5140 -84 268 -107 168 -366 189 -156 117 20 -59 -117 -156 -43 75 209 10 -232 -262 8 -100 -232 -114 -25
5162 -25 -138 -411 -437 -246 283 223 -324 -225 -615 -294 -90 122 -23 78 -273 -148 -308 -126 43 -554 -165
5183 -165 -250 -90 16 -42 -286 141 -47 -261 -67 -57 -80 -33 -228 -384 -156 -217 -246 -271 27 35 134 70 -142 -486
5207 -486 -27 67 259 95 -61 -324 -216 147 140 273 279 17 -54 -29 -194 341 63 18 203 -266 23 -211 -70
5230 -70 333 149 -47 -86 -55 253 45 277 28 203 264 -136 -194 -139 504 664 15 10 62 0 14 179 334 -4
5254 -4 101 -213 -100 315 442 195 91 133 136 -224 228 280 59 155 -1 -42 1 211 217 28 -37 117 -233 -58
5278 -58 -29 312 254 33 -65 -48 -49 -180 -6 -168 7 52 -60 -219 -65 -95 218 -98 23 -174 -148 -62 173 -282
5302 -282 108 -255 -168 -223 -414 -80 343 -271 -12 -151 69 -293 76 42 82 135 -125 -425 -377 -102 186 39
5324 39 -369 -178 -193 -143 -36 131 243 119 -70 5 -207 236 86 104 90 -354 -124 -191 -36 -31 171 138 -86
5347 -86 -37 -66 -45 76 -20 141 81 -26 -157 147 416 82 48 -95 -18 76 -102 294 168 402 410 -87 -149 30
5371 30 112 -112 113 109 -204 84 -34 232 534 205 248 12 -39 82 174 136 87 112 204 65 154 408 220 366
5395 366 85 -184 249 98 171 266 168 63 -477 -200 90 211 -57 75 -159 -239 -192 -218 -156 91 127 167 259
5418 259 14 -212 50 -135 -90 296 -94 -158 181 134 0 -91 174 -168 -471 -124 -30 -14 -141 18 -253 -204
5440 -204 13 -84 0 22 -48 -353 -231 -177 -13 -344 130 -201 -75 -214 -414 132 -155 -177 -222 -239 -308 -352 -48
5463 -48 57 138 23 -152 -329 401 -8 -155 -49 -83 -151 79 84 185 330 -81 -92 -327 60 180 -92 97
5485 97 17 124 309 86 199 107 128 160 122 176 177 -13 74 385 168 221 213 69 116 244 91 327 474 248 -57
5510 -57 41 -134 196 252 196 99 90 -83 281 78 11 52 79 85 -5 -28 -14 64 37 141 28 -57 -402 -281 -147 195
5536 195 266 -123 -110 -166 -148 -26 -76 -36 101 -367 -281 253 71 -145 159 6 -242 -392 -99 -222 -348 -213
5558 -213 -231 -425 -147 -251 104 -276 -41 -257 1 -39 -84 -157 -61 -238 -317 -79 -149 -67 109 129 -150 -156 -201 -215
5582 -215 -388 44 4 -59 -48 -322 104 -127 198 8 59 -17 77 172 -116 45 -167 151 199 148 171 68 -106
5605 -106 7 -151 -132 -38 94 291 67 -123 99 -38 58 -172 189 -6 106 349 59 181 345 112 -201
5626 -201 141 109 85 -89 226 321 80 -154 155 95 262 -58 42 211 209 278 -41 -109 253 51 -91 194 29
5649 29 58 74 -91 -61 -45 40 87 388 -54 80 -18 201 -20 -110 54 73 -282 425 6 68 142 -73 -460 -215
5673 -215 126 -170 -157 -191 116 286 -195 -89 -108 -255 -24 -410 -224 -96 -130 -302 -122 94 68 88 -211 -300
5695 -300 131 27 -60 -114 -194 -58 -156 -108 -355 -65 71 -141 -24 -221 -75 -279 -103 -14 36 112 -314 -193 186
5718 186 -93 43 -176 195 -122 -118 -80 152 -109 -125 75 -86 232 57 73 236 87 -17 20 -212 103 -124
5740 -124 381 465 12 20 -188 -163 -234 -38 199 129 261 165 -68 12 141 -287 1 98 -4 -1 -148 220 200 59
5764 59 -142 327 -44 -150 266 -44 -45 -54 -172 198 54 321 -100 54 120 -174 116 34 209 87 3 398 381
5787 381 19 286 -259 52 124 -101 -59 -88 -21 -233 180 -78 -161 -18 -319 -114 -8 -59 162 -353 -67 -137
5809 -137 1 -68 -137 20 115 -249 -161 -309 -104 90 94 -118 157 -345 -153 31 14 -24 -191 -187 -50 -9 -29 -100
5833 -100 114 49 -104 -471 74 -7 -100 182 -40 125 -202 -313 159 189 -39 318 97 -140 -113 44 -28 -76
5855 -76 179 -40 -277 -233 203 -21 61 293 299 78 274 -61 94 285 422 150 -82 -108 15 0 334 110
5877 110 -34 100 52 -28 -7 136 -103 -8 9 185 17 113 -22 96 226 95 57 30 253 218 60 350 154
5900 154 -312 175 180 88 83 341 155 199 235 144 -194 326 119 62 59 18 134 17 402 60 234 71 173 24
5924 24 83 -22 161 -3 -160 76 27 -174 -113 126 21 -68 -236 -153 -94 -24 -66 -132 -278 -167 -178 -194 125 208
5948 208 -131 -54 179 -431 -142 27 -92 -71 -195 -197 34 84 87 101 -253 -96 -171 -176 232 -9 -219 75 -227 -199
5972 -199 66 -300 218 377 -70 90 -213 -232 56 265 194 -21 -242 -118 -23 -142 80 70 57 145 -330 88
5994 88 31 219 118 -118 165 -46 46 -198 316 -112 -14 94 -136 -124 -24 162 -64 190 -95 -83 190 -46
6016 -46 152 126 667 13 -79 -5 -227 330 192 -10 -198 -343 -90 218 120 550 117 43 -143 -78 99 61 169
6039 169 128 44 -126 119 82 -84 205 446 323 -106 -159 -215 -110 -63 65 256 -56 -259 45 -70 329 -96
6061 -96 73 -89 -304 -158 113 270 153 -364 -171 -221 185 179 -24 7 -47 -118 -144 147 -48 102 -127 28 -107
6084 -107 -56 -201 -99 121 -175 -74 88 -262 105 -41 88 286 106 -144 -26 275 -444 -17 139 100 -201
6105 -201 -239 -71 -172 134 329 73 -196 189 -291 45 144 41 268 -88 231 -3 -113 3 -147 -129 81
6126 81 -14 286 22 143 -20 181 13 -128 -146 -29 158 454 -19 63 14 8 227 429 56 152 66 33 157
6149 157 -32 7 201 215 -155 25 96 -147 345 8 81 44 -46 -66 -79 0 111 119 -211 -72 -193 48 -108 -2
6173 -2 289 -170 -75 122 -49 -69 245 -26 -83 82 -334 94 -5 155 43 14 193 -140 -220 -59 -152 -229 -212 98
6197 98 -434 -120 -273 -139 172 356 -76 -298 -45 -456 34 -494 8 -159 30 -282 -348 154 -79 103 -9
6218 -9 -19 -42 1 138 75 -318 -108 -233 -212 126 2 73 -22 -9 -127 -161 109 59 -149 224 -99 -103 -91 198 119
6243 119 74 207 49 -102 -123 37 -78 156 -128 56 202 -66 207 168 -134 -126 188 53 -95 52 170 -9
6265 -9 235 138 174 -113 4 -19 253 446 100 -60 -118 33 70 141 17 22 12 79 150 268 -112 20 331 47
6289 47 -166 -133 -102 11 -239 -91 -181 220 -94 329 60 235 -28 13 -29 161 -33 160 237 -53 71 -160
6311 -160 -33 173 128 -266 -172 128 -122 16 -266 38 106 -226 -18 121 -399 -563 -35 -217 -33 -201 -230
6332 -230 -192 -121 13 -95 258 16 -40 223 -117 57 -195 -124 62 -107 -54 -47 37 -267 90 172 -238 38 -187
6355 -187 51 -119 130 70 198 -295 12 184 -167 -62 -64 46 91 -149 62 -78 -30 -437 55 97 -70 65
6377 65 -69 -258 76 300 -14 -111 29 10 -43 145 -17 260 -88 112 107 335 -193 162 -30 -82 224 127 -5
6400 -5 -110 61 -141 -92 212 457 266 -10 -222 -36 45 47 -39 -33 83 227 -32 -71 35 57 -23 23 -43 207 -46
6425 -46 83 229 68 163 -177 -248 -7 -87 -136 13 77 141 -115 -136 -232 -85 214 49 10 262 285 62 25 359
6449 359 354 81 -112 -165 -272 -105 147 40 -71 78 -94 -16 154 221 -134 283 -219 8 257 69 18 136
6471 136 175 98 -117 -44 -11 -55 -136 31 10 106 -1 -248 -90 -141 -91 59 22 -21 -239 -258 10 -220 -240 -3 -380
6496 -380 -193 54 87 62 -60 36 104 129 -9 -198 57 30 58 -195 129 -29 -160 10 79 19 159 154 1 306
6520 306 -24 116 270 -40 -110 274 359 607 139 85 40 -229 -115 202 -125 79 132 -53 -135 51 -104 170
6542 170 -39 174 25 -117 -244 3 228 -374 110 -63 -25 -237 -153 317 -31 -20 -81 -198 -17 116 131 -154
6564 -154 -24 -121 -280 67 13 -92 -158 115 -21 -12 -46 208 -4 15 6 -54 -117 -266 22 203 41 -24 -6 -64 -39
6589 -39 70 35 5 -49 -48 231 -160 -33 -130 66 -58 -112 -240 -246 -197 -341 -34 -55 -301 143 19 -222 32 -228
6613 -228 -88 -353 -226 0 -68 199 112 -298 -103 -228 -226 -70 71 -75 346 -264 18 -26 180 48 183 -29
6635 -29 87 52 -222 71 211 33 -199 56 -86 130 23 301 -50 97 52 -232 81 94 228 -70 -49 5
6657 5 247 150 309 441 -1 -45 90 200 80 -8 -107 232 370 176 321 97 -23 -76 -109 72 76 221 -54
6680 -54 -34 179 -62 282 87 35 -124 143 -168 -203 199 23 19 273 -95 499 -358 183 -33 -98 -30 1 117
6703 117 75 78 276 -42 -170 56 -65 -92 7 -24 39 25 57 73 -330 -23 -247 35 -94 -24 -75 -75 -78 255 -19
6728 -19 59 285 157 -154 -2 216 133 -55 12 -101 -156 -9 22 -165 74 -315 -209 -227 246 62 -168 209
6750 209 -307 -28 37 -82 55 -16 -100 75 25 -75 -173 196 -58 -98 -165 -23 2 296 31 -30 -121 -116 289 -58
6774 -58 73 115 181 115 -222 88 105 180 304 149 75 243 78 65 104 219 166 -249 -415 -70 382 100 149 44
6798 44 -71 -10 -194 144 -32 120 37 13 -131 -28 216 -112 156 210 221 -56 106 393 -28 -85 196 153 80
6821 80 -94 -98 -215 -31 21 -7 -35 -36 42 -196 -5 -51 -150 -89 -151 -51 -68 126 140 -211 -68 196 -160 -54 8
6846 8 -219 -146 -221 -124 -89 -67 37 138 -2 -129 -169 -179 -285 -90 50 -187 -193 -263 -170 -7 220 259 10 -86 -104
6871 -104 -258 -117 -76 -194 32 -151 -172 -8 49 -113 -40 298 -183 77 8 -46 22 -13 3 -108 16 103 318
6894 318 -14 112 40 -68 141 178 -111 7 211 -85 -75 -77 142 -165 248 23 77 127 -315 414 48 85 24
6917 24 204 -166 54 -36 44 -138 -143 170 56 41 -15 135 -196 267 242 255 -77 201 -104 95 59 164 192 -158
6941 -158 90 -31 176 50 366 211 -282 2 149 299 266 47 25 -119 -212 101 -116 214 -322 0 23
6962 23 -116 -99 135 -248 -170 37 -264 -26 -112 -62 -206 -24 -46 -399 -265 95 82 107 -100 -66 -90 72 -214
6985 -214 -297 -50 214 -213 24 14 130 -175 77 174 6 -127 -22 -158 -10 5 63 -469 169 65 166 -59
7007 -59 -346 -64 -197 -169 -68 -210 -10 154 -159 -29 180 257 -260 -197 -342 80 125 -47 57 -85 -27 -40
7029 -40 -94 -137 187 263 181 34 181 90 57 134 -100 -51 -18 105 351 -74 137 57 -31 -208 -131 349 -137 -40 -22
7054 -22 -194 -1 -8 124 121 150 -104 163 -209 130 156 45 249 49 59 -35 297 -42 -61 -54 203 129 -140 279
7078 279 -415 93 23 -44 -111 -116 40 38 181 59 285 -223 -75 -52 240 -296 -38 307 -106 -233 80 -262 -147
7101 -147 -79 -465 204 -70 -83 243 -260 -135 227 217 -81 224 179 -58 -97 -173 231 -115 -128 142 101 134 3
7124 3 -220 -26 -40 -250 -9 142 -289 101 138 106 72 23 -98 287 20 -336 144 295 -28 166 -155 83
7146 83 171 280 -200 -10 -372 -189 136 -49 353 -28 156 -296 -152 -63 -149 -96 175 336 -86 203 60 -386
7168 -386 82 -5 -44 -48 267 -64 -199 -52 150 65 152 101 117 -75 -28 -355 194 271 106 204 163 98 233 55
7192 55 124 -23 -40 130 43 275 217 -49 -192 123 -435 -140 -76 -140 98 124 -140 136 -23 -121 107 62 7 -158
7216 -158 -23 -62 -286 97 274 -154 25 -231 -270 -64 -42 67 -30 -189 72 -66 -73 146 40 93 -193 -176 -154
7239 -154 67 -15 114 5 44 -14 80 -290 22 40 175 44 -132 -281 -101 -340 -523 -172 245 221 1 -21
7261 -21 -95 118 26 110 -16 -299 197 77 3 -174 -123 55 -239 -119 -141 216 279 -359 -188 82 126 -272 -126
7284 -126 -62 -301 247 -331 -6 -72 291 -82 207 108 -57 -35 -66 153 273 117 322 17 87 -60 249 56
7306 56 87 7 -6 104 182 -42 160 45 35 -279 314 83 250 -128 174 73 40 -82 241 147 39 87 -211
7329 -211 197 -102 -12 24 -206 -98 -202 26 176 -116 -90 -7 -5 38 -210 49 -123 -196 150 79 -56 134 -126
7352 -126 15 76 -125 159 -63 -71 -161 -44 82 88 -259 418 -128 -234 107 250 -21 -73 -153 250 -29 78 -51
7375 -51 -378 31 31 59 -45 -73 -16 237 289 -226 1 -48 -86 -184 -97 113 -146 -126 -130 -91 -259 -63 10 91 -170 -140
7401 -140 191 321 125 50 144 63 -121 -192 -199 -2 -45 20 -16 -46 -307 290 -4 264 2 121 223 197 -5 -267
7425 -267 194 299 -150 159 138 22 91 -175 209 -238 122 -149 -196 -87 245 42 -253 77 92 9 81 156
7447 156 -18 91 178 -97 -59 78 -3 10 -2 26 -183 -52 -46 -110 -168 114 176 27 78 75 -109 -2 214 -64 -17
7472 -17 -42 0 80 -54 -58 -170 50 -6 -137 19 -119 -95 70 2 112 117 -90 -48 58 -187 -401 128 -31 -211
7496 -211 30 87 39 111 -146 -171 1 126 -78 -29 111 -328 -9 -236 -5 251 -117 34 219 -188 -84 -268
7518 -268 137 102 120 -118 48 21 -26 -116 151 56 105 68 52 -115 152 142 124 -59 -95 252 -42 46 85 37 -33
7543 -33 46 193 21 99 85 68 72 208 -95 -98 21 -125 -33 -129 175 -271 -30 -71 -137 -101 212 -168 -189 -30 111
7568 111 255 49 -90 193 197 25 169 13 -12 59 86 207 -10 -1 292 132 80 40 123 -37 -39 156 -29 67
7592 67 263 433 12 177 88 -271 -244 85 -22 107 -58 231 -6 -58 170 -65 -23 -106 8 119 13 -7
7614 -7 235 -145 54 -268 -206 163 59 42 236 -102 -119 -129 100 -68 260 -185 -206 173 176 101 -347 -160 -161 152
7638 152 -53 159 205 20 216 -307 -207 213 -92 -163 -96 -221 -30 79 -200 87 204 243 40 -223 -75
7659 -75 199 -46 49 -12 -3 -226 30 288 -43 69 -41 -112 -2 -134 10 -120 -112 -193 -102 93 -13 159 -24
7682 -24 -6 -110 15 30 55 73 -70 -32 -189 152 122 40 -60 -85 222 184 -91 -130 -171 95 -272 -141 210 287
7706 287 119 131 -42 -287 -113 -40 -74 -317 6 129 -94 111 -53 -234 168 39 -60 111 201 -176 -102 -22
7728 -22 132 -252 -49 -123 -268 -325 -111 -32 -158 6 138 25 -142 4 155 367 17 -361 -105 -105 -115 -270
7750 -270 -37 -112 -264 -125 -192 82 -219 180 -80 -142 -43 -32 -47 -134 -180 -100 20 -56 88 -103 -4 -194 194 187
7774 187 151 -137 79 -28 -84 -111 -8 35 45 -23 -220 -91 15 -86 100 -36 -46 118 -6 -61 -197 204 10
7797 10 -84 -13 39 266 -196 122 42 435 219 -16 101 41 366 -138 -185 37 20 284 33 65 139 348 -18
7820 -18 -136 75 188 91 233 286 -19 254 -45 137 -196 -257 -28 185 -47 168 125 317 -110 116 344 102
7842 102 77 -76 -121 -23 141 -129 -111 130 -50 -19 62 -258 24 -21 -193 -60 75 -37 13 -18 269 -122 -53
7865 -53 -63 -136 62 -247 -108 29 26 -5 -196 -191 174 -147 74 15 -148 12 150 -86 189 -39 60 -158 -54
7888 -54 -68 43 -285 95 -77 -207 159 86 138 3 -380 -40 79 94 -172 -95 65 249 -107 26 210 -56
7910 -56 -47 -183 -9 59 81 15 9 32 61 -215 -72 201 -109 -166 -147 3 143 -14 -40 -22 67 186 127 107 -131 -362
7936 -362 115 131 7 37 -71 202 -71 167 127 -314 -21 21 -42 -246 123 -20 -7 279 -99 -4 68 57 120
7959 120 -43 33 -25 124 167 -134 190 72 -196 102 -147 346 301 48 105 253 -139 97 215 -401 169 -116
7981 -116 -171 -274 332 -173 -164 145 120 -25 138 249 60 52 288 204 64 22 99 78 115 179 -42 112 167 -178
8005 -178 164 -7 140 -265 -40 -44 5 -368 -238 70 -267 82 -30 -104 119 -151 -108 58 -376 172 -83 -80
8027 -80 -66 -251 52 -317 -151 -135 11 -275 -31 -184 86 -442 18 -65 -286 230 74 -194 374 -393 -251
8048 -251 28 65 255 176 270 135 -80 221 -36 -171 -374 -103 153 151 -72 184 38 47 111 1 124 168 317
8071 317 -577 -129 162 -30 -217 149 303 -34 -109 104 -72 477 107 -129 -222 -122 195 227 42 -44 -2 -199
8093 -199 11 -24 193 -52 45 -121 81 237 -193 104 -166 10 -25 -80 -79 112 -261 254 187 61 156 121 -159
8116 -159 226 91 -16 -144 154 -57 -239 -35 97 -194 -16 203 -53 -1 -47 -58 -35 -88 -133 -55 93 99 -30
8139 -30 35 -42 -124 131 -194 -53 -10 -27 -134 -77 202 18 -38 -83 14 6 -201 60 64 133 205 -15 -12 -85 -67 3 -5 -73
8167 -73 250 171 -276 32 -54 97 -55 162 156 57 -361 -192 169 7 -82 37 -123 105 -92 -118 -57 -59 45 -154
8191a54
##END NTUPLES=NMR FID
##END=
