##TITLE=1H_Ser 4644-NEA
 200.13MHz, CDCl3,
 8 sc
 
 25.3.2025
##JCAMPDX= 6.0         $$ Bruker NMR JCAMP-DX V2.0
##DATA TYPE= NMR FID
##DATA CLASS= NTUPLES
##ORIGIN= UXNMR, Bruker Analytische Messtechnik GmbH
##OWNER= pz
$$ XWIN-NMR		Version 3.5
$$ Tue Mar 25 14:44:42 2025 Russian Standard Time (UT+4h)  she@DPX200
##.OBSERVE FREQUENCY= 200.1313
##.OBSERVE NUCLEUS= ^1H
##.DELAY= (6, 6)
##.ACQUISITION MODE= SIMULTANEOUS
##.ACQUISITION SCHEME= undefined
##.AVERAGES= 8
##.DIGITISER RES= 18
##SPECTROMETER/DATA SYSTEM= spect
##.PULSE SEQUENCE= zg30
##.SOLVENT NAME= CDCl3
##.SHIFT REFERENCE= (INTERNAL, CDCl3, 0, 14.3821)
##AUDIT TRAIL= $$ (NUMBER, WHEN, WHO, WHERE, WHAT)
$$ ##TITLE= Audit trail, XWIN-NMR		Version 3.5
$$ ##JCAMPDX= 5.01
$$ ##ORIGIN= Bruker BioSpin GmbH
$$ ##OWNER= she
$$ F:/spectra/data/she/nmr/H-C/1/audita.txt
$$ ##AUDIT TRAIL=  $$ (NUMBER, WHEN, WHO, WHERE, WHAT)
(   1,<2025-03-25 14:43:30.79 +0400>,<she>,<DPX200>,
      <created by zg, POWCHK disabled, PULCHK disabled
       configuration hash MD5:
       00 E9 B6 7A A2 85 ED C7 34 08 36 98 17 FE 4E 26
       data hash MD5: 16K
       67 4E 6D 83 C0 99 8F 6E 88 2D 69 BA 5A 78 8E 81>)
$$ ##END=
$$ 
$$ hash MD5
$$ 48 AC 77 4A 1C EA 1A CA 3F 6E D5 0F 13 B8 14 AD
##$RELAX= 
##$RELAX= 
##$RELAX= 
##$RELAX= 
##$RELAX= 
##$RELAX= 
$$ Bruker specific parameters
$$ --------------------------
##$DU= <F:/spectra>
##$EXPNO= 1
##$NAME= <H-C>
##$PROCNO= 1
##$TYPE= <nmr>
##$USER= <she>
##$AMP= (0..31)
100 100 100 100 100 100 100 100 100 100 100 100 100 100 100 100 100 100 
100 100 100 100 100 100 100 100 100 100 100 100 100 100 
##$AQSEQ= 0
##$AQ_mod= 1
##$AUNM= <au_zg>
##$AUTOPOS= <>
##$BF1= 200.13
##$BF2= 200.13
##$BF3= 200.13
##$BF4= 200.13
##$BF5= 200.13
##$BF6= 200.13
##$BF7= 200.13
##$BF8= 200.13
##$BYTORDA= 1
##$CFDGTYP= 0
##$CFRGTYP= 5
##$CHEMSTR= <none>
##$CNST= (0..31)
1 1 145 1 1 1 1 1 1 1 1 1 1 1 1 1 1 1 1 1 1 1 1 1 1 1 1 1 1 1 1 1 
##$CPDPRG= <>
##$CPDPRG1= <>
##$CPDPRG2= <>
##$CPDPRG3= <>
##$CPDPRG4= <mlev>
##$CPDPRG5= <mlev>
##$CPDPRG6= <mlev>
##$CPDPRG7= <mlev>
##$CPDPRG8= <mlev>
##$CPDPRGB= <>
##$CPDPRGT= <>
##$D= (0..31)
0 0.7 0 0 0 0 0 0 0 0 0 0.03 0 0 0 0 0 0 0 0 0 0 0 0 0 0 0 0 0 0 0 0 
##$DATE= 1742899410
##$DBL= (0..7)
120 120 120 120 120 120 120 120 
##$DBP= (0..7)
150 150 150 150 150 150 150 150 
##$DBP07= 0
##$DBPNAM0= <>
##$DBPNAM1= <>
##$DBPNAM2= <>
##$DBPNAM3= <>
##$DBPNAM4= <>
##$DBPNAM5= <>
##$DBPNAM6= <>
##$DBPNAM7= <>
##$DBPOAL= (0..7)
0.5 0.5 0.5 0.5 0.5 0.5 0.5 0.5 
##$DBPOFFS= (0..7)
0 0 0 0 0 0 0 0 
##$DE= 6
##$DECBNUC= <off>
##$DECIM= 32
##$DECNUC= <off>
##$DECSTAT= 4
##$DIGMOD= 1
##$DIGTYP= 9
##$DL= (0..7)
0 120 120 120 120 120 120 120 
##$DP= (0..7)
150 150 150 150 150 150 150 150 
##$DP07= 0
##$DPNAME0= <>
##$DPNAME1= <>
##$DPNAME2= <>
##$DPNAME3= <>
##$DPNAME4= <>
##$DPNAME5= <>
##$DPNAME6= <>
##$DPNAME7= <>
##$DPOAL= (0..7)
0.5 0.5 0.5 0.5 0.5 0.5 0.5 0.5 
##$DPOFFS= (0..7)
0 0 0 0 0 0 0 0 
##$DQDMODE= 0
##$DR= 18
##$DS= 0
##$DSLIST= <SSSSSSSSSSSSSSS>
$$ [...]
##$SUBNAM0= <"">
##$SUBNAM1= <"">
##$SUBNAM2= <"">
##$SUBNAM3= <"">
##$SUBNAM4= <"">
##$SUBNAM5= <"">
##$SUBNAM6= <"">
##$SUBNAM7= <"">
##$SUBNAM8= <"">
##$SUBNAM9= <"">
##$SW= 18.0517328524113
##$SWIBOX= (0..15)
0 0 2 0 0 0 0 0 0 0 0 0 0 0 0 0 
##$SW_h= 3612.71676300578
##$TD= 16384
##$TD0= 1
##$TE= 0
##$TE2= 300
##$TE3= 300
##$TEG= 300
##$TL= (0..7)
0 120 120 120 120 120 120 120 
##$TP= (0..7)
150 150 150 150 150 150 150 150 
##$TP07= 0
##$TPNAME0= <>
##$TPNAME1= <>
##$TPNAME2= <>
##$TPNAME3= <>
##$TPNAME4= <>
##$TPNAME5= <>
##$TPNAME6= <>
##$TPNAME7= <>
##$TPOAL= (0..7)
0.5 0.5 0.5 0.5 0.5 0.5 0.5 0.5 
##$TPOFFS= (0..7)
0 0 0 0 0 0 0 0 
##$TUNHIN= 0
##$TUNHOUT= 0
##$TUNXOUT= 0
##$USERA1= <user>
##$USERA2= <user>
##$USERA3= <user>
##$USERA4= <user>
##$USERA5= <user>
##$V9= 5
##$VALIST= <valist>
##$VCLIST= <CCCCCCCCCCCCCCC>
##$VD= 0
##$VDLIST= <DDDDDDDDDDDDDDD>
##$VPLIST= <PPPPPPPPPPPPPPP>
##$VTLIST= <TTTTTTTTTTTTTTT>
##$WBST= 1024
##$WBSW= 4
##$XGAIN= (0..3)
0 0 0 0 
##$XL= 0
##$YL= 0
##$YMAX_a= 219306
##$YMIN_a= -270519
##$ZGOPTNS= <>
##$ZL1= 120
##$ZL2= 120
##$ZL3= 120
##$ZL4= 120
##$ABSF1= 10
##$ABSF2= 0
##$ABSG= 5
##$ABSL= 3
##$ALPHA= 0
##$AQORDER= 0
##$ASSFAC= 0
##$ASSFACI= 0
##$ASSFACX= 0
##$ASSWID= 0
##$AUNMP= <proc_1d>
##$AZFE= 0.1
##$AZFW= 0.1
##$BCFW= 1
##$BC_mod= 2
##$BYTORDP= 1
##$COROFFS= 0
##$CY= -3
##$DATMOD= 1
##$DC= 2
##$DFILT= <>
##$DTYPP= 0
##$F1P= 0
##$F2P= 0
##$FCOR= 0.5
##$FTSIZE= 0
##$FT_mod= 4
##$GAMMA= 1
##$GB= 0.15
##$INTBC= 1
##$INTSCL= 1
##$ISEN= 128
##$LB= 0.25
##$LEV0= 0
##$LPBIN= 0
##$MAXI= 10000
##$MC2= 0
##$MEAN= 0
##$ME_mod= 0
##$MI= 1.114404
##$NCOEF= 0
##$NC_proc= 0
##$NLEV= 6
##$NOISF1= 3.799351
##$NOISF2= 2.8
##$NSP= 1
##$NTH_PI= 0
##$NZP= 0
##$OFFSET= 14.38212
##$PC= 1
##$PHC0= -469.9085
##$PHC1= 15.19221
##$PH_mod= 1
##$PKNL= yes
##$PPARMOD= 0
##$PSCAL= 0
##$PSIGN= 0
##$REVERSE= no
##$SF= 200.129724274929
##$SI= 16384
##$SIGF1= 3
##$SIGF2= 2
##$SINO= 400
##$SIOLD= 16384
##$SREGLST= <1H.CDCl3>
##$SSB= 0
##$STSI= 0
##$STSR= 0
##$SW_p= 3205.1282051282
##$SYMM= 0
##$S_DEV= 0
##$TDeff= 0
##$TDoff= 0
##$TI= <>
##$TILT= no
##$TM1= 0
##$TM2= 0
##$TOPLEV= 0
##$USERP1= <user>
##$USERP2= <user>
##$USERP3= <user>
##$USERP4= <user>
##$USERP5= <user>
##$WDW= 1
##$XDIM= 8192
##$YMAX_p= 0
##$YMIN_p= 0
$$ End of Bruker specific parameters
$$ ---------------------------------
##NTUPLES= NMR FID
##VAR_NAME=  TIME,          FID/REAL,        FID/IMAG
##SYMBOL=    X,             R,               I
##VAR_TYPE=  INDEPENDENT,   DEPENDENT,       DEPENDENT
##VAR_FORM=  AFFN,          ASDF,            ASDF
##VAR_DIM=   8192,          8192,            8192
##UNITS=     SECONDS,       ARBITRARY UNITS, ARBITRARY UNITS
##FACTOR=    0.0002768,     1,               1
##FIRST=     0,             0,               0
##LAST=      2.2672688,     0,               0
##MIN=       0,             -270519,         0
##MAX=       2.2672688,     219306,          0
$$ Real data points
##PAGE= N=1
##DATA TABLE= (X++(R..R)), XYDATA
$$ [...]
$$ plain form
1692 -568 708 448 -815 -735 -84 -305 -846 -774 -51 -237 -648 88 120 72 653 361 262 831 552 397 616
1713 616 164 67 49 -373 -181 -487 -632 -594 -749 -390 -261 -919 -129 739 8 28 462 852 754 541 210 711
1735 711 388 52 -54 -156 241 -399 -1166 -183 -2 -1018 -836 71 -5 -38 -142 478 939 422 163 880
1755 880 747 479 409 106 335 -130 -301 -124 -366 -558 -490 -530 -460 -95 -218 -126 -171 189 612 -26 389 904
1777 904 472 366 347 327 339 -49 -308 -314 -279 -592 -442 -671 -385 -211 -839 -275 583 196 -74 153 716 947
1799 947 468 272 823 631 125 20 -102 24 -207 -971 -567 -111 -854 -606 -316 117 165 -84 196 653
1819 653 664 232 369 481 792 127 -153 399 284 -481 -445 -390 -247 -173 -1060 -440 -87 -327 -213 -147 512 706
1841 706 238 283 948 787 219 184 289 402 -238 -445 -41 -210 -776 -782 -557 -245 -492 -799 -201 213 -55
$$ packed form
1692e68J276k60j263Q0O51k21n41P2P23j86m11P36L2m8N81k92r9N69k79j55K19
1713F16m52r7j8m22J92l06j45L8j55L59J29o58P90Q68p31K0M34L90r8k13l31N01
1735G11l23l36j06j02L97o40p67R83J81j016J82R07p6l3j04O20M61n17k59P17
1755H80j33k68p0l03K29m65j71J77k42j92O8m0P0L65j23R2m5L60M23o38M15N15
1777I04m32j06j9k0J2l88k59oL5l13J50k29K86J74o28N64Q58l87k70K27N63K31
1799I47m79j96N51j92n06j05j22J26k31p64M04M56p43K48K90M33M8k49K80M57
1819F53J1m32J37J12L11o65k80N52j15p65L6N5J43P4q87O20L53k40J14O6O59J94
1841G06m68M5O65j61n68l5J05J13o40k07M04j69n66oK25L12k47l07N98M14k68
$$ plain form
1862 -55 151 580 746 653 390 346 738 316 10 -153 -60 -52 -426 -652 -281 -186 -863 -412 -494 -369 138 218 -68
1885 -68 437 519 584 319 402 743 519 -152 262 77 -396 -231 -476 -416 -325 -785 -326 19 -350 -344 -130 265 252
1908 252 401 457 742 409 308 366 65 421 224 -461 -242 -201 -352 -651 -664 -330 -295 -629 -53 -50 -96 192 243
1931 243 214 920 556 63 464 407 257 -329 -13 145 -223 -627 -447 -363 -363 -411 -636 -85 369 -213 -154 686
1953 686 706 -135 312 726 698 -118 69 377 2 -58 -148 -542 -212 -24 -873 -705 312 -219 -551 -324 586
1974 586 417 -212 406 693 469 364 310 -80 370 303 -634 -392 -77 -393 -662 -403 -123 -400 -701 -179 266
1995 266 83 281 -30 117 868 324 72 717 530 -173 -185 214 269 -570 -474 17 -289 -535 -195 -487 -406
2016 -406 334 -288 -368 681 585 141 337 578 333 379 519 220 -307 59 264 -746 -279 206 -715 -684 -129
$$ packed form
1862e5K06M29J66r3k63m4L92m22l06j63R3Ql74k26L71R5o77M51q2J25N07Q0k86
1885f8N05Q2O5k65Q3L41k24o71M14j85m73J65k45O0R1m60M59L45l69OK14L95j3
1908B52J49N6K85l33j01N8l01L56j97o85K19M1j51k99j3L34L5l34N76Lm6K88N1
1931B43k9P06l64m93M01n7j50n86L16J58l68m04J80Q4%m8k25N51M54n82N9Q40
1953F86K0q41M47M14k8q16J87L08l75o0r0l94L30J88q49J68J017n31l32K27R10
1974E86j69o29O18K87k24j05n4l90M50o7r37K42L15l16k69K59K80k77l01N22M45
1995B66j83J98l11J47P51n44k52O45j87p03j2L99N5q39R6M91l06k46L40k92Q1
2016d06P40o22q0J049r6m44J96K41k45M6J40k99n27L66K05j010M67M85r21L1N55
$$ plain form
2037 -129 -213 -231 128 198 153 168 462 323 398 851 182 -380 530 398 -564 -250 239 -443 -991 -400 -11 -321
2059 -321 -187 -165 -239 -2 633 -30 -35 995 453 -329 386 799 506 -124 -106 273 -176 -473 -222 -476 -163
2080 -163 -81 -634 -493 365 -173 -298 710 378 237 439 408 583 269 79 -31 32 164 -192 -378 19 -75
2101 -75 -980 -381 148 -343 -393 -172 86 160 -160 71 484 303 557 279 128 576 341 -478 84 -50 -256
2122 -256 -199 -238 -377 -248 -290 -120 -325 94 204 120 241 604 278 23 442 327 191 314 12 -197 218
2143 218 -351 -515 -463 -161 -378 -899 -261 334 -384 -66 563 216 229 417 211 353 404 243 105 -310 265
2164 265 -52 -719 -268 -57 -702 -196 -198 -407 -40 -69 -274 121 383 209 289 349 417 96 86 671 86 -497
2186 -497 -107 -148 -257 -209 -597 -444 -202 -61 -285 -217 337 174 16 25 877 103 47 454 274 165 99 -117
$$ packed form
2037a29q4j8L59P0m5J5K94j39P5M53o69n62R10j32r62L14M89o82n48N91L89l10
2059c21J34K2p4K37O35o63nJ030n42p82P15M13k93o30J8L79m49k97K51k54L13
2080a63Q2n53J41Q58n38j25J008l32j41K02l1J75l14j90j10O3J32l56j86L97r4
2101g5r05N99N29m91n0K21K58P4l20K31M13j81K54k78j51M48k35q19N62j34k06
2122b56N7l9j39J29m2J70k05M19J10q4J21L63l26k55M19j15j36J23l02k09M15
2143B18n69j64N2L02k17n21O38N95p18L18O29l47J3J88k06J42N1j61j38m15N75
2164B65l17o67M51K11o45N06kk09L67k9k05L95K62j74Q0O0O8l21j0N85n85n83
2186d97L90m1j09M8l88J53K42J41k24O8N54j63j58RQ52p74n6M07j80j09o6k16
$$ plain form
2208 -117 157 -12 -501 -342 -468 -249 -422 -778 -11 95 -284 -277 301 140 188 334 87 457 325 12 246
2229 246 155 86 -335 -261 114 -148 -565 -512 -208 -224 89 -291 -133 515 107 94 356 302 377 51 -58 263 68
2252 68 -150 201 -129 -363 -95 -284 -339 -342 -225 -202 -67 -52 215 -1 265 324 117 224 568 204 207 206 -133 -130
2276 -130 154 -331 -155 -302 -375 -178 -580 -424 88 129 -91 -166 -158 468 303 124 347 318 258 138 -9 251
2298 251 -89 -629 -259 -87 -477 -263 -330 185 -32 -498 -59 335 190 15 30 251 364 162 -63 460 338
2319 338 -178 -21 -270 92 -92 -588 -276 -181 -253 -342 -110 160 -55 -48 294 452 258 251 312 472 283 183 -171
2342 -171 75 176 -153 -414 -211 -54 -204 -430 -153 -50 -437 -93 115 181 201 52 116 510 282 125 111
2363 111 222 8 16 -328 -124 -253 -231 -322 -215 -381 18 -326 -168 194 -37 327 261 120 310 178 161 263
$$ packed form
2208a17K74j69m89J59j26K19j73l56P67J06l79PN78j61M8J46k47L70j32l13K34
2229B46r1o9m21P4L75k62m17N3L04j6L13l80J58O48m08j3K62n4P5l26j09L21j95
2252F8k18L51l30k34K68j89n5lJ17K3J35J5K67k16K66N9k07J07L44l64Ljl39L
2276a30K84m85J76j47p3J97m02J56N12M1k20p5QO26j65j79K23k9o0j20j47K60
2298B51l40n40L70J72l90K14o7N15k17m66M39L94j45j75J5K21J13k02k25N23j22
2319C38n16J57k49L62j84m96L12R5p2q9K32K70k15PL42J58j94pO1J60j89j00l54
2342a71K46J01l29k61K03J57j50k26K77J03l87L44K08O6K0j49O4L94k28j57j4
2363A11J11k14Ql44K04j29K2r1J07j66L99l44J58L62k31L64o6j41J90j32j7J02
$$ plain form
2385 263 162 65 -54 -71 -192 -46 -390 -244 -81 -173 -372 -145 -131 270 -19 -146 138 365 67 194 80
2406 80 455 174 -71 33 140 34 -324 -368 -155 -26 -386 -428 -13 -170 -160 -184 -107 367 41 59 405 447 99
2429 99 -42 99 158 -3 -217 -194 214 -234 -182 -180 -37 74 -240 -232 35 99 27 63 145 299 38 289 254 252 152
2454 152 -45 -103 -152 -101 -484 -327 96 -205 -263 -148 -106 -90 13 19 224 67 121 45 99 517 -35 60 327 140
2478 140 -299 34 61 -138 -246 -216 -74 -217 -104 196 -181 20 308 342 94 97 100 223 233 141 25 148 66
2501 66 -207 -154 -277 -105 -445 -318 -121 -437 3 89 132 33 69 229 171 492 31 214 189 279 -15 -176 181
2524 181 271 -372 -220 -118 -278 -511 -179 -223 340 130 -161 -182 124 382 16 175 500 266 -73 76 180
2545 180 -124 -239 -161 -245 -18 -317 -330 -89 51 37 -228 112 305 24 -368 267 145 -51 157 -15 223
$$ packed form
2385B63j01r7j19j7j21J46l44J46J63r2j99K27J4M01k89j27K84K27k98J27j14
2406H0L75k81k45J04J07j06l58m4K13J29l60m2M15j57J0k4P7M74l26J8L46M2l48
2429I9j41J41N9j61k14K3M08m48N2KJ43J11l14QK67O4p2L6Q2J54k61K51l5kj00
2454A52j97n8m9N1l83J57M23l01n8J15M2J6J03OK05j57N4p6N4M18n52R5K67j87
2478A40m39L33K7j99j08L0J42j43J13L00l77K01K88L4k48LLJ23J0r2j16J23q2
2501F6k73N3j23J72l40J27J97l16M40Q6M3r9L6J60n8L21m61J83k5R0k94j61L57
2524A81R0o43J52J02j60k33L32m4N63k10k91k1L06K58l66J59L25k34l39J49J04
2545A80l04j15P8q4K27k99j3K41J40j4k65L40J93k81l92O35j22j96K08j72K38
$$ plain form
2566 223 217 -71 -83 132 -188 -368 -389 -161 25 -318 -192 228 -68 -148 242 261 167 286 198 136 69 227 -330
2589 -330 -184 -165 76 -302 -166 -106 -272 -102 -357 47 -126 1 -136 37 275 208 354 86 369 108 61
2610 61 -34 -7 123 -26 -339 -296 -118 -157 -138 -209 -129 173 63 -70 60 85 205 257 -82 345 144 27 4 395
2634 395 -253 -221 -200 -158 44 -240 -22 71 -113 -187 84 50 122 286 -91 190 329 27 84 265 373 67 -79
2657 -79 46 -97 -122 -107 -179 -68 3 -251 -383 75 87 -34 -63 243 167 -112 125 261 100 -63 195 317 -33
2680 -33 -29 48 -176 -151 -421 -148 -209 -10 -134 -239 19 213 -25 -20 239 249 279 205 -129 133 113 -122 35 -109
2704 -109 -68 -154 -232 119 -42 -296 29 79 -162 -40 -34 52 374 265 64 217 45 68 0 -57 -54 -121 -354 -184
2728 -184 -170 60 -235 10 34 107 -107 192 -81 70 326 225 68 166 232 80 346 72 31 123 -235 -225 -16
$$ packed form
2566B23ok88j2K15l20j80k1K28J86l43J26M20k96q0L90J9r4J19q8o2o7J58n57
2589c30J46J9K41l78J36O0j66J70k55M04j73J27j37J73K38o7J46k68K83k61m7
2610F1r5K7J30j49l13M3J78l9J9p1Q0L02j10j33J30K5J20N2l39M27k01j17k3L91
2634C95o48L2K1M2K02k84K18R3j84p4K71l4P2J64l77K81J39l02N7J81J08l06j46
2657g9J25j43k5J5p2J11P1k54j32M58J2j21k9L06p6k79K37J36j61j63K58J22l50
2680c3MP7k24K5k70K73o1J99j24j05K58J94k38NK59J0L0p4l34K62k0k35J57j44
2704a09M1q6p8L51j61k54L25N0k41J22OQ6L22j09k01J53j72K3o8n7Lo7k33J70
2728a84J4K30k95K45K4P3k14K99k73J51K56j01j57R8O6j52K66k74m1R2l58J0K09
$$ plain form
2751 -16 -173 -90 -237 59 -128 -84 -2 351 147 -87 27 62 53 91 -81 170 43 81 -88 1 -131 -102 -242 98
2775 98 -151 -136 -22 -155 -95 83 -161 -70 67 50 118 40 -134 175 50 -168 153 83 -124 -354 -93 132 124
2798 124 -38 -149 22 -114 -138 143 135 304 -140 61 374 249 -82 -160 125 122 70 -312 208 319 -230 -72
2820 -72 -92 74 -265 -200 142 -51 -82 -17 136 230 165 163 -16 5 138 -83 -155 154 -186 -201 -96 -83 -97 -176 -28
2845 -28 72 -104 85 133 10 363 168 -120 202 79 98 69 -134 -10 -147 9 23 -323 -186 166 -99 -200
2867 -200 126 -38 -58 -323 -329 45 -38 94 247 150 278 30 -192 159 -70 -79 -155 -76 -163 -153 -203 -149 -154 126 -20
2892 -20 18 86 134 36 76 61 63 -115 106 250 14 -32 -124 -118 84 -174 -167 95 -188 -335 -290 165 68 5 116 206
2918 206 212 162 250 278 -53 184 -37 54 55 -239 105 -198 97 -89 -60 -61 67 -100 -303 97 -49 52 80 -66
$$ packed form
2751a6j57Q3j47K96j87M4Q2L53k04k34J14L5rL8j72K51j27L8j69Q9j32K9j40L40
2775I8k49J5J14j33O0J78k44R1J37j7O8p8j74L09j25k18L21p0k07k30K61K25q
2798A24j62j11J71j36k4K81qJ69m44K01L13j25l31p8K85ln2l82N20J11n49J58
2820g2k0J66l39O5L42j93l1O5J53R4o5kj79K1J33k21p2L09l40j5J05J3j4p9J48
2845b8J00j76J89M8j23L53j95k88L22j23J9k9k03J24j37J56J4l46J37L52k65j01
2867b00L26j64k0k65oL74q3J32J53r7J28k48k22L51k29rp6P9q7J0n0N4nK80j46
2892b0L8O8M8r8M0j5Kj78K21J44k36m6r2OK02k58PK62k83j47M5M55r7o3J11R0
2918B06On0Q8K8l31K37k21R1Jk94L44l03K95j86K9jJ28j67k03M00j46J01K8j46
$$ plain form
2942 -66 164 -15 45 238 -218 95 183 -156 44 -93 -99 73 -6 -243 -47 53 -110 1 320 191 170 113 112
2965 112 173 -64 0 28 -23 -23 64 180 63 -108 -67 67 -201 -115 -195 -24 131 -75 29 221 174 195 157 52
2989 52 -176 260 -215 -37 -215 150 58 -297 -117 43 5 -142 -12 -107 -48 -16 32 113 -19 221 73 123 89
3012 89 90 -31 127 321 37 78 -126 -277 -9 -15 -340 -148 -14 -347 -201 -9 -158 28 159 108 229 147 307
3035 307 -74 -46 57 -127 -137 -63 -24 -75 112 -166 -121 -50 -59 66 -63 -76 262 203 189 45 -31 173 131 34 -249
3060 -249 44 67 -80 21 -163 -33 -72 -20 -265 -67 283 89 -144 73 237 82 132 76 31 20 -17 -79 -202
3083 -202 -32 126 -153 -281 -75 -33 40 255 -171 -211 -23 -4 -266 78 -71 144 -109 -71 -8 25 119 199 16
3106 16 45 51 80 -354 -200 -39 -56 -153 62 57 7 -9 -38 44 -53 156 -59 9 179 2 204 30 54 34 52 -64
$$ packed form
2942f6K30j79O0J93m56L13Q8l39K00j37oJ72p9k37J96J00j63J11L19j29k1n7j
2965A12O1k37O4K8n1%Q7J16j17j71M1J34k68Q6q0J71J55k06J04J92m7K1l8j05
2989E2k28M36m75J78j78L65r2l55J80J60l8j47J30r5N9L2M8Q1j32K40j48N0l4
3012H9Jj21J58J94k84M1k04j51K68ol25J92J34l33J46J92j49J86J31n1J21q2J60
3035C07l81K8J03j84j0P4L9n1J87k78M5P1rJ25j29j3L38n9j4j44p6K04m2r7k83
3060b49K93K3j47J01j84J30l9N2k45J98L50j94k33K17J64j55N0n6m5j1l7o2j23
3083b02J70J58k79j28K06M2P3K15m26m0J88J9k62L44j49K15k53L8O3L3R4Q0j83
3106A6K9OK9m34J54J61j7r7K15nn0j6k9Q2r7K09k15O8J70j77K02j74K4k0J8j16
$$ plain form
3132 -64 -66 -94 -95 -175 -131 356 -163 -315 259 91 -145 4 81 2 -75 -9 42 135 119 -35 -41 -93 119 -42 -169 31
3158 31 -63 -157 -83 70 19 73 -111 32 127 62 -87 106 63 40 -277 -53 -29 -32 -84 -49 63 -192 33 105 23 -116
3184 -116 -2 161 -6 71 -85 -88 -50 336 -73 101 156 -228 114 -64 55 -69 5 -13 -251 -7 148 6
3206 6 -118 138 -38 81 188 -22 -46 34 70 165 -14 115 143 -292 -183 43 -160 -104 84 -73 -85 75 -176
3229 -176 -144 -44 80 31 -101 203 -152 -80 -34 35 105 -50 206 -6 -106 -54 62 -60 13 62 -50 50 -277
3252 -277 144 -105 -110 -60 29 -129 4 114 -115 83 -53 -35 -34 -126 -66 -70 -27 -147 -250 80 -98 115 210 188 -39
3277 -39 -51 21 -58 17 25 112 23 12 -180 254 63 -34 -292 -157 20 -155 225 -126 112 -62 142 212 -69 141
3301 141 -19 152 -44 105 47 -41 141 -75 45 -136 -226 -257 79 55 -115 121 -17 191 -64 46 281 183
$$ packed form
3132f4kk8jq0M4M87n19j52N74j68k36J49P7p9p7O6N1R3j6j54on2K12j61j27K00
3158C1r4r4P4J53n1N4j84J43R5o5j49J93m3k3l17K24K4ln2L5J12k55K25P2q2j39
3184a16J14J63j67P7j56lL8L86m09J74N5l84L42j78J19j24P4j8k38K44J55j42
3206Fj24K56j76J19J07k10k4Q0L6R5j79J29K8m35J09K26k03N6J88j57j2J60k51
3229a76L2J00J24m9j32L04l55P2M6O9P0j55K56k12j00N2J16j22P3M9j12J00l27
3252b77M21k49nN0Q9j58J33J10k29J98j36J8Jr2O0mM3j20j03L30j78K13R5k2k27
3277c9j2P2p9P5QQ7q9j1j92M34j91r7k58J35J77j75L80l51K38j74K04P0k81K10
3301A41j60J71j96J49n8q8J82k16J20j81r0l1L36k4j70K36j38K08k55J10K35r8
$$ plain form
3323 183 47 203 46 73 73 -66 -51 -3 -96 24 -91 22 64 -188 -27 124 90 57 -56 39 21 236 51 84
3347 84 40 129 -157 52 -138 31 21 -47 127 -94 130 -31 105 77 20 75 -90 -176 -17 -51 233 217 -179 -34
3371 -34 222 73 -40 22 21 87 -8 -87 28 -316 -71 -23 -100 62 -27 237 268 -45 -35 11 84 7 29 -24 -126 -15
3397 -15 -21 -77 -225 189 -45 -7 -138 -104 -46 70 55 1 36 -27 58 163 -9 -96 3 -86 42 57 119 -115 -40 -108
3423 -108 215 102 -47 -54 -123 -124 76 -11 -89 -85 15 279 -16 171 -44 285 231 0 48 8 -44 -33 160 49 -6
3448 -6 -109 29 -71 -6 -34 -57 -139 -65 0 -157 -33 101 -57 -22 29 -36 186 50 35 -109 52 -109 20 145
3472 145 -199 -163 49 -60 -119 -106 83 86 143 93 -200 63 81 134 -235 -12 -181 -58 50 190 -67 -38 273
3495 273 -101 27 43 -70 -67 6 -87 -26 -29 175 -213 99 217 14 -50 172 177 -96 -60 -82 -38 83 -8 31 -75
$$ packed form
3323A83j36J56j57K7%j39J5M8r3J20j15J13M2k52J61J51l4l3j13R5j8K15j85L3
3347H4m4Q9k86K09j90J69j0o8J74k21K24j61J36k8n7N5j65q6J59l4K84j6l96J45
3371c4K56j49j13O2jO6r5p9J15l44K45M8p7J62q9K64L1l13J0M6P3p7K2n3j02J11
3397a5on6j48M14k34L8j31L4N8J16j5n4L5o3Q5J05j72q7R9q9J28J5O2k34P5o8
3423a08L23j13j49po9jK00q7p8MJ00K64k95J87k15L29n4k31M8m0n2J1J93j11n5
3448fj03J38j00O5k8k3q2P4O5j57J24J34j58L5N1o5K22j36j5j44J61j61J29J25
3472A45l44L6K12j09n9J3J89LN7n0k93K63J8N3l69K23j69J23J08J40k57K9L11
3495B73l74J28J6j13LP3r3O1lK04l88L12J18k03o4K22Nk73L6k2M4J21r1L9j06
$$ plain form
3520 -75 -210 -195 -50 118 -24 -2 127 -101 85 -65 101 141 3 -238 76 -134 -154 110 -8 -82 -136 -65 -107
3543 -107 182 -188 13 -190 39 199 244 159 44 -52 -37 90 14 -30 154 149 -12 71 -149 -158 -86 31 -137 3
3567 3 216 246 -73 64 103 -21 92 6 8 -236 39 -33 -141 -45 -51 -68 20 0 102 205 113 -38 22 84 10 88
3593 88 62 -72 193 -129 85 -133 -77 100 -160 -115 -93 -36 -9 -68 -48 41 -114 45 -8 66 88 84 215 272 95
3618 95 63 98 -246 120 6 108 199 -229 -96 276 51 160 2 90 90 -38 -56 84 -174 19 -50 -159 -147
3641 -147 52 -24 -92 -177 -1 -277 128 -32 -51 68 128 14 -121 25 -64 -33 218 166 28 183 38 45 -15 -30
3665 -30 -47 35 -90 66 -111 217 -13 -110 253 301 88 -356 -20 336 -85 -94 -142 59 -139 -14 22 -45 60
3688 60 -80 52 79 -6 -33 -84 27 29 164 1 73 246 -127 -43 -50 -28 125 -77 -146 -191 -142 -93 157 37 97 -58
$$ packed form
3520g5j35J5J45J68j42K2J29k28J86j50J66M0j38k41L14k10k0K64j18p4n4P1m2
3543a07K89l70K01k03K29J60M5q5j15r6J5J27p6m4J84nj61Q3k20rP2J17j68J40
3567CK13L0l19J37L9j24J13q6Kk44K75p2j08R6oj7Q8k0J02J03r2j51O0O2p4P8
3593H8k6j34K65l22K14k18N6J77k60M5K2N7K7n9K0Q9j55J59n3P4K2mJ31N7j77
3618I5l2L5l44L66j14J02R1m28J33L72k25J09j58Q8%j28j8J40k58J93o9j09J2
3641a47J99p6o8q5J76k76M05j60j9J19O0j14j35J46q9L1K51n2j38J55j45Po0j5
3665c0j7Q2j25J56j77L28k30r7L63M8k13m44L36L56m21rm8K01j98J25L6o7J05
3688F0j40J32K7q5k7n1J11KJ35j63P2J73l73Q4pK2J53k02o9m5M9M9K50j20O0j55
$$ plain form
3714 -58 -27 -11 -208 -16 -21 135 57 28 -84 -130 -6 31 -203 56 77 114 69 -203 0 -89 121 58 -137 168 -49
3739 -49 32 66 23 313 -8 30 139 -65 -90 27 157 -70 118 -107 8 -45 -191 157 -19 98 -19 -223
3761 -223 -53 225 85 -118 -32 98 -121 -22 -251 179 9 61 -181 82 23 11 63 -15 119 -73 99 -22
3783 -22 -50 187 0 -32 57 129 114 45 17 213 -65 -93 58 114 193 114 -27 -29 14 -53 215 71 64 181 102 101 61
3810 61 -122 8 -79 211 88 -152 87 27 -163 -55 14 74 105 7 56 308 62 -18 -82 -120 196 -55 91 -119
3834 -119 -15 -30 -124 39 -89 158 -150 -24 -148 102 41 -186 107 -24 -197 -161 148 -98 217 108 -59
3855 -59 137 62 -83 -33 -231 32 22 -46 67 156 -86 -156 -80 238 -203 118 -129 249 -74 -30 84 133 -57
3878 -57 -122 -94 100 81 -110 -76 -50 40 -43 -57 293 -40 215 -30 -46 87 -220 -40 -54 143 -84 -34 69 107
$$ packed form
3714e8L1J6j97J92nJ56p8k9j12m6J24L7k34K59K1L7m5k72K03q9K10o3j95L05k17
3739d9Q1L4m3K90l21L8J09k04k5J17J30k27J88k25J15n3j46L48j76J17j17k04
3761b23J70K78j40k03Q6J30k19R9k29M30j70N2k42K63n9j2N2p8J34j92J72j21
3783b2k8K37j87l2Q9P2j5o9k8J96k78k8J51N6P9p9j41kM3o7K68j44pJ17p9jm0
3810F1j83J30q7K90j23k40K39o0j90J08O9O0L1r8M9K52k46q0o4l8L16k51J46k10
3834a19J04j5r4J63j28K47l08J26j24K50o1k27K93j31j73L6L09k46L15j09j67
3855e9J96p5j45N0j98K63j0o8J13Q9k42p0P6L18m41L21k47L78l23M4J14M9j90
3878e7o5K8J94j9j91L4K6R0q3j4L50l33K55k45j6J33l07J80j4J97k27N0J03L8
$$ plain form
3902 107 99 253 20 -1 133 15 -51 -52 -31 -66 99 -99 -232 103 -226 -153 -75 81 108 -84 181 21 -61 88
3926 88 -16 69 -124 78 -15 -114 -157 -32 185 -19 -151 -46 142 117 50 -6 -88 -26 -48 59 -29 -132 87 -69
3950 -69 -288 190 -25 41 31 -9 -184 -47 40 39 -56 54 -216 -86 -132 -78 -158 18 97 39 5 141 1 74 -83
3975 -83 -225 73 166 94 35 31 105 8 -112 87 80 97 1 49 -58 120 -153 -151 -52 101 -31 -287 42 -110 -100 111
4001 111 -49 33 -194 95 -20 6 -112 -30 -42 31 -28 19 8 -6 112 -8 70 92 93 -117 113 45 52 201 -138
4026 -138 -143 146 153 -89 -161 44 53 61 -147 -42 -72 78 -1 -76 -142 -30 38 -39 209 -83 -121 -5 60 32 33 0 143
4053 143 151 50 126 -38 48 -141 -55 33 -79 -144 115 10 128 132 -63 178 -66 164 -115 3 -117 -126 -10 -94
4077 -94 -19 -144 -38 88 34 -3 59 -14 -195 -98 -272 -216 22 -67 -8 86 105 -6 -59 -156 220 95 62 -29 69 -151
$$ packed form
3902A07qJ54k33k1J34j18o6jK1l5J65j98j33L35l29P3P8J56K7j92K65j60q2J49
3926H8j04Q5j93K02r3r9m3J25K17k04j32J05J88k5o7n6q2O2k2J07q8j03K19j56
3950f9k19M78k15O6j0m0j75J37Q7jr5J10k70J30m6N4q0J76P9n8l4J36j40P3j57
3975h3j42K98R3p2n9mP4r7j20J99pJ7r6M8j07J78k73KR9J53j32k56L29j52J0K11
4001A11j60Q2k27K89j15K6j18Q2j2P3n9M7j1j4J18j20P8K2Jk10K30o8PJ49l39
4026a38nK89Pk42p2K05RQk08J05l0J50p9p5o6J12O8p7K48k92l8J16O5k8Jl3J43
4053A43Qj01P6j64Q6j89Q6Q8j12o5K59j05J18Mj95K41k44K30k79J18j20rJ16q4
4077i4P5j25J06J26n4l7O2p3j81R7j74N6K38q9N9R4J9j11n3r7L76j25l3r1R8k20
$$ plain form
4103 -151 84 34 21 -87 -4 50 -107 61 -3 55 -187 -74 197 -50 5 -26 46 -2 -112 -83 81 -130 208 -35
4127 -35 0 -47 -174 150 -38 -212 10 104 -73 136 91 88 26 313 -103 -117 -111 95 -47 64 96 36 0 -150 -117
4152 -117 6 -119 -324 43 -117 201 -47 24 43 200 104 12 -4 -76 122 -61 114 -31 71 29 -78 63
4174 63 -158 -42 -97 259 -85 -101 -35 103 1 128 -118 128 -161 115 8 54 237 -82 -45 -368 7 2 73
4197 73 115 -38 -72 35 52 91 -36 31 112 -169 -15 77 -14 85 5 173 -94 -105 12 11 116 -79 81 -71 56
4222 56 81 -261 8 67 -63 -160 30 12 145 -196 -176 30 -93 70 -37 128 15 -36 49 117 -131 54 -75
4245 -75 80 -57 -214 94 155 105 165 -65 58 -110 -243 9 -2 135 -20 -171 -57 -29 -14 93 85 103 53 -14
4269 -14 -112 12 53 -23 -20 174 -118 88 32 -19 231 -88 85 -231 -76 121 -325 216 -134 95 -217 30 30
$$ packed form
4103a51K35n0j3j08Q3N4j57J68o4N8k42J13K71k47N5l1P2m8j10K9J64k11L38k43
4127c5L5m7j27L24j88j74K22R4j77K09m5lo2K87m16j4OK06j42J11L2o0l6j50L3
4152a17J23j25k05L67j60L18k48P1J9J57r6r2j6p2J98j83J75j45J02m2j07J41
4174F3k21J16n5L56l44j6O6J38j02J27k46K46k89K76j07M6J83l19L7l23L75nP1
4197G3M2j53l4J07J7L9j27O7Q1k81J54R2r1R9q0J68k67j1J17jJ05j95J60j52J27
4222E6K5l42K69N9j30r7J90j8J33l41K0K06j23J63j07J65j13n1Q5O8k48J85j29
4245g5J55j37j57L08O1n0O0k30J23j68j33K52j1J37j55j51J14K8J5J07qJ8n0o7
4269a4r8J24M1p6LJ94k92K06n6n1K50l19J73l16J55J97m46N41l50K29l12K47%
$$ plain form
4292 30 -22 39 -40 144 17 -139 216 75 82 10 83 -37 120 189 -206 166 -118 -147 -79 279 -59 -101 7 51
4316 51 6 117 51 -123 -270 79 31 -223 77 33 -42 -115 -153 -84 -83 -86 133 12 -97 145 137 150 141 176 203 136 -123
4343 -123 -38 -113 -16 -152 -7 112 -44 -187 -5 -109 -19 153 -23 -273 -119 35 155 -5 34 59 50 178 -39
4366 -39 221 -157 -34 3 -261 221 -84 -122 -235 -95 91 17 123 49 -59 -35 203 14 239 204 35 194
4388 194 159 75 -199 27 92 -126 -30 -130 -36 -39 -73 -122 221 84 68 -35 -79 -190 -47 -36 -11 -306 -107 -103 -63
4413 -63 267 68 -26 -90 -98 -28 -59 64 -16 -94 -42 -134 65 184 139 111 150 140 57 9 -60 -41 3 -76 -129 -20 -84 -248
4441 -248 -42 -117 -171 -91 -145 -73 -75 117 81 -2 -59 211 144 -157 -72 -204 130 79 2 -50 -20 198 -65 16 159 6
4467 6 59 45 79 9 54 91 73 81 -10 -110 -165 -166 -24 161 -49 -230 -141 184 -26 72 -162 36 16 -158 -219 -17
$$ packed form
4292C0n2O1p9J84j27j56L55j41Pp2P3j20J57O9l95L72k84k9O8L58l38m2J08M4
4316E1m5J11o6j74j47L49m8k54L00m4p5p3l8O9JlK19j21j09K42qJ3rL5K7o7k59
4343a23Q5p5R7j36J45J19j56j43J82j04R0J72j76k50J54J54J20j60L9K5rJ28k17
4366c9K60l78J23L7k64M82l05l8j13J40J86p4J06p4j08K4K38j89K25l5j69J59
4388A94l5q4k74K26O5k18R6j00R4ll4m9L43j37j6j03m4j11J43J1K5k95J99MM0
4413f3L30j99r4o4qP0l1J23q0p8N2r2J99J19m5k8L9j0q3m8o9J9M4p9n3J09o4j64
4441b48K06p5n4Q0n4P2kJ92l6q3n7K70o7l01Q5j32L34n1p7n2L0K18k63Q1J43j53
4467FN3j4L4p0M5L7j8Qr1j00n5jJ42J85k10j81Q9L25k10R8k34J98k0j74o1K02
$$ plain form
4493 -17 -60 142 109 -212 72 53 -153 -97 76 149 -26 -13 -28 44 -96 -27 -23 64 50 48 -181 -93 -20 -79 136 -44
4519 -44 183 210 92 -144 5 -5 167 -143 32 143 241 -102 118 33 -244 196 267 0 136 86 67 2 -89
4542 -89 -150 -76 60 -42 -75 160 66 21 -140 30 -113 -202 -35 128 -183 -186 -83 -170 84 -68 -51 -137 141 3
4566 3 189 -27 33 9 114 134 13 -13 -142 -2 -69 97 41 -167 -74 43 -31 -164 276 275 -69 271 176 3
4590 3 154 40 -225 52 -37 200 -210 5 191 133 -60 9 232 -268 -254 9 -102 -60 -224 -34 -10 134 256
4613 256 198 51 -52 121 45 -10 -161 21 -150 -8 68 73 -76 -76 267 -17 13 -129 184 -126 43 178 -89
4636 -89 -75 -229 -28 -61 39 -155 -60 -151 -83 -121 19 -40 103 26 -70 121 64 -20 -133 115 -37 -49 48 -106 34
4661 34 -120 -98 -183 -82 136 64 128 -46 -26 -15 -53 -96 -56 114 -34 2 6 66 40 73 -17 127 150 47 -47 -88 -77
$$ packed form
4493a7m3K02l3l21K84j9k06N6J73P3j75J3j5P2j40O9MQ7j4kk29Q8P3n9K15j80
4519d4K27K7j18k36J49j0J72l10J75J11R8l43K20q5k77M40P1k67J36n0j9o5r1
4542h9o1P4J36j02l3K35r4m5j61J70j43q9J67J63l11lJ03q7K54j52J7q6K78j38
4566CJ86k16O0k4J05K0j21k6j29J40o7J66n6k08R3J17p4j33M40jl44L40r5j73
4590CJ51j14k65K77q9K37m10K15J86n8j93O9K23n00J4K63j11M2j64J90K4J44J22
4613B56n8j47j03J73p6n5j51J82j71J42P6Nj49%L43k84L0j42L13l10J69J35k67
4636h9J4j54K01l3J00j94R5r1O8l8J40n9J43p7r6J91n7q4j13K48j52j2R7j54J40
4661C4j54K2q5J01K18p2O4j74K0J1l8m3M0J70j48L6MO0k6L3r0J44K3j03r4m1J1
$$ plain form
4688 -77 -35 -346 -14 193 79 -181 82 1 -236 73 48 109 121 78 -34 83 43 66 -14 81 -80 -99 -238 11
4712 11 -354 27 234 75 -154 112 -80 12 85 173 -33 38 34 -231 -129 -133 -26 -191 85 -7 -56 -161 -41 -129
4736 -129 27 133 -40 278 58 163 -5 -26 -11 62 5 -145 -77 -16 162 0 215 -160 -75 -147 -198 119 58
4759 58 -73 9 114 143 148 -129 -68 -51 -78 14 29 -117 -107 52 145 16 -90 108 -101 -204 147 -45 -168 91
4783 91 91 65 12 -106 -95 116 -144 31 -13 12 -204 148 269 28 167 -60 -22 -224 86 66 -26 233 -3 -50
4807 -50 -47 -48 159 218 119 -141 -105 -37 -26 46 -72 129 27 -226 -103 -93 -287 6 137 -29 -183 -222 158 -9
4831 -9 88 -52 -34 -84 56 85 178 -24 -136 -22 -92 -9 85 64 -171 168 -141 50 132 12 233 -131 10 -44
4855 -44 90 94 155 -57 301 185 -146 138 -306 -19 30 -95 -146 -178 39 115 -55 38 182 162 -14 -13 -34 98
$$ packed form
4688g7M2l11L32K07j14k60K63q1k37L09k5O1J2m3j12J17m0K3q0R5j61j9j39K49
4712A1l65L81K07j59k29K66j92R2P3Q8k06P1mk65J02mJ07j65K76r2m9j05J20q8
4736a29J56J06j73L18k20J05j68k1J5P3n7j50O8O1J78j62K15l75Q5p2n1L17o1
4759E8j31Q2J05K9Nk77O1J7k7R2J5j46J0J59R3j29j06J98k09j03L51j92j23K59
4783I1%k6n3j18J1K11k60J75m4K5k16L52J21k41J39k27L8k02L10k0r2K59k36m7
4807e0LjK07N9r9k60L6O8J1P2j18K01j02k53J23J0j94K93J31j66j54l9L80j67
4831iR7j40J8n0J40K9R3k02j12J14p0Q3R4k1k35L39l09J91Q2j20K21l64J41n4
4855d4J34MO1k12L58j16l31K84m44K87M9j25n1l2K17P6j70R3J44k0j76Jk1J32
$$ plain form
4879 98 168 124 155 -27 -98 -119 161 -82 134 -215 -103 -129 -93 -24 -67 91 119 -70 156 194 128 172 -185 87 -74
4904 -74 230 18 -114 53 -43 -151 -166 -197 8 -23 -118 -4 -132 -113 11 100 -9 85 171 120 102 94 -75 106 -56
4929 -56 -152 100 -94 115 -213 -129 135 -106 -127 87 35 47 -11 119 185 75 94 52 -36 26 96 146 -5 7 46
4954 46 -131 99 -251 -257 -65 126 136 -19 159 92 284 -38 -46 184 -81 -54 52 211 -71 -2 -90 -31 138 -42
4978 -42 -32 -103 -195 13 4 140 -27 -205 89 -61 -15 -41 65 150 -45 75 10 24 -139 -118 -99 -77 -17 -404 23
5003 23 -133 -61 -6 277 -143 103 99 269 -83 -124 49 169 -99 18 136 115 -72 -190 -148 -23 131 48 -89
5026 -89 -208 45 -29 -59 160 -359 -77 136 -163 70 31 -62 -137 15 44 -22 9 -63 -116 -20 11 61 -49 16 210
5051 210 167 60 -132 127 -20 -92 75 194 153 -11 -1 -160 -78 -180 -4 55 -82 -55 -90 -58 -129 174 -53
$$ packed form
4879I8P0m4L1j82p1k1K80k43K16l49J12k6L6O9m3J58K8j89K26L8o6M4l57K72j61
4904g4L04k12j32J67r6j08j5l1K05l1r5J14j28J9J24Q9j09R4Q6n1j8qj69J81j62
4929e6r6K52j94K09l28Q4K64k41k1K14n2J2n8J30O6j10J9m2q8O2P0N0j51J2L9
4954D6j77K30l50oJ92J91J0j55J78o7J92l22qK30k65K7J06J59k82O9q8N9J69j80
4978d2J0p1r2K08rJ36j67j78K94j50M6k6J06Q5j95J20o5J4j63K1J9K2O0l87M27
5003B3j56P2N5K83m20K46mJ70l52m1J73J20k68J17J18k1j87j18M2J25J54q3j37
5026h9j19K53p4l0K19n19K82K13k99K33l9r3p5J52K9o6L1p2n3R6L1N0j10O5J94
5051B10m3j07j92K59j47p2J67J19m1j64J0j59Q2j02J76N9j37K7l5L2p1L03k27
$$ plain form
5074 -53 -85 232 75 186 128 -81 -107 11 -54 113 91 -53 -9 -68 -292 32 -130 -50 -12 94 3 -129 -69 255
5098 255 28 152 59 -104 58 92 5 -134 43 244 238 -231 -375 4 205 -154 156 -123 22 -153 -157 -7
5120 -7 -109 -107 310 168 -40 -83 70 -7 44 -11 -29 13 78 36 -67 28 110 185 210 134 34 -182 -76 -12 65 -40
5146 -40 61 -129 -54 -79 -75 142 -113 61 0 -229 -10 2 5 -49 93 88 12 86 -18 -162 -98 152 99 116 49 -118
5172 -118 67 -61 -85 -25 54 59 -230 -143 -62 63 -14 -74 144 -18 68 -191 -56 30 -172 207 -69 116 309 42
5196 42 34 11 111 -113 169 37 -196 33 -15 26 -135 41 -16 -73 64 137 147 -63 17 -132 -50 324 -13 41
5220 41 -72 69 75 -160 23 137 -88 -53 -48 68 71 -76 25 -55 270 79 25 -68 176 97 -17 -128 -88 276
5244 276 -179 -108 -165 -40 -21 146 -147 -10 -314 -141 40 6 215 21 -118 201 57 45 47 130 76 121 -4
$$ packed form
5074e3l2L17j57J11n8k09k6J18o5J67k2j44M4n9k24L24j62Q0L8J06r1j32O0L24
5098B55k27J24r3j63J62L4q7j39J77K01om69j44L79K01l59L10k79J45j75mJ50
5120gj02KM17j42k08m3J53p7N1n5j8M2O5m2j03R5Q2P5K5p6j00k16J06O4P7j05
5146d0J01j90P5k5MK17k55J74o1k29K19J2Ln4J42np6P4j04j44O4K50n3J7o7j67
5172a18J85j28k4O0P9Nk89Q7Q1J25p7o0K18j62Q6k59J35Q6k02L79k76J85J93k67
5196D2qk3J00k24K82j32k33K29m8M1j61J76n7n7J37P3J0k10Q0j49Q2L74l37N4
5220D1j13J41Ok35J83J14k25L5NJ16Lj47J01q0L25j91n4r3K44p9j14j11M0L64
5244B76m55P1n7J25J9J67k93J37l04J73J81l4K09j94j39L19j44j2KQ3n4M5j25
$$ plain form
5267 -4 133 106 -95 -20 25 -1 28 187 -144 -113 -114 -17 -120 -90 -3 -333 302 269 -59 101 107 55 -221 -96 -100 62
5293 62 -342 -51 0 95 28 -75 215 36 284 31 11 130 54 -73 226 -257 -139 -34 -78 -12 -96 -131 73
5316 73 5 -91 -11 -69 -36 -36 -74 49 75 -180 -32 228 -88 -8 -86 10 91 -28 14 142 -22 -235 -19 -25 10 157
5342 157 27 -196 -10 51 35 294 -63 4 131 -110 -27 13 -73 -32 -151 0 -72 -162 5 -149 -173 -83 -17 10
5366 10 105 -383 -14 31 167 20 126 62 94 -23 -16 -114 -83 -136 -92 -32 69 -159 -126 -53 -53 164 -42 -102 99 178
5392 178 109 -51 -103 118 208 10 15 -123 -2 -50 -23 -111 -267 65 -269 -236 90 -48 -83 -147 -58 9 -227 222
5416 222 234 -89 102 -49 -165 -291 -100 45 -44 -46 -119 -216 27 -33 -110 75 82 -66 -2 105 63 105 -68 9 229
5441 229 2 39 -93 -45 -201 18 25 26 -35 -153 7 -163 -337 -64 104 111 -3 301 168 -163 139 -96 -10
$$ packed form
5267dJ37k7k01P5M5k6K9J59l31L1jR7j03L0Q7l30O35l3l28J60On2k76J25mJ62
5293F2m04K91N1R5o7j03K90j79K48k53k0J19p6j27K99m83J18J05m4O6q4l5K04
5316G3o8r6Q0n8L3%l8J23K6k55J48K60l16Q0p8R6Q1j19M2J28j64k13K16oL5J47
5342A57j30k23J86O1j6K59l57O7J27k41Q3M0q6M1j19J51p2r0J67j54k4R0O6K7
5366A0R5m88L69M5J36j47J06o4L2j17Pr8L1n3M4O0J01k28L3P3%K17k06o0K01P9
5392A78o9j60n2K21R0j98Nj38J21m8K7q8j56L32l34L3L26j38l5o4Q9O7k36M49
5416B22J2l23J91j51j16j26J91J45q9kp3r7K43o0p7J85Pj48O4J07m2M2j73P7K20
5441B29k27L7j32M8j56K19PJo1j18J60j70j74K73J68Pj14L04j33l31L02k35Q6
$$ plain form
5464 -10 -153 -66 59 42 14 -166 131 30 205 93 5 -28 44 132 45 -72 108 114 -22 -62 125 99 79 47 -96
5489 -96 -175 -80 -286 135 -39 -90 -198 -5 -50 38 182 -112 99 -7 -101 -124 -143 -87 113 50 280 182 60 -95
5513 -95 -79 -143 -11 -51 -127 4 -331 -129 -170 -35 -55 74 -3 -88 232 41 48 -206 20 37 -163 -31 -71 -7 -63
5538 -63 15 -150 40 -16 -173 77 -65 119 -119 124 60 -200 -87 44 26 10 131 -71 -124 70 134 86 -114
5561 -114 -72 160 -2 42 94 -154 -43 248 -74 -41 178 -90 1 34 2 -53 125 5 -203 5 67 88 -278
5584 -278 -159 -30 -159 -202 -167 75 -11 136 -1 -104 74 -96 151 -34 -60 -156 -20 -184 -51 -197 -62 -155
5606 -155 -99 -200 140 -5 -58 126 -38 -61 53 60 67 -162 12 169 79 -59 -125 21 -202 -11 80 -111 -120 -121 34
5631 34 -14 -13 168 -111 -218 -67 19 75 233 -59 28 68 33 68 -7 -173 -129 58 -200 1 -60 -66 -231 69 -73
$$ packed form
5464a0j43Q7J25j7k8j80K97j01J75j12q8l3P2Q8q7j17J80Oj36m0J87k6k0l2j43
5489i6p9R5k06M21j74n1j08J93m5Q8J44k94K11j06r4k3j9N6K00o3K30r8j22j55
5513i5J6o4J32m0p6J31l35K02m1J35k0J29p7q5L20j91Pk54K26J7k00J32m0O4n6
5538f3P8j65J90n6j57K50j42J84k38K43o4k60J13J31j8j6J21k02n3J94O4m8k00
5561a14M2K32j62M4N2k48J11K91l22L3K19k68R1L3l2n5J78j20k08K08O2K1l66
5584b78J19J29j29m3L5K42q6J47j37j03J78j70K47j85k6r6J36j64J33j46J35r3
5606a55N6j01L40j45n3J84j64k3J14PPk29J74J57r0j38o6J46k23J91R1j91rjJ55
5631C4m8JJ81k79j07J51Q6N6J58k92Q7M0l5L5p5j66M4J87k58K01o1oj65L00j42
$$ plain form
5656 -73 165 -4 -92 191 210 51 35 -110 113 -66 95 243 43 -216 -28 45 -89 -84 52 23 -25 -208 43
5679 43 -211 -22 215 -7 77 -61 -16 38 155 87 67 -142 131 6 -223 23 -107 -42 2 -38 -68 -107 -4 8
5703 8 43 27 118 -51 64 7 -87 50 -26 151 38 -122 28 120 109 -107 -16 -53 15 -23 11 -272 -125 143 30
5728 30 165 -19 83 -14 9 -157 -159 113 -44 -130 69 -84 11 -204 207 129 -70 60 -44 -53 128 -1 -48 69
5752 69 -86 -155 33 -105 92 18 -69 -23 -131 -101 -24 62 -93 97 -35 22 -70 -173 2 40 -14 -29 -23 -37 197
5777 197 -130 -13 115 5 78 88 131 -128 -163 -140 -53 -98 -81 26 257 -79 -55 25 -72 196 134 117 -75 -52 -9
5802 -9 -58 -66 42 -40 116 96 -77 80 39 -143 184 66 -50 92 210 -88 -15 101 -128 130 73 -70 160
5825 160 -58 155 11 -69 17 -98 -16 101 26 125 -93 -29 -91 13 -234 106 8 92 -59 -220 -56 29 132
$$ packed form
5656g3K38j69q8K83J9j59j6j45K23j79J61J48k00k59J88P3j34NJ36k9m8j83K51
5679D3k54J89K37k22Q4j38M5N4J17o8k0k09K73j25k29K46j30O5M4m0l0l9J03J2
5703HL5j6R1j69J15n7r4J37p6J77j13j60J50R2j1k16R1l7O8l8L4k83J47K68j13
5728C0J35j84J02r7K3j66kK72j57q6J99j53R5k15M11p8j99J30j04rJ81j29m7J17
5752F9j55o9J88j38J97p4q7M6j08L0P7Q6j55J90j32N7r2j03J75L8n4j5Oj4K34
5777A97l27J17J28j10P3J0M3k59l5K3Q7m5J7J07K31l36K4Q0r7K68o2j7j92K3M3
5802im9qJ08q2J56k0j73J57m1j82L27j18j16J42J18k98P3J16k29K58n7j43K30
5825A60k18K13j44q0Q6j15Q2J17p5R9k18O4o2J04k47L40r8Q4j51j61J64Q5J03
$$ plain form
5848 132 -185 -124 -38 -65 -122 51 30 -13 1 11 -92 -103 -230 -21 135 225 105 29 194 127 222 -52 41 -10 -2 -144
5874 -144 -167 -126 57 -11 123 -2 -73 96 212 -48 -112 -82 -69 1 -192 62 -192 43 73 -132 71 -122 -167
5897 -167 215 115 52 10 40 179 -76 151 98 -13 196 117 288 44 130 -106 99 -5 147 37 -193 -217
5919 -217 99 43 -56 -57 -75 -160 37 187 118 169 61 144 338 2 -303 -9 -279 -84 60 80 -87 -4 113 -193
5943 -193 -171 18 -124 -100 -18 -173 52 296 143 76 242 -143 -154 123 53 -200 -261 -75 245 164 -366 -86 -29
5966 -29 -309 37 -107 100 -68 167 12 -7 172 91 12 -10 232 10 -56 -123 60 29 118 63 -20 -36 -136 -49
5990 -49 179 -147 71 -77 -67 -154 41 -117 70 338 59 -5 -223 -92 14 -25 -179 195 -18 -185 22 -286
6012 -286 -26 -79 30 -109 -11 108 149 -16 -214 22 159 -138 126 -60 -135 13 155 -2 -44 -144 -87 141
$$ packed form
5848A32l17O1Q6k7n7J73k1m3J4J0j03j1j27K09J56R0j20p6J65o7R5k74R3n1Qj42
5874a44k3M1J83o8J34j25p1J69J16k60o4L0J3P0j93K54k54K35L0k05K03j93m5
5897a67L82j00o3m2L0J39k55K27n3j11K09p9J71k44Q6k36K05j04J52j10k30k4
5919b17L16n6r9jj8q5J97J50o9N1j08Q3J94l36l05K94k70J95J44K0j67Q3J17l06
5943a93K2J89j42K4Q2j55K25K44j53o7J66l85j1K77p0k53o1J86L20q1n30K80N7
5966b9k80L46j44K07j68K35j55j9J79q1p9k2K42k22o6o7J83l1Q9n5q3j6j00Q7
5990d9K28l26K18j48J0q7J95j58J87K68k79o4k18J31J06l9j54L74k13j67K07l08
6012b86K60n3J09j39R8J19M1j65j98K36J37k97K64j86p5J48J42j57m2j00N7K28
$$ plain form
6034 141 -126 217 20 129 279 6 10 74 126 106 -60 -63 -79 44 -131 -122 -67 27 13 30 20 -26 99 -25 114
6059 114 -80 -98 -95 -34 -13 7 -143 54 29 -137 169 55 -63 155 -182 160 91 -15 -51 35 93 95 -192 -191 -88
6084 -88 39 43 -117 -4 -187 87 65 17 -33 -124 -135 70 -44 -153 104 22 17 22 261 21 -57 -94 -10 84 -114 -161
6110 -161 -102 49 42 158 108 -24 137 -3 -85 -218 84 78 43 -33 -142 64 73 -89 -19 -154 64 80 -68 -91 -101
6135 -101 70 63 -128 73 249 17 45 5 26 -36 -28 -86 136 -129 -170 26 -57 66 -5 51 126 -197 31 -8 -14 -180
6161 -180 189 -46 -105 -166 -91 -149 -197 -38 -286 100 -70 -1 -66 28 14 78 144 -38 34 154 90 243 66 78 -70
6186 -70 -105 -115 -18 -19 -131 -180 -60 107 -132 78 27 -137 29 -5 126 -204 -76 54 -29 6 162 19 176 -309
6210 -309 -88 18 -105 50 191 -41 -13 -40 -111 -110 46 223 -43 24 43 14 6 27 171 -32 -54 57 -74 27
$$ packed form
6034A41k67L43j97J09J50k73MO4N2k0j66lj6J23j75RN5R4j4J7j0m6J25j24J39
6059A14j94j8LO1K1K0j50J97k5j66L06j14j18K18l37L42o9j06l6Q6N8Kk87JJ03
6084h8J27Mj60J13j83K74k2m8n0r1j1K05j14j09K57q2nNK39k40p8l7Q4R4j98m7
6110a61N9J51pJ16n0j32J61j40q2j33L02ol5p6j09K06Rj62P0j35K18J6j48k3j0
6135a01J71pj91K01J76k32K8m0K1o2Qn8K22k65m1J96q3J23p1N6P5l23K28l9oj66
6161a80L69k35n9o1P5n8m8J59k48L86j70O9o5R4j4O4O6j82P2J20o4J53j77J2j48
6186g0l5j0R7jj12m9J20J67k39K10n1j64J66l4J31l30J28J30q3L5J56j43J57m85
6210c09K21J06j23J55J41k32K8k7p1JJ56J77k66O7J9k9qK1J44k03k2J11j31J01
$$ plain form
6234 27 -21 230 161 162 12 17 6 88 -6 16 105 -58 -28 126 157 -147 -13 13 -2 -26 18 -296 -122 -21 75 -126
6260 -126 -112 294 113 5 -316 -71 66 85 22 -21 98 91 96 -148 -41 68 80 -10 186 -40 -139 -261 175 -60
6284 -60 -27 70 -157 -44 6 25 -19 0 93 118 55 128 11 57 -145 97 -118 -45 -325 150 3 -6 -151 136 -56
6309 -56 -85 -213 133 125 1 208 15 -2 171 -112 115 13 -28 13 -170 -163 -131 -6 -54 -111 158 112 -95 87
6333 87 40 60 20 101 -210 105 18 -23 -98 -47 14 -23 -40 71 -6 -10 -105 67 -37 109 -110 -83 44 -3 87 153 -61
6360 -61 144 -137 -108 -123 -108 -74 -27 -131 19 -180 205 -22 -196 -4 32 -62 133 197 81 101 27 -75 -130 -13
6384 -13 -46 39 -115 196 8 -135 100 -8 34 -13 -145 190 -71 220 -249 184 220 -76 -62 91 1 -122 -80
6407 -80 150 199 -63 -42 -32 86 68 78 -17 -115 -169 52 -120 68 14 -74 156 -50 -44 -137 -10 -16 -46 100 -269 -268
$$ packed form
6234B7m8K51o9Jj50Nj1Q2r4K2Q9j63L0J54L1l04J34K6j5k4M4l14J74J01R6k01
6260a26J4M06j81j08l21K45J37J9o3m3J19pNk44J07J09J2r0J96k26r9j22M36k35
6284f0L3R7k27J13N0J9m4J9R3K5o3P3j17M6k02K42k15P3k80M75j47rj45K87j92
6309e6k9j28L46qj24K07j93j7J73k83K27j02m1M1j83PL2J25m8n7K69m6k07J82
6333H7m7K0m0Q1l11L15q7m1p5N1O1l7j7J11p7mr5J72j04J46k19K7J27m7R0O6k14
6360f1K05k81K9j5J5L4M7j04J50j99L85k27j74J92L6r4J95O4j16K0p4j02n5J17
6384a3l3Q5j54L11j88j43K35j08M2m7j32L35k61K91m69M33L6k96J4J53r0j23M2
6407h0K30M9k62K1J0J18j8J0r5r8n4K21j72J88n4q8K30k06Or3J27ol0J46l69J
$$ plain form
6433 -268 51 145 -43 -153 92 -98 87 -8 87 17 -45 142 216 52 120 114 252 126 -86 142 -18 -45 48 -84
6457 -84 62 130 13 -71 195 -160 -143 -94 -26 131 11 -38 11 24 38 25 -66 114 -138 174 87 -134 -296 14
6481 14 -99 -7 -105 -95 283 -162 -116 54 -225 90 227 202 -3 43 195 -173 278 -110 148 -174 -7 121
6503 121 102 -33 -89 104 -4 -337 60 66 -211 -73 363 36 61 195 130 14 -12 28 -46 -17 -66 -190 7 -47
6527 -47 155 85 71 78 132 5 188 14 97 81 -46 -7 182 70 -128 -7 86 285 -127 -38 89 64 -74 -111
6551 -111 -41 -28 -265 16 179 -87 62 -69 51 27 122 -69 114 170 65 -9 119 42 -43 -135 -14 116 84
6574 84 -70 89 10 81 53 -120 100 -52 44 35 -25 238 43 110 98 -101 -137 -197 -7 -66 -29 -110 -43 -26 109 -151
6600 -151 -177 69 52 148 -16 65 193 107 -36 -96 -379 -11 -24 -38 -128 -51 147 92 166 166 109 91 55 5 7 -223 40
$$ packed form
6433b68L19R4j88j10K45j90J85r5R5p0o2J87P4j64O8oJ38j26k12K28j60k7R3j32
6457h4J46O8j17q4K66l55J7M9O8J57j20m9M9J3J4j3r1J80k52L12q7k21j62L10
6481A4j13R2r8J0L78m45M6J70k79L15J37k5k05M6J52l68M51l88K58l22J67J28
6503A21j9j35n6J93j08l33L97Ok77J38M36l27K5J34o5j16k6M0p4K9m9j24J97n4
6527d7K02p0j4PN4j27J83j74Q3j6j27L9J89j12j98J21R3J99m12Q9J27k5j38l7
6551a11P0J3k37K81J63k66J49j31J20k4R5j91J83N6j05p4J28p7q5r2J21J30l2
6574H4j54J59p9P1k8j73K20j52R6ro0K63j95O7j2j99l6o0J90n9L7q1O7J7J35k60
6600a51k6K46j7R6j64Q1J28q6j43o0k83L68j3j4r0P7J98n5P4%n7j8l6n0Kk30K63
$$ plain form
6627 40 105 -51 51 29 55 230 90 -73 20 65 180 52 -11 -114 -107 99 160 12 -157 68 -76 128 -6
6650 -6 130 169 57 139 -94 84 -51 -291 -93 57 119 -286 -170 -43 70 24 -84 -1 -51 -128 -31 74 245
6673 245 311 -164 -272 -135 -1 -174 -76 29 34 -132 31 40 110 -19 46 105 234 154 63 -57 110 164 96 -307
6697 -307 58 207 51 125 -47 -40 -154 -18 -59 -43 8 -41 242 -38 97 -96 3 -43 -18 -20 11 2 49 74 -61 -98
6723 -98 -220 39 71 -130 -69 -44 -51 -136 25 163 26 -21 58 36 43 -29 136 5 133 -149 45 45 -47 -61 -122 69
6749 69 -43 77 83 200 178 -119 76 87 18 161 145 -262 -11 -17 16 49 67 -331 -110 42 -52 6 90 -7 -116
6774 -116 43 72 -94 78 81 170 -293 111 15 -49 -41 -175 -115 -162 -115 -143 -5 -300 -15 -61 -13 210 19 2 50
6799 50 -17 90 -116 -74 32 -3 -56 -20 4 132 55 199 -53 56 84 78 -59 77 26 -159 -37 137 97 -99
$$ packed form
6627D0O5j56J02k2K6J75j40j63R3M5J15j28o3j03PK06O1j48j69K25j44K04j34
6650fJ36L9j12Q2k33J78j35k40J98J50O2m05J16J27J13m6j08Q3n0p7R7J05J71
6673B45O6m75j08J37J34j73R8J05Nj66J63RP0j29O5N9J29q0r1j20J67N4o8m03
6697c07L65J49j56P4j72Pj14J36m1J6N1m9K83k80J35j93R9m6K5kL1rM7K5j35l7
6723i8j22K59L2k01O1K5pq5J61J38j37m7P9k2Pp2J65j31J28k82J94%r2j4o1J91
6749F9j12J20OJ17k2k97J95J1o9J43j6m07K51oL3L3J8l98K21J52r4N8Q4r7j09
6774a16J59K9j66J72LQ9m63M04r6o4Qj34O0m7M7k8J38k95K85m6M8K23j91j7M8
6799E0o7J07k06M2J06l5n3L6K4J28p7J44k52J09K8oj37J36n1j85J22J74m0j96
$$ plain form
6823 -99 -159 -32 -27 -124 -15 199 60 1 26 96 119 407 76 -199 -43 75 55 58 49 -45 -38 149 52 39 222 165 222
6850 222 101 -155 -66 146 32 5 -189 -63 59 -255 111 109 110 -176 194 -96 -233 -21 -60 164 172 93 235
6873 235 83 26 25 -69 -32 -291 74 -69 71 35 -58 -22 -33 -94 -92 -109 -3 198 79 212 -87 120 203 33 16
6898 16 182 -39 210 25 -61 207 -36 20 89 -37 214 -115 -110 81 63 -64 -276 123 -80 76 -48 -193
6920 -193 -30 -4 6 -123 157 -162 -47 -73 -65 56 -57 -255 39 69 47 -153 -137 167 128 -19 -44 28 -35 121
6944 121 21 88 -24 -73 39 58 178 -10 34 40 110 -130 137 85 -86 134 -213 -59 -19 -235 -58 103 -88
6967 -88 -40 -80 69 -47 61 143 38 -137 -208 164 -36 38 -12 1 56 69 56 153 -181 -66 93 -67 112 100
6991 100 136 -78 26 -85 -48 8 17 -131 -49 60 46 -69 184 138 100 52 -91 -172 89 83 -57 109 0 -49 58
$$ packed form
6823i9o0J27Nr7J09K14j39n9K5P0K3K88l31k75J56J18k0Lrr4PJ87r7j3J83n7N7
6850B22j21k56Q9K12j14k7j94J26J22l14L66kJk86L70k90j37K12l9K24Qp9J42
6873B35j52n7jr4L7k59L65j43J40l6r3L6j1o1Kj7J06K01j19J33k99K07Q3j70j7
6898A6J66k21K49j85q6K68k43N6O9j26K51l29NJ91j8j27k12L99k03J56j24j45
6920a93J63K6J0j29K80l19J15k6QJ21j13j98K94L0k2k00J6L04l9j47k5P2o3J56
6944A21j00O7j12m9J12J9J20j88M4OP0k40K67n2j71K20l47J54M0k16J77J61j91
6967h8M8m0J49j16J08Q2j05j75p1L72k00P4n0J3N5J3j3R7l34J15J59j60J79j2
6991A00L6k14J04j11L7N6Rj48Q2J09j4j15K53m6l8m8j43q1K61oj40J66j09m9J07
$$ plain form
7016 58 -75 -96 -12 46 -27 -13 28 -74 -183 -32 -37 82 -165 102 82 19 -157 81 -2 43 -112 124 -35 101
7040 101 30 28 -6 -16 -72 -72 30 -10 -100 -78 1 83 -21 132 -116 -59 -12 -138 46 -63 -93 -134 -75 -104 -68 96 -112
7067 -112 -102 53 -193 23 -57 -155 43 -17 -153 262 200 -263 -56 -114 22 108 -119 -3 111 54 -144 167 34
7090 34 -43 -146 47 27 51 3 -157 72 72 -13 -35 -48 -11 -117 10 -108 -55 -271 -66 -100 45 -96 36 53 200
7115 200 134 -161 -76 107 -65 13 70 -107 202 16 36 155 -7 -140 58 29 -77 -247 -25 70 46 81 -102
7138 -102 -160 -22 61 112 -154 9 -16 152 -129 -193 -60 -57 -17 16 98 -55 -169 -52 -66 -41 10 67 25 -55 37 6
7164 6 166 -41 39 -26 -64 -106 -85 7 -120 25 -47 50 125 -55 -75 -79 -23 -126 153 -16 73 210 81 78 -58 220
7190 220 163 -177 -212 44 -75 59 32 -78 74 60 168 52 -324 89 -58 -59 -139 246 55 -10 -124 -62 -38
$$ packed form
7016E8j33k1Q4N8p3J4M1j02j09J51nJ19k47K67k0o3j76K38q3M5j55K36j59J36
7040A01p1kl4j0n6%J02m0r0K2P9Q2j04J53k48N7M7j26J84j09l0m1N9k9L6J64k08
7067a12J0J55k46K16q0r8J98o0j36M15o2m63K07n8J36Q6k27J16J14n7j98L11j33
7090C4p7j03J93k0K4m8j60K29%q5k2j3L7j06J27j18N3k16K05l4J45j41J32J7J47
7115B00o6k95Q5J83j72P8N7j77L09j86K0J19j62j33J98k9j06j70K22R5k4L5j83
7138a02n8J38Q3N1k66J63k5J68k81o4J33LM0L3Q2j53j14J17j4K5N1N7m2q0R2l1
7164FJ60k07Q0o5l8m2K1R2j27J45p2R7P5j80k0mN6j03K79j69Q9J37j29lj36K78
7190B20n7l40l5K56j19J34k7j10J52j4J08j16l76M13j47jq0L85j91o5j14O2K4
$$ plain form
7213 -38 60 107 45 -110 -263 -106 120 -158 -78 163 -131 30 97 219 -52 17 78 38 162 247 100 169 -56 65
7237 65 157 -274 -213 111 -50 57 100 -131 16 15 -133 35 -61 -74 -140 204 -48 71 18 256 175 -5 24 114
7261 114 -35 -92 -87 -188 218 -106 -208 -193 28 124 -7 69 -115 171 62 98 17 206 14 -257 164 34 229
7284 229 89 102 -51 -58 4 60 -117 -26 -1 8 105 -110 1 -141 134 30 24 -84 -117 -76 -87 110 -20 -145 22
7309 22 -80 -62 -86 -98 -6 57 238 -9 55 -186 168 -71 -2 187 171 23 -63 25 54 129 -121 -242 -118 -394
7333 -394 38 -72 19 -239 271 -125 20 -81 -7 26 -267 62 -182 138 -230 -233 6 59 105 43 24 47 90 42
7357 42 66 183 -48 144 -75 122 -94 -54 190 117 -131 16 87 51 119 134 -35 -50 -108 70 -28 68 -113 -99
7381 -99 -64 -74 20 67 0 13 31 149 152 -125 -7 141 -73 239 12 35 -23 -124 135 221 0 -159 -22 -90 -3
$$ packed form
7213c8R8M7o2j55j53J57K26k78Q0K41k94J61O7J22k71O9O1m0J24Q5j47O9k25J21
7237F5R2m31O1L24j61J07M3k31J47jj48J68r6j3o6L44k52J19n3K38q1j80K9R0
7261A14j49n7Nj01M06l24j02J5K21R6j31P6j84K86j09L6q1J89j92k71M21j30J95
7284B29j40J3j53pO2N6j77R1K5RR7k15J11j42K75j04oj08l3M1j1J97j30j25J67
7309B2j02J8k4j2R2O3J81k47O4k41L54k39O9J89j6j48q6Q8K9P5k50j21J24k76
7333c94M32j10R1k58N10l96J45j01P4L3k93L29k44L20l68lK39N3M6o2j9K3M3m8
7357D2K4J17k31J92k19J97k16M0K44p3k48J47P1l6O8J5j69j5n8J78r8R6j81J4
7381i9L5j0R4M7o7J3J8J18Lk77J18J48k14L12k27K3n8j01K59Q6k21j59J37o8Q7
$$ plain form
7406 -3 -112 149 134 153 -2 -42 -45 126 -2 -110 -28 -232 -69 -18 -139 119 -127 -64 -17 48 18 2 -81 161 -207
7431 -207 -123 72 -46 -177 -103 -68 -283 46 -55 -108 -45 -21 -14 -96 -88 -70 -200 82 -45 42 13 -54 -25 -26 -87 -8 -119
7458 -119 21 -76 -11 21 95 217 0 -28 90 -142 212 26 81 -115 -72 206 145 -49 11 -69 -52 34 72 -86
7482 -86 130 61 7 69 -57 -104 -98 -29 -168 147 -198 -62 145 69 -18 81 -101 -27 -325 76 -44 -88 -18 2 26
7507 26 8 97 -142 -217 -29 -54 31 -36 157 -45 -94 -75 138 -22 -43 188 -107 -90 109 127 30 28 -22 -131 -150 -103
7533 -103 139 32 101 10 130 -106 45 123 -105 129 127 159 160 174 104 -97 2 -41 -126 -67 -2 -231 -96 -284 96
7558 96 119 -43 -95 136 42 128 -13 85 121 175 187 107 67 278 -16 34 -65 -163 -95 -166 -30 117 119 -64 -105 -125 -22
7585 -22 98 -63 -37 92 -34 66 -75 110 278 -235 257 282 -124 -85 74 -97 -22 -56 -306 99 -167 -137
$$ packed form
7406cj09K61j5J9j55m0lJ71j28j08Q2k04J63N1j21K58k46O3M7O5l0j6q3K42l68
7431b07Q4J95j18j31P4L5k15L29j01n3O3K4Pq2QJ8j30K82j27Q7k9o7K9jo1P9j11
7458a19J40r7O5L2P4J22k17k8J18k32L54j86N5j96M3K78o1j94O0q0J7Q6L8j58
7482h6K16o9n4O2j26m7OO9j39L15l45J36K07p6q7R9j82P4k98M01j20m4P0K0K4
7507B6j8Q9k39p5J88k5Q5o7J93k02m9J9K13j60k1K31k95J7J99J8r7kn0j09j9M7
7533a03K42j07O9r1J20k36J51P8k28K34kL2JJ4p0k01R9m3q5N9O5k29J35j88L80
7558I6K3j62n2K31r4Q6j41R8L6N4J2q0m0K11k94N0r9r8O8p1J36J47Kj83m1k0J03
7585b2J20j61K6J29j26J00j41J85J68n13M92K5m06L9J59j71P5l4k50M05k66L0
$$ plain form
7607 -137 -106 44 -76 -74 76 194 -8 -178 -49 -77 -121 51 -230 -232 117 132 305 19 117 -38 143 22 33
7630 33 -96 96 -136 60 146 25 10 78 -45 -34 79 -87 -69 -115 94 -290 -55 -142 17 22 -152 -36 -94 -76
7654 -76 -67 -74 101 -334 100 -62 98 -8 56 78 154 -127 -26 -16 -35 -62 -259 96 79 13 -122 72 21 -154 -77
7679 -77 -23 170 171 -47 62 14 -191 89 -12 -96 -10 -26 -218 -102 -26 -318 45 116 44 45 12 34 37 29 236 -172
7705 -172 141 96 19 -49 160 -73 82 -63 -81 -209 -63 5 279 -109 -53 256 -112 141 149 58 -45 64 -67
7728 -67 74 16 21 -90 60 -248 48 -9 -190 -19 185 21 100 33 -61 -178 -138 45 -85 62 128 -11 -61 0
7752 0 -108 -12 -94 19 67 12 69 150 173 166 8 123 -213 15 46 -74 229 -129 57 90 -7 -217 -34 -4 -145
7777 -145 116 -131 153 116 5 -66 74 -91 -37 -237 199 -38 -41 -28 -68 17 238 32 137 52 -56 136 -9
$$ packed form
7607a37L1J50j20KJ50J18k02j70J29k8m4J72k81kL49J5J73k86R8j55J81j21J1
7630C3j29J92k32J96Q6j21j5O8j23J1J13j66J8m6K09l84K35q7J59Nj74J16n8J8
7654g6RpJ75m35M34j62J60j06O4K2P6k81J01J0j9k7j97L55j7o6j35J94n1j75P7
7679g7N4J93Jk18J09m8k05K80j01q4Q6j6j92J16P6k92L63P1p2Jl3K2LqK07m08
7705a72L13m5p7o8K09k33J55j45j8j28J46O8K74l88N6L09l68K53Qr1j03J09j31
7728f7J41n8Nj11J50l08K96n7j81J71K04j64P9o7r4j17M0J83j30J47O6j39n0O1
7752@j08R6q2J13M8n5N7Q1K3pj58J15l36K28L1j20L03l58J86L3r7k10J83L0j41
7777a45K61k47K84l7j11p1J40j65N4k00M36k37lJ3m0Q5K21k06J05q5j08J92j45
$$ plain form
7800 -9 57 -112 96 69 4 205 40 -46 30 307 27 32 -103 224 6 40 198 -10 -81 -127 19 -168 91 -139
7824 -139 -257 72 -25 16 36 93 34 35 50 40 153 11 -5 20 -190 52 -168 -60 54 -179 67 -136 -313 -29
7848 -29 4 -75 -20 -32 -88 10 -34 126 70 59 153 -279 64 -77 16 94 -21 157 -239 -245 8 -163 24 258 -72
7873 -72 45 -84 57 85 -154 63 43 294 -69 158 -91 34 -41 139 -37 -138 144 18 172 -88 -155 -3
7895 -3 161 208 151 -39 -144 -93 -54 -162 38 39 -223 28 -158 201 109 -66 104 -47 -33 -74 -80 -52 -35 -136 54
7920 54 -47 -205 -19 67 114 146 -184 4 -229 104 -69 -25 -131 -62 -44 39 -35 -23 -235 -85 48 -23 82 -41
7944 -41 -153 102 62 -162 102 92 -62 -16 -32 -327 110 45 41 -249 -104 60 -102 151 151 159 -115 -159 -52 158
7968 158 20 -25 54 -68 101 159 6 129 70 -125 -21 80 -33 -9 -13 -79 34 -127 -166 52 52 55 -67 136
$$ packed form
7800iO6j69K08k7o5K01j65q6P6K77k80Nj35L27k18L4J58k08p1m6J46j87K59k30
7824a39j18L29r7M1K0N7n9JJ5j0J13j42j6K5k10K42k20J08J14k33K46k03j77K84
7848b9L3p9N5j2n6R8m4J60n6j1R4m32L43j41R3P8j15J78l96oK53j71J87K34l30
7873g2J17j29J41K8k39K17k0K51l63K27k49J25p5J80j76j01K82j26J54k60o7J52
7895cJ64M7n7j90j05N1L9j08K00Jk62K51j86L59r2j75J70j51J4m1oK8J7j01J90
7920E4j01j58J86Q6M7L2l30J88k33L33j73M4j06O9J8Q3p4J2k12J50J33p1J05j23
7944d1j12K55m0k24K64j0j54M6j6k95M37o5mk90J45J64j62K53%Qk74m4J07K10
7968A58j38m5P9j22J69N8j53J23n9j95J04J01j13K4mo6J13j61l9K18%Lj22K03
$$ plain form
7992 136 144 24 -101 -40 -54 -125 376 76 230 -79 -291 -178 98 -221 -194 -10 40 150 143 -28 -70 13 13 174
8016 174 -72 -102 5 -71 -98 69 -90 -116 -41 112 179 -36 172 17 63 -34 126 -144 153 102 31 118 57 17
8040 17 64 63 -34 33 172 -41 70 2 -154 -72 74 8 65 -2 37 -58 111 88 93 118 107 -122 -158 -26 5 -81 156
8067 156 146 -120 -22 -63 -109 136 -122 -46 28 -106 74 53 -41 -87 56 54 128 162 -69 42 46 -193 -34 -20 132
8092 132 -2 -186 322 163 25 -37 -98 -15 107 34 134 24 12 32 -29 89 4 34 -20 -23 121 -31 -127 -11
8116 -11 -39 177 107 -33 210 88 172 189 -30 -3 -34 -233 -150 -63 -108 13 -111 58 -51 -58 -82 110 205 29 25
8141 25 6 -7 -30 88 -59 -20 37 52 95 -100 -166 162 -77 49 8 -81 -78 248 1 54 -195 143 134 -37 -26 -65
8167 -65 68 37 46 -195 244 14 58 -63 -40 -195 138 -75 -84 48 -8 66 27 44 202 -12 222 -235 174 58
$$ packed form
7992A36Qj20j25O1j4p1N01l00J54l09k12J13K76l19K7J84N0J10pj71m2Q3%J61
8016A74k46l0J07p6k7J67j59k6P5J53O7k15K08j55M6r7J60k70K97n1p1Q7o1m0
8040A7M7jr7O7J39k13J11o8j56Q2J46o6N7o7L9r5J69k3NK5j1k29l6J32L1q6K37
8067A56j0k66R8m1m6K45k58P6P4j34J80k1r4m6J43kP4L4k31J11Mk39J59J4J52
8092A32j34j84N08j59j38o2o1Q3J22p3J00j10j2K0o1J18q5L0n4lJ44j52r6J16
8116a1k8K16p0j40K43j22Q4J7k19K7l1j99Q3Q7m5J21j24J69j09pk4J92R5j76m
8141B5j9j3k3J18j47L9N7J5M3j95o6L28k39J26m1q9LL26k47N3k49L38rj71J1l9
8167f5J33l1Rk41M39k30M4j21K3j55L33k13rJ32n6P4l9J7J58k14K34m57M09j16
8191E8
$$ Imaginary data points
##PAGE= N=2
##DATA TABLE= (X++(I..I)), XYDATA
$$ plain form
0 0 0 0 0 0 0 0 0 0 0 0 6 -8 8 -8 8 -16 16 -24 24 -32 40 -48 56 -64 73 -88 104 -120 136 -157 178 -204 233
33 233 -263 297 -335 375 -421 470 -525 583 -649 720 -796 881 -974 1073 -1184 1304 -1437
50 -1437 1584 -1744 1923 -2121 2345 -2597 2880 -3209 3591 -4040 4581 -5241 6074 -7161 8642
65 8642 -10795 14220 -20532 36040 -159524 -101889 217528 -98 -117957 -621 73184
76 73184 -26803 29458 124148 45543 -96687 -31060 79906 58818 -53731 -72763 11792 51985
88 51985 -28895 -27600 45361 -8903 -104639 -15913 88259 4813 -90467 -4423 65402 3474
100 3474 -1188 67526 23321 -46466 -4811 42113 2933 -45926 -37739 549 8110 -401 13653
113 13653 23311 -5789 -33382 1514 50832 -1355 -79595 -32887 39968 18602 -9573 4217
$$ packed form
0@%%%%%%%%%%Oj4J6j6J6k4L2m0M8n6P2q8J04j20J37j61J92k24K56k93L35l82M37
33B33m96N60o32P10p96Q91r95J108j232J369j516J677j855K047k257K488k741
50a437L021l328L667m044M466m942N477o089O800p631Q621r822J1315j3235J5803
65H642j9437K5015l4752N6572j95564N7635L19417k17626j17859J17336P3805
76G3184r9987N6261R4690p8605j42230O5627J10966k1088j12549j9032Q4555M0193
88E1985q0880J295P2961n4264r5736Q8726J04172q3446r5280Q6044O9825o1928
100C474m662O8714m4205o9787M1655M6924l9180m8859Q187L8288P561q511J4054
113A3653R658k9100k7593L4896M9318n2187p8240M6708P2855k1366k8175J3790
$$ plain form
125 4217 7311 9819 37828 44553 -5337 -45447 -16935 15861 185 -24957 -30577 -7947 18883
138 18883 6017 -6738 10320 4507 -9474 6814 9894 -13700 -14671 14116 21712 -838 -1505
151 -1505 12816 1143 -1417 9567 -7743 -18107 -2795 -2392 -4365 1652 -10364 -16301 10797
164 10797 29449 290 -29341 -2770 21320 -3400 -14243 1181 4057 9938 15437 6103 8085
177 8085 14334 1949 -9226 -5404 -3039 -17241 -24089 -6812 -4368 -15933 792 16211 3818
190 3818 -2883 4551 17162 22687 2544 -11544 5238 18697 6181 -11189 -7993 3264 -6910
203 -6910 -13147 -1268 -9378 -23063 -10331 3552 6167 4051 -2225 2970 16708 18899 8089 -4286
217 -4286 -702 10007 3128 -4985 -2444 -6388 -7411 -2005 -1219 -469 -7656 -14126 -334 8210 -3775
$$ packed form
125D217L094K508K8009O725m9890m0110K8512L2796j5676k5142n620K2630K6830
138A8883j2866j2755J7058n813j3981J6288L080k3594r71K8787P596k2550o67
151a505J4321j1673k560J0984j7310j0364J5312M03j973O017j2016n937K7098
164A0797J8652k9159k9631K6571K4090k4720j0843J5424K876N881N499r334J982
177H085O249j2385j1175L822K365j4202o848J7277K444j1565J6725J5419j2393
190C818o701P434J2611N525k0143j4088J6782J3459j2516j7370L196J1257j0174
203f910o237J1879q110j3685J2732J3883K615k116o276N195J3738K191j0810j2375
217d286L584J0709o879q113K541l944j023N406P86P50p187o470J3792Q544j1985
$$ plain form
232 -3775 -9574 -280 10074 7424 -122 8459 13849 3631 2525 5388 936 -1024 -6256 -7350 -23
247 -23 -4605 -11063 -3682 425 -4166 -7459 -1663 5588 -2280 -3700 10930 7945 -3047 6879 13508
262 13508 4152 -2438 2031 7694 -2017 -11981 -2174 2028 -9065 -11780 -4891 1840 -1382 -10260 -1841
277 -1841 9347 1309 -2707 6113 9603 5509 851 4962 10138 1189 -4333 1205 543 -2523 -4320
292 -4320 -8105 -4353 -2352 -6153 -5687 -5094 -1780 2859 -107 849 8213 6951 4271 4498 6029 8128
308 8128 486 -6589 2395 4603 -6679 -10415 -3234 2830 -4883 -13938 -1070 7817 -6012 -8934
322 -8934 5258 9287 -380 -4781 8384 14869 -415 -3177 10067 7786 -3197 -5407 -837 1212
336 1212 -8071 -11757 -1630 103 -5894 -5807 -557 5554 2071 -4707 2754 8083 616 441 6138 5170
$$ packed form
232c775n799R294J0354k650p546Q581N390j0218j106K863m452j960n232j094P327
247b3m582o458P381M107m591l293N796P251p868j420J4630k985j0992R926O629
262A3508r356o590M469N663r711r964R807M202j1093k715O889O731l222q878Q419
277a841J1188q038m016Q820L490m094m658M111N176q949n522N538o62l066j797
292d320l785L752K001l801M66N93L314M639k966R56P364j262k680K27J531K099
308H128p642p075Q984K208j1282l736P181O064p713r055J2868Q887j3829k922
322h934J4192M029r667m401J3165O485j5284k762J3244k281j0983k210M570K049
336A212r283l686J0127J733n997Q7N250O111l483o778P461N329p467j75N697r68
$$ plain form
352 5170 2076 1930 7093 4123 -6267 -3494 1598 -6601 -9413 -4715 -5323 -5644 -3367 1906 4295 -1261
368 -1261 301 8556 6893 2683 862 1848 6485 3546 -1386 2321 913 -3433 -1096 -1936 -5560 -7277
384 -7277 -7657 -3436 -1804 -3713 -1855 -368 3625 9585 5528 2061 7063 5963 2080 1062 -1634
399 -1634 -1082 -1356 -4361 -3442 -692 -1016 -3404 -6073 -217 3040 -6649 -6761 3039 2885 -1451 340 6629
416 6629 10472 3016 -1365 7125 8332 -3154 -8393 -1880 3701 -5340 -10337 2006 2388 -8418 -2851
431 -2851 5303 -754 -6044 -3151 3539 5545 299 -1570 3442 9637 9420 -613 -1482 7189 331
446 331 -8379 -1865 -2535 -9599 -6637 -1147 -1402 -2430 355 2641 -4 2953 6457 -276 -2109 3900
462 3900 2852 1593 2688 -813 2232 6253 -312 -4016 -925 -1425 -6705 -6203 -153 -3494 -8254 2411
$$ packed form
352E170l094j46N163k970j0390K773N092q199k812M698o08l21K277N273K389n556
368a261J562Q255j663m210j821R86M637k939m932L707j408m346K337q40l624j717
384g277l80M221J632j909J858J487L993N960m057l467N002j100l883j018k696
399a634N52k74l005R19K750l24k388k669N856L257r689j12R800j54m336J791O289
416F629L843p456m381Q490J207j1486n239O513N581r041m997J2343L82j0806N567
431b851Q154o057n290K893O690K006n246j869N012O195k17j0033q69Q671o858
446C31q710O514o70p064K962N490k55j028K785K286k645K957L504o733j833O009
462C900j048j259J095l501L045M021o565l704L091n00n280N02O050l341m760J0665
$$ plain form
478 2411 6184 -4156 -44 8766 3094 -359 2159 1911 1934 3717 1931 -1608 1567 5713 -1798 -6738
494 -6738 11 -2450 -9111 -3973 -4011 -7980 475 5219 -1192 -445 8545 9845 2081 1897 7354 3206
510 3206 -2068 -359 -2113 -1380 -879 -8310 -6091 3626 -2563 -9658 -866 4054 -3521 -3530 6451 4520
526 4520 -5111 4236 13659 2198 -3584 2502 3165 3033 314 -7930 -5487 3538 -812 -9561 -3358
541 -3358 5977 -745 -7956 855 3686 -2832 1104 2617 -1838 4050 8066 721 -232 5269 3701
556 3701 -1311 -1028 317 -4330 -3910 0 -5751 -7437 846 -805 -4235 2518 934 -2967 5269 7621
572 7621 -1904 -1717 9457 7303 -5725 -1975 7598 211 -5803 -837 -2125 -2761 -1055 -5976 -5852
587 -5852 2448 1561 -3994 -918 4543 1932 -419 5541 3490 -3795 2848 6838 -2441 -2293 4149 989
$$ packed form
478B411L773j0340M112Q810n672l453K518k48K3J783j786l539L175M146p511m940
494f738O749k461o661N138l8l969Q455M744o411P47Q990J300p764j84N457m148
510C206n274J709j754P33N01p431K219R717o189p095Q792M920p575rR981j931
526D520r631R347R423j1461n782O086O63j32k719q244K443R025m350q749O203
541c358R335o722p211Q811K831o518L936J513m455N888M016p345r53N501j568
556C701n012K83J345m647M20L910n751j686Q283j651l430O753j584l901Q236K352
572G621r525J87J1174k154j3028L750R573p387o014M966j288o36J706m921J24
587e852Q300q87n555L076N461k611k351N960k051p285O643L990r279J48O442l160
$$ plain form
603 989 -2410 -1496 -1699 -1236 -1729 -4056 -5313 -1231 1967 -3175 -2913 5209 2240 -2025 6354 5359 -3223
620 -3223 1858 8363 1076 -5419 -136 4173 -1528 -5544 -2335 -2038 -2039 -1771 -6432 -2660 5748 -557
636 -557 -5648 3401 7243 1528 535 4740 3953 267 1533 1976 -2815 -1454 606 -4510 -3678 525
652 525 -3120 -3797 197 -1335 -2771 89 2467 1281 -120 2117 3354 2932 3986 476 -1562 5202
668 5202 3864 -5875 -3853 2893 -142 -5909 -4806 146 -104 -4107 -1844 1330 1076 238 -779 2394
684 2394 6119 889 -1047 5631 3989 -1623 -319 1998 -751 -4277 -2724 454 -2609 -4883 -1711
699 -1711 -1070 -496 -927 -2245 1221 3938 399 1138 4540 2431 560 2514 2974 -115 -1955 1312
715 1312 260 -4915 -1448 1366 -3982 -4825 -947 -264 -707 -1303 -403 2188 2287 1423 1649 2620 3685 1565
$$ packed form
603I89l399R14k03M63m93k327j257M082L198n142K62Q122k969m265Q379r95q582
620c223N081O505p287o495N283M309n701m016L209K97jK68m661L772Q408o305
636e57n091R049L842n715r93M205p87l686J266M43m791J361K060n116Q32M203
652E25l645o77L994j532j436K860K378j186j401K237J237m22J054l510k038O764
668E202j338r739K022O746l035n767J103M952k50m003K263L174k54q38j017L173
684B394L725n230j936O678j642n612J304K317k749l526J553L178l063k274L172
699a711O41N74m31j318L466K717l539P39L402k109j871J954M60l089j840L267
715A312j052n175L467K814n348q43L878O83m43n96R00K591R9q64K26R71J065k120
$$ plain form
733 1565 163 3697 1129 -3721 -1099 899 -2088 -3605 -2849 -1776 -1529 -2106 -270 -446 -1120 1476
749 1476 1791 1634 2910 1694 1451 3073 1666 1275 740 -1798 -1099 431 -968 -2891 -4010 -1388 440
766 440 -3631 -3483 1530 706 -1144 974 3339 3074 -281 180 4571 3082 -1241 213 1839 929 -2118
783 -2118 -3097 -567 -919 -4611 -3248 108 -251 -1529 -2055 1201 3604 73 -102 3433 3118 1174 1097
800 1097 2472 2323 -953 -1280 1153 -895 -3056 -1849 -2423 -2398 -841 -1409 -1562 -1185 335 2049 694
817 694 475 3033 2271 1042 1979 2011 1391 14 -1359 1086 700 -2928 -2940 -1403 -593 -1637 -3519 -1551
835 -1551 998 -1146 -843 1534 1857 1475 1497 2354 3407 1123 -24 1626 758 -657 -1000 -1617 -1180 -1647
853 -1647 -2705 -865 -1135 -2912 -495 223 -829 150 1677 2460 1163 541 3747 2939 -857 599 2385
$$ packed form
733A565j402L534k568m850K622J998k987j517P56J073K47n77J836j76o74K596
749A476L15j57J276j216k43J622j407l91n35k538O99J530j399j923j119K622J828
766D40m071J48N013q24j850K118K365k65l355M61M391j489m323J454J626r10l047
783b118r79K530l52l692J363L356l59j278n26L256K403l531j75L535l15j944p7
800A097J375j49l276l27K433k048k161J207n74K5J557n68j53L77J520J714j355
817F94k19K558p62j229R37L2o20j377j373K445l86l628j2J537Q10j044j882J968
835a551K549k144L03K377L23l82K2Q57J053k284j147J650q68j415l43o17M37m67
853a647j058J840k70j777K417P18j052R79J527P83j297o22L206q08l796J456J786
$$ plain form
870 2385 135 -1761 -2114 -249 -751 -3840 -2414 400 -1004 -2339 -669 1335 1572 -429 -169 3178
886 3178 2613 620 1132 1601 2037 447 -1343 1037 423 -2963 -2324 -730 -1379 -2775 -2815 -380 303 -1303
904 -1303 408 1271 470 1941 1909 649 1811 2219 657 226 487 1241 -319 -2318 -959 -480 -2066
921 -2066 -2210 -2261 -1523 584 -1260 -1669 2239 1766 61 1132 2685 2476 451 667 2309 438 -947
938 -947 141 -1053 -1301 -823 -2550 -1703 -138 -2065 -2413 203 661 -396 -279 2136 2166 349 1860
955 1860 3264 166 809 2112 -636 -879 60 -977 -1786 -1808 -1356 -828 -1627 -1571 -876 -171 1209 -420
973 -420 -608 3181 2397 -617 2231 3505 433 -488 989 781 -944 -1878 -842 -1361 -1754 -1189 -2186 -889
991 -889 1003 -1777 -1698 2754 1406 -1487 1367 3609 1285 -303 1947 2520 -268 -48 703 -2225 -1177
$$ packed form
870B385k250j896l53J865n02l089J426K814j404j335J670K004K37k001K60L347
886C178n65j993N12M69M36j590j790K380o14l386O39J594o49j396m0K435O83j606
904a303J711Q63q01J471l2j260J162M08j562m31K61P54j560j999J359M79j586
921b066j44n1P38K107j844m09L908m73j705J071J553k09k025K16J642j871j385
938i47J088j194k48M78j727Q47J565j927l48K616M58j057J17K415L0j817J511
955A860J404l098O43J303k748k43R39j037q09k2M52N28p99N6O95P05J380j629
973d20j88L789p84l014K848J274l072r21J477k08j725r34J036n19l93N65r97J297
991h89J892k780P9M452j348k893K854K242k324j588K250N73k788K20P51k928J048
$$ plain form
1008 -1177 625 -2512 -2953 -108 -1176 -2138 -646 246 342 570 1188 819 1312 3068 1299 -1328 2159
1025 2159 2619 -1615 -529 1447 -1510 -2603 -597 -359 -2323 -2520 -1133 -204 -556 194 -845 582
1041 582 3664 748 -883 3288 2862 -1430 71 2669 335 -1636 -580 -76 -2174 -1458 259 -2590
1057 -2590 -2458 1019 -393 -1705 897 772 283 1676 1255 822 2042 1948 247 -433 1418 277 -2583
1074 -2583 -469 753 -3370 -2544 540 -1131 -2405 -151 296 267 288 470 1272 1776 1966 -55 390 3511
1092 3511 897 -2728 795 1826 -2385 -1962 265 -1173 -2087 -776 -401 -1669 -849 1477 -96 -827
1108 -827 2419 1583 -46 1800 1582 692 1698 355 -1015 124 254 -1502 -2169 -480 -538 -2925 -939
1125 -939 1411 -1705 -2097 2015 1594 -267 736 1674 1891 1546 662 437 1003 1006 -881 -1907 651 521
$$ packed form
1008a177J802l137m41K845j068r62J492Q92R6K28O18l69M93J756j769k627L487
1025B159M60m234J086J976k957j093K006K38j964j97J387R29l52P50j039J427
1041E82L082k916j631M171m26m292J501K598k334j971J056N04k098P16J717k849
1057b590J32L477j412j312K602j25m89J393m21m33J220r4j701o80J851j141k860
1074b583K114J222m123Q26L084j671j274K254M47k9K1J82Q02N04J90k021M45L121
1092C511k614l625L523J031m211M23K227j438r14J311L75j268Q20K326j573p31
1108h27L246q36j629J846k18q90J006j343j370J139J30j756o67J689n8k387J986
1125i39K350l116l92M112m21j861J003R38K17l45q84k25N66Lj887j026K558j30
$$ plain form
1143 521 -3451 -1865 328 -1465 -1770 -193 -127 -233 461 1225 1155 562 1528 1722 492 1398 854 -206
1161 -206 301 23 -1114 -464 -1260 -1867 -410 -963 -1389 -681 72 -184 -581 721 2018 565 188 1929
1179 1929 1353 702 1124 13 97 848 -886 -1681 -451 -342 -1353 -2374 -495 368 -1216 -988 1168
1196 1168 428 469 1075 758 1297 1437 249 591 907 153 -237 -522 -583 -824 -1749 -518 -1062 -1490 -134
1215 -134 -453 -1171 655 1131 28 397 1525 1781 587 288 1639 1161 -477 190 -184 -885 -212 -1859
1233 -1859 -1630 -44 -823 -1577 -710 376 495 -753 -99 1878 921 -21 1255 1811 931 371 -25 720
1251 720 185 -1495 -479 -171 -1293 -1421 -1108 -603 -257 -749 -259 487 81 1074 1310 289 1186 1721 673
1270 673 603 579 408 71 -952 -711 -181 -1205 -1143 -1007 -885 -397 -995 -941 842 858 -236 296 1275 1460
$$ packed form
1143E21l972J586K193j793l05J577O6j06O94P64p0n93R66J94j230R06n44j060
1161b06N07k78j137O50p96o07J457n53m26P08P53k56l97J302J297j453l77J741
1179A929n76o51M22j111Q4P51j734p95J230J09j011j021J879Q63j584K28K156
1196A168p40M1O06l17N39J40j188L42L16p54l90k85o1k41r25J231n44m28J356
1215a34l19p18J826M76j103L69J128K56j194k99J351m78j638O67l74p01O73j647
1233a859K29J586p79p54Q67J086J19j248O54J977r57r42J276N56q80n60l96P45
1251G20n35j680J016L08j122j28L13N05L46m92M90P46m06R93K36j021Q97N35j048
1270F73p0k4j71l37j023K41N30j024O2J36J22M88n98N4J783J6j094N32R79J85
$$ plain form
1290 1460 682 133 1367 1078 -468 -89 231 -214 -810 -1296 -642 -148 -1531 -1014 -252 -571 -30 80 390
1309 390 988 704 610 1337 438 588 1253 -133 -150 287 -320 -1136 -1195 -629 -219 -1436 -1314 252 -417 -646
1329 -646 49 574 1114 616 245 1499 1449 569 164 382 675 61 -1209 -472 175 -1506 -1445 -504 -435 -1024
1349 -1024 -933 -248 662 -47 -87 1184 1038 629 1267 493 566 513 271 264 -546 -699 -252 -1305 -1345 -256 -778
1370 -778 -1124 -581 -81 433 61 -307 812 1205 658 673 532 1351 858 -688 225 915 -518 -1242 -858
1389 -858 -512 -650 -1666 -1047 46 -545 -590 115 486 678 582 319 1527 1092 45 500 866 137 -303
1408 -303 -645 -340 -601 -1096 -451 -898 -1100 -42 -453 -900 158 453 -63 522 951 1098 1037 314 959 624
1428 624 238 -119 -498 -148 224 -1178 -1296 -206 -696 -802 -430 -206 261 -89 -169 938 1019 616 674 969
$$ packed form
1290A460p78n49J234k89j546L79L20m45n96m86O54M94j383N17P62l19N41J10L10
1309C90N98k84r4P27q99J50O65j386j7M37o07q16n9N66M10j217J22J566o69k29
1329f46O95N25N40m98l71J254n0q80m05K18K93o14j270P37O47j681O1R41O9n89
1349a024R1O85R10p09m0J271j46m09O38p74P3n3k42pq10j53M47j053m0J089n22
1370g78l46N43N00N14l72l68J119L93n47J5j41Q19m93j546R13O90j433p24L84
1389h58L46j38j016O19J093n91m5P05L71J92r6k63J208m35j047M55L66p29m40
1408c03l42L05k61m95O45m47k02J058m11m47J058K95n16N85M29J47o1p23O45l35
1428F24l86l57l79L50L72j402j18J090m90j06L72K24M67l50q0J107Q1m03N8K95
$$ plain form
1448 969 1224 317 -247 827 318 -908 -250 -271 -1052 -856 -781 -1130 -679 -243 -214 -426 144 1261 288 -11
1468 -11 1178 867 365 901 294 164 631 -207 -1196 -292 -82 -986 -1923 -803 451 -1180 -1078 845 309
1487 309 38 893 392 894 1187 422 252 952 668 -669 -354 716 -157 -1854 -589 330 -1646 -1016
1505 -1016 312 -496 -284 265 211 181 720 1046 447 183 1353 931 -535 247 488 -845 -368 -408 -1080
1524 -1080 -459 -330 -1291 -910 -8 81 -723 -61 1073 446 244 1284 821 294 765 316 217 521 -377 -844
1544 -844 122 -40 -1315 -1390 6 -72 -1498 -457 1005 -144 -205 1002 403 937 1128 444 97 993 821
1563 821 -284 -577 30 -168 -1273 -537 -164 -1184 -343 -369 -915 71 635 -304 -19 1314 798 104 536
1582 536 1208 364 -207 779 221 -636 100 -710 -997 115 -804 -1799 -243 682 -318 -747 359 1225 52
$$ packed form
1448I69K55r07n64J074n09j226O58k1p81J96P5l49M51M36K9k12N70J117r73k99
1468a1J189l11n02N36o07j30M67q38r89R04K10r04r37J120J254j631J02J923n36
1487C09k71Q55n01N02K93p65j70P00k84j337L15J070q73j697J265R19j976O30
1505a016J328q08K12N49n4l0N39L26n99k64J170m22j466P82K41j333M77m0o72
1524a080O21J29r61L81R02Q9q04O62J134o27k02J040m63n27M71m49r9L04q98m67
1544h44R66j62j275p5J396p8j426J041J462j149o1J207n99N34J91o84l47Q96j72
1563H21j105k93O07j98j105P36L73j020Q41k6n46R86N64r39K85J333n16o94M32
1582E36O72q44n71R86n58q57P36q10k87J112r19r95J556R25j000m29J106Q66j173
$$ plain form
1601 52 -217 1801 836 87 648 133 81 683 -258 -859 -100 -194 -663 -1122 -304 -473 -795 -78 209 -360 265
1622 265 890 -168 819 1192 125 418 1328 554 -359 -11 195 -177 -986 -472 -518 -911 -263 -673 -935 832
1642 832 572 -932 69 1338 561 -100 615 1072 554 -362 539 121 -390 -262 -498 -766 -287 -681 -1363
1661 -1363 -297 -72 -449 -246 381 216 230 443 818 517 791 1006 -86 -24 865 -532 -876 -194 -286 -1017
1681 -1017 -866 -574 -446 -510 -162 -143 -297 756 365 -200 773 1503 170 17 1131 725 -141 -299 156
1700 156 -64 -895 -573 -342 -822 -537 -497 -658 0 179 -184 209 589 586 607 586 631 794 308 49 -45 93
1722 93 -76 -799 -615 -86 -761 -813 -288 -44 -30 -274 -178 402 623 178 558 713 876 369 -131 454 725
1743 725 -518 -800 -66 -36 -741 -736 -529 -303 -531 -706 -77 72 239 299 76 929 716 226 634 496 35
$$ packed form
1601E2k69K018r65p49N61n15n2O02r41o01P59r4m69m59Q18j69l22P17K87n69O25
1622B65O25j058R87L73j067K93R10p74r13L48K06l72q09N14m6l93O48m10k62J767
1642H32k60j504J001J269p77o61P15M57n18r16R01m18n11J28k36k68M79l94o82
1661a363J066K25l77K03O27j65J4K13L75l01K74K15j092O2Q89j397l44O82r2p31
1681a017J51K92J28o4L48J9j54J053l91n65R73P30j333j53J114m06q66j58M55
1700A56k20q31L22K31m80K85M0j61O58J79l63L93L80lK1k1M5J63m86k59r4J38
1722I3j69p23J84N29o75n2N25K44J4k44R6N80K21m45L80J55J63n07n00N85K71
1743G25j243k82P34L0p05NK07K26k28j75O29J49J67O0k23Q53k13m90M08j38m61
$$ plain form
1764 35 383 31 -239 29 -298 -517 -813 -517 -281 -509 -714 222 262 -300 214 787 515 712 453 521 725
1785 725 432 153 -122 -224 31 -755 -790 -57 -542 -880 -437 -195 -103 -319 -205 543 387 209 511 632 449
1806 449 525 72 357 426 -210 -537 -325 -310 -402 -643 -915 -86 -155 -474 25 250 422 226 6 539 1047 162
1828 162 499 319 474 348 -473 -2 184 -353 -881 -720 -548 -235 -461 -709 373 31 -316 133 417 674
1848 674 619 72 914 882 -9 -69 245 240 -274 -467 -402 -136 -619 -692 -305 -331 -273 -46 -382 554 651 239 249 629
1872 629 695 367 -45 365 189 -135 -88 -53 -643 -386 -324 -705 -230 -211 -330 -57 -130 303 336 48 708 769 410
1895 410 509 375 314 426 -292 -43 64 -240 -722 -280 -363 -431 -580 -427 8 -11 14 249 218 568 587 297 496
1918 496 603 171 192 71 66 -93 -783 -298 -208 -871 -586 -242 -679 -63 -111 -676 72 659 287 232 83 579
$$ packed form
1764C5L48l52k70K68l27k19k96K96K36k28k05R36M0n62N14N73k72J97k59O8K04
1785G25k93k79k75j02K55p86l5P33m85l38M43K42R2k16J14P48j56j78L02J21j83
1806D49P6m53K85O9o36l27K12J5r2k41k72Q29o9l19M99K25J72j96k20N33N08q85
1828A62L37j80J55j26q21M71J86n37n28J61J72L13k26k48J082l42l47M49K84K57
1848F74n5n47Q42l2q91o0L14nn14j93O5K66m83p3L87k6N8K27l36R36R7m12J0L80
1872F29O6l28m12M10j76l24M7L5n90K57O2l81M75J9j19K73p3M33L3k88O60O1l59
1895D10R9j34o1J12p18K49J07l04m82M42q3o8j49J53M35j9K5K35l1L50J9k90J99
1918D96J07m32K1j21nj59o90M85R0o63K85L44m37O16m8n65P48N87l72n5j49M96
$$ plain form
1940 579 539 -92 144 329 43 -146 -415 -324 95 -661 -889 -31 -31 -653 -428 493 568 -128 -111 809 523 302
1962 302 587 93 214 570 -183 -288 333 -33 -653 -616 -174 -269 -700 -522 173 -148 -229 184 72 397 682
1983 682 115 352 467 344 -81 59 13 -104 -649 -409 20 -641 -407 -468 -438 -92 -183 -518 384 623 19
2004 19 138 1012 537 96 317 704 119 -356 87 -106 -550 29 -330 -937 24 -227 -462 -168 167 116 152
2025 152 159 272 150 526 1011 11 158 710 -306 -500 57 -32 -527 -228 -286 -452 -239 -183 -250 -415 287
2046 287 211 -360 589 1095 -239 88 924 196 -380 413 480 -121 -478 -289 -431 -743 -256 -446 -758 438
2066 438 130 -786 16 859 233 2 159 736 477 159 484 134 29 214 -415 -411 94 -312 -1024 -262 -15
2087 -15 -556 -165 -136 -66 128 108 23 415 579 348 140 621 505 -497 -216 445 -87 -769 -320 -160 -388
$$ packed form
1940E79m0o31K36J85k86j89k69R1M19p56k28Q58%o22K25R21P5o96J7R20k86k21
1962C02K85m94J21L56p53j05O21l66o20L7M42r5m31J78O95l21q1M13j12L25K85
1983F82n67K37J15j23m25J40m6j17n45K40M29o61K34o1L0L46r1l35R02K39o04
2004A9J19Q74m75m41K21L87n85m75M43j93m44N79l59o07R61k51k35K94L35n1L6
2025A52PJ13j22L76M85j000J47N52j016j94N57q9m95K99n8j66K13N6o7j65P02
2046B87p6n71R49N06j334L27Q36p28n76P93O7o01l57J89j42l12M87j90l12J196
2066D38l08r16Q02Q43o26k31J57N77k59l18L25l50j05J85o29MN05m06p12P62K47
2087a5n41L91K9P0J94k0q5L92J64k31k08M81j16j002K81O61n32o82M49J60k28
$$ plain form
2108 -388 -538 -278 -105 18 19 79 -85 431 362 259 505 519 146 386 292 -105 -87 -108 -366 -345 -188 -173 -378
2131 -378 -346 -99 -203 -316 247 233 -62 361 600 459 362 496 106 342 373 15 -366 -235 266 -582 -688
2152 -688 45 -439 -384 -345 -127 -188 143 189 345 335 514 365 -108 545 675 -151 -225 115 -227 -106 -412 -586
2174 -586 -133 -164 -216 -413 39 138 -57 102 887 786 -166 310 560 337 203 -14 -22 2 -12 -317 -215 -141 -299
2197 -299 -665 -335 61 -250 -536 134 306 31 569 235 359 292 346 41 327 269 -2 -195 -146 109 -340
2218 -340 -561 118 -374 -490 -236 -285 -93 107 -175 311 468 144 190 195 230 447 -8 -19 -39 -196 -216 -141 -511
2241 -511 -97 -15 -432 -230 -89 -94 -161 -73 388 211 322 341 455 185 323 204 -17 -71 -117 -341 -145 -430 -102
2264 -102 -221 -443 41 -102 -413 137 -38 183 492 52 507 362 484 366 144 -129 292 -239 -222 -158 -229
$$ packed form
2108c88j50K60J73J23JO0j64N16o9j03K46J4l73K40r4l97J8k1k58K1J57J5k05
2131c78L2K47j04j13N63j4k95M23K39j41r7J34l90K36L1l58l81J31N01q48j06
2152f88P33m84N5L9K18o1L31M6J56j0J79j49m73O53J30q26p4L40l42J21l06j74
2174e86M53l1n2j97M52R9j95J59P85j01r52M76K50k23j34k17qK4j4l05J02P4j58
2197b99l66L30L96l11k86O70J72k75N38l34J24o7N4l05K86n8k71j93M9K55m49
2218c40k21O79m92j16K54m9J92K00k82M86J57l24M6NL5K17m55j1k0j57k0P5l70
2241e11M14Q2m17K02J41no7Q8M61j77J11J9J14k70J38j19k21n4m6k24J96k85L28
2264a02j19k22M84j43l11N50j75K21L09m40M55j45J22j18k22k73M21n31J7O4p1
$$ plain form
2285 -229 -506 -432 -475 -372 -217 -346 30 117 69 -29 282 431 585 78 294 415 143 -11 -53 -14 39 -325 -120
2308 -120 63 -175 -403 -269 -71 -1 -96 -194 374 431 205 103 210 379 385 148 90 288 -91 -414 -296 -40
2330 -40 -268 -394 -445 -9 -170 -7 164 -17 327 409 218 197 674 13 185 323 308 169 -147 -171 111 -432
2352 -432 -403 -82 -38 -192 -139 89 120 103 9 200 274 258 365 43 333 402 -94 265 -171 -224 -171 -203 -258 -25
2376 -25 -152 -355 -196 -314 5 -239 -75 147 43 177 199 251 158 368 -29 1 154 101 -213 -142 -342 -129
2398 -129 -254 -493 -81 -50 -170 -121 -121 52 123 -78 410 482 77 90 116 145 231 186 -353 -166 -220 -223 -337 -304 217
2423 217 -271 -136 34 135 -64 0 219 182 101 115 224 185 320 -147 -150 -216 168 -322 -321 173 -223 -310 -423 -167
2447 -167 -28 -30 -208 316 287 -152 228 267 537 117 -7 -266 317 -165 -253 3 -44 -288 -269 -165 -340 -83
$$ packed form
2285b29k77P4m3J03J55j29L76Q7m8r8L11J49J54n07K16J21k72j54m2L9N3l64K05
2308a20J83k38k28J34J98P0r5r8N68N7k26j02J07J69Ok37n8J98l79l23J18K56
2330d0k28j26n1M36j61J63J71j81L44Q2j91k1M77o61J72J38j5j39l16k4K82n43
2352d32K9L21M4j54N3K28L1j7r4J91P4j6J07l22K90O9m96L59m36n3N3l2n5K33
2376b5j27k03J59j18L19k44J64K22j04J34K2N2r3K10l97L0J53n3l14P1k00K13
2398a29j25k39M12L1j20M9%J73P1k01M88P2m05J3K6K9Q6m5n39J87n4lj14L3N21
2423B17m88J35J70J01j99O4K19l7q1J4J09l9J35m67lo6L84m90JM94l96q7j13K56
2447a67J39kj78N24k9m39L80L9K70m20j24k59N83m82q8K56m7k44J9J04j75K57
$$ plain form
2469 -83 -168 -274 -100 63 272 -41 127 492 41 80 179 204 226 43 -150 -107 -123 -127 -276 -347 -92 -306 -427 -41
2493 -41 268 -161 -60 246 302 340 176 213 259 42 289 -40 -120 270 15 -183 -219 -127 -452 -90 -81 -167 77 -299
2517 -299 39 111 302 60 7 151 414 -136 98 206 28 -190 -92 -174 13 49 -224 -493 -135 106 -265 -180
2539 -180 131 9 -288 313 514 125 310 259 -127 141 89 -134 -68 87 -307 -551 -183 -11 -78 -422 220
2560 220 262 -236 -20 236 281 343 211 246 380 216 299 -247 -20 52 -368 -242 89 -193 -234 -131 -154 -210 39
2583 39 -69 -155 66 -33 363 -3 235 222 228 130 265 29 -190 158 -174 -35 -275 -2 -289 -187 -113 -32 136
2606 136 124 97 -264 413 317 102 68 29 22 108 106 -39 37 83 -11 -98 -163 11 -259 -125 -140 4 -29 245 38 -198
2632 -198 444 106 -169 185 348 60 -48 56 256 -93 27 -50 -121 41 -87 -266 -1 68 -299 -114 41
$$ packed form
2469h3q5j06J74J63K09l13J68L65m51L9R9K5K2j83j93M3j6mj49p1K55k14j21L86
2493d1L09m29J01L06N6L8j64L7M6k17K47l29q0L90k55j98l6R2l25L62Rq6K44l76
2517b99L38P2J91k42n3J44K63n50K34J08j78k18R8q2J87L6k73k69L58K41l71Q5
2539a80L11j22k97O01K01l89J85n1l86K68n2k23O6J55l94k44L68J72o7l44O42
2560B20M2m98K16K56M5O2j32L5J34j64Q3n46K27P2m20J26L31k82m1J03k3n6K49
2583C9j08q6K21r9L96l66K38j3Or8J35k36k19L48l32J39k40K73k87J02P4Q1J68
2606A36j2k7l61O77r6k15l4l9pQ6kj45P6M6r4q7o5J74k70J34j5J44l3K74k07k36
2632a98O42l38k75L54J63k88j08J04K00l49J20p7p1J62j28j79K65O9l67J85J55
$$ plain form
2653 41 173 220 38 36 263 98 -3 124 -5 154 -348 -190 -96 -173 -388 -234 147 -96 -312 -258 47 79 -153
2676 -153 31 277 35 72 294 146 175 174 -17 107 -56 -286 -193 -339 -104 -226 -201 -43 1 -19 -66 -96 -80 379
2700 379 -6 -39 92 69 67 34 -1 8 -298 38 -132 -357 -212 -273 -137 57 42 20 -79 -126 -11 95 172 298 126
2725 126 229 221 39 110 -61 211 -70 -209 106 -208 -421 -242 145 -18 -155 -68 207 122 1 208 208 394
2747 394 -13 111 131 -100 -118 -2 -61 0 -7 -263 -129 -341 -343 -208 -158 -84 52 -245 100 178 143 96 136 205 49
2772 49 65 -101 -57 114 -203 -111 -245 -194 6 -396 -187 -71 -249 122 229 106 86 10 285 275 -101 16 -43
2795 -43 212 80 -174 21 136 -20 -468 -102 -57 -111 172 -203 42 -25 59 -174 247 99 199 57 -4 166
2817 166 -29 -146 -148 -172 -108 -228 -200 156 23 -179 -188 137 -4 259 98 -2 150 -75 166 163 116 134 174 214
$$ packed form
2653D1J32M7j82kK27j65j01J27j29J59n02J58R4p7k15J54L81k43k16N4L05L2k32
2676a53J84K46k42L7K22j48K9jj91J24j63k30R3j46K35j22K5J58M4k0m7l0J6M59
2700C79l85l3J31k3kl3l5Rl06L36j70k25J45o1J36J94j5k2r9m7J15J06P7J26j72
2725A26J03qj82P1j71K72k81j39L15l14k13J79L87j63j37Q7K75q5j21K07%J86
2747C94m07J24K0k31j8J16n9O1pk56J34k12kJ35N0P4J36k97L45P8l5m7M0O9j56
2772D9J6j66M4J71l17R2j34N1K00m02K09J16j78L71J07j23k0p6K75j0l76J17n9
2795d3K55j32k54J95J15j56m48L66M5n4K83l75K45o7Q4k33M21j48J00j42o1J70
2817A66j95j17kk4O4j20K8L56j33k02rL25j41K63j61j00J52k25K41lm7J8M0M0
$$ plain form
2841 214 17 -36 -44 -61 -106 -11 -161 -5 71 -23 -208 143 -29 25 157 -65 58 127 -41 114 254 -115 52
2864 52 -59 -12 -50 -245 9 -268 -95 -211 -236 -221 -82 -145 14 111 285 107 95 109 70 151 133 -121 -62 65
2888 65 -238 -101 -204 -137 37 -92 -42 -38 88 161 -142 -99 178 124 -85 174 130 203 -136 -142 142 -9 -186 24
2912 24 -328 269 -204 -517 -121 -93 -188 14 -85 -29 144 256 159 5 -44 173 -16 17 -52 -162 44 106 130 -272
2936 -272 -172 -190 -284 -135 24 0 -179 -5 -126 32 145 -20 112 -6 -29 -123 82 21 -159 -441 -72 -221
2958 -221 -266 24 -55 71 4 -63 129 -122 90 117 15 35 29 285 44 311 -71 -125 68 87 -103 -184 82 -302
2982 -302 -113 -101 45 -193 25 64 4 208 21 76 31 -73 228 51 -99 75 -149 139 40 -180 -109 -383
3004 -383 -111 -7 -240 -288 -187 193 174 145 36 256 248 36 -62 108 25 38 16 142 -122 92 -8 -100 130
$$ packed form
2841B14j97n3qj7m5R5j50J56P6r4j85L51j72N4J32k22J23O9j68J55J40l69J67
2864E2j11M7l8j95K54k77J73j16k5J5J39o3J59R7J74j78j2J4l9Q1j8k54N9J27
2888F5l03J37j03O7J74j29N0MJ26P3l03M3K77n4k09K59m4P3l39oK84j51j77K10
2912B4l52N97m73l13L96K8r5K02r9N6J73J12r7j54m9K17j89L3o9j10K06O2K4m02
2936b72J00j8r4J49J59k4j79J74j21J58J13j65J32j18k3r4K05o1j80k82L69j49
2958b21m5K90p9J26o7o7J92k51K12K7j02K0oK56k41K67l82n4J93J9j90q1K66l84
2982c02J89J2J46k38K18L9o0K04j87N5m5j04L01j77j50J74k24K88r9k20P1k74
3004c83K72J04k33m8J01L80j9k9j09K20qk12r8J70q3J3k2J26k64K14j00r2K30
$$ plain form
3027 130 -252 -273 -231 131 34 -261 26 56 10 3 171 -46 -21 16 -20 10 106 -2 10 -183 -137 -25 20 51 -186
3052 -186 -83 -113 31 -103 87 -89 -109 38 111 53 138 93 110 -159 61 16 -114 163 -127 -222 137 132 5 -252
3076 -252 171 -63 -7 160 202 -114 210 243 -103 89 154 294 -223 -59 -143 -156 16 105 -316 -227 -145 77 -104
3099 -104 -131 17 82 -25 75 -177 -188 201 18 6 206 180 11 41 83 12 -183 -269 -222 -207 116 -3 -300 -144
3123 -144 384 195 98 -130 161 216 -143 185 11 140 41 14 34 -32 -84 -293 -14 -41 -39 32 -28 -100 16 -65 37
3148 37 21 145 -193 34 152 106 -165 -24 -133 80 -134 -106 107 -15 -13 6 -14 35 64 165 -32 205 211 -83
3172 -83 -16 293 -58 65 128 90 -101 -71 44 -108 -182 79 16 -145 68 172 37 39 25 -102 -167 128 70 -19
3196 -19 122 105 81 132 64 -124 64 44 103 -61 35 -27 -125 -120 -277 175 16 -7 47 106 136 -25 -188 -116 259 -4
$$ packed form
3027A30l82k1M2L62r7k95K87L0m6pJ68k17K5L7l6L0R6j08J2j93M6J12M5L1k37
3052a86J03l0J44j34J90j76k0J47P3n8Q5m5J7k69K20m5j30K77k90r5L59nj27k57
3076b52M23k34N6J67M2l16L24L3l46J92O5J40n17J64q4j3J72Q9m21Q9Q2K22j81
3099a04k7J48O5j07J00k52j1L89j83j2K00k6j69L0M2p1j95q6M7J5L23j19k97J56
3123a44N28j89r7k28K91N5l59L28j74J29r9k7K0o6n2k09K79k7KP1o0p2J16q1J02
3148C7j6J24l38K27J18m6k71J41j09K13k14K8K13j22KJ9k0M9K9J01j97K37Ok94
3172h3O7L09l51J23O3l8j91L0J15j52p4K61o3j61K13J04j35Kj4j27o5K95n8q9
3196a9J41j7k4N1o8j88J88k0N9j64R6o2r8Nj57M52j59k3N4N9L0j61j63P2L75k63
$$ plain form
3222 -4 -232 172 -47 -8 -186 -261 121 86 -122 -22 -184 32 158 68 2 232 143 -98 5 73 169 184 -1 139
3246 139 -4 -220 79 95 -268 -194 -128 -20 -166 44 105 148 8 -59 102 126 246 -223 -90 7 149 -66 -10
3269 -10 15 -104 -209 -45 82 53 -127 127 85 -184 172 -87 11 118 24 95 158 -70 -45 -33 -89 -30 167 111
3293 111 135 -123 -189 -5 -374 137 -128 -83 7 -37 -24 -49 22 47 -76 45 13 69 -103 292 172 -9 -77 -55
3317 -55 -65 -114 -175 -87 9 -162 103 17 27 -103 46 -97 226 16 11 -7 25 -117 130 165 -128 50 -93 -205
3341 -205 55 -46 -112 -68 -30 110 10 160 -132 -66 263 19 246 52 67 -103 40 17 14 -35 30 -69 -45 -65
3365 -65 -51 -68 -179 168 -223 -304 -125 87 -153 -4 -64 -60 244 -212 130 44 -253 -1 35 -37 -20 -120 110 38
3389 38 -131 6 212 -155 107 -21 -174 -56 37 23 -24 240 11 -177 221 109 1 207 -63 -38 127 71
$$ packed form
3222dk28M04k19L9j78p5L82l5k08J00j62K16J26r0o6K30q9k41J03O8R6J5j85J40
3246A39j43k16K99J6l63P4O6J08j46K10O1M3j40o7J61K4J20m69J33R7J42k15N6
3269a0K5j19j05J64J27k9j80K54m2k69L56k59R8J07r4P1O3k28K5J2n6N9J97n6
3293A11K4k58o6J84l69N11k65M5R0m4J3k5P1K5j23J21l2N6j72L95j20j81o8K2
3317e5j0m9o1Q8R6j71K65q6J0j30J49j43L23k10nj8L2j42K47L5k93J78j43j12
3341b05K60j01o6M4L8J40j00J50k92O6L29k44K27j94J5j70J43k3lm9O5r9K4k0
3365f5J4j7j11L47l91q1J79K12k40J49o0ML04m56L42q6k97K52L6p2J7j00K30p2
3389C8j69J37K06l67K62j28j53J18R3j4m7K64k29j88L98j12j08K06k70K5J65n6
$$ plain form
3411 71 -8 43 21 3 25 178 -148 -73 -112 81 34 -50 71 -55 50 93 -56 -16 -157 -90 17 -138 112 -110
3435 -110 -169 77 90 121 -92 132 122 -10 84 35 -138 -289 -2 -70 184 -15 -91 29 111 137 124 -29 -55 -102
3459 -102 97 -56 176 -16 113 -65 -140 116 65 136 -168 44 -112 -90 69 286 110 121 -53 -105 -60 -21 76
3482 76 46 279 99 -13 94 98 40 -181 0 59 -20 79 -57 -253 34 -104 -139 -39 8 -82 149 -180 -138 194
3506 194 -7 15 80 56 64 77 -33 -15 177 -256 3 158 -174 62 84 -38 116 158 -131 8 -127 -56 25 35
3530 35 -23 88 -51 194 130 -58 181 90 -12 66 215 -173 -113 106 -44 -247 -154 45 -136 94 48 -59 -13
3553 -13 -5 -48 38 298 -52 -5 -89 93 60 67 -160 48 -47 -16 241 -1 19 211 151 42 153 -171 -4 79 -16
3578 -16 -266 -157 92 68 24 -150 -60 -8 -88 42 -126 110 39 5 -346 44 202 130 28 89 52 138 291 -43
$$ packed form
3411G1p9N1k2j8K2J53l26P5l9J93m7q4J21j26J05M3j49M0j41O7J07j55K50k22
3435a10n9K46J3L1k13K24j0j32R4m9j73j51K87o8K54j99p6J20Q2K6j3j53k6m7
3459a02J99j53K32j92J29j78p5K56n1P1l04K12j56K2J59K17j76J1j74n2M5L9R7
3482G6l0K33j80j12J07Mn8k21J81N9p9R9j36j96K87j38l5J00M7r0K31l29M2L32
3506A94k01K2O5k4QJ3j10J8J92m33K59J55l32K36K2j22J54M2k89J39j35P1Q1J0
3530C5n8J11j39K45o4j88K39r1j02P8J49l88O0K19j50k03R3J99j81K30m6j07M6
3553a3Qm3Q6K60l50M7q4J82l3Pk27K08r5L1K57k42K0J92o0j09J11l24J67Q3r5
3578a6k50J09K49k4m4j74R0N2q0J30j68K36p1l4l51L90J58p2j02O1l7Q6J53l34
$$ plain form
3602 -43 -172 196 62 -40 84 146 -58 183 -85 -175 145 -38 -119 -87 -64 5 -86 -146 151 40 6 371 -69
3625 -69 25 53 35 -156 -191 5 134 -104 -73 163 -68 32 216 -227 -9 106 -7 95 156 110 50 -7 134
3648 134 -41 14 106 -13 43 167 -8 -21 -82 132 25 -19 202 -7 -151 -41 -40 -155 47 -14 85 -22 39 -196
3672 -196 -152 -48 -48 -47 107 47 -250 -100 -3 -77 68 16 -192 -129 73 -81 110 -8 254 142 -16 -11 164 -8
3696 -8 37 -110 -150 42 -163 -259 -141 38 -38 27 -95 178 -132 187 77 -84 -75 -60 -43 -265 23 -48 -56 86 84
3721 84 -364 -146 -126 -22 39 15 128 -104 139 -103 53 177 35 -143 260 182 180 -3 -295 52 -81 111
3743 111 -48 -97 45 -41 186 -54 -131 68 116 106 -45 100 59 -86 273 -50 -128 219 109 -54 -96 -125 133
3766 133 118 126 -62 10 197 -101 -7 180 66 137 193 -54 -3 90 -168 114 -80 175 -170 3 3 15 144 -6
$$ packed form
3602d3j29L68j34j02J24O2k04K41k68r0L20j83q1L2K3O9r1o0K97j11l4L65m40
3625f9R4K8j8j91l5J96J29k38L1K36k31J00J84m43K18J15j13J02O1m6o0n7J41
3648A34j75N5R2j19N6J24j75j3o1K14j07m4K21k09j44J10Jj15K02o1R9j07O1k35
3672a96M4J04%JJ54o0k97J50R7p4J45n2k08O3K02j54J91j18K62j12j58NJ75j72
3696hM5j47m0J92k05r6J18J79p6O5j22K73l10L19j10j61RJ5J7k22K88p1qJ42k
3721H4m48K18K0J04O1k4J13k32K43k42J56J24j42j78M03p8kj83k92L47j33J92
3743A11j59m9J42q6K27k40p7J99M8j0j51J45m1j45L59l23p8L47j10j63m2k9K58
3766A33j5Qj88P2J87k98R4J87j14P1N6k47N1R3k58K82j94K55l45J73%J2J29j50
$$ plain form
3790 -6 157 180 28 -159 -93 -52 69 12 76 53 124 35 -205 -7 31 48 185 -9 30 -362 -81 86 93 -376 77
3815 77 -17 24 2 -160 -55 41 -93 -32 43 -120 -211 85 63 -33 -106 -61 -187 -16 -97 -9 149 142 -132 39 75 95
3841 95 41 -268 -170 -9 -282 62 56 -170 114 45 171 -1 139 17 -146 4 73 -74 62 0 -52 132 95
3864 95 -187 79 21 18 -113 -30 108 254 -10 -92 97 95 -104 -84 8 -44 -196 -19 -36 -57 -117 -199 233 50 183
3889 183 -36 21 132 164 169 211 74 83 -155 -42 -146 28 247 -48 150 119 -30 -50 149 -113 -127 101 -17
3912 -17 31 -227 -167 -70 -63 -33 -101 -181 227 -93 139 -259 -51 18 110 19 -6 143 66 -126 46 -122 2 -83 -1
3937 -1 99 21 -49 -142 51 -157 -16 -48 55 -161 34 -156 -132 66 6 1 24 82 136 75 0 69 119 87 -81 17
3963 17 -170 -22 -254 107 -26 105 -242 -63 -5 197 43 -7 -11 15 -128 -151 -112 190 -149 -223 -143 -58 42 36
$$ packed form
3790fJ63K3j52j87O6M1J21n7O4k3P1q9k40J98L8J7J37j94L9l92K81J67Pm69M53
3815G7r4M1k2j62J05R6j34O1P5j63r1K96k2r6p3M5j26J71q1Q8J58pk74J71L6K0
3841I5n4l09R8J61k73L44ok26K84o9J26j72J40j22j63J50O9j47J36o2n2J84l7
3864I5k82K66n8lj31Q3J38J46k64q2J89kj99K0R2n2j52J77j7k1o0q2M32j83J33
3889A83k19N7J11L2NM2j37Rk38J13j04J74K19k95J98l1j49k0J99k62j4K28j18
3912a7M8k58O0R7PL0o8q0M08l20K32l98K08O9R2r1k5J49p7j92J72j68J24q5Q2
3937aJ00p8p0r3J93k08J41l2J03k16J95j90K4J98o0nK3N8N4o1p5O9N0l2j68R8
3963A7j87J48k32L61j33J31l47J79N8K02j54n0mK6j43k3L9L02l39p4Q0Q5J00o
$$ plain form
3987 36 -67 -69 210 -223 50 -105 63 177 11 38 -59 -139 -132 176 -37 -174 38 2 35 127 52 -72 243 -7
4011 -7 -89 -41 58 71 59 207 -65 -7 -147 -15 -31 150 -114 145 22 44 -27 -37 31 -178 -83 -212 -36 52 46 -7
4037 -7 -82 -62 175 -196 -120 -1 161 -18 -195 50 4 -6 -92 -94 -19 50 118 114 15 3 247 -7 45 99 55 -193 338
4064 338 34 91 -36 120 -11 40 -139 -52 -5 -177 31 225 -63 18 69 274 5 19 -5 234 63 -71 -43
4087 -43 -73 -79 46 232 -123 -27 171 45 24 -15 -68 -64 75 45 149 -147 223 57 83 180 187 -30 10 59 -92 -68
4113 -68 -16 -43 130 2 -88 176 -20 97 -43 -246 151 -7 -179 113 27 93 106 63 92 -178 11 -94 -173
4136 -173 -41 -205 128 57 67 -192 74 242 -108 17 131 -151 -124 5 4 -29 -50 115 36 23 212 -172 -60
4159 -60 -25 7 47 -70 -87 89 -3 -65 -93 23 -42 -249 140 -81 -83 109 -38 -89 22 -8 213 57 200 4
$$ packed form
3987C6j03kK79m33K73j55J68J14j66K7r7q0PL08k13j37K12l6L3R2p5j24L15k50
4011gq2M8R9J3j2J48k72N8j40J32j6J81k64K59j23K2p1j0O8k09R5j29J76Q8on3
4037gp5K0K37l71P6J19J62j79j77K45m6j0q6kP5O9O8mr9j2K44k54N2N4m4k48N31
4064C38l04N7j27J56j31N1j79Q7M7j72K08J94k88Q1N1K05k69J4k4K39j71j34K8
4087d3l0oJ25J86l55R6J98j26k1l9n3MJ39l0J04k96L70j66K6R7Pk17M0M9j51K4
4113f8N2k7J73j28r0K64j96J17j40k03L97j58j72K92q6O6J3m3K9k70J89j05p9
4136a73J32j64L33p1J0k59K66J68l50J25J14k82K7J29jl3k1J65p9j3J89l84J12
4159f0L5L2M0j17j7J76r2o2k8J16o5k07L89k21kJ92j47n1J11l0K21j56J43j96
$$ plain form
4183 4 15 78 -68 -1 70 -89 197 -141 -204 14 -119 160 -87 223 123 220 52 -157 119 144 -57 7 143
4206 143 85 42 30 165 32 201 44 -296 19 -6 109 -298 -25 89 64 34 17 102 -31 88 -88 260 84
4229 84 82 -20 -200 7 245 -76 67 117 -20 142 -10 93 -4 -60 3 33 115 -171 68 169 -40 19 69 -62
4253 -62 -183 248 69 -40 66 54 -246 -156 104 44 -144 -39 -40 24 16 -224 -80 -287 -106 -50 163 -36 -118 -25
4277 -25 73 192 -202 243 180 8 -44 -195 -171 -179 -202 71 1 -137 -137 9 -302 8 12 98 -155 -86 171 -102 84
4302 84 168 140 52 -88 54 -93 92 12 91 -33 37 -204 67 8 -147 46 -74 -49 -111 -53 -232 21 -19 -119
4326 -119 221 -64 124 59 -156 -7 -143 121 50 -86 105 27 -260 -20 -126 140 106 -137 -104 65 113 -41
4348 -41 159 -147 85 -94 -40 55 -121 -187 56 70 -76 19 -77 -146 -263 53 -95 -144 114 -64 -21 50 79 151
$$ packed form
4183DJ1O3j46O7P1j59K86l38o3K18j33K79k47L10j00R7j68k09K76K5k01O4J36
4206A43n8m3j2J35j33J69j57l40L15k5J15m07K73J14k5l0j7Q5j33J19j76L48j76
4229H4kj02j80K07K38l21J43N0j37J62j52J03r7n6O3L0Q2k86K39J01k09N9N0j31
4253f2j21M31j79j09J06j2l00R0K60o0j88J05jO4qk40J44k07J81N6K13j99q2R3
4277b5R8J19l94M45o3j72n2j51K4qk3K73p0j38%J46l11L10MQ6k53O9K57k73J86
4302H4Q4k8q8j40J42j47J85q0P9j24P0k41K71n9j55J93j20K5o2N8j79K53m0j00
4326a19L40k85J88o5k15J49j36K64p1j36J91p8k87K40j06K66l4k43L3J69M8j54
4348d1K00l06K32j79N4R5j76o6K43J4j46R5r6o9j17L16j48m9K58j78M3P1K9P2
$$ plain form
4372 151 -103 91 -168 83 -71 38 68 64 39 -16 -9 198 -135 120 51 -57 -31 39 172 108 -34 -230 256 165
4396 165 -99 364 -145 113 106 -261 -79 177 -119 -207 -62 -125 -29 145 191 32 254 49 120 -9 108 -61
4418 -61 83 -243 -196 33 -158 -189 149 11 34 -136 -169 -114 129 220 143 39 -24 -52 -106 115 116 114 36 -33 -221 -103
4444 -103 29 69 38 -197 -142 -108 -52 -148 -32 -173 117 52 -87 -49 -92 3 227 -102 -178 33 108 -201 14 -49
4468 -49 -85 -11 5 110 -10 24 -171 -107 19 -42 -25 47 168 13 30 -5 89 56 -77 30 -223 52 -16 54 -76
4493 -76 -31 -70 -307 -50 17 10 137 253 110 -53 183 80 -2 -141 202 -140 103 98 -130 -34 -108 -50 105 -69
4517 -69 13 13 -31 -8 -130 18 49 132 145 74 51 136 70 43 97 -104 26 142 -162 -18 -62 67 -8 -57 -208 -32
4543 -32 156 118 101 158 287 21 -150 40 -76 -114 -162 35 -135 -225 -94 83 -140 78 51 9 -8 -97 -22 -105
$$ packed form
4372A51k54J94k59K51j54J09L0mk5n5PK07l33K55o9j08K6P0J33o4j42j96M86r1
4396A65k64M63n09K58pl67J82K56k96q8J45o3R6J74M6j59K22k05P1j29J17j69
4418f1J44l26M7K29j91l1L38j38K3j70l3N5K43R1p7j04o3k8n4K21Jkp8o9j88J18
4444a03J32M0l1k35N5L4N6r6J16j41K90o5j39L8m3R5K24l29p6K11P5l09K15o3
4468d9l6P4J6J05j20L4j95O4J26o1J7P2J21j55J7l5R4l3j33J07k53K75o8P0j30
4493g6M5l9k37K57O7pJ27J16j43j63K36j03q2j39L43l42K43nk28R6p4N8J55j74
4517f9Q2%m4K3j22J48L1Q3J3p1k3Q5o6k7N4k01J30J16l04J44m4J29p5m9j51J76
4543c2J88l8j7N7J29k66j71J90j16l8m8J97j70r0J31J77k23K18k7m2j7q9P5q3
$$ plain form
4567 -105 129 45 -67 23 -192 -76 133 -28 -182 -153 126 -199 69 35 -151 -289 144 7 -55 -47 158 -21
4589 -21 27 270 165 152 220 20 -248 254 -18 39 12 59 -12 -160 -8 170 -196 89 -10 -80 307 -126 79
4612 79 73 38 128 40 120 46 46 16 -57 111 216 -82 -83 -130 43 76 186 -172 -100 187 156 83 0 -37 74 -57 -208
4639 -208 78 -2 -42 94 -157 -158 135 -203 65 -157 51 150 3 -7 38 51 57 428 92 137 62 107 66 -213 -97
4664 -97 2 -9 107 -73 -61 75 -223 -138 -186 204 11 -158 -107 -34 -25 -163 -102 258 -27 67 -18 14 205 -65 -39
4689 -39 43 -41 -152 41 -166 -101 -146 -38 31 -153 -37 1 124 -37 237 31 141 192 34 -93 76 105 -167
4712 -167 159 13 10 -154 -144 -43 6 -61 28 -101 -188 69 24 1 122 28 83 109 66 39 319 -38 113 -57 -109
4737 -109 -74 45 -55 10 154 -111 -148 174 -2 4 -240 -12 121 28 81 182 71 90 -154 19 -26 158 -89
$$ packed form
4567a05K34q4j12R0k15J16K09j61j54K9K79l25K68l4j86j38M33j37o2QK05j79
4589b1M8K43j05j3O8k00k68N02k72N7k7M7p1j48J52J78l66K85r9p0L87m33K05
4612G9ol5R0q8Q0p4%l0p3J68J05k98jm7J73L3J10l58P2K87l1p3q3l7J11j31j51
4639b08K86q0m0J36k51jK93l38K68k22K08R9j47j0M5J3OL71l36M5p5M5m1k79J16
4664i7R9j1J16j80J2J36k98Q5m8L90j93j69N1P3Rj38O1L60k85R4q5L2J91k70K6
4689c9Q2q4j11J93k07O5m5J08O9j84J16L8J23j61K74k06J10N1j58j27J69K9k72
4712a67L26j46lj64J0J01M9o7Q9j29q7K57m5k3J21r4N5K6m3k7K80l57J51j70n2
4737a09L5J19j00O5J44k65l7L22j76Ok44K28J33r3N3J01j11J9k44J73m5J84k47
$$ plain form
4760 -89 -208 -45 99 18 -8 162 -169 -168 12 -105 30 62 -73 -76 -120 48 -80 -1 -159 -7 35 105 178 -5
4784 -5 -23 198 -75 140 -46 -134 134 -63 32 27 -104 -45 -50 125 18 8 -145 -155 -348 -24 -166 218 172 -74
4808 -74 -146 -85 121 201 86 172 276 116 16 -78 -20 64 108 135 -58 -96 154 -66 -34 -122 -113 60 -24 124 50 -166
4834 -166 -30 -139 -103 -44 6 -30 -106 -17 38 -62 5 193 42 -11 -49 -131 -32 -302 6 -91 -1 -112 209 37 -72
4859 -72 -44 278 11 -54 -64 45 152 147 -2 4 -171 20 60 -87 46 8 102 49 3 -38 -38 40 -36 -28 191 -154 -259
4886 -259 -1 19 -192 -201 -105 30 -206 148 115 143 -3 -109 -68 -153 -96 -88 -34 22 29 -16 -90 -139 9 73 -4 209 21
4913 21 -91 -148 -163 68 123 3 -94 108 126 151 107 -78 -37 120 111 95 34 37 23 -90 71 190 -145 36 -253
4938 -253 153 -288 31 66 -95 -72 -55 113 13 -212 75 23 -186 172 -205 129 -162 -158 -20 110 9 -35
$$ packed form
4760h9j19J63J44q1k6J70l31JJ80j17J35L2j35lm4J68j28P9j58J52M2P0P3j83
4784ej8K21k73K15j86q8K68j97R5nj31N9nJ75j07j0j53j0j93L24j42L84m6k46
4808g4p2O1K06Q0j15Q6J04j60j00r4N8Q4M4K7j93l8K50k20L2q8RJ73q4J48p4k16
4834a66J36j09L6N9N0l6p6Q9N5j00O7J88j51n3l8q2R9k70L08r7R0j11L21j72j09
4859g2K8L22k67o5j0J09J07nj49Oj75J91M0j47J33l8R4n3m6m1%P8p6QK19l45j05
4886b59K58K0k11rR6J35k36L54l3K8j46j06M1q5N7QN4N6Pm5p4m9J48O4p7K13j88
4913B1j12n7j5K31N5j20r7K02J8K5m4j85M1J57rj6o1Lj4j13J61J19l35J81k89
4938b53M06m41L19L5j61K3J7J68j00k25K87n2k09L58l77L34k91MJ38J30j01m4
$$ plain form
4960 -35 -203 -132 17 -120 23 -10 11 -37 29 -146 15 118 5 140 -49 -34 -299 319 20 4 -245 -106 -60
4983 -60 -30 133 -20 145 -22 155 -232 -75 -5 -157 -73 14 16 -46 -24 -216 119 -59 -32 32 -33 -17 -111 60 -56
5008 -56 -24 37 -7 -14 24 45 81 12 142 43 74 -63 -56 -144 -76 70 -104 -121 135 -105 -41 -14 -20 -140 -78 117 116 -228
5036 -228 -158 -105 66 73 186 -50 -156 -171 -36 228 121 142 -31 -28 -183 43 118 -63 -49 -138 11 16 187 116 115
5061 115 185 -11 139 -101 117 10 89 -86 207 38 -5 -89 66 -165 -167 141 -139 -43 -10 107 -131 306 61
5084 61 31 42 86 -61 74 266 293 -127 -106 -39 197 -91 55 -17 -139 -70 125 -182 49 33 35 -57 68 -36
5108 -36 164 -27 -11 -197 -182 245 119 -14 -191 -178 -44 -27 -108 -18 -174 206 76 95 438 50 -14 -2 219
5131 219 123 37 17 -157 -128 79 -161 -23 -206 -128 -5 -301 6 -37 -152 177 72 -1 135 179 -21 30 -12
$$ packed form
4960c5j68P1J49j37J43l3K1m8O6j75J61J03j13J35j89J5k65O18k99j6k49J39M6
4983f0L0J63j53J65j67J77l87J57P0j52Q4Q7Ko2K2j92L35j78K7O4o5J6r4J71j16
5008e6L2O1m4pL8K1L6o9J30r9L1j37Pq8O8J46j74j7K56k40O4K7oj20O2J95jl44
5036b28P0N3J71PJ13k36j06j5J35K64j07K1j73Lj55K26P5j81J4q9J49NJ71p1j
5061A15P0j96J50k40K18j07P9j75K93j69m3q4J55k31kL08k80R6L3J17k38M37k45
5084F1l0J1M4j47J35J92K7m20K1O7K36k88J46p2j22O9J95l07K31j6Kr2J25j04
5108c6K00j91J6j86J5M27j26j33j77J3J34J7q1R0j56L80j30J9L43l88o4J2K21
5131B19r6q6k0j74K9K07k40J38j83P8J23k96L07m3j15L29j05p3J36M4k00N1m2
$$ plain form
5154 -12 -86 -187 54 -101 -51 -271 -4 -82 -120 -136 174 38 -75 0 2 26 190 183 84 96 -185 105 76 -71 53
5179 53 79 -64 -117 -339 20 -47 -212 191 30 -168 -112 183 49 -61 68 59 89 44 -7 -1 22 194 68 -53
5203 -53 -43 234 47 -93 7 -63 -109 -55 -197 65 61 -22 88 89 -35 106 -17 -133 -202 57 93 -62 164 284
5227 284 -60 -1 -121 -147 47 25 -111 115 -53 19 83 -13 -86 143 -68 -149 -38 71 304 236 284 50 149 -132
5251 -132 -246 -72 -96 -71 -90 -9 -49 -97 -85 -169 -17 -51 -104 -17 75 -33 -148 98 95 -245 259 -102 185 -75 30
5276 30 -145 36 -73 -67 -50 184 39 10 73 71 124 -111 -95 -113 180 89 -23 -98 -68 -80 -61 107 212 -136 83
5301 83 -58 36 103 -38 -81 132 213 -44 94 -49 -7 1 133 58 230 6 -100 -9 -170 -153 7 -270 -45 -90
5325 -90 -49 -17 84 168 -16 25 -47 15 -58 -122 -56 -15 -81 -47 -82 -165 -250 52 -155 -178 148 -185 19 -4 19 -63 -36
$$ packed form
5154a2p4j01K41j55N0k20K67p8l8j6L10j36j13P5KK4J64pr9J2k81K90k9j47J24
5179E3K6j43n3k22L59o7j65M03j61j98N6K95j34j10J29rL0m5n1OK3J72j26j21
5203e3J0K77j87j40J00p0m6N4j42K62mq3J10Jj24J41j23j16o9K59L6j55K26J20
5227B84l44N9j20k6J94k2j36K26j68P2O4r6p3K29k11q1J11J09K33o8M8k34R9k81
5251a32j14J74k4K5j9Q1m0m8J2q4J52l4n3Q7R2j08j15K46ll40N04l61K87k60J05
5276C0j75J81j09OJ7K34j45k9O3kN3k35J6j8K93r1j12p5L0j2J9J68J05l48K19
5301H3j41R4O7j41m3K13Q1k57J38j43M2QJ32p5J72k24j06R1j61J7J60k77K25m5
5325i0M1L2J01Q4j84M1p2O2p3o4O6M1o6L4l5q3q5L02k07k3L26l33K04k3K3q2K7
$$ plain form
5352 -36 -208 59 -70 41 -11 92 64 -151 -34 20 63 -124 -58 -33 -16 -102 155 -55 5 123 -143 -100 67 5
5376 5 187 71 -3 338 8 105 -160 -229 -33 -207 -24 194 -56 -142 196 27 127 -7 11 -49 -87 130 -168
5399 -168 167 84 216 34 -21 -112 -29 -100 -17 -6 -147 -96 86 -48 -99 -71 104 -294 -59 -45 92 24 109 28 76
5424 76 4 62 -8 -109 -94 -272 84 -19 11 -8 -80 76 138 61 119 3 142 74 -13 26 250 -24 248 117 -9
5449 -9 130 -141 130 -108 200 156 45 -40 -150 227 -88 -184 -2 -128 96 -19 37 -214 37 -119 70 32
5471 32 -72 39 113 39 217 8 43 19 48 -18 75 -40 93 -113 77 43 245 -73 -9 406 30 -39 255 -16
5495 -16 4 70 -101 -239 -186 165 46 -36 5 154 -68 -166 32 31 186 -48 -73 226 -43 -59 150 76 86 6 85
5520 85 -18 -131 -205 82 -169 17 -52 42 -71 355 170 30 -104 164 97 32 -17 -20 155 28 102 127 -220 -113
$$ packed form
5352c6j72K67j29J11n2J03k8k15J17N4M3j87O6K5J7q6K57k10O0J18k66M3J67o2
5376EJ82j16p4L41l30R7k65o9J96j74J83K18k50q6L38j69J00j34J8o0l8K17k98
5399a68L35q3J32j82n5r1Q3p1Q3J1j41N1J82j34n1K8J75l98K35J4J37o8Q5q1M8
5424G6p2N8p0j01J5j78L56j03L0j9p2J56O2p7N8j16J39o8q7L9K24k74K72j31j26
5449iJ39k71K71k38L08m4j11q5j10L77l15r6J82j26K24j15N6k51K51j56J89l8
5471C2j04J11P4p4J78k09L5k4K9o6R3j15J33k06J90l4K02l18O4M15l76o9K94k71
5495a6K0O6j71j38N3L51j19q2M1J49k22r8J98jJ55k34k5K99k69j6K09p4J0q0P9
5520H5j03j13p4K87k51J86o9R4j13M26j85j40j34K68o7o5m9lJ75j27P4K5l47J07
$$ plain form
5544 -113 -208 -37 190 171 -169 107 -75 -101 43 -56 192 95 107 77 -69 92 13 -12 -40 52 9 -39 15 -96 -196
5569 -196 -148 -78 -3 -31 2 57 -26 296 -60 48 189 509 188 55 -93 120 153 -56 -12 -165 121 14 -152
5592 -152 51 -89 -46 121 61 -82 69 2 21 16 31 -145 -79 11 -140 59 244 -72 85 -113 -116 204 -136 -85
5616 -85 207 66 -330 -83 -25 58 133 -48 217 -140 141 112 265 390 107 -23 -51 134 -4 -219 -178 53
5638 53 88 -16 70 -143 53 133 190 -57 47 -67 6 -82 -53 131 27 71 21 -81 37 160 82 -169 49 -149
5662 -149 52 33 -101 97 24 -54 164 122 78 -79 -43 258 132 143 -224 5 261 -163 -243 -65 -209 131 27
5685 27 -117 -102 -80 -216 18 115 24 121 70 113 49 138 -104 -173 -182 -30 108 218 182 33 -136 -32 -25 46 60 46
5711 46 164 -100 -124 191 -135 64 -23 112 79 -151 -58 -262 60 -48 88 -158 -93 -241 104 52 -31 37 226
$$ packed form
5544a13r5J71K27j9l40K76j82k6J44r9K48r7J2l0j46J61p9k5k8R2m3m8N4j11j00
5569a96M8P0P5k8L3N5q3L22l56J08J41L20l21j33j48K13L3k09M4j53K86j07j66
5592a52K03j40M3J67o0j43J51o7J9nJ5j76O6R0j51J99J85l16J57j98lL20l40N1
5616h5K92j41l96K47N8Q3P5j81K65l57K81k9J53J25k83j30k8J85j38k15M1K31
5638E3L5j04Q6k13J96Q0N7k47J04j14P3q8K9J84j04M4n0j02J18J23p8k51K18j98
5662a49K01j9j34J98p3p8K18m2m4j57L6L01j26J1l67K29K56m24q0J78j44L40j04
5685B7j44J5K2j36K34R7r1R7n1M3o4Q9k42o9rJ52J38J10l6j49j69J04PP1J4j4
5711D6J18k64k4L15l26J99q7J35l3k30R3k04L22j08J36k46O5j48L45n2q3O8J89
$$ plain form
5734 226 -81 6 -194 215 5 60 -132 24 -47 -63 -65 -168 -33 60 -157 -113 -169 -105 -60 43 85 -84 69 83
5758 83 82 -62 -13 79 68 -95 121 -164 111 280 167 -99 103 16 36 86 26 77 -65 174 -132 -26 107 19
5782 19 10 -155 168 96 -152 7 -66 -34 -81 -5 65 -43 -123 43 60 133 234 39 91 69 146 7 127 -12 109
5807 109 56 57 -183 -26 104 -155 -229 -122 65 84 -7 -116 -7 62 -35 -7 61 34 -6 -27 -35 -73 87 -41 -136 15
5833 15 -278 7 55 180 -139 -333 -33 -76 120 129 -176 177 110 210 2 63 -75 100 69 -210 -40 -46 -124 -67
5857 -67 -78 20 -46 -262 -129 -28 -215 110 291 -5 210 52 -111 22 -28 -163 158 37 130 -227 -81 -77 52
5880 52 75 98 -6 39 77 75 -134 -118 -85 -63 48 174 -156 -17 -47 223 87 32 72 294 218 -117 -64 -37 -167
5905 -167 -111 88 -67 60 -68 -47 80 116 22 -8 93 -73 119 135 87 84 26 -84 35 211 -122 -121 -204 89
$$ packed form
5734B26l07Q7k00M09k10N5j92J56p1j6kj03J35R3k17M4n6O4M5J03M2j69J53J4
5758H3jj44M9R2j1j63K16k85K75J69j13k66K02q7K0N0o0N1j42K39l06J06J33q8
5782A9rj65L23p2k48J59p3L2m7P6P0j08q0J66J7P3J01j95N2k2P7j39J20j39J21
5807A09n3Jk40J57J30k59p4J07J87J9r1j09J09O9r7K8O8k7m0k1ql8J60j28r5J51
5833A5k93K85M8J25l19j94L00m3J96Rl05L53o7J00k08O1j38J75l1k79J70op8N7
5857f7j1R8o6k16J33J01j87L25J81k96K15j58j63J33n0j35L21j21R3l57J46MJ29
5880E2K3K3j04M5L8kk09J6L3K2J11J26l30J39l0K70j36n5M0K22p6l35N3K7j30
5905a67N6J99j55J27j28K1J27L6r4l0J01j66J92J6m8ln8j10J19J76l33Jq3K93
$$ plain form
5929 89 36 46 -106 34 141 190 62 30 199 132 207 65 21 -30 -105 -129 24 -102 -1 -218 -45 49 -175 -78
5953 -78 -11 -50 12 132 5 72 169 52 138 -107 -57 -34 73 -57 -79 -58 -101 -3 -98 -74 -105 113 7 97 -93 -70
5979 -70 -93 286 199 328 -33 -121 91 -9 11 58 -44 89 35 248 -18 -107 89 -182 294 -59 -165 120 -88
6002 -88 -105 72 96 -36 71 -40 237 20 198 -81 178 74 -31 -49 -235 -114 -195 -117 -116 254 -62 50 59
6025 59 -76 -27 -45 11 -106 67 83 -108 -104 31 150 -175 -96 68 149 73 -225 60 91 -40 119 251 208 -169
$$ packed form
5929H9n3J0j52J40J07M9j28l2J69o7P5j42m4n1p5k4J53j26J01k17J73R4k24R7
5953g8O7l9O2J20j27O7R7j17Q6k45N0K3J07j30k2K1m3R8r5K4l1K18j06R0j90K3
5979g0k3L79q7J29l61q8K12j00K0M7j02J33n4K13k66q9J96k71M76l53j06K85k08
6002h8j7J77K4j32J07j11K77k17J78k79K59j04j05j8j86J21q1P8JL70l16J12R
6025E9j35M9j8N6j17J73J6j91MJ35J19l25P9J64Q1p6k98K85L1j31J59J32m3l77
$$ [...]
8191a64
##END NTUPLES=NMR FID
##END=
