##TITLE=1H_Ser 4634-i-K
 CDCl3, 8 sc, 
 5.3.2020
##JCAMPDX= 6.0         $$ Bruker NMR JCAMP-DX V2.0
##DATA TYPE= NMR FID
##DATA CLASS= NTUPLES
##ORIGIN= UXNMR, Bruker Analytische Messtechnik GmbH
##OWNER= root
$$ XWIN-NMR		Version 3.5
$$ Thu Mar  5 14:02:34 2020 Russian Standard Time (UT+4h)  she@DPX200
##.OBSERVE FREQUENCY= 200.1315
##.OBSERVE NUCLEUS= ^1H
##.DELAY= (6, 6)
##.ACQUISITION MODE= SIMULTANEOUS
##.ACQUISITION SCHEME= undefined
##.AVERAGES= 8
##.DIGITISER RES= 18
##SPECTROMETER/DATA SYSTEM= spect
##.PULSE SEQUENCE= zg30
##.SOLVENT NAME= D2O
##.SHIFT REFERENCE= (INTERNAL, D2O, 0, 15.7039)
##AUDIT TRAIL= $$ (NUMBER, WHEN, WHO, WHERE, WHAT)
$$ ##TITLE= Audit trail, XWIN-NMR		Version 3.5
$$ ##JCAMPDX= 5.01
$$ ##ORIGIN= Bruker BioSpin GmbH
$$ ##OWNER= she
$$ F:/spectra/data/she/nmr/H-F/1/audita.txt
$$ ##AUDIT TRAIL=  $$ (NUMBER, WHEN, WHO, WHERE, WHAT)
(   1,<2020-03-05 14:01:30.32 +0400>,<she>,<DPX200>,
      <created by zg, POWCHK disabled, PULCHK disabled
       configuration hash MD5:
       00 E9 B6 7A A2 85 ED C7 34 08 36 98 17 FE 4E 26
       data hash MD5: 16K
       D8 4B E6 FF 6B CF D0 F3 41 24 68 20 97 5A 97 F3>)
$$ ##END=
$$ 
$$ hash MD5
$$ 8D BD D5 26 6E F5 AA EF 6A 09 D3 B5 1C 54 2E 54
##$RELAX= 
##$RELAX= 
##$RELAX= 
##$RELAX= 
##$RELAX= 
##$RELAX= 
$$ Bruker specific parameters
$$ --------------------------
##$DU= <F:/spectra>
##$EXPNO= 1
##$NAME= <H-F>
##$PROCNO= 1
##$TYPE= <nmr>
##$USER= <she>
##$AMP= (0..31)
100 100 100 100 100 100 100 100 100 100 100 100 100 100 100 100 100 100 
100 100 100 100 100 100 100 100 100 100 100 100 100 100 
##$AQSEQ= 0
##$AQ_mod= 1
##$AUNM= <au_zg>
##$AUTOPOS= <>
##$BF1= 200.13
##$BF2= 200.13
##$BF3= 200.13
##$BF4= 200.13
##$BF5= 200.13
##$BF6= 200.13
##$BF7= 200.13
##$BF8= 200.13
##$BYTORDA= 1
##$CFDGTYP= 0
##$CFRGTYP= 5
##$CHEMSTR= <none>
##$CNST= (0..31)
1 1 145 1 1 1 1 1 1 1 1 1 1 1 1 1 1 1 1 1 1 1 1 1 1 1 1 1 1 1 1 1 
##$CPDPRG= <>
##$CPDPRG1= <>
##$CPDPRG2= <>
##$CPDPRG3= <>
##$CPDPRG4= <mlev>
##$CPDPRG5= <mlev>
##$CPDPRG6= <mlev>
##$CPDPRG7= <mlev>
##$CPDPRG8= <mlev>
##$CPDPRGB= <>
##$CPDPRGT= <>
##$D= (0..31)
0 1.2 0 0 0 0 0 0 0 0.06 0 0.03 0 0 0 0 0.0002 0 0 0 0 0 0 0 0 0 0 0 0 
0 0 0 
##$DATE= 1583402489
##$DBL= (0..7)
120 120 120 120 120 120 120 120 
##$DBP= (0..7)
150 150 150 150 150 150 150 150 
##$DBP07= 0
##$DBPNAM0= <>
##$DBPNAM1= <>
##$DBPNAM2= <>
##$DBPNAM3= <>
##$DBPNAM4= <>
##$DBPNAM5= <>
##$DBPNAM6= <>
##$DBPNAM7= <>
##$DBPOAL= (0..7)
0.5 0.5 0.5 0.5 0.5 0.5 0.5 0.5 
##$DBPOFFS= (0..7)
0 0 0 0 0 0 0 0 
##$DE= 6
##$DECBNUC= <off>
##$DECIM= 24
##$DECNUC= <off>
##$DECSTAT= 4
##$DIGMOD= 1
##$DIGTYP= 9
##$DL= (0..7)
0 120 120 120 120 120 120 120 
##$DP= (0..7)
150 150 150 150 150 150 150 150 
##$DP07= 0
##$DPNAME0= <>
##$DPNAME1= <>
##$DPNAME2= <>
##$DPNAME3= <>
##$DPNAME4= <>
##$DPNAME5= <>
##$DPNAME6= <>
##$DPNAME7= <>
##$DPOAL= (0..7)
0.5 0.5 0.5 0.5 0.5 0.5 0.5 0.5 
##$DPOFFS= (0..7)
0 0 0 0 0 0 0 0 
##$DQDMODE= 0
##$DR= 18
##$DS= 0
##$DSLIST= <SSSSSSSSSSSSSSS>
$$ [...]
##$SUBNAM2= <"">
##$SUBNAM3= <"">
##$SUBNAM4= <"">
##$SUBNAM5= <"">
##$SUBNAM6= <"">
##$SUBNAM7= <"">
##$SUBNAM8= <"">
##$SUBNAM9= <"">
##$SW= 24.9337058887773
##$SWIBOX= (0..15)
0 0 2 0 0 0 0 0 0 0 0 0 0 0 0 0 
##$SW_h= 4990.01996007984
##$TD= 16384
##$TD0= 1
##$TE= 0
##$TE2= 300
##$TE3= 300
##$TEG= 300
##$TL= (0..7)
0 120 120 120 120 120 120 120 
##$TP= (0..7)
150 150 150 150 150 150 150 150 
##$TP07= 0
##$TPNAME0= <>
##$TPNAME1= <>
##$TPNAME2= <>
##$TPNAME3= <>
##$TPNAME4= <>
##$TPNAME5= <>
##$TPNAME6= <>
##$TPNAME7= <>
##$TPOAL= (0..7)
0.5 0.5 0.5 0.5 0.5 0.5 0.5 0.5 
##$TPOFFS= (0..7)
0 0 0 0 0 0 0 0 
##$TUNHIN= 0
##$TUNHOUT= 0
##$TUNXOUT= 0
##$USERA1= <user>
##$USERA2= <user>
##$USERA3= <user>
##$USERA4= <user>
##$USERA5= <user>
##$V9= 5
##$VALIST= <valist>
##$VCLIST= <CCCCCCCCCCCCCCC>
##$VD= 0
##$VDLIST= <DDDDDDDDDDDDDDD>
##$VPLIST= <PPPPPPPPPPPPPPP>
##$VTLIST= <TTTTTTTTTTTTTTT>
##$WBST= 1024
##$WBSW= 4
##$XGAIN= (0..3)
0 0 0 0 
##$XL= 0
##$YL= 0
##$YMAX_a= 285158
##$YMIN_a= -181585
##$ZGOPTNS= <>
##$ZL1= 120
##$ZL2= 120
##$ZL3= 120
##$ZL4= 120
##$ABSF1= 10
##$ABSF2= 0
##$ABSG= 5
##$ABSL= 3
##$ALPHA= 0
##$AQORDER= 0
##$ASSFAC= 0
##$ASSFACI= 0
##$ASSFACX= 0
##$ASSWID= 0
##$AUNMP= <proc_1d>
##$AZFE= 0.1
##$AZFW= 0.1
##$BCFW= 1
##$BC_mod= 2
##$BYTORDP= 1
##$COROFFS= 0
##$CY= 11.3945322036743
##$DATMOD= 1
##$DC= 2
##$DFILT= <>
##$DTYPP= 0
##$F1P= 16.9975609425685
##$F2P= -3.02152046262296
##$FCOR= 0.5
##$FTSIZE= 0
##$FT_mod= 4
##$GAMMA= 1
##$GB= 0.15
##$INTBC= 1
##$INTSCL= 1
##$ISEN= 128
##$LB= 0.24
##$LEV0= 0
##$LPBIN= 0
##$MAXI= 10000
##$MC2= 0
##$MEAN= 0
##$ME_mod= 0
##$MI= 1.114404
##$NCOEF= 0
##$NC_proc= 0
##$NLEV= 6
##$NOISF1= 3.799351
##$NOISF2= 2.8
##$NSP= 1
##$NTH_PI= 0
##$NZP= 0
##$OFFSET= 15.70392
##$PC= 1
##$PHC0= -9794.289
##$PHC1= 26.00082
##$PH_mod= 1
##$PKNL= yes
##$PPARMOD= 0
##$PSCAL= 0
##$PSIGN= 0
##$REVERSE= no
##$SF= 200.130013532006
##$SI= 16384
##$SIGF1= 3
##$SIGF2= 2
##$SINO= 400
##$SIOLD= 16384
##$SREGLST= <1H.CDCl3>
##$SSB= 0
##$STSI= 0
##$STSR= 0
##$SW_p= 3612.71676300578
##$SYMM= 0
##$S_DEV= 0
##$TDeff= 0
##$TDoff= 0
##$TI= <>
##$TILT= no
##$TM1= 0
##$TM2= 0
##$TOPLEV= 0
##$USERP1= <user>
##$USERP2= <user>
##$USERP3= <user>
##$USERP4= <user>
##$USERP5= <user>
##$WDW= 1
##$XDIM= 8192
##$YMAX_p= 0
##$YMIN_p= 0
$$ End of Bruker specific parameters
$$ ---------------------------------
##NTUPLES= NMR FID
##VAR_NAME=  TIME,          FID/REAL,        FID/IMAG
##SYMBOL=    X,             R,               I
##VAR_TYPE=  INDEPENDENT,   DEPENDENT,       DEPENDENT
##VAR_FORM=  AFFN,          ASDF,            ASDF
##VAR_DIM=   8192,          8192,            8192
##UNITS=     SECONDS,       ARBITRARY UNITS, ARBITRARY UNITS
##FACTOR=    0.0002004,     1,               1
##FIRST=     0,             0,               0
##LAST=      1.6414764,     0,               0
##MIN=       0,             -181585,         0
##MAX=       1.6414764,     285158,          0
$$ Real data points
##PAGE= N=1
##DATA TABLE= (X++(R..R)), XYDATA
0@%%%%%%%%qJ6j6J6k4L2m0M8n6P2q8J04j20J38j62J90k19K51k86L25l70M20m73
31b50N32n99O72p50Q37r35J039j152J279j418J571j739J925k132K361k621K914
48A534l246L628m074M604n240O021p015Q326j0139J2836j7331K6627p9355J70715
62A07891R3386k99549q3313J86516Q7220j79766n1717J65496O1708j82424o9365
73a63917J77479J15582j46678j17184J10969J19580q8592j03050P2860J01927
83G8976n9434q3946N7820Q6692n5620q6579N5187J04839m4860j22553J3410J23962
95F7894J6912j03691k9160Q5617K5814p8938k5225Q3030L2937q9589n9060P3029
107d30P4792m3560o5712K6781M7743l0614l7803M1509M0072n1081n6849M2849
$$ plain form
0 0 0 0 0 0 0 0 0 0 -8 8 -8 8 -16 16 -24 24 -32 40 -48 56 -64 74 -88 102 -117 134 -152 173 -197 223 -250
31 -250 282 -317 355 -395 442 -493 546 -606 673 -745 826 -913 1012 -1120 1241 -1380 1534
48 1534 -1712 1916 -2158 2446 -2794 3227 -3788 4538 -5601 7235 -10096 16531 -62824 107891
62 107891 201277 -98272 -181585 4931 92151 -87615 -139332 26164 87872 -94552 -163917
73 -163917 13562 129144 -17534 -134718 -23749 95831 7239 -95811 -22951 78976
83 78976 19542 -64404 -6584 80108 24488 -62091 -6904 97935 53075 -69478 -56068 67894
95 67894 84806 -18885 -48045 37572 63386 -15552 -40777 42253 75190 -14399 -73459 -430
107 -430 74362 30802 -34910 -8129 39614 9000 -28803 12706 52778 1697 -55152 -12303
119a2303O8600k4778o4178J2231N5559j0733n4096N875M9448p420n4089L866O0148
132B8130N574o1469k1153N5073L3585m3708m5434K1344M3150m913l2854J204K6964
145E493J192k1583l29J8753k51k0409k166K0886J0116j4477j3174R401J7173n04
159A0121j5107m925P606K235q993L85J2702N037j4727j0743J4517J6160j4329
172f1k6007P937K8813n529l3487J534L9461P169m1397j5828L7991K0132l7727
185a6999k7054L4414L1864l1479l4068L3644M3904k8547n0823K0447N3053j2399
197A5957n1342R754N2128m338n0766M513N9403N413o2018j6698N8829K4591n4211
210h785k7921N3965L3743m9898l8299M6726M2746m3295m8138L5552M9315l5301
$$ plain form
119 -12303 56297 31519 -32659 -20428 35131 24398 -29698 -23823 25625 18205 -35884 -32018 28130
132 28130 33704 -27765 -48918 6155 39740 -3968 -49402 -28058 15092 10179 -22675 -21471 5493
145 5493 6685 -14898 -15227 3526 3275 -17134 -19300 1586 11702 -2775 -15949 -6548 10625 10121
159 10121 -4986 -9911 -2305 -70 -9063 -8678 4024 9061 -5666 -16409 -1892 14268 -61
172 -61 -26068 -18131 10682 5153 -28334 -26800 12661 19830 -21567 -37395 596 20728 -16999
185 -16999 -44053 -9639 22225 -9254 -43322 -9678 34226 5679 -45144 -24697 28356 15957
197 15957 -35385 -25631 26497 22159 -28607 -24094 35309 40722 -21296 -37994 20835 45426 -8785
210 -8785 -36706 17259 51002 1104 -37195 9531 52277 8982 -39156 -3604 45711 10410
222A0410n4711L1295O3663k1149o6482R188O1639n543n9484K715N7538j363o0079
235c2363k370O5827J5135o3376k5609N6142L1553n1087l5572M7380L9234m1551
247C343m0492M0845M7054l6345n2948K8097N3614k2155n6418J4660N8498o476
259C1277n8050J670N7373K172n8493q889N5724J1486n7652j7374N7031K7108n0978
272g595l1217M3771L2140m1220l4034L8668L4792l6988l8640L6002M3669k7427
284A1921m2543K0590L8555j9161l8198J6154L6057j3727l4804J2852L5592j0305
296A2983l6664N866L4623m651l5800j667L2231M692k6268m783K4480O488k3423
309a1893j0525J9272J2510j6575j4003J3321J6741p299j3314O687J2609l437j1006
$$ plain form
222 10410 -44301 -13006 50657 29508 -36974 -27786 33853 28310 -31174 -28459 29079 27716 -32363
235 -32363 -34733 31094 46229 -17147 -42756 13386 44939 -6148 -41720 5660 44894 3343
247 3343 -37149 3696 50750 14405 -38543 -10446 43168 21013 -35405 -20745 37753 31277
259 31277 -26773 -25103 32270 34442 -24051 -32940 22784 34270 -23382 -40756 16275 43383 -7595
272 -7595 -38812 4959 37099 -4121 -38155 513 35305 -1683 -40323 -4321 39348 11921
284 11921 -30622 -10032 28523 9362 -28836 -12682 23375 9648 -25156 -12304 23288 12983
296 12983 -23681 -17815 16808 12157 -23643 -25310 6921 11613 -14655 -19438 5042 11530 -11893
309 -11893 -22418 -3146 9364 -7211 -21214 -7893 8848 1549 -11765 -5078 7531 4094 -6912
322f912J55Q261J380n357n62O359L812m380l295L378K110l448m042l15K257K184
338A585j87j904M07M006K49o959k751P083L202r377n453R989J1217o192j1106
353f191O607J3085o589j5872M690J9684l208j9763K652K2024K039k0083k234J9875
367A6716J295k2549n364K1800P663k0938q845K1489J0118k2350j2668K1703J2447
380B0517k4516j7718K1461J9815j9150k0089J7903K2790j6312k6191J2256K6515
392A7281j0729k8729P886K9806l956k7958L556K8982j743k9519j834K7350L692
405A4085k7417o038K8087R798k6266j0621K5573J2642k6819j6665K3545J7701
417A7605k1777j9085K0443K1730j6822k3034J4338K3087j3037k5967Q288K5167
$$ plain form
322 -6912 -6757 1504 2884 -2473 -3035 3324 7136 2756 -539 2839 4949 1501 -2541 -2856 -599 1585
338 1585 1398 -506 -99 3907 4156 -2803 -5554 1529 4731 -4646 -10099 -110 11107 4915 -6191
353 -6191 416 13501 6912 -8960 -4270 15414 12206 -7557 -4905 17119 19158 -925 -3159 16716
367 16716 18011 -4538 -9902 11898 19561 -1377 -10222 11267 21385 -965 -13633 8070 20517
380 20517 -3999 -21717 -256 19559 409 -19680 -1777 21013 4701 -21490 -9234 17281
392 17281 6552 -22177 -14291 15515 11559 -16399 -12843 16139 14396 -15123 -16957 10393 14085
405 14085 -13332 -19370 8717 18515 -7751 -18372 7201 19843 -6976 -23641 -96 17605
417 17605 -4172 -23257 -2814 18916 2094 -20940 -6602 16485 3448 -22519 -14231 10936
429A0936n193k4127N299K4351k194k3622R97K1404q51k2141j265K1902L442j9090
443a0152l957K0712O661j9717q730J7971Q897j7494j0566J7328J2662j3897j1666
456a1948J2809J3141j0664j4669P693J2572o292j2647O155J3100l590j1273M059
469a554J1411m981j1952K960J0476k379r764K998J1058n20r489R57R411j410j1155
484c933m81J0925R82r525o95R806J698p248p33N206j602p496R25O911j032p086
500c378J548Q817m42q926r17P958j103r421Q83R396j56r815J263J1867K078j0997
516a345m359Q849L800q529l585Q616M227q161k305J0674M878j2524p273J1100
530D063O932j1259q416J0038R365q809r623R540J0679j1011j5233Q366J5205q520
$$ plain form
429 10936 5743 -18384 -13085 11266 9072 -14550 -13553 7851 7000 -15141 -16406 5496 8938 -10152
443 -10152 -14109 6603 13264 -6453 -15183 2788 11685 -5809 -16375 953 13615 -282 -11948
456 -11948 861 14002 3338 -11331 -3638 8934 2642 -10005 -3850 9250 5660 -5613 -1554
469 -1554 9857 4876 -7076 -4116 6360 3981 -5783 -2785 8273 7753 -1736 -779 8632 7222 -3933
484 -3933 -4414 6511 7493 -2032 -2727 7079 8777 1529 796 6002 4400 -3096 -2171 4740 3708 -3378
500 -3378 -1830 6987 6545 -2381 -3298 4660 3557 -5864 -4981 4415 4259 -5556 -4293 7574 9652 -1345
516 -1345 -5704 3145 6945 -1584 -5169 3447 7674 -487 -2792 7882 12760 236 -7037 4063
530 4063 10995 -264 -8680 1358 10723 1914 -7709 1831 12510 1499 -13734 -5368 9837 1317
544A317j7175O690J7977m621j6442L347J4728m533j6031L168J6131k858j7947
557a6249K215J9716K823j8088l736J5934K003j5902j748J6470K960j6502l611
570a3715J7835Q563j5225j0520J2454J0729j0727j1385Q708J0882o414q804Q717
583A098R854q480j2331O877J2650m291j4332J470J4318J548j1591q34J2266R67
597I189j4457j907J3902K638j5013m505J5661Q132j2652q812J0985Q731j1083
610H09r544R913R138j0001r525J1000J1049r633r633R021Q734j0261r978Q569
624c42J0089p809r226Q947J1199p675j1934N676J2110m778j1786L172Q990k867
638C766o480N794Q104o034q850M380P413m693p456L229P058l128n814M201O558
$$ plain form
544 1317 -15858 -9168 8809 4188 -12254 -8907 5821 1288 -14743 -11575 4556 1698 -16249
557 -16249 -14034 5682 8505 -9583 -13319 2615 4618 -11284 -13032 3438 6398 -10104 -13715
570 -13715 4120 12683 -2542 -13062 -608 10121 -606 -11991 -3283 7599 1185 -7619 1098
583 1098 10952 2472 -9859 -2982 9668 5377 -8955 -7485 6833 8381 -3210 -4044 8222 9189
597 9189 -5268 -7175 6727 9365 -5648 -10153 5508 13640 988 -7824 3161 11892 809
610 809 -8735 1178 10316 315 -9210 1790 12839 3206 -6427 2594 11328 1067 -8911 -342
624 -342 9747 1938 -7288 1659 12858 5183 -6751 -1075 11035 6257 -5529 -2357 6633 3766
638 3766 -2714 3080 11184 5150 -3700 680 8093 3400 -4056 -827 6231 3103 -2711 1490 8048
653H048n131p509M852N704o910q422N685R302k963q057J126O431p07m876n33K504
669a456l000k701M553M869m666n134M938O810l705p507J411N803j690m750K108
684d117N448O6m018O85M808n76o484k406O273M500m828n464L408O258L17l840
700C0j8K265k558n323J975O895k93o679J103O949j085p684J160R008k087j1471
716g813l56J1927K567j1067k350J1834M545j1560o942R330N737q575m522J0018
730B773M555j0294m416J2309O716j1023r699P753Q134n245n938N869O038o236
744A296n190Q643P474r999j1208P204J3059m140j2527J281J2513J193q954j729
758a084P207K9q015q94Q404N69q704r18J0331L417r373m539O216K565o864j399
$$ plain form
653 8048 2917 -4592 260 5964 -946 -9368 -3683 5619 2656 -5401 -4275 2156 1449 -3427 -3960 -1456
669 -1456 -4456 -7157 -2604 2265 -2401 -7535 -2597 4213 508 -6999 -5588 215 -1475 -6225 -4117
684 -4117 1331 1397 -2621 -1936 2872 2296 -4188 -6594 -321 4179 -649 -6113 -2705 3553 3870 30
700 30 12 2277 -281 -5604 -3629 3266 2973 -3706 -2603 4346 3261 -4423 -3263 5745 3658 -7813
716 -7813 -8169 3758 6325 -4742 -7092 4742 9287 -2273 -9215 115 5852 -2723 -7245 2773
730 2773 7328 -2966 -7382 4927 11643 620 -9079 -1326 6808 1563 -4375 1494 7532 1296
744 1296 -3894 4749 12223 2224 -8984 -1780 11279 7139 -5388 -4107 8406 9599 645 -1084
758 -1084 6123 6152 -1863 -2757 5647 6216 -2488 -3406 6925 10342 969 -3570 2646 5211 -1653 -3052
774c052P057J045q305j897R718M445q637n893O204L462p277l579P769M151o556
789a345m104N931L859m405l578K134J548k411o36K077j80j856J737M330q39n608
805c346j644L287J279k107oQ15j190K18L755J40l082k264J470J286j030q56L33
822b942Q54m12J669J703q34l102j611K741J354j486j740J88K415K450k55l056
838b064o97L299J133m256k260L801K654l071j145M937K387n360k708M528K809
853C987n209k800N768L238o136l099Q600M842q646n231P432L930q650m368J0025
868C683O085r352o125R145P324r002q691P961Q830q400r542P513J0160n540q350
883d301N748Q026o904r385N727R089m975r787M598J0950k600j0842J309J0643
$$ plain form
774 -3052 4005 5050 -3255 -5152 4566 9011 374 -5519 685 4147 -3130 -6709 1060 5211 -1345
789 -1345 -5449 482 4341 -64 -3642 -1508 40 -2371 -3007 -930 -1110 -2966 -1229 3101 2262 -3346
805 -3346 -4990 -1703 -424 -2531 -2537 -1722 -2912 -2694 1061 1201 -1881 -4145 -2675 -1389 -2419 -3275 -2942
822 -2942 -2088 -2500 -831 872 38 -3064 -4675 -1934 -580 -2066 -3806 -3618 -1203 1247 992 -2064
838 -2064 -2761 538 1671 -2585 -4845 -1044 1610 -1461 -2606 2331 4718 -642 -3350 1178 3987
853 3987 -1222 -4022 1746 4984 -1152 -4251 4349 9191 545 -4686 2746 6676 -1974 -6342 3683
868 3683 9768 416 -5709 3436 10760 1758 -6933 1028 9858 1458 -8084 -571 9589 4049 -4301
883 -4301 1447 9473 2569 -6816 -1089 8000 3025 -6762 -2164 8786 6186 -4656 -3347 7296
897G296o55j1147j369R719J500q957j262R124K895p799m061O610M236p026o160
912g056O084O892n036o141M138O918l649p117L230O323m213q008K765R109m55
927C784r449N32R613J24j0276k549R775L107r906l591R079M725p894l966P747
942H55M563p621o399N903O293n661n793O491O951n492o303M746O392m915o648
957f638L523O072k926n946L624O566r77o480J81N085o89n727k29N513J055m574
973b567K7L522J151k886j059K039k73k628L2K317J264j910K2K593J206k598k246
990a994K208J044j814j000K013J829j050m68R85J043o67j329M56j04j155L15K353
1007B665J2j306J370K183k313l620J624L769j705m326J766M377p45l861O42N050
$$ plain form
897 7296 6641 -4506 -5875 3844 5344 -3613 -4875 4249 7144 -655 -4716 1894 6130 -896 -7056
912 -7056 -972 5920 884 -5257 -1119 5799 2150 -4967 -1737 4586 373 -7635 -4870 4239 3784
927 3784 -5665 -5133 4480 4604 -5672 -8221 1554 4661 -5245 -8836 243 4968 -2926 -6892 855
942 855 5418 -2203 -8602 -2699 3594 -2067 -7860 -1369 5582 90 -6213 -1467 4925 10 -6638
957 -6638 -3115 2957 31 -5915 -2291 4275 3298 -3182 -3001 2084 1395 -4332 -4561 952 2007 -2567
973 -2567 -2540 982 2133 -753 -1812 227 -46 -2674 -2642 -325 939 -971 -949 1644 2850 252 -1994
990 -1994 214 1258 -556 -1556 457 2286 1236 768 1753 2796 2129 800 1256 1152 -3 312 2665
1007 2665 2677 1371 2741 4924 2611 -1009 615 4384 2679 -1647 119 4496 3751 -110 532 5582
1023E582q27o001j017N531J68n398N95O324L95p004j15O236j60p043j414O803
1039B655J214p151j628P606L340o677m700O092M181p059n681O203O028n141n815
1054f533M731O494l560o994K564O448k946p524J964P781n00p430R99Q507j63r033
1070e195j261Q276J662q787k734R236M709q383n134Q509O295q435p988P087Q108
1085E965o703q533O519R151m263r011L665Q293l277r506K099R387j239r720J511
1100e662J0628Qj0187m28R977P95j0324k309J0147L548q668l838R546N332q511
1115E4o298P128O932o791p529O088P782m554p122M715Q008m291p821K066P524
1130E891k045q237J891Q181m0p991o8Q586Mq890j645P785K129p587k761P487M431
$$ plain form
1023 5582 4755 -1246 -2263 3268 3436 -1962 -1367 4957 5352 -1652 -1767 4469 4309 -2734 -4148 2655
1039 2655 3869 -3282 -4910 2696 6036 -641 -5341 751 4932 -2127 -7808 -1605 4423 -718 -6533
1054 -6533 -1802 4692 1132 -5862 -3298 3150 204 -7320 -5356 2425 1925 -5505 -4506 4001 3838 -5195
1070 -5195 -6456 1820 3482 -5305 -8039 1197 5906 -2477 -7611 898 7193 -1242 -9230 -2143 5965
1085 5965 -738 -9271 -2752 6399 2136 -6875 -3210 5083 1806 -7700 -5601 3786 2547 -7173 -5662
1100 -5662 4966 4974 -5213 -5641 4336 5131 -5193 -7502 2645 6193 -2475 -6313 3233 8565 54
1115 54 -6244 884 7816 1025 -6504 -416 7366 2812 -4310 405 8413 4122 -3699 -1633 5891
1130 5891 3846 -4391 -2500 5681 5641 -2350 -2418 6168 6172 -2718 -4363 3422 5551 -2036 -4797 2690 7121
1147G121o038n035N394N025n474n899M104N575l718n037L919N332k615n327K313
1162c60M338k221n258J075N101o13m448P89N771p81n291p89M950L42n341j236
1178c972M788J970l351j874K837K602l167k725J720J794j844k295K840J993j745
1193d29j054J261R87j312j687Q44N14j322m40J695J057k06j372N02J147j410p92
1210b017k92K01k38O54J233p83r06J595J306k139k299J810J556j541j909K123
1226a646L343j373l316J608L661j165m222K58M354l37l695J527M064o73l698J072
1242b38L829j038m501m70M808O66m146j26M620J160n276j061M825R11n495k871
1258d403N591L469l877l479L322M768l071m536J532L843j726m327K058N322j490
$$ plain form
1147 7121 1083 -3952 1442 6467 993 -4906 -802 4773 1055 -3982 -63 5269 2654 -2673 -360
1162 -360 3978 1757 -3501 -2426 2675 2062 -2386 -1597 4174 3393 -1898 -2687 2263 2605 -2736 -3972
1178 -3972 816 2786 -565 -2439 398 3000 -167 -2892 -1172 622 -1222 -3517 -677 1316 -429
1193 -429 -1483 -222 765 -547 -2234 -1390 -876 -2198 -2638 -943 114 -92 -1464 -962 185 -1225 -2017
1210 -2017 -2309 -2108 -2346 -1692 -459 -1242 -2148 -553 753 -1386 -3685 -1875 -319 -1860 -3769 -1646
1226 -1646 1697 324 -2992 -1384 2277 1112 -3110 -2852 1502 1165 -2530 -1003 3061 2388 -1310 -238
1242 -238 3591 2553 -1948 -2418 2390 3056 -1090 -1216 3404 4564 -712 -1773 3052 3963 -1532 -4403
1258 -4403 1188 4657 780 -2699 623 5391 2320 -2216 -684 3159 1433 -2894 -836 4486 2996
1273B996n117J888N768r67o496k18N390Q34o084o40O582J795o247k257O495K437
1289F159o590m438N909M144n417m193M646N343m083n161L239M448l299n909K663
1304b539N693k395n483K800N751k172o286J923N515k138o481P77P096M61o816
1319d294o82P170J819o503k996N749K239n956k589N948L479n057l677N303M082
1334D035m228n138K757M846l090m540K794N192k351m274L102M045l243n555K490
1349c158N638j540n392N77N888R15m856o23M277O36m287j183L839Q03k940k52
1365a658L658R21k773j219J878R12j863j457J232J680j133j095J647J768j084
1380A414k162M79J390n69k025J84K330J681k228j395K004K540k015l636J308L432
$$ plain form
1273 2996 -2121 -233 5535 4568 -1928 -2146 3244 4078 -2006 -2646 3936 5731 -516 -2773 3722 6159
1289 6159 -431 -4869 1040 5184 -233 -4426 220 5563 1480 -3681 -442 4006 707 -5202 -2539
1304 -2539 3154 759 -4724 -1924 3827 1655 -4631 -2708 2807 669 -5812 -5035 2061 2522 -4294
1319 -4294 -4976 2194 4013 -2490 -5486 263 2502 -3454 -6043 -95 3384 -1673 -5350 -47 4035
1334 4035 -193 -5331 -2574 2272 -818 -5358 -2564 2628 277 -3997 -895 3150 -93 -5648 -3158
1349 -3158 2480 940 -4452 -3875 2013 2928 -1928 -2551 1726 2362 -1925 -3108 731 1534 -1406 -1658
1365 -1658 2000 2921 148 -1071 807 1719 -144 -1601 -369 1311 178 -917 730 2498 1414
1380 1414 -748 -269 1121 552 -1473 -1289 1041 2722 494 -901 1103 3643 1628 -2008 -700 2732
1396B732p24l251O28L778L82k603k68K119k5l509j8L075M78l329j98M084o6l259
1414B6j85K425k75k622p18J890n4j879J120K333n7k365n84J146K50j630r0J044
1432b25k14j00J491j7j247l47J813p0k702o24J917N94r86K59J755m26j786L39
1450e76J931j350k980Q68L479q68l923J213M733q67m793O04M175j402n390P74
1466d372N606L39n275j24N081J281n747j546M752K161m726k585M317K995k885
1481g28k262L376K226l308k635K567K645k174k952K158M804j624m557R33N045
1496C514n98m788q01M135Q68l846r54M772J944m647k302M312L062n726l671N211
1512D85M721m347m397M091M959l127n431L344N032l146o421K945O802j472p121
$$ plain form
1396 2732 2008 -1243 -615 3163 3545 942 674 2793 2768 -741 -759 2316 2794 -535 -733 3351 3285 26
1414 26 -159 2266 1991 -631 -1349 541 487 -1392 -272 2061 2004 -361 -945 201 451 -1179 -1269 -225
1432 -225 -439 -539 952 935 -312 -659 1154 1084 -1618 -2242 -325 269 -717 -458 1297 871 -915 -576
1450 -576 1355 5 -2975 -2107 1372 504 -3419 -2206 2527 1660 -3133 -2529 1646 244 -5146 -4372
1466 -4372 1234 1573 -3702 -3826 1255 2536 -3211 -4757 -5 2156 -2570 -5155 -838 2157 -728
1481 -728 -2990 386 2612 -696 -3331 -764 1881 -293 -3245 -1087 3717 2093 -2464 -1531 3514
1496 3514 2916 -1872 -2673 1462 2330 -1516 -2470 2302 4246 -401 -2703 1609 4671 -1055 -4726 485
1512 485 5206 859 -3538 553 5512 2385 -3046 298 5330 2184 -4237 -1292 5510 4038 -3083
1527c083J915P561r65q185o33P088J305p102j746O574K399n613k699N058L531
1542E405n351m337M045L850m105l577M385M070l453m182K731M822l049m703J920
1557a529M552k129m396J936N833j105n682L73N482n76n585j003N167J955m327
1572a034k457M282K795m017l154K772K845l434l214K738L200j833k698K275L122
1587B188k146l602M19L282l30k712l17L225P12k194q40K376J087j967j578J085
1603a312J486m70j417N39K392O94j715j997J553J493j252k006R76K217r24j653
1619a396J160K259l26k556N1J773q29k383O57L440m42l243N60L708n28l566k08
1636a869L228K7l055l38L218J409k312j381K436J921k391k677J373K379m82j961
$$ plain form
1527 -3083 -1168 6393 5428 -2757 -3390 3698 5003 -2099 -3845 2729 5128 -485 -3184 1874 5405
1542 5405 54 -4283 -238 3612 -493 -4070 315 4385 932 -3250 -519 4303 1254 -3449 -1529
1557 -1529 3023 894 -3502 -1566 4267 3162 -2520 -2147 3335 2759 -2826 -3829 1338 3293 -1034
1572 -1034 -3491 791 3586 -431 -3585 -813 2032 -1402 -4616 -1878 1322 -511 -3209 -934 2188
1587 2188 42 -3560 -3141 141 -189 -2901 -3218 7 719 -1475 -2315 61 1148 -819 -2397 -1312
1603 -1312 174 -296 -1713 -1174 1218 1912 197 -1800 -247 1246 -6 -2012 -1036 1181 257 -1396
1619 -1396 -236 2023 1697 -859 -808 965 136 -2247 -1590 1850 1408 -1835 -1275 2433 1905 -1661 -1869
1636 -1869 1359 1386 -1669 -2007 1211 2620 308 -1073 1363 3284 893 -1784 -411 1968 1486 -475
1652d75L73K337P91j947j258J428J584k145k070J576K635j674k596K065L310j242
1668B692m563O37L954n27m929K97N518M96n090r79N313J709n406k191M750J544
1684C225m923k287N244L207l801l355L434K668l638l378L154L743l546l857K714
1699a396M531k000m269K112L802k014n313Q72N181J35m746r09N082J689m915k169
1715d327M600K354m259l500L657M122k839l807K662M705j828n361J400M894j446
1730A027n481J316N396J62n408P9N641k5n524q72M934J222n083j836N069L058
1746C675m301k728L906K623l986l369L013L322k156k910K411K960j401k733R27
1761g47K997o00l601Q31K997j41k507L71L567K54l560o79K904J002k861j804K349
$$ plain form
1652 -475 -102 2235 3026 1079 -179 1249 2833 688 -1382 194 2829 1155 -1441 624 3934 2692
1668 2692 -1871 -1234 2720 2193 -2736 -2439 3079 3575 -1515 -2494 2819 4528 -878 -3069 1681 3225
1684 3225 -1698 -3985 1259 4466 665 -2690 744 3412 -226 -3604 -450 3293 -253 -4110 -1396
1699 -1396 3135 1135 -3134 -1022 2780 766 -4547 -3675 1506 1641 -3105 -4014 1068 2757 -2158 -4327
1715 -4327 273 2627 -1632 -5132 -1475 2647 -192 -3999 -1337 3368 1540 -3821 -2421 2473 1027
1730 1027 -4454 -3138 2258 2420 -2988 -2909 2732 2707 -2817 -3689 1245 2467 -2616 -4452 617 3675
1746 3675 -626 -3354 552 3175 -811 -4180 -1167 2155 -1 -2911 -500 2460 1059 -1674 -747
1761 -747 2250 1650 -1951 -1120 1877 1736 -771 -400 3167 3421 -139 -818 2086 3088 227 -1577 772
1778G72K480j847k334J702K589j170k901L03K114j01k797O61J827Q28j514p87
1794a75J503M82j574j300J067J028q30q55O87J673q53q41K75J139n46j760k63
1811a143J664O31j269m74J367J013j258j546P03J177n86j916J2J975R61j950n97
1828a236J833O55k025j592J517J431j506j285J563J647j013j801J536J341j023
1843D2k435N07K501n99k466P29L442k50l262l46K877P56l510q75K777J753k995
1860a354j784K940K560k510k596J260K827j475l018J380K843l13k787Q68K666
1875A507r5l249j28K711K52k805p01L643J253l222r70L808J047l447k019K651
1891B36K094k420k190K407L195j710l129J705K897j580l276O93L312r55k826R43
$$ plain form
1778 772 3252 1405 -929 773 3362 2192 -709 -406 1708 1607 -1190 -529 1298 2126 612 -175
1794 -175 1328 1810 236 -1064 3 1031 201 -654 33 1706 853 12 287 1426 880 -880 -1143
1811 -1143 521 1152 -117 -591 776 1789 531 -1015 -312 865 279 -1637 -1625 350 1311 -639 -1236
1828 -1236 597 1252 -773 -2365 -848 583 -923 -2208 -645 1002 -11 -1812 -276 1065 42
1843 42 -2393 -1886 615 16 -2450 -1721 1721 1471 -1791 -2137 740 1496 -2014 -2889 -112 1641 -1354
1860 -1354 -3138 -198 2362 -148 -2744 -1484 1343 -132 -3150 -1770 1073 760 -2027 -1159 1507
1875 1507 1412 -1837 -1965 746 998 -1807 -2508 1135 2388 -834 -1804 2004 3051 -396 -2415 236
1891 236 2330 -90 -2280 127 3322 1612 -1517 188 3085 1505 -1771 -1078 2234 1279 -1547 -604
1907f04K992J28l040l62K769m66k685n81K999J208k799j125L365J296k735j596
1923a236J746J600j880k123J952K297q86j889J169J920q81k668L54K086n60j626
1939f25J51J776M8j172k03R06J46j336n70L55R24j101o01J408R46p55j645R25
1957d23Q74p40j340j15J269L06o06m89J251P05j420o08P97O35j380m48R29P26
1975g7k01j11k06R27n94p03k13O82n42o40O09Q92o1n54O31M14n94r49j2N15M35
1996c52k79J00j5N20L82l59k75l56L25M76q95m62J330M54m50n20Q96J116j327
2015C09j139P56J161j179j020J302J506p24j073O48J151j217j695J024J420j315
2031h5j135J874J764j425j693J127J802r60k411L36K235l50j639L56K034J54j469
$$ plain form
1907 -604 2388 2516 -524 -886 1883 1417 -1268 -1849 1150 2358 -441 -1566 1799 3095 360 -1236
1923 -1236 510 2110 230 -1893 59 2356 1470 -419 750 2670 1789 -879 -525 1561 1001 -625
1939 -625 -474 1302 1350 178 -25 881 1027 -309 -879 -524 400 -701 -1302 106 1052 297 -1348 -423
1957 -423 451 -289 -1629 -1744 -475 -169 -775 -1264 -13 692 -728 -1336 -539 96 -1284 -1732 -803 -77
1975 -77 -278 -389 -595 332 -262 -965 -1178 -496 -1038 -1678 -1069 -177 -238 -792 -161 253 -341 -1290 -1302 -787 -352
1996 -352 -631 -531 -546 -26 356 -3 -278 -634 -309 167 -728 -1190 140 594 144 -376 520 1636 309
2015 309 -830 -74 1087 -92 -1112 190 1696 972 -101 547 1698 481 -1214 -190 1230 -85
2031 -85 -1220 654 2418 993 -700 427 2229 1269 -1142 -806 1429 1079 -560 -204 1830 1984 515
2048E15l10J518k78j901L48J359j63j318O4J966P2j400l34R83o4j285o92J169
2066B49N89o68n35P14R27j161j099L97J000o38j034O6J345L78r38j58M80R43j301
2085d44o51M46Q0l36J44J184K20r75n8P85k5j010p79J212L32j022p5J096R70j379
2105b85q04J299K35j433q46R71R69r82p7M78P25l76m49J17K78j090k82R00L13
2124c39q45Q7J054P89j153p08Q85M60o13q46K30J035p2m56L60J122j32j273q5
2143e00J233n08j418N51J543J08j320n0K098o83j725J55J553k77j821N9K598M06
2161B002k252n06K587Q37k909j171J993J120j939o65K027Q26j485r47J752N53
2177A823j734j067J557J022j842q07K040J559j731j501R19J075j072j173R49J087
$$ plain form
2048 515 205 1723 1445 -456 -108 1251 1088 -230 -166 1800 1872 472 138 1121 1057 -228 -920 249
2066 249 838 170 -365 349 1276 115 -984 -587 413 -225 -1259 -1193 152 530 -408 -566 -86 857 -444
2085 -444 -1095 -649 -569 -905 -761 423 643 -332 -390 395 370 -640 -1419 -207 125 -897 -972 124 1094 -285
2105 -285 -1089 210 445 -988 -1834 -863 106 -876 -953 -475 250 -126 -575 -458 -180 -1270 -1552 -652 -339
2124 -339 -1184 -1097 -43 746 -407 -1115 -230 230 -383 -1229 -999 36 -36 -492 -132 990 858 -415 -500
2143 -500 733 225 -1193 -642 901 1009 -311 -361 1737 1054 -671 -516 1037 760 -1061 -1002 1596 2002
2161 2002 -250 -756 1831 2668 -241 -1412 581 1701 -238 -903 1124 1950 465 -482 1270 1823
2177 1823 89 -978 579 1601 -241 -1048 992 2551 820 -681 238 1313 241 -932 17 1104
2193A104l53j209j05J839R8j349n77O89L96q32r89J001J290l61j348N44J015l65
2211D88j424O9J364j97k066O57K254n88k031N22J895o8k451o21K172K78j177r13
2229a837K303Q19j928j070J601P27k140n24J387J004j335m80J141J036j130q02
2245a228Q06P63j433q19J440Q00p21o82J135Q66r18j165J126O58l17j237K34P18
2263B6K30K26l25L32l05m78M56o24J68L35L67k9n57O68K77L9j014L21O11r24k90
2284d90O85O53j33p74N87O17j032m86O20O98n52j247P71J220l47q93R93O62o02
2303I50j171k55J277p4p06l05J044J082r44r88M15J061o05j499P19J096m22j065
2321c90J72J477M5j589k7R90j12j913Q6K184M35k195j37K390k0k262p35K108R73
$$ plain form
2193 1104 751 -458 -563 1276 1374 25 -552 137 533 -299 -1288 -287 1003 642 -706 -162 853 488
2211 488 -936 -867 497 300 -1766 -1109 1145 557 -1474 -952 943 875 -1576 -2197 -25 253 -924 -1837
2229 -1837 466 1285 -643 -1713 -112 615 -1525 -2049 -662 342 -993 -1473 -332 704 -426 -1228
2245 -1228 -422 341 -1092 -1911 -471 329 -392 -1074 61 927 9 -1156 -30 628 311 -926 -692 26
2263 26 256 482 157 489 184 -294 162 -462 -294 41 408 379 -178 490 767 806 -208 113 724 -200 -490
2284 -490 195 848 715 -59 528 1145 113 -373 247 945 393 -854 -83 1137 790 -103 890 1552 950
2303 950 -221 -476 801 727 21 -284 760 1842 898 -90 325 1386 781 -718 1 1097 675 -390
2321 -390 -218 1259 1304 -285 -312 678 566 -1347 -1261 923 1358 -837 -974 1416 1396 -866 -1601 507 1480
2340A480k552j468K585J412j809j848K062J987k267j983J462K033j580j330J010
2355h06J475k39k018N75K288l55k485k29J978J71j787j43K502O18k189q46J285
2372b05J261j509j791J453K088j480j791J055K559p92k604M67K409p48k358M47
2388a539K557k75k487P61K394pl087J75K663j68k472j73K240R17k203n58K524
2405A262O73k138j164J664P76j208j215J436J547n55j543L23J424k59q37p21J286
2422G51n4q33J2J228N85r28q57M89J007r25j229Q39J800j273r36Q73R24Pj574
2441i4l74J822m95j723j33J852O77j650k09J009O77j491n45P76J13o68m05J049
2459A88M82p07L1k20N84m15m67k95P29K48r99K72Q91N44j033m24M12L82p53q55
$$ plain form
2340 1480 -1072 -2540 45 1457 -352 -2200 -138 1849 -418 -2401 -939 1094 -486 -1816 -806
2355 -806 669 430 -1588 -1013 1275 920 -1565 -1794 184 355 -1432 -1575 927 1545 -644 -1490 -205
2372 -205 1056 -453 -2244 -791 1297 -183 -1974 -919 1640 848 -1756 -1289 1120 372 -1986 -1539
2388 -1539 1018 743 -1744 -983 1411 1404 -1683 -1508 1155 987 -1485 -1658 582 1499 -704 -1262 1262
2405 1262 1935 -203 -1367 297 1073 -135 -1350 86 1633 1078 -465 -142 1282 1023 186 -535 751
2422 751 697 -136 -124 1104 1689 761 -96 393 1400 475 -754 85 1885 612 -324 549 1473 1480 -94
2441 -94 -468 1354 859 -864 -997 855 1532 -118 -327 682 1359 -132 -677 99 212 -456 -861 188
2459 188 670 -37 -6 -226 358 -57 -524 -819 -90 158 -841 -569 322 866 -167 -591 -179 203 -550 -1405
2479a405L62J242J39j380K03J685J24j963n14J487L43j551q83J811R12p74j227
2496a389J110J268j310j061O80J195j167j473J426J312k58j537M99J376n24j481
2512a334l63J985L64j626p69K468M57j582p24J770M82j649r48J168J342o76j536
2529a171Q67J906m25k083L70J824p93j680N54K207n56j606J68K093k21j978o86
2546a210K127L91k082p50K123J699j547j701J598J554j338k360J288J798q30j855
2562a095P96K013n2k503O51J877l79k451m1K244Q7j966j00J981M89j962m61J472
2580F00M37j548j219J976J083j145j307J645J073p37j925O04J520o46j448K68
2596g69J742J80j916j51J770N3j704l73J452K21j732j73J463R32j542n56J219
$$ plain form
2479 -1405 -1043 199 338 -1042 -839 846 970 -993 -1507 -20 323 -1228 -2111 -300 612 -162 -1389
2496 -1389 -279 989 -321 -1382 -702 493 -674 -2147 -721 591 333 -1204 -705 671 147 -1334
2512 -1334 -1697 288 652 -974 -1743 725 1182 -400 -1124 646 1128 -521 -1469 -301 1041 365 -1171
2529 -1171 -304 1602 1177 -906 -536 1288 495 -1185 -631 1576 1020 -586 -418 1675 1454 -524 -1210
2546 -1210 917 1308 -774 -1524 599 2298 751 -950 648 2202 864 -1496 -208 1590 760 -1095
2562 -1095 -299 1714 1662 -841 -190 1687 1308 -1143 -1184 1060 1147 -819 -919 1062 1551 -411 -872 600
2580 600 1037 -511 -1730 246 1329 184 -1123 522 1595 858 -1067 -463 1057 411 -1037 -769
2596 -769 973 1153 -763 -914 856 909 -795 -1168 284 505 -1227 -1400 63 995 -547 -1103 116
2613A16L53r15j356J103R78n84j299Q96J256l39j248O4J089l27q64k73N91P33
2631b6m99j70M33P78r26k44J69M45o8m18L58K65n0m38N65N72m44o28k18N90J6
2652F2o31k2J019P50p92o64L18P59o66p06J87R98j95q89M8J083K78p42p09R18
2672D04K18o34m59N16N00l34l76P02O42l88o09J30O19n15j174N73J282k93p49
2691E5l47J457j85o46r14P79J160j124r69O37J278m40j005K49J626r98j209j6
2709f12J207J34j601N27J417K64j466m42J063L48j396p14J552O60j657o55K185
2726H14O03j844j053J467J575j671k063J551J592p48k115J268K106j369j722N92
2742a017K032j307j475J79K099J8j680J71J477J75j671l35J542P2j287n05J936
$$ plain form
2613 116 469 -446 -1802 -699 279 -305 -1604 -708 548 209 -1039 -975 114 -213 -1077 -1350 -759 -26
2631 -26 -525 -695 -262 516 -410 -654 -485 -40 -108 -526 -168 97 47 -391 174 746 302 -326 -544 46 62
2652 62 -569 -591 428 1178 386 -278 40 799 133 -573 -386 612 417 -472 -424 659 937 195 -514 404
2672 404 622 -12 -471 45 545 211 -165 537 1179 791 182 312 931 416 -758 -185 1097 804 55
2691 55 -292 1165 980 334 -580 199 1359 235 -734 -97 1181 741 -264 -15 1611 613 -596 -612
2709 -612 595 729 -872 -345 1072 1336 -130 -572 491 839 -557 -1271 281 941 -716 -1371 814
2726 814 1417 -427 -1480 -13 1562 -109 -2172 -621 971 223 -1892 -624 1482 113 -1609 -1017
2742 -1017 1015 -292 -1767 -1588 511 529 -1151 -980 497 672 -999 -1334 208 280 -1007 -1512 424
2759D24R27j856p49J635N22j357j154Q94J645p39j446Q03J265k90j469J55J523
2776G33m64j189q7R01L63r12j56J243M44j052n32N64J331j549j081J533J001p64
2794C27j177J028J604q56j800L06J896o37j693M37K126n41j148k64J783O0j737
2811b86j04J006R4j125K20Q47N81j014l84J335j57j225k09N37P39q40l86Q88M95
2830A012m23n18K87r2l00k20M6M99R9j59r1K51K52L7n80m34J54M48r5p38N77L48
2852C60k72m22N47M86r69k67O9N65q57K42Q16L49m53j002O89N13n06j167N78O78
2872b3k94m93L84N12J33p78j08N67j13k53m76K96N03J5m67k3R64j61m37l22P3
2893e01n1m64K98L96M62j76n04P11J57p77m50Q09J09k01p64J171L52n82m24L94
$$ plain form
2759 424 1351 -505 -1254 381 903 -454 -1608 -714 931 192 -1254 -451 814 524 -945 -790 733
2776 733 269 -920 -1007 -106 257 -655 -811 432 876 -176 -708 -144 1187 -362 -1443 90 1091 327
2794 327 -850 178 1782 926 -874 -568 1328 691 -1002 -565 1561 1020 -128 -392 1391 1451 -286
2811 -286 -390 616 710 -415 -195 652 1233 219 -165 1170 1013 -212 -421 116 855 15 -371 517 1012
2830 1012 589 71 358 266 -34 -254 -208 291 390 231 140 391 643 680 100 -334 -180 268 173 -565 12 360
2852 360 88 -334 213 699 -270 -537 -468 97 -760 -518 298 647 194 -808 -119 394 -112 -1279 -701 -23
2872 -23 -317 -810 -426 86 219 -559 -667 -100 -213 -466 -942 -646 -143 -128 -595 -618 346 185 -252 -574 -501
2893 -501 -552 -1016 -718 -322 140 -36 -540 171 328 -449 -899 -90 19 -182 -946 225 577 -5 -429 -35
2913c5N35l12o95K12P33Rp00K06P36K32r61k84J006l13o64J45P42N3n25RM99O88
2935A316q16l57J34R82j158r46Q41J193n11j128N80R85k83j361j80J385J95j249
2953c78j61J229m0p77m3J055m7j096k97J154k17p46j80J668K0r69j78O31J23j086
2973c35o46J364M50o26r30O05Q50n66p02K93P58o20o36j68Q94m84J17MJ321r75
2993c2o30J24R70o44o95J59L11N78o20o6N33K09n61m90L40J6J01n88P31N84l65
3014c5j05j80K83N4o40J6R6L81k32k92N28nJ64j90L6N8m58k04M69k9O4J6L97J84
3038C76l48j55K80K16r16J40M59L33l45k71M84L07l41l73M51m49k5K5L89M7k34
3059E0M94j9nj71K45n38K0j54J5M79j84K09R6L19p07R6M74k53o01q8J111j66o63
$$ plain form
2913 -35 500 188 -507 -295 438 447 -253 -47 689 921 -40 -324 682 369 -295 -150 592 645 120 129 628 1316
2935 1316 500 143 277 1259 101 -845 -4 1189 678 -450 130 1115 832 -529 -709 676 871 -378
2953 -378 -539 690 650 -127 -170 885 838 -258 -555 599 382 -364 -544 1124 1144 175 -3 628 751 -335
2973 -335 -981 383 833 207 -723 -118 732 166 -536 -243 515 -105 -741 -909 -15 -499 -382 -378 943 -32
2993 -32 -662 -538 432 -212 -907 -748 -437 141 -479 -545 -12 197 -364 -854 -514 -498 -397 -985 -254 330 -35
3014 -35 -140 -320 -37 17 -623 -607 -511 -130 -362 -654 -126 -131 33 -157 -121 -63 -521 -725 -256 -285 -221 -205 192 376
3038 376 28 -127 153 369 -547 -407 52 385 40 -231 253 560 219 -154 297 -152 -177 -152 237 284 50
3059 50 544 525 520 349 594 56 76 -78 -63 416 232 441 537 856 149 245 719 466 -135 -223 888 722 59
3082E9j11J007J16q90k70O31q6n12k22P69K21j82m50K88K63l12l9k41p8j48J32
3103e5J84k01k04L95J89J9l95l09L3J86k36o1k4O23Q6l09l92J54O53o67m87O58
3125a60n5j63l33N03P67o05o57K6Q45l28o45N31O44l56p16J70N61L95j195J37
3145f34P48n64n81j47J335oq91K77N97M5q25l74R32J66o43k89P83M41l03k84L24
3166A07K45m17p89N66K74J05l91k3J467p01n74J42R21n67p06j61R64L59r62j42
3186b83Q90O01o44q73J062K7p09o46O74P50m45n22N34O26q90o35R55K82r85j74
3206d05N05P08l58m28J93P92k60p26j66M65k5p30K34Q76Nn81n38J017Q8p97n9
3227a90j84L24n8k25N93J41j23l83L37K39m79n78N32M17m90o32K29J282l20p27
$$ plain form
3082 59 -52 955 1071 181 -89 542 456 -56 -278 491 712 530 80 368 631 319 280 39 -39 -187 -55
3103 -55 129 -72 -276 119 308 327 -68 -377 -344 -158 -394 -455 -479 144 230 -79 -471 -317 336 -331 -818 -160
3125 -160 -215 -378 -711 -208 559 -46 -703 -677 168 -160 -805 -274 370 14 -702 -532 29 424 -771 -634
3145 -634 114 -450 -1031 -1178 157 151 -740 -463 134 179 -646 -1020 -88 78 -565 -854 -71 370 67 -217 107
3166 107 352 -65 -854 -288 -14 91 -300 -323 1144 443 -131 11 932 365 -341 -502 462 821 -141 -283
3186 -283 607 1208 564 -309 753 780 71 -575 99 849 404 -118 416 1042 152 -483 472 754 -231 -405
3206 -405 100 808 450 22 215 1007 747 21 -145 320 295 -435 -201 675 680 99 -439 578 666 -131 -190
3227 -190 -374 -50 -108 -333 260 401 278 -105 232 471 -8 -586 -54 363 -127 -759 -530 752 432 -295
3247b95o3N84k5p85k43O74O97p00k76L99P89q18o67L12R8k07l19K53O02j25l14
3268d29K87L2k51Pj99L89k33j59K98L87r4n18L3Q09l56n43K7J36K87k06j74K17
3290b53O05q7j56l8m42M87k41j75K41K29j21j99K38R6L67m64R6k56J00k46Q8K52
3312A21N20m16k76K35M22o87k14N75M76p35j42M47L90J18r83K64P00r8q62j75
3332c20P89J49p63M32K44O85m75o51O62m70j65M1rL36m71M9J58N86o5j152L24
3353h6O64n84n78M69M70J66q32j18J114j16j064q8P23L90j029k32N67N86l42k62
3373a82J75K32n55p20O97L43l89M3J61Q01m23j074O82L67l19r52K07R09J27j002
3393h72J65J033L61j363l13Q62L16j000p40R29J140p47l29L23Q44p65n83O98J41
$$ plain form
3247 -295 -358 226 201 -584 -827 -153 544 -156 -432 -33 756 -62 -729 -417 -319 -526 -845 -592 10 -115 -429
3268 -429 -142 -110 -361 -354 -553 -164 -397 -556 -258 129 35 -483 -450 359 3 -540 -513 -377 -90 -296 -470 -253
3290 -253 352 265 109 71 -371 116 -125 -300 -59 170 49 -150 88 184 551 87 183 -73 27 -219 -131 121
3312 121 641 225 -51 184 606 -81 -295 280 756 21 -121 326 716 834 -149 115 815 717 -145 -320
3332 -320 469 618 -145 287 531 1216 741 90 752 282 117 158 149 485 14 63 221 807 742 -410 -86
3353 -86 578 -6 -584 -115 355 521 -311 -429 685 569 -495 -583 140 530 -499 -731 -164 422 80 -182
3373 -182 -7 225 -330 -1050 -353 -10 -399 -356 -195 606 183 -891 -209 158 -161 -1113 -906 3 130 -872
3393 -872 -707 326 687 -676 -989 -127 189 -811 -1551 -622 518 -229 -558 -235 609 -156 -739 -41 100
3412A00k27n61J53R37k08p08K85O36L5j141L70N63l19l02j02J096N3q21l14R06
3432D31J03o47p32O80M37m56j52K69P86k56m72J70K24j89n09K51J13N34k79q5
3452B21J95K01n89k20O43k51j62j91N26K16K3m46K69J54j06k72k33M13J04m89
3472FJ74K08J67l02k71J48Q2k71o9J11q1m5QK19L23n05K90l01N95o60m99N95J0
3495f8k18m5K04M91J03o98n18Q21Np1l59Q3N60j43l89m9K59L76n90m37L08N39
3517A64n40k77N04J59om34M11j34N7n81K86J23o7l0%O59K0q38q7J161q06n45L6
3540g65Q04M0p42L55P17K13j041k53O85K24n46m46Q11J10J60n78L39M49r06j63
3560e33P66K55p56l31O31N61l77m16L38P31q16m97K99J031p27m87L96O69K7n28
$$ plain form
3412 100 -127 -688 -535 402 194 -514 -229 407 442 -699 -329 234 -85 -387 -489 607 660 -161 -475 431
3432 431 534 -113 -845 -165 272 -184 -336 -67 719 463 -9 161 385 196 -313 -62 51 585 306 221
3452 221 416 617 28 -192 451 200 38 -153 373 589 612 166 435 589 483 211 -22 391 495 6
3472 6 180 388 555 253 -18 130 212 -59 -128 -17 -98 -143 -135 84 407 -98 192 -109 486 -174 -673 -78 -68
3495 -68 -286 -331 -127 364 467 -231 -749 72 77 6 -353 -270 290 147 -242 -291 -32 344 -246 -683 -375 164
3517 164 -376 -653 -149 10 4 -430 -19 -153 -96 -677 -391 -268 -335 -365 -365 294 314 -524 -611 550 -256 -801 -765
3540 -765 39 79 -663 -308 409 622 -419 -672 13 237 -309 -755 56 166 326 -252 87 536 -370 -533
3560 -533 233 488 -268 -599 32 593 216 -200 138 869 53 -444 -145 886 159 -328 68 737 764 236
3580B36j04J87l69J89k28J44L20j81J45K50k24J3l19J86J48l84M1K19J97J01p44
3601a77J17O54L09j114o0N40j91Pn50L74Q93m84m99j10Q49m21o95O89N22p60m72
3622e79N36L75j16k39L25K20o91m06M98K76l76o16Q20L75l60l97N6M38o5n52j73
3643f51M9L45M4Lr5N5J68N3j46K8j96J93j77M29k89k51L55K50m46J58o1j56l20
3666f58J67J51M24k59L6r7n5M98l20l01J75K43j85j86J83N68k42K2j87rK26k04
3688a0j23P9q3K23K47k7l40K53K05j56m23N0J55m4J30m5J53J13j08O3J28n81K4
3711a17K37K86k86K78r8K51k68l93J35K55J15l43j60J20J68K7P2L55j97l22K9
3732A44J11l46M41l12O3J0m88N79K92j60k18k0J57j04l28J75J03J34n26K58J09
$$ plain form
3580 236 132 319 -50 139 -89 55 375 194 339 589 365 378 59 245 393 9 50 269 466 567 -177
3601 -177 -60 594 903 -211 -271 269 78 85 -465 -91 802 318 -181 -291 558 137 -558 131 653 -107 -579
3622 -579 -43 332 216 -23 302 522 -169 -575 -77 199 -177 -793 27 402 42 -355 -299 139 74 -478 -651
3643 -651 -602 -257 -213 -210 -305 -250 -82 -29 -175 -147 -343 -150 -327 102 -187 -438 -83 167 -279 -121 -182 -338 -658
3666 -658 -491 -340 84 -175 -139 -236 -291 207 -113 -414 -239 4 -181 -367 -184 384 142 164 -23 -32 194 -10
3688 -10 -133 -54 -137 86 333 306 -34 219 424 268 -155 -105 50 6 136 91 244 357 249 312 440 -141 -117
3711 -117 120 406 120 398 300 551 283 -110 25 280 395 52 -108 12 180 207 279 634 437 115 144
3732 144 255 -91 350 38 101 111 -377 202 494 334 116 96 253 149 -179 -4 99 233 -293 -35 74
3753G4P9l00k17R5J63j11N8K48j36J66l17K8N03n99J63k01J56j5j39J04M64j64
3775A02n42J7M40j45m72J78N97m71l58Q9R42kn21j49K76m5k19l96M75J04m63N03
3797f0K10r0l81k34O47j08m66r8O98j08l13J9N13K40m45o03K45M42k31l03J52
3818b74M17J00n49M21K82Q4m79l47M68O7l63J1J74L47j76j24M87J87n91l88L76
3839A30K01j78n2N5N66k68o64M33N57n44n09M9O49m54J07k11P12p6m08P5K31m62
3861f1l94M25J23J54l64K83N3J46m97j21O67m30k53K7K35M59o57J45J19K23k51
3882C1l92j3J41R2j51k14M03L91l54p2J18L6J6k68J24K47k84L0K81j76K51m67
3904b30P9k8r0j44o7K93J75j58k94N95k40j07q0K67j72k68J89j01K27m3j99L21
$$ plain form
3753 74 153 -147 -364 -269 -106 -217 -159 89 -47 119 -198 -170 333 -266 -103 -304 -148 -163 -302 -198 266 102
3775 102 -440 -423 17 -128 -600 -422 175 -296 -654 -565 377 375 -146 -295 -19 -64 -283 -679 -204 -100 -563 -60
3797 -60 150 60 -321 -555 92 -16 -482 -580 118 10 -303 -284 229 469 24 -579 -334 108 -123 -426 -274
3818 -274 143 243 -306 115 397 481 2 -345 123 190 -173 -162 12 359 183 59 546 733 142 -246 130
3839 130 331 153 101 156 722 454 -210 223 780 236 -273 -224 425 -29 78 -133 579 503 95 170 401 -61
3861 -61 -455 -30 93 247 -117 166 219 365 -132 -253 414 -16 -269 -242 -7 452 -205 -60 59 282 31
3882 31 -361 -374 -233 -141 -292 -506 -103 288 -66 -138 -20 16 32 -236 -112 135 -149 -119 162 -14 237 -230
3904 -230 -151 -179 -269 -413 -480 -187 -12 -170 -464 131 -109 -216 -296 -29 -201 -469 -280 -381 -154 -197 -396 -75
3926g5J15k98J31k70K18QO0j71K97K09j74k0l36K45k9p7j15M41r8j45r3N84o9
3949C38o31J96N13m90k77Q2L92L78m11j41J99j9P5n78L44M96l51j13m55Q81k25
3970B03k43LN30m84l0R6J78M8m04L61l3K43l26q7K30J15m39l37N21J08l85j47
3992b79O74K85m08l96M79J80l30o22L04M28k13k12j01P44P0o21ON28j82p42P6
4013c32M75J69l19k01M42K25q09j98N13L58n23l26O10J34l47O1M1J85j74p16L08
4034d24L25l30j02M9L44J59k80J47j40J81j79j55L41j15J9k35L54K53j86o25M76
4055a23L72k87n63K72O31k80m84k5P99P9n94j98N04m1m28m3K93M76n23K78J92
4076C07j2m10j28M60l9j64k91L00M83l96j86J22L15k17k89J88L45l80j95K43L61
$$ plain form
3926 -75 40 -258 -127 -397 -179 -171 -111 -282 15 224 50 30 -306 -61 -90 -167 -282 159 61 -84 -177 407 338
3949 338 -293 -97 416 -74 -351 -269 123 501 90 -51 148 129 204 -374 -30 466 115 2 -453 428 203
3970 203 -40 -37 493 9 -21 75 253 301 -103 258 225 468 142 55 285 400 -39 -376 145 253 -132 -279
3992 -279 395 680 272 -124 355 535 205 -417 -113 315 102 -110 -211 533 603 -18 -12 516 334 -408 -332
4013 -332 143 312 -7 -208 234 459 -350 -548 -35 323 -200 -526 84 218 -129 -68 -27 158 -16 -732 -424
4034 -424 -99 -429 -531 -482 -138 21 -259 -112 -252 -71 -250 -405 -64 -179 -160 -395 -41 212 26 -599 -123
4055 -123 249 -38 -601 -329 302 22 -462 -487 312 391 -203 -401 103 62 -366 -409 -116 360 -163 115 307
4076 307 295 -115 -243 217 178 14 -277 23 506 110 -76 46 361 144 -145 43 388 8 -187 56 417
4097D17J12l30J22l88K57j61j67K60K30j80K30p7r3J27q7j64o0L3M9j53K08j7
4119A68m1J30m5PK74m38K8K19k28l67J67N13j72m32J38L35j39l22j09N30j00k91
4141a75k32M73K71j97k96L6J25j89j62L3K04r0%k7M06n32K16j01M40m14j34J05
4163b40L64K7m75M3L95L16p38l9J90K29n65R8L50J24O7j46k11J79N4m56k26M72
4185a88r8J53lr3N57m78j85P47l86l19j69L46Q2J55p46O61L26o3o28K42M94n43
4207a36l27j3N89n2m10O39q2K84n69M2K78o2l51l2L48K33l67J54J39M7l00l44
4229b92M99N35q74k29O96K95l05m24M94q9j25m30j02N20L23l74k2K16K16n37J92
4250A83J18k28j6l47L95K85o89J68M92k63%j94j2j5j48m4J80K94k26jJ48J77K98
$$ plain form
4097 417 529 199 321 -67 190 29 -138 122 352 172 402 325 232 359 272 108 48 81 130 -23 185 168
4119 168 127 257 212 219 493 55 83 302 74 -293 -126 387 215 -217 -79 256 117 -205 -314 216 116 -175
4141 -175 -407 66 337 140 -156 -120 5 -184 -346 -313 -109 -199 -199 -226 180 -352 -136 -237 203 -211 -345 -240
4163 -240 124 151 -324 -281 114 430 -308 -347 -157 72 -493 -395 -45 79 146 0 -211 -32 22 -434 -660 -188
4185 -188 -286 -133 -136 -229 328 -150 -335 412 26 -293 -462 -116 -34 121 -625 36 362 299 -329 -87 407 -136
4207 -136 -463 -476 113 61 -349 290 208 492 -77 -35 243 181 -170 -202 146 379 12 166 305 352 52 -292
4229 -292 207 742 -132 -361 335 630 325 -99 395 306 181 -249 -351 169 492 118 96 312 528 -9 183
4250 183 301 73 57 -290 105 390 -299 -131 361 98 98 -96 -108 -123 -271 -315 -135 159 -67 -68 80 257 555
4273E55r43J37QK74l85J29J77J35n8q4K1j97j45j8J34K89l81L44r3M18l29j6K51
4296B23j54Q2m82j24J78K49k78j84L96k13j32JK40K82m04l0J35J77K1l19L66q5
4318e5Q0l08M2K38k28K64k75L84l16o5N43n7l15K10j64o8M6r5Q7M1J07j37J67
4341A26j62K6L10k87k4M3qm3j89K43L88j26n10o7L09K81l37j78M57J55m58J4J91
4364A54L89p74L73m0R9k56J12K17L51n36j46L60J89o14n48Q14r7Q0n53O10J6j91
4386Iq4M60j15k18m48Q3N77K60n06K4j75K88k7k90J55k05J31j17L86l9r8l30N60
4409B81k40l25k46L07K86k05j55j89M70j18q0j84R47k76j020L95M91m85j73K13
4429c06L12P3k28O2O6j87k46L6N63J5o69K24L61j93j18k22K69O67q36k2R9M69
$$ plain form
4273 555 -388 -251 -243 31 -354 -225 -48 87 29 -55 -34 -231 -376 -394 -260 29 -352 -8 -101 317 -12 -28 223
4296 223 69 151 -331 -455 -277 -28 -306 -490 -94 -307 -439 -438 -198 84 -320 -350 -215 -38 -17 -336 30 -55
4318 -55 25 -283 -241 -3 -231 33 -242 142 -174 -239 304 247 -68 142 -22 -90 -44 -139 -52 -11 96 -41 126
4341 126 -36 -10 300 13 -11 32 24 -19 -208 35 423 297 -213 -280 29 310 -27 -205 252 407 -51 -37 154
4364 154 543 -231 142 102 201 -55 57 274 625 89 -57 303 492 -122 -670 144 47 127 -426 184 200 9
4386 9 -75 385 270 52 -396 -313 264 524 18 42 -133 155 128 -162 -7 -212 -81 -198 188 149 51 -279 281
4409 281 41 -284 -530 -223 63 -142 -297 -486 -16 -134 -214 -398 549 273 -747 -352 139 -346 -519 -306
4429 -306 6 79 -149 -87 -21 -208 -454 -418 145 160 -509 -285 76 -117 -235 -457 -188 479 -357 -379 -280 189
4451A89p0l21J91J90O1l43k18M36k32lm4p9o7L41QM9J67l86m2M06l23p5M0L18
4475A93L09l62k73K71J41o5j53J06J8O5j22R5L7q7n8q7O6K27o8j55l43M64L0o7
4499A82M26n73K90O8k55k5k90P1PK99j19M5k30J81L22j88k99J08k4O9j90J44J64
4522A83n1m0j02Q6M47p07j37K76o7l22J82L29j57k12N8K46J53L2o8k66R3l35K04
4545a75P0J18K62n15M25J72n73q2rL68k27j1k29K17J74k00k4k4N04m40r6J07J53
4568c5m2j43J52J75j4l84j31J63K25n9J15L97k78k46k97N97R8o78M31J96j21n11
4590c90O4J67N54l90j10K22K96n10j97lN68k27J54J26N2l49J31j97K32N9m4r6
4612A12K01J13n63O05j46q8j80j16J98j64J86K47j45j50k1N7R2k62M5m70N05L7
$$ plain form
4451 189 119 -202 -11 179 240 -103 -321 115 -117 -120 -164 -243 -310 31 39 88 255 -131 -173 233 -90 -165 -125 193
4475 193 502 140 -133 138 279 214 61 167 185 250 128 223 260 173 115 28 94 321 253 98 -245 219 249 182
4499 182 608 35 325 393 138 113 -177 -106 -99 200 81 126 -104 77 399 211 -88 20 -4 65 -125 19 183
4522 183 132 92 -10 76 523 -184 -321 -45 -112 -434 -252 77 -80 -292 -234 12 165 197 129 -137 -44 -379 -175
4545 -175 -105 13 275 -240 185 357 -216 -298 -307 61 -166 -177 -406 -189 -15 -215 -239 -263 241 -199 -295 -188 -35
4568 -35 -77 -220 -68 107 93 -291 -422 -259 -34 -93 22 419 141 -105 -402 195 293 -385 46 242 121 -390
4590 -390 -326 -159 395 5 -105 117 413 -97 -294 -297 271 44 198 324 376 27 158 -39 193 252 208 112
4612 112 313 426 -137 468 322 234 54 -62 136 -28 158 405 260 110 89 146 238 -24 21 -449 56 93
4634I3r5QM0K26k4j84r2K78k04k21j36O60l03o9q7L86k11j34j7K03J23m75p5K09
4658a01J35j01mj7N09l88k75R2Kl41J11J56M62o45M41p9J35k03k49N04K7m76J71
4681a34k8K35k34k9N00j31q6k16N6j23L67n68J30J63J96m73L61j88r9L04n4j86
4703b37K29L7l36Q2J80K08j80J5Q1j79K01j42K61m04J28K49l16J99j84mJ54j90
4725a48l8M96m36K90L2j24j58oL14m41N07m28L14j7j13l1J61P0j10n6j32K2L0
4748bK4n7K47j95J01L24j10o5k35K57j74j30j35O6J26p9M26l79J67O7k48M02l19
4771G9J33m24pL20j87L1R9o9J34k02m8L0J5J80j1m4q5o4K34j34k23L04j64J61
4795E8k48J42n75M77L53j03j20k53M45r4k14j95J45K45k14J9l7J74J71k36J48
$$ plain form
4634 93 -2 6 46 272 248 64 -28 250 46 -175 -311 349 46 -23 -110 276 65 -69 -86 117 240 -235 -310 -101
4658 -101 34 -67 -71 -88 421 33 -242 -150 -148 -489 -378 -222 240 -405 36 -43 92 -111 -360 144 171 -305 -134
4681 -134 -162 73 -161 -190 310 179 93 -123 -67 -190 177 -391 -261 -98 98 -375 -14 -202 -301 3 -51 -237
4703 -237 -8 29 -307 -225 -45 163 -17 -2 79 -100 101 -41 220 -184 -56 193 -123 76 -108 -112 42 -148
4725 -148 -186 310 -126 164 196 72 -86 -92 222 -219 288 -140 174 157 44 13 174 244 134 78 -54 -32 -2
4748 -2 22 -35 212 17 118 442 332 267 32 289 115 -15 -150 -84 42 -37 389 10 177 244 -4 398 79
4771 79 212 -212 -219 101 -86 -55 44 -25 109 -93 -141 -111 -96 84 73 29 -56 -120 114 -20 -243 61 -103 58
4795 58 -190 -48 -623 -146 207 104 -16 -269 176 82 -132 -327 -182 63 -151 -132 -169 5 176 -60 88
4816H8J9j33n45M65J13k23J54K8J22l4N1k77M60m03j88L74l27K65N4k21K37l42
4838b63PJ05j19P9K13m21K60K52J23l52J93R3l4k45l5J65j67j28M84J03o1Oj92
4861F6J24k61O0j57N17j05n0k60M14K52k25j64n6P6m12J55K6N22k79J16l78K14
4883A95J40J03m47J72R9o73N0O72k27k74J60M27m14p3j39L53J01l98k8K64K12
4904B75k61J96k36J66l86J75K71k64j10J24M4m3J23j34J36j9k55J7q3J33k3l1
4926a85K90J3j5o5o9m11N86m00J28k59O48m57J81j29L72m11j38K85l1P0K2n32
4948e07L10K21l67J34q9p2L36j17j29n7K42J32k49J42j64J32K55P5k33k87K54
4969c8P7J02k00K84R0r0k56k84J53J99k23j08J35N0K37l02J86J10J0kO0n31J93
$$ plain form
4816 88 107 -26 -571 -106 7 -216 -62 -34 88 54 105 -172 288 -115 -303 71 -256 9 63 -158 79 -263
4838 -263 -256 -151 -270 -191 22 -399 -139 113 236 -116 77 170 136 -109 -144 21 -146 -274 210 313 252 258 66
4861 66 190 -71 -11 -168 349 244 194 -66 348 600 375 211 155 231 -181 -26 0 522 243 359 -19 195
4883 195 335 438 -9 163 262 -411 -361 311 84 -190 -30 397 -17 -90 -229 124 225 -173 -201 63 275
4904 275 14 210 -26 140 -246 -71 200 -64 -174 -50 -6 -49 74 -60 76 57 -198 -181 -264 -131 -154 -185
4926 -185 105 118 103 38 -31 -442 144 -256 -128 -387 261 -196 -15 -144 228 -183 -321 -36 -67 3 25 -507
4948 -507 -197 24 -343 -209 -298 -370 -34 -151 -280 -337 -95 37 -212 -70 -234 -102 153 228 -5 -292 -38
4969 -38 39 141 -59 225 315 225 -31 -315 -162 37 -186 -294 -159 -109 128 -174 12 122 132 130 190 -341 -148
4992a48P9q6M43N7j56p4j95K80k47oK61M1l21Q0l5K54J37n28L0M67m13J83k70
5015a67L76q2l49J79K03L38m29k32L16J73m24M8M40J1m26K59n1j53r5k21L38L23
5037C75n67R2j69M60j5l74k50O19j59j24m9L38N6k05m07M59J07j79j65l8O9j12
5059b38k22K08m6N90m85K21J07l77L25k30M20l07k0r3J7Jk01L43K97K08q69j57
5081e08M52j75J25R7j1N1k04j52N71j2k28m2L3K20r1k86L40p4k14K67o9j46pp6
5105a39j13J16J43l18L96Q8m79L79k66n7L64j58j7j18K19j92L40j64J83k61L47
5126B93n27K95j09j70K60O0j85R6R2M5l9l43J44K1L91m13L89r1L18n18k47M37
5148A99j7j09j45J91k16L82m13J00j70L40M27n02p0L17k92J47j62j36K48j91j08
$$ plain form
4992 -148 -69 -155 288 345 189 115 -80 200 -47 -53 208 249 -72 8 -27 227 364 -164 -134 333 -80 103 -167
5015 -167 209 127 -222 -43 160 498 69 -163 153 326 -98 -50 390 401 -25 234 183 30 -65 -286 52 375
5037 375 -192 -100 -269 191 176 -198 -448 171 12 -112 -161 177 233 28 -379 80 187 8 -157 -195 -126 -238
5059 -238 -460 -252 -298 292 -193 28 135 -242 83 -147 273 -34 -54 -147 -130 -129 -330 13 310 518 -351 -508
5081 -508 -56 -231 -106 -9 -20 31 -173 -325 246 234 6 -36 -3 217 126 -160 180 106 -108 159 90 -56 -63 -139
5105 -139 -252 -136 7 -311 85 173 -306 73 -193 -250 114 -44 -61 -179 40 -152 188 24 207 -54 293
5126 293 -234 61 -48 -218 42 102 -83 13 105 150 111 -232 -88 -67 324 -89 300 209 527 9 -238 199
5148 199 182 73 -72 119 -97 285 -128 -28 -198 142 569 67 -3 314 22 169 7 -129 119 -72 -180
5169a80M69J34k67l14K17J07q0j29J29O2l82Q9K7rJ45M2p9N3m22P9m7L95K67n16
5193b10j32M28m2m82M0L88J29p2k03j91L37n4J62k53M66m69L43k57L73k24j52
5214g5nL08m11o7K0L50J75l76q0J99j09j12J39j1L74k20r1qR3j39J47J24mk46
5238b5r1L40k99J8o0j5K85J77n33K40L23j82j93K50lQ5n54R9M66J1n57J38K90
5261B10N4J56k79j19N2n7l45K83J56k0J81k71L12j05o70O00j12m2k9p8J04J57
5283A38r6L5q9Q7k44J1O9K71l21Q8Mj01J22j54J54O5j28L0Q9j08Q2k32M22l37
5307a43K20j78K59l8j98n43N44o8K06J08j52P0j54J87o0k40L9p6r9N18j89j86
5329a73J88k60M37r4l40J17Q1k87L87j55J46j87L3j50O6jJ71L3k55K03j4j20K29
$$ plain form
5169 -180 289 423 156 -158 59 166 86 -43 86 148 -234 -145 -118 -127 18 60 -19 34 -388 -309 -356 39 306 -210
5193 -210 -342 86 44 -438 -398 -10 119 47 -156 -347 -10 -64 98 -155 311 -158 185 -72 301 77 -75
5214 -75 -80 228 -183 -250 -230 120 295 -81 -161 38 -71 -183 -44 -55 319 99 8 0 93 -46 101 225 221 -25
5238 -25 -116 224 -75 -57 -117 -132 153 330 -203 37 360 178 -15 235 232 317 -237 -138 328 339 -218 -80 210
5261 210 264 420 141 22 74 17 -328 -45 111 91 272 1 313 208 -462 138 26 -16 -45 -123 -19 138
5283 138 42 77 -12 75 -169 -158 -89 182 -139 -51 -47 -148 -26 -180 -26 39 -89 -59 30 -78 4 -228 194 -143
5307 -143 77 -101 158 120 -78 -621 -77 -145 61 169 17 87 -67 120 60 -180 -141 -217 -316 202 13 -173
5329 -173 15 -245 192 98 -242 -125 -44 -331 56 -99 47 -140 -107 -257 -191 -192 -21 12 -243 -40 -54 -174 55
5352E5R5j91J65j48k03M98l29J5J39l36Q2O2J62K50j81k57K19J82l7m40M6J93
5374D1K43l26J40K26j16R4m08nL83o36M00m1L01l04j6M2K17m42J88mj24L60k10
5397CL8K72p6j3k38J11J00k25k21K35J85k14o7M66j99O9R3l55J26l34N7L08l9
5420H2j17J73J10O2J77o18R0j4k87J86k7K00m3K55k08R9j90n1L8k31K41k64K32
5443a05j41J97j26P1k07J1J98j14K79o6R5l9j90K27J7l17K38o7M38o81k09M55
5465c6l74L30j5K43l60J50j59M49j49j52k44L56j0K52L0o57M56O7l72J88L86n12
5487a33K88j14J51l67l7L05K68n00j66N92k91J47l59J63K2J63k0k20J67qJ0k25
5509a64K79j17Q3K10j50j38j8K22qP4l44K65P0l7k98j1M9J47k03N8O8P2l8k61
$$ plain form
5352 55 150 -41 124 -24 -227 271 -58 -43 96 -240 -158 -96 66 316 135 -122 97 279 242 -198 -152 41
5374 41 284 -42 98 324 208 302 -106 -111 272 -364 36 -5 296 -8 -24 18 235 -207 -19 -23 -147 213 3
5397 3 41 313 237 224 -14 97 197 -28 -249 -14 171 -43 -110 356 157 226 319 -36 90 -244 -187 121 82
5420 82 -35 138 248 310 487 -131 -41 -55 -342 -156 -183 17 -26 229 21 120 -70 -121 -83 -314 -73 -337 -105
5443 -105 -246 -49 -175 -104 -311 -300 -102 -216 63 -3 92 53 -137 90 107 -210 28 -39 399 -282 -491 -36
5465 -36 -410 -80 -95 148 -212 -62 -221 228 79 -73 -317 39 29 281 311 -346 110 177 -195 -7 379 -133
5487 -133 155 41 192 -175 -212 93 361 -139 -305 287 -4 143 -216 -53 -31 132 112 -108 59 51 61 -164
5509 -164 115 -2 81 291 141 3 -15 207 199 273 -71 194 264 227 -71 -82 -33 114 -89 -31 37 109 71 -190
5533a90R7K09k5Nk38K50J39j77J00j8nJ4j51k34L23q4J36k12J6R7J8m6M3k65J76
5558b2r1M00l10K39m14K24K3k52k68M69J81k53j87M55M0m4k39j02K76o8l61k0
5580c24j9R2K02Qk19J58P3j84n4K0K22k70L66No0n8L26k27j87n5r3K27m3k19L48
5605C5J7K28l4m40L59l3k07P0k1j26K33j21j15K70J45l38Q3j60O6k80K76m3N2
5628h4J12K22m5M0k04P9M4n04k0K62O90k45j86o4o9R9R1j09k33K47O7l93M25j58
5652F4J68k3j17L2m2j82j16N64j50m63M34j69p2Oq5M32l23J85J52k8j94k6j79
5675a32M2K57k52l6K8M3O2k05Q0L35q5j68j22J86L5K39k46k9j57K92m80K46J25
5698E8k05K8J55J0R1l10K18l5q3k08K1L31j36r3K13j32l9j6OJ34j91k51R5M65
$$ plain form
5533 -190 -93 116 91 96 -142 108 247 70 170 152 147 161 10 -224 99 15 151 -61 -45 52 70 24 67 -198 -22
5558 -22 -113 287 -23 216 -198 26 49 -203 -471 -2 179 -74 -261 194 234 190 -49 -151 125 57 -304 -324
5580 -324 -343 -251 -49 -41 -260 -102 -29 -213 -267 -247 -25 -295 71 76 16 -42 284 57 -130 -185 -278 -51 -94 -313 35
5605 35 52 280 246 -194 165 132 -75 -5 -26 -152 81 -40 -155 115 260 -78 5 -155 -89 -369 -93 -136 -84
5628 -84 28 250 205 245 41 120 164 -340 -360 -98 592 347 161 97 28 127 218 109 -124 123 190 -203 222 64
5652 64 232 209 92 124 82 -100 -216 348 198 -265 169 0 -72 -66 -151 281 -42 143 295 267 73 47 -132
5675 -132 -90 167 -85 -121 -93 -50 12 -193 -113 222 137 -31 -153 33 68 307 61 32 -125 167 -313 -67 58
5698 58 -147 -119 36 46 137 -173 45 10 -73 -281 -260 71 -65 -158 55 -77 -116 -132 -126 8 -183 -434 -339 126
5722A26K95l41l55J32j63J03N3L68n32K32p1K10k41L9n8K72j42n0o9N13n10k73
5744d62O01J3j37q8l32J55M09k04K42k92n7N2J14L95p22M85M9l77n7k1L70k12
5766g6m4K34J61j95l5K88k10K7l28o6J69jJ3n2M04J16l78N0j7j27J66l69M06N0
5790A86k70K33L64n47j5K93J32m43K59k86M4QK37j09j44L27m93L22j11j52N08
5811C43l29p8J98J18k87K85r5j36P3m63L80p9n2M8J79j00j79q6K57j35P0l4j66
5834b68K30M0k05l15M85J23j3j36J16l19O6M4J27L01n80K72Q2J20m09R5J19R2
5856F7j51M7j81K62N9q1l05J13K47Rj19O4J55l00J00p4J13j92K8J77lm31K76J17
5880cj8q7J14M2o5j72l0M87J30k04l33Q2L14j56L4p3k78P6j69O90n43K05n0K3
$$ plain form
5722 126 421 80 -275 -143 -306 -203 -150 218 -314 -82 -153 57 -184 -145 -203 69 -73 -123 -192 321 -189 -462
5744 -462 139 152 15 -73 -405 -250 159 -45 197 -95 -152 -100 14 409 -313 172 221 -156 -213 -234 136 -76
5766 -76 -120 114 275 80 45 333 123 150 -178 -244 -75 -76 -63 -115 289 405 27 77 60 -67 99 -270 136 186
5790 186 -84 149 513 -34 -49 244 376 -67 192 -94 -50 -42 195 86 -58 269 -224 98 -13 -165 343
5811 343 14 -64 134 252 -35 250 155 19 92 -371 9 -70 -122 -74 105 5 -174 -260 -3 -138 -68 -102 -268
5834 -268 -38 2 -203 -518 -33 90 77 -59 57 -262 -196 -152 -25 276 -304 -32 50 170 -239 -144 -25 67
5856 67 -84 -37 -218 44 103 22 -283 -170 77 86 -33 31 186 -114 -14 -88 25 -167 -139 38 35 -396 -120 -3
5880 -3 -21 -108 6 48 -17 -189 -219 268 398 194 -139 -57 257 101 135 62 -216 -140 -309 381 -162 43 -7 16
5904A6Om2J12k53M3K94j35q6K17l11M9J0K77J27l55k2J91j9m8J06j75K9J0k45
5928b04J94K8J63m03N81m66k45L91oJ39l23K61Q8N2l02N7m82L60N68l21j95K04
5950A39k18Q8k34K71pL7j10K28l26K43j18r0K05k12P2j23J66M9m34O6J19j62J82
5973a69J67k39K14J3J32j15l92L95J45m2j70k49K05K51J34j92r9n54M43J18j08
5994a12J59k35M59k21K1j18KK07m15M64k59J54N3l48J99J06r9L37m01J59p6l39
6016c03N13k24m6N1j20mR2j41n0K61K7k77M42j69K29j22m65K45L04l39O0J71j98
6039f3P1j1L2j9K10j05K78k98r8J05k97R0lk57O32l98q8K96l38N80o11K51J51
6062A10j44J03k51P6K4K4L6j47J24J61j48M6R7j23J25M1k50M1L2J11m42L49l59
$$ plain form
5904 16 22 -20 92 -161 -118 176 41 -45 172 -139 -90 -80 197 324 -31 -53 138 119 71 177 2 31 41 -204
5928 -204 -10 18 181 -222 359 -107 -352 39 33 172 -151 110 198 250 -52 5 -477 -117 451 130 -65 139
5950 139 -79 9 -225 46 39 76 -34 194 -132 111 -7 -97 108 -104 -32 -155 11 60 -374 -308 -189 -351 -169
5973 -169 -2 -241 -27 -14 118 3 -389 6 151 109 -61 -310 -105 146 280 88 -11 -565 -122 -4 -112
5994 -112 47 -188 271 50 71 -47 -45 162 -253 211 -48 106 159 -189 10 116 17 354 -47 112 36 -303
6016 -303 210 -14 -60 -9 -129 -133 -41 -182 -232 29 56 -221 221 52 281 159 -306 -61 243 -96 -36 135 -63
6039 -63 8 -3 29 10 220 115 393 95 -3 102 -195 -105 -108 -365 267 -131 -219 77 -261 319 -292 -41 110
6062 110 -34 69 -182 -106 -82 -58 -22 -169 -45 116 -32 14 111 -12 113 154 -96 -55 -23 88 -354 -5 -364
6085c64L12pK11l19nJ72K1L95o72K32j82L34J11l94j01K88J90l75m3k0k04J73
6107b47J76j52M7J78q2J47n3L3j73L06j03j85j02J88J81m06K65L06m30j27J79
6128e4K21J4k44L07l02J3J11K47o43M40mj30j44Q0j39L5J79o8N3K22j83J73j19
6151F5p8K37l16M4r6J94j33K45k19j43J34P6K6P3j30K09m1j58rK17k34n2M58m25
6175e6N50o00k69L28K62k64q7L94q3l30L90l79P6J35m16k4M26J62l06J29j68K33
6197A03J23m51r8L17J01l69K99P5l41j0J42J05K29j24l74K66k17J53j12rJ78J06
6219I2K6o2o9q9j10K62m4J40k05l2L6j43j76L52k49J44J43k12M50k72k09lj00
6242c30L67j15j90L35k40n4O9J66J06j54n2K28q5k42O7J92M5l95J76L71j45m65
$$ plain form
6085 -364 -52 -59 152 -167 -172 0 21 416 -256 -24 -206 128 239 -155 -256 32 222 -153 -196 -216 -420 -247
6107 -247 -71 -223 -176 2 -80 67 14 47 -126 180 77 -108 -210 -22 159 -247 18 324 -106 -233 -54
6128 -54 167 181 -63 244 -58 -45 66 313 -330 110 106 -24 -168 -88 -227 -192 -13 -81 -28 194 11 184 65
6151 65 -13 224 -92 -48 -144 50 -83 162 -57 -200 -66 10 36 109 -21 188 147 -11 -20 197 -37 -89 369 -56
6175 -56 494 -106 -375 -47 215 -49 -136 258 175 -155 235 -144 -68 67 -349 -373 53 215 -91 38 -130 103
6197 103 226 -225 -323 -6 95 -274 25 100 -241 -251 -109 -4 225 101 -273 -7 -224 -71 -183 -192 -14 92
6219 92 118 56 -13 -102 -212 50 6 146 -59 -91 -55 -198 -374 -22 -271 -127 16 -196 254 -18 -227 -230 -330
6242 -330 37 -78 -268 67 -173 -227 -158 8 114 -40 -92 136 51 -191 -124 68 113 -282 -106 265 120 -345
6264c45M54J21N4l45k76L49nK08q1m02M30K14l00k25k22O19k62q8K37J11N2l02
6286dp9J08l3J73P0k18J63l51R9K51L5k89L69l31L84j92j73R8J24n17M58k44J12
6309A3J15l50L02K3J68o09L63P0k06M6K60j06J02j78Rr6J48r6J5j19O7p6Q1J31
6333G7J7k4n1j70K23j2N4k53PK31k04J36Q0j61j09K50k80l9M76l00M45l69m07
6356c83J73L35J16m84j05L70j10J65N6k60j1j82K53K16j87j06P9L64j35n5k17
6377a08N9K9N21n89K17R1l37k37N74j81j53O9j74K53O3j93J97K7l55Q8p5K68m4
6400A0k03M52j49l6qj5J4k7jj88J58m01O68m61K57n3K88k68k01K68l06J26L0K38
6424A92l54L77j71L4P8k24J37K98l86r5J27Jn6J6NJM3K22ml99L86m77J62j08K34
$$ plain form
6264 -345 109 230 284 -61 -337 12 7 215 134 -268 162 376 76 -149 -371 248 -14 -102 135 246 298 -4
6286 -4 -83 25 -8 165 235 17 180 -171 -72 179 214 -75 294 -37 347 155 -18 80 204 -313 145 -99 13
6309 13 128 -222 80 103 271 -338 25 95 -111 -65 195 89 191 13 22 -74 74 -22 -7 -126 -59 -135 -54 77
6333 77 94 70 19 -151 72 60 114 -139 -132 99 -105 31 111 -50 -159 91 -189 -228 248 -52 393 24 -383
6356 -383 -210 125 241 -243 -348 22 -88 77 133 -127 -138 -320 -67 149 -38 -144 -65 299 164 109 -108
6377 -108 -49 -20 501 -88 129 220 -117 -354 220 39 -114 -45 -219 34 97 -96 101 128 -227 -139 -214 54 10
6400 10 -193 259 110 74 66 51 65 38 37 -151 7 -394 274 -187 70 17 305 37 -164 104 -202 -76 -46 192
6424 192 -162 215 44 78 156 -68 69 367 -19 -114 13 14 -42 -26 -21 -20 23 245 241 -158 228 -249 -87 -195 39
6449C9J35l27j25O36m5m07%N0K11J54p30L55R4j39K95m61L87j44j21m8o1J28J1
6472a13R8J58r5j56r0K6J90k30K49l38K11J5J62m96K95K46n2J88j06m86N29j34
6494G1k18L09k01k4J1M3K5k2L49k37j29p5J61k0j18O2k82J1Q9J80P4j21J95k90
6518a57r2M20q4J62j69j0mJ38l23J49K25k98j2j48L57L6l59M7J01R0j17j15J67
6541Dj07J44k0n6J09J57j99M6J23q7Mj37M58o37J32j64L26j14O0j0J89k04L7j65
6565a11l1j61K27Q4j8n7K39jn8n4j31J7K60k01k83K22r9K74j36J19k5J46n13L29
6589C8K02j79K49n15L47l8k68J35p3k57J67K51m1j83J6O6m1J81j98M38k45J33
6611A85j19K3J8j23l41M33K4m24J19j89J60K54K89l79j31M25p61L72K92k69M0
$$ plain form
6449 39 174 -153 -278 358 313 -94 -94 -44 167 321 -409 -54 40 -99 196 -265 122 -22 -143 -191 -252 -124 -113
6472 -113 -15 143 48 -108 -198 -172 18 -212 37 -301 -90 -75 87 -409 -114 132 80 268 162 -324 205 71
6494 71 -147 162 -39 -63 -52 -9 16 -6 343 106 -23 -98 63 43 -75 -13 -295 -284 -195 -15 59 -62 133 -157
6518 -157 -249 171 87 249 80 70 66 204 -119 30 255 -43 -55 -203 154 190 -169 -122 -21 69 -48 -163 4
6541 4 -103 41 21 -35 74 231 32 78 201 114 118 -19 439 -198 -66 -230 96 -18 42 32 221 17 54 -111
6565 -111 -142 -303 -76 8 -10 -67 172 171 113 59 -72 -55 205 4 -279 -57 -156 118 -18 101 76 222 -291 38
6589 38 240 61 310 -205 142 104 -164 -29 -102 -359 -192 59 18 -165 -149 -83 -124 57 -141 297 52 185
6611 185 66 89 107 -16 -357 76 100 -324 -205 -394 -234 20 309 -70 -201 224 -537 -165 127 -142 -102
6632a02L50k98k87M73l28L15l06J5K1J77q0j88J56j47K24j71Q4J08J17j0j29r3
6654i9n0K45j84J89Q2j49J01j33m6N9Qk5Q8j70K38M4k49k7Q7J26j65P8L32k20
6678A60j99m0j28M70k40L02n44J96L40k20k97K40M0J64j69k5K52k06k24K18K2
6699A12k66L31k23O6L28m76k5R5j65Q1j04L90j80J13K9k31L30l02K11R7l31M5
6721g5J86k07j5j6K40j12j32L4m4L99q4k34n3k4K00J90o42O15k45N0J46n34M28
6744G1j01m20M37p1J25j20r0M41j54j56N4K00j38o4j9J72J44k93om27M52M7l80
6767b96J40K10j37j17p1L69k31K72k67P6M7K56l17O9K18m05J97q7m6K5mL37j79
6790E9q6J64l9k85K02r7k1J41M4J51j03Q9j71k94L28J23o4rM6j38J16q9n5j69
$$ plain form
6632 -102 248 -50 -337 136 -192 123 -183 -168 -147 30 -50 -238 -82 -229 -5 -176 -92 16 133 123 -6 -99
6654 -99 -149 96 -88 101 183 34 135 2 -44 15 23 -2 86 -84 154 198 -51 -78 9 135 -30 48 380 160
6678 160 -39 -79 -207 263 23 325 -219 -23 317 97 -200 40 80 244 75 50 302 96 -128 90 112
6699 112 -154 177 -46 20 348 -128 -153 -58 -223 -142 -246 144 -36 77 106 -125 205 -97 114 211 -120 -75
6721 -75 111 -96 -111 -127 113 1 -131 -97 -141 258 174 -60 -113 -137 63 253 -389 226 -19 31 177 -357 71
6744 71 -30 -450 -13 -84 41 -79 -169 272 118 -38 16 216 78 14 -5 167 311 18 12 -415 37 84 -296
6767 -296 -156 54 -83 -200 -271 98 -133 139 -128 -52 -5 251 -66 3 221 -184 13 -74 -120 -95 -99 238 59
6790 59 -27 137 98 -187 15 -82 -103 38 82 233 130 219 48 -246 82 205 141 132 178 40 156 67 12 -157
6814a57K9K72r9k20r0L34j01J07r6o9J08J81j42N3q3K23r3k25M3k68M27O2l83
6837a87L22J38l25K18l21J66J1j33K1k05R9j75M07k40l3N64l37K79k10K47k18
6858H8r1r4PL8J8lM6P8j78j51M1J13K36p4rJ66P8j88l01L12p3k28k37J06M15M2
6884A57rl09l9k6J85j01L19l27j77M03L8j27k48K39pk45J80J05J05j11M9j10j00
6907a56J01m3J63j28n9m8n7L24j92L10k40k04J89J15p8J81k14k53M37k92J17L15
6929B88l95k33M13n9N0r2K9m0k36J61P0Q3j84M34j92N6p8n0K02k08p4lL22m34
6953a70K62j40L6K72j09k32L3J11k75O1O9k19K56J27j80K51j05%m0Q6m0k21L6
6976a31j27N51l02J31k43j00K99j93M2L23k93K72j34r5k61L34j92J99j96J7J17
$$ plain form
6814 -157 -128 144 45 -175 -265 69 -32 75 -21 -90 18 199 57 110 27 250 157 -68 -25 -293 134 196 -187
6837 -187 135 273 -52 166 -155 11 22 -111 -90 -295 -196 -371 36 -204 -237 327 -10 269 59 306 88
6858 88 -3 -97 -90 -52 -34 -37 9 87 -91 -242 -201 -88 148 74 65 231 309 121 -180 132 59 -169 -406 -300 115 157
6884 157 148 -161 -200 -226 -41 -142 177 -150 -327 76 114 -13 -261 -22 -29 -274 -94 11 116 5 54 -56 -156
6907 -156 -55 -98 65 -63 -122 -170 -227 97 -95 215 -25 -229 -40 75 -3 178 -36 -289 148 -144 -27 288
6929 288 -107 -340 73 14 64 -28 1 -39 -275 -114 -44 39 -145 289 97 153 75 25 227 19 -55 -58 264 -170
6953 -170 92 -48 -12 260 151 -81 -48 63 -212 -151 -82 -301 -45 82 -98 153 48 48 8 94 54 -167 -131
6976 -131 -258 293 -9 122 -121 -221 78 -115 -73 250 -43 229 95 0 -261 73 -119 80 -116 -99 18
6997A8l2j87J55R2J9Nl19J60J27j37j36J50j89O19l59K08j97J47j3k26J24Jo6
7020c6l88J69K03j11L59j33j97K17k09J92J3l9n3Q2j36J79K25j99k89K77Kk45
7042a17Q8NK83l99nL78l64K9K6M79o71j81M81j63L00J48q8k7k48l1j74K23K32
7065B04kj59K44j38m42N03k34PM4k3J29l9k3J43j79j16P6j50K19j76K30l58J57
7088h3L74k61j84%K48k11P4j9O4J27k36K21jQ1O4k60j37L06L8l04L47k16j26o6
7112a60RQ3J31J65j58j91K16k40M9J22n6j45K97k01J07l21J74J85k47J67j59K2
7134a51L85j79Q8O4j36j60j48j19K16Q7j22L57k20Qn5K1M1L0J79k08K41l30K07
7157I6Q2k0Q3j82o4J5l38L80n5K87k69m6J84j4k70L27p4L7j35j55Q4Q0r3J51k40
$$ plain form
6997 18 -14 -201 -46 46 65 70 -249 -89 38 -99 -235 -85 -274 345 -14 194 -3 144 131 -95 29 30 -36
7020 -36 -424 -255 -52 -163 196 63 -134 83 -126 66 79 40 -13 69 -67 112 337 138 -151 126 128 -117
7042 -117 -29 -24 259 -140 -145 233 -131 -102 -76 403 -268 -449 32 -131 169 317 229 202 -46 -77 -251 -28 204
7065 204 202 43 287 149 -293 210 -24 -17 27 4 133 94 71 214 35 -81 -5 -155 64 -112 118 -240 -83
7088 -83 291 30 -154 -154 94 -117 -43 -62 2 129 -107 114 113 194 258 -2 -139 167 205 -99 248 32 -94 -160
7112 -160 -151 -68 63 228 70 -121 95 -145 -96 26 -30 -175 122 -79 28 -293 -119 66 -181 -14 -173 -151
7134 -151 234 55 143 207 71 -89 -237 -356 -140 -53 -175 182 -38 -30 -85 -64 -23 7 186 -22 219 -111 96
7157 96 178 158 241 59 -5 10 -328 52 -3 284 15 -31 153 139 -131 196 122 159 24 -131 -47 33 -60 91 -149
7182a49J63J77m54M99r5l38K61l9J3k42O2L95k15k51L63n4j59L39n14L59l0k24
7204a33J79Oj41J91L6n6k9j64J27p4%L39k30q5K44l24K70K98k07j25j58j5l02
7227c53L59j62N94o08K46m06K57j06O7K03j09k19J18l88O56k88K17j77j63K17
7247d5k19P8Q6j74p6L06J16j1N8k05k49R8K66k19O2N8o1J16Q5l20K08J52j18k5
7271c3l90M15J41j03O4P3k78p6K60L8n8m4J54O7k96p2K45J34j09l63M12j20K52
7294C13k10p6K05l19p4J24K64k57O9l31L36J35j76L31m42K21q2k2q3L36j25Q7
7316B24o48N75j27J10K0k07K29j71O5k26J78K32k98J70j43j96K26j05K0p1J40
7337cK26r9M7n23K14M03k66m0J38p0j05R7k02K99k48J24N2o8J13Jl10L72k38p5
$$ plain form
7182 -149 14 191 -263 236 141 -197 64 25 38 -204 -142 253 38 -213 150 96 -63 276 -238 121 91 -133
7204 -133 46 52 -89 102 138 82 53 -111 16 -58 -58 281 51 -34 210 -114 156 454 247 122 -36 -51 -353
7227 -353 6 -156 438 -170 76 -330 -73 -179 -112 91 -18 -237 -119 -507 149 -139 78 -99 -262 -45
7247 -45 -264 -186 -100 -274 -350 -44 72 61 119 -86 -335 -237 29 -190 -128 -70 -131 -15 70 -250 -42 110 -8 -33
7271 -33 -423 -8 133 30 94 167 -111 -187 73 111 53 9 163 230 -66 -138 107 241 132 -231 181 61 313
7294 313 103 27 232 -87 -161 -37 227 -30 39 -292 44 179 3 334 -108 113 31 9 -74 262 137 224
7316 224 -424 151 24 134 154 -53 176 5 70 -156 22 254 -44 126 -17 -213 13 -92 -72 -143 -3
7337 -3 223 124 171 -352 -138 265 -1 -41 97 27 -78 19 -183 116 -132 -8 44 -24 89 90 -220 152 -86 -161
7361a61J48K41j07j58mJ51J03j32j52J08J86j77n3L8k19N0N8m1r9J69l9j55K71
7384B6j96J76J37k96R4rj8j16j9N23l17q5nJ55m4M0J99l29K92k59J7R6j98J88
7408E2J83m77M3K36q8n0L39k37p2j00J60k01L26J32o45M06Q0j57L60l38j05J83
7430C0J30p9K21J10n29J28o0J35J02O0j57O6k14L20m23Q6J93j22P0k89M14O7j95
7453F4j3l7j41J9k4J62k47K6K93n9j74J86J94l16K5j63K85J85k26J89l23l4M4
7476h5J13J58n0k14j06K65K3j27k33J64J22L61l57j88J60J37l16J16K70m85O59
7497C87k86m50N23j20l5k40J77j63K13kQk11J99l61K50L06n14M74k40L75n51K41
7519b0j2Q6J7j82P8j02L46k64J27Kk03j51L72k92R0O1r0L06N5l41J59J67j03n2
$$ plain form
7361 -161 -13 228 121 -37 -41 110 213 81 -71 37 223 46 -7 31 -188 -138 -80 -121 -220 -51 -90 -245 26
7384 26 -170 6 143 -153 -59 -68 -86 -202 -221 302 -15 -100 -105 50 6 46 245 -84 208 -51 -34 62 -136 52
7408 52 235 -242 -199 37 -51 -101 238 1 -71 -171 -11 -212 114 246 -399 7 87 -70 290 -48 -153 30
7430 30 160 81 302 412 -117 11 -49 86 188 248 91 157 -57 263 -160 -74 119 -3 67 -222 192 259 64
7453 64 51 14 -127 -108 -132 30 -217 -191 102 43 -131 55 249 -67 -42 -205 80 265 39 228 -95 -129 -85
7476 -85 28 186 136 -78 -184 81 104 -23 -256 -92 30 391 34 -154 6 143 -173 -57 213 -272 387
7497 387 101 -349 174 54 19 -221 -44 -207 6 4 12 -199 0 -361 -111 195 -319 155 -85 290 -261 -20
7519 -20 -32 54 71 -111 -33 -135 211 -53 74 76 -127 -278 94 -198 -108 -47 -137 169 224 -117 42 209 106 54
7543E4m2j01N7L35j97l69K87J06m96K77j40J91Q7k05L2l9J71p6J68p8oK9M7L2
7567A24l24L02J18l46K15k85K45j68J79L7Q4j5p5Q2j44N6n3p5l7k87J81J80J03
7590I7k41nK55k0k09J49M62m81Q8m0l35J15J72j22j5m2K29L3K9RmJ1n0J17k72
7615g0j15P8L36j97j88J2K41k00K59j64qk15M64j97k46Q5p8K92j62j40L70l9k64
7638a46M7K57k25J22M7Pk63K66l3Ol58K31q6j64L37l15J39k94N69Q4l15J12j04
7661g9q4O52o80K5J67j07R2j12J29J09J54l05L0R4k1l14K89j73J41N9j49K45m03
7684b41L46l1l62K76L8J71k82K39j80J25M0p8n8J59k63M9P0j10K66j59j3l72K70
7707a00L18k28o9L61j21j47q0K34j71l1J24n6j09Ll3P05p52J93O8j72J47j00Q4
$$ plain form
7543 54 12 -89 -32 303 106 -263 24 130 -366 -89 -229 -38 49 -156 -124 -163 8 -68 100 22 16 45 92 124
7567 124 -200 102 220 -126 89 -196 49 -119 60 97 181 166 91 173 29 85 32 -43 -80 -367 -186 -6 97
7590 97 -144 -149 106 86 -123 26 488 7 95 55 -280 -165 7 -115 -130 -172 57 90 119 128 124 135 85 202 -70
7615 -70 -185 -107 229 32 -156 -144 97 -103 156 -8 -16 -231 233 36 -210 -125 -203 89 -73 -213 157 118 -146
7638 -146 -99 158 -67 55 102 109 -154 112 79 85 -273 -42 -128 -292 45 -270 -131 -425 144 228 -87 25 -79
7661 -79 -163 489 -191 -166 1 -106 -14 -126 3 112 266 -39 -9 85 64 -250 39 -134 7 66 -83 162 -241
7684 -241 105 74 -288 -12 26 197 -85 154 -26 99 139 61 3 162 -101 -52 18 -92 174 15 2 -370 -100
7707 -100 218 -10 -79 282 161 14 -66 168 -3 -34 90 34 -75 -72 -105 600 -152 41 109 -63 84 -16 68
7730F8j28m3k0J74r3O4J82j54J10k97R0J3K01j06k95K56j45K9K4j45K20O3j56
7753h8Q4K26j94l85K63k8J27NOP8r1J4l3j48J07oj78R7M02l47N4K6q2j68K8M04
7779A73k97K61k03r5J86J2j19k7O5L0p2j50J70n8l3L73j99k46K41j50k44L51J11
7802H0m5k2k38L80k88j5K08k11J48l0j7Q6n4J29k84J02JN1K27k96J24r7M6K46
7826B31k29j94j36K97j67K89J54o3k22L54j64j77j59M07l95K58J98m25K74J74
7846C05j97L60k96j08j04M1Lj1L07l50R0k8R6p1p3O9J2J05k47J54J12J24k74k64
7870b45L29j26o1j21M21r0j00pJ32J07j01j30l86L19L7j75O9K66p5J2j29K69k35
7893b0j44m1L59l31M23N3j48qj04k3j97K17l20L92k96q3N15k36k5j27N51n49j87
$$ plain form
7730 68 -60 -103 -123 51 -42 22 204 50 160 -137 -47 -34 167 61 -234 22 -123 -94 -70 -215 5 68 -88
7753 -88 -4 222 28 -357 -94 -122 5 10 16 94 3 17 -16 -164 -57 -63 -241 -144 258 -89 -35 -9 -91 -259 -231 173
7779 173 -124 137 -66 -161 25 37 -82 -109 -44 -14 -86 -236 -66 -124 -157 216 17 -229 12 -138 -382 -31 80
7802 80 35 13 -225 155 -133 -148 60 -151 -3 -33 -50 36 -18 111 -173 -71 -70 -19 208 -88 36 -61 -15 231
7826 231 2 -192 -328 -31 -198 91 245 182 -40 314 150 -27 -186 221 -174 84 282 -143 131 305
7846 305 108 468 172 64 -40 1 4 -7 300 -50 40 12 108 37 -36 33 45 150 -97 57 169 293 19 -245
7870 -245 84 -42 -103 -224 197 107 7 0 132 239 138 8 -378 -59 -22 -197 -128 138 63 75 -54 215 -20
7893 -20 -164 -205 154 -177 246 299 151 143 39 16 -181 36 -284 108 -188 -271 244 8 -17 -144 407 -142 -329
7916c29L58J9Jn7J43l50R7J62R6k81J99K14q0l06Q1J10j07J85k66qj19J8M70k93
7940d3k5o5o9K99j02L74k92L5J03j64j6O0l34L47j59k10J53M89l35j12l5r5J93
7963cn0J75l89K85K33m03L37L6l86l3J03K32j58l8K22j05L9j30L44l21j94L20
7985A16p4l8r8j38K3K53k7j41j30R5J53j27j11K66m07M77l09K83j7O4j54k72K02
8008a11k57N59j70L84m83n9L48j49K11l73N4o3K62j12L0j3rK12l97L9K28k95J32
8031c2j72K85k71M62j81m17K52k03J76n5K10mj59m0M37l76O6j05j9k39N40j42
8053A3j43J28J12l5J0j63R2n2K1M31l06k11j26M60j54J61m15j22K93M5J24k0j49
8076fK21j57j91PR7R4K2l62K04J03l5k40K82n2J08r6L45j43l02J24J21j18k70
$$ plain form
7916 -329 29 48 49 -8 135 -215 -118 44 140 -141 58 272 192 -114 -33 77 -30 155 -111 -119 -238 -220 250 -43
7940 -43 -68 -133 -202 97 -5 369 77 112 215 51 35 95 -239 108 -51 -261 -108 381 46 -66 -101 -196 -3
7963 -3 -53 122 -267 18 251 -152 185 221 -165 -198 -95 137 -21 -59 163 58 97 -33 311 -10 -204 116
7985 116 42 4 -94 -232 -209 44 17 -124 -254 -159 -6 -133 -244 22 -385 92 -217 66 49 113 -41 -313 -111
8008 -111 -368 191 21 405 -78 -137 211 62 273 -100 -46 -109 153 41 71 58 49 261 -136 -97 131 -164 -32
8031 -32 -204 81 -190 272 91 -326 -74 -277 -101 -156 54 50 -109 -149 288 -88 -22 -127 -146 -385 155 13
8053 13 -130 -2 110 75 85 -78 14 -38 -17 414 108 -103 -229 231 77 238 -177 -299 -6 39 163 143 -6
8076 -6 215 58 -133 -126 -29 65 87 -275 -71 32 -3 -243 39 -13 95 -1 344 201 -101 23 144 26 -244
8099b44K74Q4n00M58J61j20L4j54l7Q4J76o4k1q9k63K24j23J33J87j24L5j73J22
8122F0l8n7m6j27K30J8K64j75j51J02r4N0k32K94k69m3k35O03k59KK04q8k64J22
8146a29k8K57n6J85k77k2L67k04M3k18J3J70p6k29R1K94R9j84J21k31K25l85K50
8169G6k33J83j26K56j37L49l11J97J52m00Q1j69Q5k0L0j48j62M6K69J58o7l45
$$ plain form
8099 -244 30 114 -386 72 233 113 147 -7 -44 40 216 152 131 42 -221 3 -120 13 200 76 111 -62 60
8122 60 22 -35 -81 -208 22 40 304 129 -22 80 -14 36 -196 98 -171 -214 -449 154 -105 -103 101 13 -251 -129
8146 -129 -157 100 44 229 -48 -70 297 93 136 -82 -69 101 25 -204 -113 181 280 96 217 -14 211 -174 76
8169 76 -157 26 -100 156 19 368 57 254 406 6 87 -82 3 -17 13 -135 -297 -251 18 176 109 -236
8191b36
$$ Imaginary data points
##PAGE= N=2
##DATA TABLE= (X++(I..I)), XYDATA
0@%%%%%%Qj6J6j6K4l2M0m8N6p2Q8j04J20j44J70j94K25k64L05l47L98m53N12n81
30c09O55p37Q29r25J030j150J281j422J579j752J940k148K378k634K919l235L592
47A891l999M465n005N641o399P323q483R985j2016J4935j9514K7776m7293J74102
61A43409J41749l62888o8457K10994J00277j95088o0282J57852N8619j83784n8795
72a16394J75319R4833j70573j18463J22397J21281j02045j08673P9087J05622
82H2391o6326q9355N7356Q6937n6465q2839N6048R6259n2483j12462L1698J28042
94G8801L573j14108k5202R3491K7971q0539k5686P9515K5933q7890m5769Q3800
106A3890O9013n8123p3684L1722N5983k7253m1575L4960L6782m7607m7924N0066
$$ plain form
0 0 0 0 0 0 0 0 8 -8 8 -8 16 -16 24 -24 32 -40 48 -56 64 -80 90 -104 121 -143 162 -185 213 -240 272 -309
30 -309 346 -391 438 -487 543 -607 674 -748 831 -921 1019 -1129 1249 -1385 1534 -1701 1891
47 1891 -2108 2357 -2648 2993 -3406 3917 -4566 5419 -6597 8338 -11176 16600 -30693 143409
61 143409 285158 -77730 -146187 64807 165084 -30004 -90286 67566 126185 -57599 -116394
72 -116394 58925 153758 -16815 -135278 -12881 108400 6355 -102318 -23231 82391
82 82391 16065 -73290 -15934 71003 14538 -68301 -12253 84006 31523 -80939 -49241 78801
94 78801 82374 -31734 -56936 36555 64526 -16013 -41699 37816 63749 -24141 -69910 13890
106 13890 82903 24780 -48904 -17182 38801 11548 -30027 4933 41715 -5892 -53816 -3750
118c750O4431l3662o8089J6254N9191j1372n4887O992N1890o743n1151O499N6632
131C2235j352o2740j4056N7609K6359n1080m1969L2048M5905j2692l8403J522
143b6614K8232J4k4788j691J9044N8j9347J72K1807O816j7224j1901J2695J5779
157C052m642j6380k534J2162N397o376J255J1896K801j3527p444J5357J3722j4474
171B65k0506J1955K8398n545l0380M255L7017K066m1738j2123L9266J7113l8120
184h077k3590L6014K8750l1828l3408L1829L7851l2788m8812K4444N1884j6231
196A6038n1837J1254N1946o794n1077N488N5171n46o1584j0272O1553K2308n4798
209a3150k4843N4282L1555n1426l5275M8501M0342m5006m5623M0178M8968l4405
$$ plain form
118 -3750 60681 27019 -41070 -24816 34375 23003 -31884 -24892 26998 20255 -30896 -24397 32235
131 32235 30883 -31857 -45913 11696 38055 -13025 -54994 -22946 22959 10267 -28136 -26614
143 -26614 1618 1632 -23156 -24847 -5803 -5745 -25092 -24920 -3113 3703 -13521 -25422 -12727 3052
157 3052 -1590 -17970 -20504 -8342 -2945 -9321 -8066 3830 6631 -6896 -14340 1017 14739 265
171 265 -20241 -8286 20112 14567 -15813 -11558 25459 27525 -14213 -26336 12930 30043 -8077
184 -8077 -31667 4347 33097 1269 -32139 -310 37541 4753 -44059 -19615 32269 16038
196 16038 -35799 -24545 27401 20607 -30470 -24982 30189 29643 -31941 -42213 19340 41648 -13150
209 -13150 -37993 16289 47844 -3582 -38857 9644 49986 4980 -40643 -465 48503 14098
221A4098n1344L3815N9355k7102o7312J3855O3613p456o1040K957N7913k396n9010
234c0054l55O2708P119o6594k1910N9419K8749n3851l4020M9266L7932m4144l9778
247d5513M1354M3108l9598m9725L1868N3519k3952n4700J9052N8547j0455n8194
259c4689L857N7001J69n8366o179N7311J0203n6437j3161N7318K2112n4584l0466
272d5911M6448L1726m2410l3000L9704L5082l7832l5981L7357M1687l1858m3631
284c8619K3836M0269j9212l7348J9072L7660j3597l4737J3838L5740j1722l6721
296b1541Q405L5743n052l5131J826L4500L654k8824n168K4626M869k4916r026
309a6035K1124J1247j8205j3113J5174J5570j0347j5065O086J2441m887j2034
$$ plain form
221 14098 -37246 -3431 55924 28822 -38490 -24635 38978 31522 -29518 -26561 31352 28956 -30054
234 -30054 -30409 32299 39418 -27176 -49086 10333 39082 -14769 -48789 477 38409 -5735 -45513
247 -45513 -4159 38949 -649 -50374 -18506 35013 11061 -43639 -24587 33960 23505 -34689
259 -34689 -30832 26169 26338 -32028 -38207 19104 29307 -27130 -40291 17027 39139 -15445 -45911
272 -45911 537 32263 -10147 -43147 -3443 31639 -6193 -42174 -4817 36870 5012 -38619
284 -38619 -14783 25486 6274 -31074 -12002 25658 12061 -22676 -8838 26902 15180 -21541
296 -21541 -13136 22607 17555 -17576 -15750 18750 22404 -6420 -11588 13038 17907 -7009 -16035
309 -16035 5089 16336 -1869 -14982 192 15762 5415 -9650 -3564 8877 3990 -8044
321h044J619J0584J417n761k85O530K379m843l486L762K451k846k612J508M480
336F853J375n42k230k97K176p28o371k138O569K451q621m424J0063P962q939j1813
352h654N831J0493p034j4885O102J7704l672j9104L017K1492j46k0981k543J9721
366G341J732k0648k094K2349P709k1092p973K1311R442k2129j1936K1839J2062
379A7913k3548j5017K3489J8390j9729k0675J7756K0860j8273k5529J3701K6155
391A5493j1828k7788R619K9607n596k9295L680K7299l044k9213m50K8523L662
404A0669k6793l940K7883Q112k6520j0316K5845J1065k6103j4747K5447J8336
416A8938k2008j7836K1605K0944j9236k2657J5597K2519j3580k4498J1002K6217
$$ plain form
321 -8044 -6425 4159 5576 -185 -470 6060 8439 3596 110 3872 6323 3477 865 2373 6853
336 6853 8228 7686 5456 5159 7335 6607 236 -1902 4667 7118 -1503 -5927 4136 12098 3159 -8654
352 -8654 -2823 7670 636 -14249 -8147 9557 5885 -13219 -10202 11290 11144 -9837 -12380 7341
366 7341 9073 -11575 -13669 8680 16389 -4703 -12676 8635 18077 -4052 -15988 5851 17913
379 17913 -5635 -20652 2837 21227 1498 -19177 -1421 19439 1166 -24363 -10662 15493
391 15493 3665 -24123 -14504 15103 9507 -19788 -16108 11191 8147 -21066 -21516 7007 10669
404 10669 -16124 -20064 7819 15931 -10589 -20905 4940 16005 -10098 -24845 602 18938
416 18938 -3070 -20906 699 21643 2407 -20250 -4653 17866 4286 -20212 -9210 17007
428A7007o109k4368N410K4163m645k4125J582K2027q04k1595N7K2238K979j9988
442f171l718K0126M582k0586p952J8858Q967j7431r080J8431J1803j4932j2167
455i270J2978J1986j1961j3956Q537J4381o226j2414O481J3366m960j2595L525
468a28J0879m922j1943L474J1576k473r973K756J0732k118j0661J90R149j604
482D934j1063J121J1410J168r933q84R683J616r440j676N782o01o342J415P149
497D339l61o747J135P789j570r925p53P603n25q726Q42R305o96r935R17J0661
513C353m62j2144l933R519L748p729l889R172M343p983l440R698L383j1975n569
528a3908J1962P082r723p068J1047R645q809r247R491R865j0925j2480R751J5563
$$ plain form
428 17007 10898 -13470 -8060 16103 11458 -12667 -11085 10942 10138 -11457 -11400 10838 13817 -6171
442 -6171 -9889 10237 14819 -5767 -13719 5139 14106 -3325 -12405 6026 17829 2897 -9270
455 -9270 3708 15694 3733 -10223 -1686 12695 6469 -5945 536 13902 8942 -3653 -128
468 -128 10751 5829 -6114 -2640 8936 6463 -3510 -754 9978 7860 -2801 -2611 6538 4934
482 4934 -6129 -5008 6402 7570 -2363 -3247 6436 8052 -1388 -3064 2718 2117 -4225 -2810 4339
497 4339 3978 -2769 -1634 6155 4585 -5340 -6093 1510 985 -7741 -6899 2406 1710 -8225 -7308 3353
513 3353 2891 -9253 -13186 -3667 81 -7648 -11537 -2365 1978 -6005 -9445 253 3636 -8339 -13908
528 -13908 -1946 5136 -4587 -11655 -608 9037 228 -9019 472 10337 -588 -13068 -3317 12246
542A2246q180j5329P626J7627n579j7417K881J5236l669j5707L304J6273k964
555F348j7150K918J9101L89k0273l540J6086L274j6061j772J6477K599j6289k792
569a0685J7958N533j6729r816J3504J0752j0854j0914R830J2373p213r574P721
582A886Q783q927j1012P890J2458n630j3468L464J4862O28j2786j494J1166O00
596H420j3506j490J3832L292j4507l565J5817O591j4626r340J1910Q534j1313
609D9r309J0557R558r723r324J0450J0173j0401j0541Q306Q579j0027r436R354
623a735J0608q274r593P913J0263q930j2202O490J1760n339j2203M175J0495k406
637A022p384M504P114o550q765M960Q293m035p367M439P759k748o339L736N699
$$ plain form
542 12246 4066 -11263 -3637 13990 8411 -9006 -6125 9111 5442 -10265 -6961 9312 6348
555 6348 -10802 -7884 11217 11606 -8667 -12207 3879 7153 -8908 -10680 5797 8396 -7893 -10685
569 -10685 7273 12806 -3923 -13739 -235 10517 -337 -11251 -1421 10952 3739 -5835 1886
582 1886 10669 1742 -9270 -1380 11078 5448 -8020 -4556 10306 10934 -1852 -3346 7820 8420
596 8420 -5086 -6576 7256 10548 -3959 -7524 8293 14884 258 -9082 2828 11362 49
609 49 -9260 1297 10855 1132 -8192 2258 12431 2030 -8511 -205 8374 -1653 -11089 -1735
623 -1735 8873 599 -8994 -1081 9182 252 -11950 -5460 6300 961 -11242 -7067 3428 1022
637 1022 -6362 -1858 5256 -1294 -10059 -5099 3194 -841 -8208 -3769 3990 1242 -5097 -1361 4338
652D338m707o800M664O451n636o994P015Q995l860r261J810P220j459o119qL068
668a283r32j872L787L295m300m720M089N581m831p259K878O421j410m306K111
683b751N224q80m782J57M387j018n680k73P078M041n250n209M898O114j157n263
699c64l10K962j218l090K907O223o85o177M73O408o13p928J080Q912k051j0218
715c689Q99J2469J583j1437k553J1157L330j2606o398J0171O725q850m921R579
729E459L984j0141m718J1410N151j2241q794Q681R436n709p199N488N980o465
743C22n179O969N936j0144r414Q702J2479n261j3087L295J2221J01j0604k235
757e899P381R18p250j73Q174R43q797n86R663K326j0508m235P415L495n898k044
$$ plain form
652 4338 -369 -7169 -2505 3946 -1690 -8684 -1669 7326 3466 -5795 -3985 3235 1776 -4343 -4351 -1283
668 -1283 -2215 -4087 -300 2995 -1305 -6025 -1936 3645 -1186 -8445 -5567 854 -556 -4862 -2751
683 -2751 2473 1593 -3189 -3032 1355 337 -5343 -5616 1462 5503 253 -4956 -58 6056 4899 -364
699 -364 -674 2288 1070 -2020 887 7110 6425 248 721 7129 6516 -1412 -332 8580 6529 -3689
715 -3689 -2790 9679 11262 -175 -2728 8429 11759 -847 -7245 2926 9651 801 -4120 5459
729 5459 9443 -698 -5416 5994 11145 -1096 -9890 -1209 8227 2518 -4681 807 6787 322
743 322 -4857 2112 8048 -2096 -11510 -2808 9671 4410 -8677 -5382 6839 6940 -3664 -5899
757 -5899 1482 2400 -4850 -5023 3151 4094 -4703 -5289 4374 6700 -3808 -8043 -628 2867 -3031 -5075
773e075O745R77p145j231R244L183j0365n249O893M612o393l086P667M111o851
788a963m292N581M029n661l917L109K723j738q85K251N48j609J061L222j992n510
804e043n62M973J779k449j48J297O2M1K268l6l862j514K639J492o84p76J361R78
822A816m10Q22N04j292l047l70K953J460j594j346J358K374N90j448k582q93L061
839A956P81l722j467M382L026l195j556L724J096n671k482M807K932m330k981
854b700N818K937n761k820P687L061q819n471P896M716p833l463R616N102r647
869C19o599R353O415r426q454Q600Q642p990q774P712J0309o227r992N373P980
884G241o924q856N930R244m937r305N065J0397l825j1252J712J0223j393j0688
$$ plain form
773 -5075 1670 2647 -4498 -5729 3515 6698 -3667 -8916 -2023 2589 -3804 -6890 777 4888 -1963
788 -1963 -6255 -674 3355 -2306 -6223 -3114 -391 -2129 -3014 -763 -215 -1824 -763 2459 467 -5043
804 -5043 -5605 -632 1147 -1302 -1450 -153 -91 -50 2218 2182 -1680 -3194 -555 937 253 -523 838 1816
822 1816 1406 2228 2732 1440 -1607 -1977 976 2436 842 -504 854 3228 3818 2370 -212 -1105 1956
839 1956 2737 -985 -2452 1930 4956 1761 205 3929 5025 -646 -3128 1679 4611 281 -2700
854 -2700 3118 6055 294 -2526 5161 8222 -597 -6068 1828 6544 -1289 -4752 4864 9966 319
869 319 -6280 3073 9488 62 -8392 208 8850 860 -7914 -202 10107 3880 -6112 -739 7241
884 7241 317 -8539 -2609 6635 1698 -7607 -2542 7855 4030 -7222 -5510 4713 3320 -7368
898g368p78J0426J416q608j085Q887K009q915m177P204M164o960n083O840O942
913D914m896o947M373O891m160p319L255O527l465p037L828Q860j280r228Q91
928d793Q850l05j0166j580J0218K869r447l578R826M376q047m699P427M302q005
943b752n768P389O527n577n407O311O090n795o954N585N765m648o369M517O486
958E400l002n408L598O478k457o896R86N638n46n558Q51N787Q03m620n93L695
974D156P14l814j245K095M99k104k84K965J017k350q96K292M15l293j701K029
990D95J486j704p92K349J265j551j746P65Q98j323j316M63O60l48Q0J719J81j728
1008a47M21J225k017l052J857L372j166m073J947M664j267m347M55M444q84n909
$$ plain form
898 -7368 -8146 2280 3696 -4912 -5997 2890 4899 -4016 -8193 -989 3175 -3785 -8868 -2028 4914
913 4914 18 -6929 -2556 4335 175 -7144 -3889 2638 -827 -7864 -4036 4824 3544 -5684 -4793
928 -4793 4057 3752 -6414 -7994 2224 5093 -4354 -7932 1894 6270 -1777 -6476 951 5253 -2752
943 -2752 -8520 -1131 5396 -181 -5588 723 6813 1018 -5936 -351 5414 766 -5603 -1086 5400
958 5400 2398 -3010 588 7066 4609 -2287 -1301 4337 3791 -1767 -916 4871 5674 1054 461 4156
974 4156 4870 1056 -189 1906 2405 301 17 2982 3999 1649 753 3045 3460 167 -1534 495
990 495 1981 277 -515 1834 3099 1548 -198 567 1465 142 -1174 -711 -51 -399 -319 1400 1581 -147
1008 -147 274 1499 -518 -3570 -1713 1659 493 -3580 -1633 3031 1764 -2583 -2128 2316 1432 -4477
1024d477j73N519Q72m915K74O134j04o825m92O273J63o924q07O950J438o614j021
1041d729P061K902p533m185O088M175o652m527O581N593n042n664M492O208m718
1056E0o265K848O148k793o372K563P695j054p611R87P613o19q926n78Q886J679
1072D251q658j830R492L994q801m940P989O209q415p402P767Q339o555p736O724
1087D28R131n378r375L716Q412l073r227K714R602j467r436J584J0439j262j0576
1102c768o56R982N20j0613r49J0152L139r331l697R578L944q818o407P894O524
1117G494o864p251P002P628m689p571M602P121m610q000K905Q042k215p454J914
1132a946Q541r75q425K4P722j05q755j000Q276J691p646k241P796L299p113m867
$$ plain form
1024 -4477 -4650 869 1741 -3174 -2900 3234 3130 -3695 -4187 2086 2249 -4675 -5482 1468 2906 -3708 -4729
1041 -4729 2332 5234 -2299 -6484 -396 3779 -2873 -7400 -819 4774 -268 -5932 -1440 4768 50
1056 50 -6215 -3367 2781 -12 -6384 -3821 3874 2820 -4791 -3804 3809 3190 -5736 -6314 2572 4251
1072 4251 -4407 -6237 3255 7249 -1552 -6492 1497 7706 -709 -8111 -344 7995 1440 -6296 428
1087 428 9559 4181 -5194 -1478 6934 3861 -5366 -2652 6950 5483 -3953 -2369 8070 6808 -3768
1102 -3768 -4424 5558 6078 -4535 -5484 4668 7807 -1524 -5221 4357 8301 -517 -6924 970 7494
1117 7494 630 -6621 381 8009 3320 -4251 351 7472 2862 -5138 -2233 5809 3594 -3860 -1946
1132 -1946 6595 5620 -2805 -2781 4941 4836 -3919 -4919 3357 5048 -2598 -4839 2957 6256 -857 -5724
1148e724N682M284n515n505M561O043l840n167L608N207l448n663J998M806j881
1163e54n203J618N365k01m700P69M650q05n534l60M814P51m864n31N180J775l779
1180a609j901L064J804l012k574K332K323j661j820K829K184j849j955J525J093
1195G73j885j554J622J122n97k07J743Q34j150q60L99R02r43q28O13N52j97R67
1213A306J324r65j358Q29J455k166k057J899J790r59k118K266K495j397l720J032
1229c44L435j355m330J042M082K3l666J474M078j338m218O71L514r31m007N76
1245a294M346O57l653m02M018M37m720j290M774R01m901k180N864K823l984m173
1261b777L484L979l266n037J570M802k052m602K503M963j935n219J651N103j822
$$ plain form
1148 -5724 -42 4242 -1273 -6778 -2217 3826 -14 -5181 -1573 3634 186 -5477 -3479 1327 -554
1163 -554 -5757 -4139 1226 1025 -3675 -2906 1744 939 -4595 -4955 -141 610 -4254 -4785 395 2170 -1609
1180 -1609 -3510 -446 1358 -1654 -4228 -1896 427 -1234 -3054 -225 1959 110 -1845 -320 773
1195 773 -1112 -2666 -1044 78 -519 -726 1017 1851 701 -159 240 1142 199 -629 -16 536 339 1306
1213 1306 2630 1665 307 1136 2591 425 -1632 267 2057 1098 -1020 1246 3741 2344 -1376 -344
1229 -344 3091 1736 -2594 -1552 2530 2553 -1113 361 4439 3101 -1117 -446 3068 2137 -1870 -1294
1245 -1294 3052 3709 56 -346 3672 4109 -611 -1901 2873 3774 -1127 -3307 2557 5380 1396 -2777
1261 -2777 707 4686 1420 -3617 -2047 2755 703 -3899 -1396 3567 1632 -3587 -1936 3167 1345
1276A345o015K37N740P78n178n26N902J306o208k238N956K075o241l153O423L920
1292D123n060m147N157M572m269n389L069N145l773n282L139O096k336n483K417
1307b021N604k857n703J975N198j932n906J439P268k42o938j25O463J436p240
1322c581k644O343K785n626k183O220L473o048l255N164L919n071m820L759N259
1337C694k776m657L364N161k462m999K665M065l405m923K884O126j886n515J092
1352a572N975k6n508n71M042O17m474r21M566J379k968r55L455O43l260j136K250
1369A536J101k287p85J876J431q80j305J200J455j602k501O84J648l99j665L18
1385a75K097J135k908j658K277J649k218l552J781L543j234k861N73L577M9l000
$$ plain form
1276 1345 -4670 -4433 1307 2085 -3093 -3619 2283 3589 -2619 -4857 1099 3174 -3067 -6220 203 4123
1292 4123 -937 -5084 73 4645 376 -5013 -1944 3201 -572 -5854 -2715 3381 1045 -4438 -2021
1307 -2021 3583 726 -4977 -3002 2196 264 -5642 -4203 3065 2823 -4115 -4240 2223 3659 -3581
1322 -3581 -6225 118 2903 -2723 -4906 1314 4787 -1261 -4516 648 4567 -504 -5324 -1565 3694
1337 3694 918 -3739 -375 4786 2324 -2675 -10 4055 650 -4273 -1389 4737 2851 -2664 -1572
1352 -1572 4403 4377 -1131 -1702 2340 2957 -1517 -2438 2128 3507 539 -416 3039 3682 422 -714 1536
1369 1536 2637 350 -435 1441 2872 1992 687 1887 3342 1740 -761 -77 1571 1172 -493 -175
1385 -175 1922 3057 149 -1509 768 2417 199 -3353 -1572 1971 737 -2124 -1551 2026 2075 -925
1401i25j014J878N16k841O0L002P31l076J29L151L32l418r22K437L62k173p31
1418b502K416M64j635O3K243l25k854q57K196l7j576j0J571n8o91R18J77j513
1436b010m29K005l27k360m31K864P59j402MJ827p15j817M18K339n41l116J455
1453a477L600q18l368J229M463j281m986R55M248j028m523J535N439l72n249k21
1469a854N138N47n469j740N082J839m790k144M805K670l223k581K857J677l182
1484c68k644L108K743k141k967K906L887k219m499J624M297q16m852k16N138P04
1500C685m354p68N080Q99m692k605M501K653m943l570N197M191m397m557L984
1515C04M644l477n203K705N002l221n533L067O956j978p388J858P307j550q226
$$ plain form
1401 -925 -1939 -61 455 -2386 -2326 676 1407 -1669 -1540 1611 1943 -1475 -2397 40 402 -1771 -2502
1418 -2502 -86 378 -1257 -1194 1049 724 -2130 -2987 -791 -828 -2404 -2414 -843 -901 -1592 -674 -497 -2010
1436 -2010 -2439 -434 -761 -3121 -3552 -688 71 -1331 -1327 500 -215 -2032 -1614 725 184 -2932 -1477
1453 -1477 2123 1305 -2063 -834 3629 2348 -2638 -1683 2565 1537 -2986 -1451 3988 3616 -1633 -1854
1469 -1854 3284 3831 -1638 -3378 1704 3543 -1247 -3391 1414 4084 861 -1720 1137 2814 -368
1484 -368 -3012 96 2839 698 -2269 637 4524 2305 -2194 -570 3727 2911 -1941 -2157 2981 3685
1500 3685 -669 -1437 3643 4542 -150 -2755 1746 4399 -544 -4114 1083 5274 877 -3680 304
1515 304 4948 1471 -3732 -1027 3975 754 -4779 -1712 5244 3266 -4122 -2264 5043 3493 -4733
1530d733J98P918Q65p036j466O623K387n921k865N544K542n780l716M696L834
1545C090m020l600M252M048m236m378L174M196l306m597K590M559j932l797J259
1560b698N522j511n902Q33N293m52n289k69N988J525m679k040M224K766m120l025
1576c834L272K626k738k637L080L249k372k978K279K724k027l961J372L230n98
1591F87k466L19K854M06k427r33K207R12k284j777J885J587p32r44P29J938N1
1608B012k169j497K447J203j492j886J835K437r20j600P77J996r22k018l04K239
1624B138m65k167R40L008o97l076j7L607j093l534J2L223j79k457n83L355Q06
1641B821k772j380K015J376k480k278J811K434o92j730L83K045N72k695j127K124
$$ plain form
1530 -4733 -4535 3383 4248 -2788 -4254 2369 4756 -1165 -4030 1514 4056 -1724 -5440 -744 3090
1545 3090 -930 -4530 -278 3770 -466 -4844 -1670 2526 -780 -5377 -2787 1772 -160 -3957 -2698
1560 -2698 2824 1313 -4589 -3756 1537 1085 -4204 -4473 1515 3040 -1639 -3679 545 3311 -809 -3834
1576 -3834 -562 2064 -674 -3311 -231 3018 646 -2332 -53 2671 644 -3317 -1945 1285 687
1591 687 -1779 -1460 1394 1800 -627 -1560 647 1559 -725 -2502 -617 970 238 -706 23 1961 2012
1608 2012 -157 -1654 793 1996 504 -1382 453 2890 1970 370 1147 3143 2221 203 -101 2138
1624 2138 1673 -494 446 3454 2757 -319 -336 3271 2178 -1356 -1344 1879 1700 -757 -1340 2015 2821
1641 2821 49 -1331 684 2060 -420 -2698 -887 1547 855 -875 -492 1553 2125 -570 -1697 427
1657D27R54k056j693J891K449j304k650J801K817j949m118N42M054j71m261N49
1673b718M914K52n564q73N443J463n977k191N375J885m552j720M763L242m160
1688d18l589L349K841l399l049L819L321l059l482K898M070k140m439J744L777
1703B244j946m541J696M847M28n116n87M880J335n329k217M452K489m004l226
1718d595M253L803k950m046K801M270k194n070J855M561r53n025J429N925l99
1733C665n764N31M955j47n503j45N115R24m615j179M830K440m344k892L799K362
1749D032m049l132L367L446k554k896K371K892k065k836J068K563r67l639R59
1764a440L502J67l035K90K958j25l561p12K905J368k894j259K914K007j806k466
$$ plain form
1657 427 1381 -675 -2368 -477 1972 668 -1982 -181 2636 687 -3431 -2889 1165 994 -3267 -2718
1673 -2718 2196 2448 -3116 -3989 1454 2917 -3060 -5251 124 2009 -2543 -4263 500 3742 -418
1688 -418 -4007 -658 2183 -1216 -4265 -446 2875 -184 -3666 -768 3302 1162 -3277 -1533 2244
1703 2244 298 -4243 -2547 2300 2728 -2388 -2975 1905 3240 -2089 -4306 146 2635 -1369 -4595
1718 -4595 -342 3461 511 -3535 -734 3536 1342 -3728 -1873 2688 1735 -3290 -1861 4064 3665
1733 3665 -2099 -1568 3387 3240 -2263 -2408 2707 3631 -984 -2163 2667 5107 763 -2129 1670 4032
1749 4032 -17 -3149 218 3664 1110 -1786 585 3477 1412 -1424 -356 2207 1240 -2399 -1440
1764 -1440 2062 2229 -806 -516 2442 2317 -1244 -1956 949 2317 -577 -1836 1078 3085 1279 -1187
1780a187J791K084j321l433R54K818j16k497K84K126N42k180r52J559M59j498
1796e67j724J549J104q58j212J314J277j197j434P32O64p07j174K98J587P97j241
1813g92l87J110M55j271j192P36J493l66j642L75J960O57j959p63J796N76k262
1830a476j331J979J646j264j528J613J568j322j756J352J220j047k429J315K770
1845A310p41k653J296K914p08l164r6L186N55l569k33L455J075k631j339K854
1861A511J653k563k532J900K755j879k782K245K637r43l193J332K387p85l060
1876a317o5L019K76k769r7L224P69l507j036L193J048l340j715K958K266k350
1892E57k149K336L226k313l177J110L181j687l216J255L409n95k988J139K818
$$ plain form
1780 -1187 604 2688 1367 -2066 -1112 1706 1590 -907 -623 1503 2045 -135 -1087 472 931 -567
1796 -567 -2291 -742 362 -496 -1708 -394 883 -314 -1748 -1016 -352 -1059 -2233 -1935 -348 449 -792
1813 -792 -1179 -69 386 -885 -2077 -1341 152 -214 -1856 -1481 479 1136 -823 -1586 210 786 -1476
1830 -1476 -2807 -828 818 -446 -1974 -361 1207 -115 -1871 -519 701 -346 -2775 -1460 1310
1845 1310 569 -2084 -788 2126 1418 -1746 -1842 1344 1899 -1670 -1903 1552 2627 -4 -1343 1511
1861 1511 3164 601 -1931 -31 2724 845 -1937 308 2945 2002 -1191 141 2528 1743 -1317
1876 -1317 -1382 1637 1913 -856 -953 2271 3040 -467 -1503 1690 2738 -602 -2317 641 2907 557
1892 557 -1592 744 3970 1657 -1520 -410 2771 1084 -2132 -877 2532 1937 -1051 88 2906
1907B906r05l191n4K453J58l162m9L126O21k737j233K975Q30l065j314K189J479
1924A027k308j301J564K472j280k095P34K252j296k138N13J811K04j732L13J875
1940F15K44j312o12R56J89j182o91J801K26o15o89J458R05j522j044P22P73p96
1958e74j169M88J318M42j266J74P91K16j334o95R36P76p29n95J131P84n01m22
1976b29M47N35j069m89K77P92r0m78P33P63l20r82M32M55n44p72L55N15L8j74
1996A95K57L83J27K7l14n12o8M52L26j021N3J285N17p64j129Q80R08j136j021
2015e55R37J043j059n68J348J195j088j354N11R77q05j449P66J488r91j363J606
2032F39J622j589j702J152J439j197k610J046K403j37k019J84K016m26j701k4
$$ plain form
1907 2906 2001 -1190 -1244 1209 1367 -1795 -1844 1282 1903 -834 -2067 908 1738 -1327 -2641 -452 1027
1924 1027 -1281 -2582 -1018 1454 174 -1921 -1187 1065 -231 -2369 -1856 -45 159 -1573 -1260 615
1940 615 859 -453 -1065 -109 80 -1102 -1793 8 234 -381 -1070 388 1293 -229 -1273 -551 222 -574
1958 -574 -1743 -1255 63 505 -761 -587 204 420 -914 -1609 -673 103 -626 -1221 -90 694 193 -229
1976 -229 218 753 -316 -805 -528 264 174 -304 429 1192 872 -110 322 777 233 -539 -184 331 369 195
1996 195 452 835 962 989 675 163 95 547 873 -148 -95 1190 1707 943 -186 694 1602 466 -555
2015 -555 382 1425 366 -202 1146 2341 1253 -101 410 1387 582 -867 -101 1387 396 -967 639
2032 639 2261 672 -1030 122 1561 364 -2246 -1200 1203 1066 -953 -769 1247 821 -880 -904
2048i04J438n19j579M40J691K31j357K19J072J10j732j27R18p5n02p01J527R73
2066A123j340o48P70L49r63q10M32R14l54o94p6J408J61j104m65L63K83m28m99
2085a578N09P22p73L79P54K16j034k59P73K41j042m18J303O04n49p05J216N86
2103I45r51o77Q46O89r85q84J459P67o36n74Q09j14m54J42R5j92p69J25Q59M70
2123I70n34l77J097M97j560p72R21P81p49q25R08J214p56k27p5P40k02j435K00
2142a84J134j49j068M33J642k27j668j4J541j06k190N3J571L84j603l17K364K15
2160A811k268p29K446J43k381p78K270J188j885j018J835J134k127j004J284J257
2176A178k226o40J912P82j607p31K012Q91j791j379R68Q84n73r64O91Q77j89j091
$$ plain form
2048 -904 534 15 -1564 -1124 567 798 -559 -340 732 842 -890 -1017 -99 -174 -676 -1377 150 1123
2066 1123 -217 -865 -95 254 -709 -1519 -1087 -173 -527 -1221 -1297 111 272 -832 -1297 -934 -651 -1079 -1578
2085 -1578 -1069 -347 -1120 -741 13 229 -805 -1064 -291 -50 -1092 -1510 -207 397 -152 -857 359 945
2103 945 -6 -683 163 852 -133 -1017 442 1209 573 -1 808 694 240 382 477 285 -484 -359 500 970
2123 970 436 59 1156 1653 93 -679 242 1023 274 -551 357 1571 815 588 513 1253 1051 -384 -184
2142 -184 950 801 -267 166 1808 1581 -87 -101 1440 1334 -856 -803 768 1152 -451 -768 1596 1811
2160 1811 -457 -1186 1260 1403 -978 -1756 514 1702 -183 -1201 634 1768 -359 -1363 -79 1178
2176 1178 -1048 -1688 224 1006 -601 -1332 680 1571 -220 -1599 -631 253 -320 -1284 -593 284 95 -996
2194i96L43R70j06j284l89P89N72j084j45J116Q99n48j357n5J164j33j234K13
2212a265J646o02j205R08J714p31j736K31J519J6k394p1K474Q00k130m78J958
2229F54J213k062j010J600L04j302j049K077N39j253m95J418P26j425j006R77
2245i4M46q26j060J783J248j311q59R51P78p32j024Q64J024r83p18L83J045K34
2263A149m39r3K43n67J1j85N92l97N88J82k32k69L13L84o75n75N18m3l65k6O59
2284G73O75p06m32N56q9n92p27L80Q09o53o77J075R23o62r26K00Q95q34j074k94
2304a380J751M2r62k26R14Q60j214q47K26R82n42j126P25J283j06j311J24J435
2322F28k39j562n9J245k34j770M66J908P61k181l16K076Q4k232n64K340N24k346
$$ plain form
2194 -996 -653 317 211 -1073 -1462 -673 -101 -1185 -1330 -214 685 137 -1220 -1275 -111 -244 -1478 -1265
2212 -1265 381 -221 -1426 -518 1196 465 -1271 -1040 479 495 -1899 -1970 504 1304 -826 -1304 654
2229 654 1867 -195 -1205 395 699 -603 -1652 425 964 -289 -784 634 1360 -65 -1071 -94
2245 -94 352 -474 -1534 249 1497 186 -673 278 1056 324 -700 164 1188 205 -513 -130 915 1149
2263 1149 710 617 860 293 304 119 711 314 902 1084 852 583 896 1280 605 30 548 505 140 114 773
2284 773 1448 742 310 866 777 185 -542 -162 647 -6 -683 392 1315 653 -273 -73 822 -12 -1086 -1380
2304 -1380 371 413 -549 -775 139 999 -215 -1062 -836 146 -396 -1522 -797 486 380 -931 -807 628
2322 628 389 -1173 -1232 13 -221 -1991 -1525 383 1144 -1037 -1353 723 807 -1425 -1989 351 875 -1471
2340a471j115K454K026k401j403J636J732k147k061J702K107j301j660J288J955
2355A341r16j837O34J869p32k420M45K122L23j702J63J770R03k200j490J879J410
$$ plain form
2340 -1471 -2586 -132 1894 -507 -1910 -274 1458 -689 -2750 -1048 1059 -242 -1902 -614 1341
2355 1341 425 -1412 -778 1091 359 -2061 -1616 506 829 -873 -710 1060 1963 -237 -1727 152 1562
$$ [...]
8191I8
##END NTUPLES=NMR FID
##END=
