##TITLE=1H_Ser 4630-ionCO
 CDCl3, 8 sc, 
 6.5.2019
##JCAMPDX= 6.0         $$ Bruker NMR JCAMP-DX V2.0
##DATA TYPE= NMR FID
##DATA CLASS= NTUPLES
##ORIGIN= UXNMR, Bruker Analytische Messtechnik GmbH
##OWNER= root
$$ XWIN-NMR		Version 3.5
$$ Mon May  6 17:38:36 2019 Russian Standard Time (UT+4h)  she@DPX200
##.OBSERVE FREQUENCY= 200.1315
##.OBSERVE NUCLEUS= ^1H
##.DELAY= (6, 6)
##.ACQUISITION MODE= SIMULTANEOUS
##.ACQUISITION SCHEME= undefined
##.AVERAGES= 8
##.DIGITISER RES= 18
##SPECTROMETER/DATA SYSTEM= spect
##.PULSE SEQUENCE= zg30
##.SOLVENT NAME= CDCl3
##.SHIFT REFERENCE= (INTERNAL, CDCl3, 0, 15.7039)
##AUDIT TRAIL= $$ (NUMBER, WHEN, WHO, WHERE, WHAT)
$$ ##TITLE= Audit trail, XWIN-NMR		Version 3.5
$$ ##JCAMPDX= 5.01
$$ ##ORIGIN= Bruker BioSpin GmbH
$$ ##OWNER= she
$$ F:/spectra/data/she/nmr/H-F/1/audita.txt
$$ ##AUDIT TRAIL=  $$ (NUMBER, WHEN, WHO, WHERE, WHAT)
(   1,<2019-05-06 17:37:40.64 +0400>,<she>,<DPX200>,
      <created by zg, POWCHK disabled, PULCHK disabled
       configuration hash MD5:
       00 E9 B6 7A A2 85 ED C7 34 08 36 98 17 FE 4E 26
       data hash MD5: 16K
       15 3E 86 DC BC D2 A7 51 22 95 A6 33 5E 26 76 20>)
$$ ##END=
$$ 
$$ hash MD5
$$ B1 31 23 51 04 44 57 68 88 AF 14 80 31 B8 1A 49
##$RELAX= 
##$RELAX= 
##$RELAX= 
##$RELAX= 
##$RELAX= 
##$RELAX= 
$$ Bruker specific parameters
$$ --------------------------
##$DU= <F:/spectra>
##$EXPNO= 1
##$NAME= <H-F>
##$PROCNO= 1
##$TYPE= <nmr>
##$USER= <she>
##$AMP= (0..31)
100 100 100 100 100 100 100 100 100 100 100 100 100 100 100 100 100 100 
100 100 100 100 100 100 100 100 100 100 100 100 100 100 
##$AQSEQ= 0
##$AQ_mod= 1
##$AUNM= <au_zg>
##$AUTOPOS= <>
##$BF1= 200.13
##$BF2= 200.13
##$BF3= 200.13
##$BF4= 200.13
##$BF5= 200.13
##$BF6= 200.13
##$BF7= 200.13
##$BF8= 200.13
##$BYTORDA= 1
##$CFDGTYP= 0
##$CFRGTYP= 5
##$CHEMSTR= <none>
##$CNST= (0..31)
1 1 145 1 1 1 1 1 1 1 1 1 1 1 1 1 1 1 1 1 1 1 1 1 1 1 1 1 1 1 1 1 
##$CPDPRG= <>
##$CPDPRG1= <>
##$CPDPRG2= <>
##$CPDPRG3= <>
##$CPDPRG4= <mlev>
##$CPDPRG5= <mlev>
##$CPDPRG6= <mlev>
##$CPDPRG7= <mlev>
##$CPDPRG8= <mlev>
##$CPDPRGB= <>
##$CPDPRGT= <>
##$D= (0..31)
0 1.2 0 0 0 0 0 0 0 0 0 0.03 0 0 0 0 0 0 0 0 0 0 0 0 0 0 0 0 0 0 0 0 
##$DATE= 1557149860
##$DBL= (0..7)
120 120 120 120 120 120 120 120 
##$DBP= (0..7)
150 150 150 150 150 150 150 150 
##$DBP07= 0
##$DBPNAM0= <>
##$DBPNAM1= <>
##$DBPNAM2= <>
##$DBPNAM3= <>
##$DBPNAM4= <>
##$DBPNAM5= <>
##$DBPNAM6= <>
##$DBPNAM7= <>
##$DBPOAL= (0..7)
0.5 0.5 0.5 0.5 0.5 0.5 0.5 0.5 
##$DBPOFFS= (0..7)
0 0 0 0 0 0 0 0 
##$DE= 6
##$DECBNUC= <off>
##$DECIM= 24
##$DECNUC= <off>
##$DECSTAT= 4
##$DIGMOD= 1
##$DIGTYP= 9
##$DL= (0..7)
0 120 120 120 120 120 120 120 
##$DP= (0..7)
150 150 150 150 150 150 150 150 
##$DP07= 0
##$DPNAME0= <>
##$DPNAME1= <>
##$DPNAME2= <>
##$DPNAME3= <>
##$DPNAME4= <>
##$DPNAME5= <>
##$DPNAME6= <>
##$DPNAME7= <>
##$DPOAL= (0..7)
0.5 0.5 0.5 0.5 0.5 0.5 0.5 0.5 
##$DPOFFS= (0..7)
0 0 0 0 0 0 0 0 
##$DQDMODE= 0
##$DR= 18
##$DS= 0
##$DSLIST= <SSSSSSSSSSSSSSS>
##$DSPFIRM= 0
$$ [...]
##$SUBNAM2= <"">
##$SUBNAM3= <"">
##$SUBNAM4= <"">
##$SUBNAM5= <"">
##$SUBNAM6= <"">
##$SUBNAM7= <"">
##$SUBNAM8= <"">
##$SUBNAM9= <"">
##$SW= 24.9337058887773
##$SWIBOX= (0..15)
0 0 2 0 0 0 0 0 0 0 0 0 0 0 0 0 
##$SW_h= 4990.01996007984
##$TD= 16384
##$TD0= 1
##$TE= 0
##$TE2= 300
##$TE3= 300
##$TEG= 300
##$TL= (0..7)
0 120 120 120 120 120 120 120 
##$TP= (0..7)
150 150 150 150 150 150 150 150 
##$TP07= 0
##$TPNAME0= <>
##$TPNAME1= <>
##$TPNAME2= <>
##$TPNAME3= <>
##$TPNAME4= <>
##$TPNAME5= <>
##$TPNAME6= <>
##$TPNAME7= <>
##$TPOAL= (0..7)
0.5 0.5 0.5 0.5 0.5 0.5 0.5 0.5 
##$TPOFFS= (0..7)
0 0 0 0 0 0 0 0 
##$TUNHIN= 0
##$TUNHOUT= 0
##$TUNXOUT= 0
##$USERA1= <user>
##$USERA2= <user>
##$USERA3= <user>
##$USERA4= <user>
##$USERA5= <user>
##$V9= 5
##$VALIST= <valist>
##$VCLIST= <CCCCCCCCCCCCCCC>
##$VD= 0
##$VDLIST= <DDDDDDDDDDDDDDD>
##$VPLIST= <PPPPPPPPPPPPPPP>
##$VTLIST= <TTTTTTTTTTTTTTT>
##$WBST= 1024
##$WBSW= 4
##$XGAIN= (0..3)
0 0 0 0 
##$XL= 0
##$YL= 0
##$YMAX_a= 448756
##$YMIN_a= -675197
##$ZGOPTNS= <>
##$ZL1= 120
##$ZL2= 120
##$ZL3= 120
##$ZL4= 120
##$ABSF1= 10
##$ABSF2= 0
##$ABSG= 5
##$ABSL= 3
##$ALPHA= 0
##$AQORDER= 0
##$ASSFAC= 0
##$ASSFACI= 0
##$ASSFACX= 0
##$ASSWID= 0
##$AUNMP= <proc_1d>
##$AZFE= 0.1
##$AZFW= 0.1
##$BCFW= 1
##$BC_mod= 2
##$BYTORDP= 1
##$COROFFS= 0
##$CY= 11.3945322036743
##$DATMOD= 1
##$DC= 2
##$DFILT= <>
##$DTYPP= 0
##$F1P= 18.9103706918063
##$F2P= -1.10871071338519
##$FCOR= 0.5
##$FTSIZE= 0
##$FT_mod= 4
##$GAMMA= 1
##$GB= 0.15
##$INTBC= 1
##$INTSCL= 1
##$ISEN= 128
##$LB= 0.24
##$LEV0= 0
##$LPBIN= 0
##$MAXI= 10000
##$MC2= 0
##$MEAN= 0
##$ME_mod= 0
##$MI= 1.114404
##$NCOEF= 0
##$NC_proc= 0
##$NLEV= 6
##$NOISF1= 3.799351
##$NOISF2= 2.8
##$NSP= 1
##$NTH_PI= 0
##$NZP= 0
##$OFFSET= 15.70392
##$PC= 1
##$PHC0= -8862.552
##$PHC1= 23.40026
##$PH_mod= 1
##$PKNL= yes
##$PPARMOD= 0
##$PSCAL= 0
##$PSIGN= 0
##$REVERSE= no
##$SF= 200.130013532006
##$SI= 16384
##$SIGF1= 3
##$SIGF2= 2
##$SINO= 400
##$SIOLD= 16384
##$SREGLST= <1H.CDCl3>
##$SSB= 0
##$STSI= 0
##$STSR= 0
##$SW_p= 3612.71676300578
##$SYMM= 0
##$S_DEV= 0
##$TDeff= 0
##$TDoff= 0
##$TI= <>
##$TILT= no
##$TM1= 0
##$TM2= 0
##$TOPLEV= 0
##$USERP1= <user>
##$USERP2= <user>
##$USERP3= <user>
##$USERP4= <user>
##$USERP5= <user>
##$WDW= 1
##$XDIM= 8192
##$YMAX_p= 0
##$YMIN_p= 0
$$ End of Bruker specific parameters
$$ ---------------------------------
##NTUPLES= NMR FID
##VAR_NAME=  TIME,          FID/REAL,        FID/IMAG
##SYMBOL=    X,             R,               I
##VAR_TYPE=  INDEPENDENT,   DEPENDENT,       DEPENDENT
##VAR_FORM=  AFFN,          ASDF,            ASDF
##VAR_DIM=   8192,          8192,            8192
##UNITS=     SECONDS,       ARBITRARY UNITS, ARBITRARY UNITS
##FACTOR=    0.0002004,     1,               1
##FIRST=     0,             0,               0
##LAST=      1.6414764,     0,               0
##MIN=       0,             -675197,         0
##MAX=       1.6414764,     448756,          0
$$ Real data points
##PAGE= N=1
##DATA TABLE= (X++(R..R)), XYDATA
$$ [...]
3598G127q442l871O993o39k969L443k278l247O940l5r091M176Q506q618m311J1048
3614D732p53j1037N530Q366q572l721Q116q97m230L450j047l143O042K11r187
3629f140M098R221q003o500J0853J297j0365L907P333p129k595Q386k523n650
3643c810M836Q86m551L729K096p121K989P692q219n509J1333J864j1671K776R123
3658F443o394m092P121r29n496M811J218n472L454K556o156J756P034p024n298
3673f468J1221J333j2601L116J0589n961p139P556J414n110K507Q95m137L917
3687A132K752p811J374Q654o004p212J0434K787j1615J623J0771n687p448O943
3701F93L132n520R65J463l010L832K263q842J797J0793o120r617R248O298j1101
$$ y = [7127, -1315, -5186, 1807, 1168, -1801, 1642, -636, -3883, 3057, 3022, -6069, -1893, 6613, -2005, -6316, 4732, 3979, -7058, -1528, 6838, -1734, -5455, 2661, 1764, -2466, 984, -63, -3206, 2836, 3047, -6140, -2042, 7179, -824, -7324, 3529, 4826, -5539, -1632, 5701, -1428, -4023, 4363, 1840, -3810, 1026, 1912, -2639, 1090, 3186, -3935, -946, 6746, -1473, -6982, 4351, 6215, -5456, -2680, 6443, 49, -4043, 3078, 2149, -3347, 1464, 2682, -2790, 664, 3220, -2936, -1180, 5854, -1170, -6468, 4753, 6086, -6515, -3399, 7190, 1229, -5910, 1646, 3060, -2050, 457, 1352, -2785, 1132, 3884, -3927, -2553, 6101, 97, -7115, 3319, 6106, -5509, -3886, 6885, 1198, -6250, 693, 3825, -1695, -730, 733, -2277, 1555, 3818, -5024, -3227, 7566, 1446, -8171, 1077, 7375, -3726]
3716c726j207R891l131o622N635K352n448J974J326l842L399L071q006K26J0950
3731F842m977j0601Q548Q187j0785l758J0068n79o764L540J583l825L473J169
3745B121o057K820O183p512k545R670j439j0374O624P432r477l384J0178j124
3759C116p040L833J968l648K584J564o012K745O576o811m556R712M20j0160M668
3774a041P193q361k386R358k377p164N285L221n606J075L355m381R67N262n399
3789i99m008R215J13j0032M194Q028p629l627Q738j177p393N039L821o229M33
3804a513M319l397o19M491m092l051Q795j155j0371N268R461q951n736J0107J042
3819D598q438K271N009m225j55L194l601k84N034m393l558Q524n8j0629M646R923
$$ y = [-3726, -4933, 4958, 1827, -4795, 840, 3192, -2256, -282, 1044, -2798, 601, 3672, -4334, -4108, 6842, 1865, -8736, -188, 7999, -2786, -6544, 3524, 2945, -3819, -279, 1304, -2521, 952, 2121, -3936, -1116, 5067, -2445, -4990, 4680, 3241, -7133, -509, 6923, -2554, -5938, 4240, 3116, -3924, -91, 1877, -1771, 813, 2377, -3635, -890, 5686, -1125, -5681, 4031, 4451, -5709, -1041, 6152, -2209, -4595, 4763, 2386, -4778, 507, 3728, -1878, -803, 2552, -1829, -862, 4400, -999, -5007, 4208, 4321, -5711, -1517, 6511, -1118, -4745, 3993, 2816, -4577, 462, 4283, -1946, -1513, 2806, -591, -1210, 3281, -811, -3862, 4933, 3778, -6593, -1325, 8136, -815, -6551, 3556, 4598, -3840, -1569, 3440, -785, -940, 2254, -1347, -1631, 3403, -990, -4548, 3976, 3918, -6711, -2065, 7858]
3835G858q555p143J0384L349r508P3N799k030o41R87l631J940O040n466o443R908
3851B921L275j1999J289J1521n856q138P836M489p543n83N019k207k93J396l952
3866b825J021P425n712p982R841N968j2216j814J1503k000q876M570M511m988
3880a574L24K749l698J718L586n284j787Q676k456q861O985O865j0486k831J0786
3895D712r47q767M050M108m271N27K508m458J566N738n843l934Q547L85q974L703
3911a350O863o660l351Q322j447p142N317L277o105R70M641m594j076O158l364
3926D59m994P230J510q142K167O777n840k488O608j494o751O350L210p910P07
3941b601P330m104m177N427n97m238M765Q72o545L487N449p204k444R195j783
$$ y = [7858, -697, -7840, 2544, 5893, -3615, -3542, 2257, 227, -414, 573, -3058, -1118, 4922, -544, -6987, 2921, 6196, -5803, -4514, 7007, 1151, -6987, 849, 5338, -2205, -2788, 2231, 24, -269, 1127, -2825, -1804, 5621, -91, -8073, 1768, 7736, -4480, -6294, 5209, 3209, -5667, -1097, 3414, -1574, -1250, 1499, -2199, -481, 3105, -2179, -3966, 4710, 2254, -6607, 378, 7243, -3243, -6074, 4712, 3765, -5002, -952, 3156, -1115, -588, 1920, -2538, -972, 4766, -1077, -5011, 3536, 3921, -5053, -1350, 5513, -1147, -4498, 3824, 2377, -4765, 552, 3829, -2276, -1306, 3335, -1259, -2335, 3823, 459, -4535, 2695, 4205, -3937, -1770, 5007, -833, -3321, 3287, 1793, -4958, 1392, 4602, -3308, -2601, 4729, 625, -3552, 1875, 1278, -2960, 1805, 2677, -3868, -381, 5068, -2136, -4580, 4615, 2832]
3956B832q772N759N570q113j214Q102k382n032M059O53l396L617r0n969N053N115
3972E792q572l157J1342o93j1509M359Q490o065m758O056O09l780K540j256k189
3987b791N077M7p623M027Q020q595n772J1404K264j2316J966R782l908o072M202
4002b88J563j623J965l015k393P280R90j0462K724J0653o349q814Q790N247r472
4017c204j113P975j985m645L354L03j164K891k914m190P550K727j0706N44J1889
4032G312m136j0781P449O772p800k839O112j094j893K451k150j876N652j609o873
4047e303N587N603q465k431J0099j699r233M776O640o571k083N288j406k018L160
4062A944k222k925O310L38q477L359P740o876m544Q690P0p702M081M502o344m44
$$ y = [2832, -5940, -181, 5389, -2724, -3938, 4164, 1782, -3250, 809, 1462, -1934, 1683, 1593, -4376, 677, 5792, -2780, -5937, 5405, 4712, -6797, -2438, 6052, -13, -4771, 1285, 1894, -1886, 654, -602, -2791, 2286, 2333, -5290, -1263, 6757, -1838, -7610, 3794, 6058, -6258, -4292, 5490, 1582, -4490, -288, 1275, -348, 1617, -1398, -3791, 3489, 4479, -5983, -3259, 7394, 1045, -7769, 1021, 6268, -3204, -4317, 3658, 1673, -2972, 382, 685, -479, 2412, -502, -4692, 2858, 5585, -5121, -4577, 7312, 3176, -7605, -156, 6616, -1184, -4023, 2089, 995, -898, 1553, -597, -2473, 3179, 1570, -5303, 284, 5887, -2578, -5009, 5090, 3391, -5842, -1066, 5574, -997, -3080, 2208, 802, -1216, 1944, -278, -3203, 3107, 3445, -5032, -1673, 6067, -809, -5353, 3337, 3407, -4295, -214, 4288, -2056, -2500]
4078b500O075l117l505N276o84m717M469K175p344J908O861n543l780P350L59
4093C283p791M380M413o517k77O632l765m884O111R46n668K574L230m802Q26M662
4109C353m648k604P512p04q567M923N825p189k199Q020j778o132M504K294n131
4124b521J886L129m525Q28M433m918k556Q273o96r583M595Q182p538m943Q388
4139B434J213o625J750K910l182J459J641m375J730N878n932m524Q858J376j0226
4154e615K708R436o374n839P004K756o236J092K288k218J751J239n589K112P327
4169E842o113o431R027M208j0810M45R047l529o333N445K219m240J085J561l006
4184a583K313K475o447P17Q416m439q058P956N419r540j774Q933j808n994L986
$$ y = [-2500, 3575, 458, -3047, 2229, 1545, -3172, 1297, 3472, -3872, -1964, 4897, -646, -4426, 2924, 3283, -4508, -128, 4285, -2232, -2509, 4123, 358, -4526, 1585, 2531, -3137, -563, 2667, -2135, -1309, 3353, -1295, -3899, 3613, 2909, -5658, -735, 5090, -2099, -4298, 3722, 1944, -4188, 316, 2610, -2521, -635, 2494, -2031, -1203, 3230, -1688, -4244, 4029, 3333, -6250, -1655, 6527, -1011, -5954, 2434, 3647, -2978, -1228, 1682, -1500, -41, 1600, -2775, -1045, 4833, -1099, -5623, 3235, 4611, -5615, -2907, 6529, 155, -5684, 1320, 4076, -2160, -1068, 1220, -998, 753, 1992, -3597, -1485, 5842, -271, -6702, 2325, 6533, -4277, -3832, 5215, 1686, -4647, 798, 3017, -1223, -138, 1423, -1583, 730, 3205, -3242, -2525, 5891, 1452, -6606, 1350, 6769, -2771, -4545, 4388, 2580, -3414, 572]
4199E72J515l571K043J278m520K565M299o136j776Q139j979p977N830N487q051
4214b282j996Q133j624o040M268J882m259K177J936n208J898N411n473l349P995
4229C469k40q233M160N704o537j887O845k189n138M755K088n551J784L942m922
4244a950J02N355m456l085O819j88p542M117N828o913k399P985k012o054M837
4259D44K790n842Q22M690l886j397N119l154l079O070j23p610M589N689o722l459
4275e059Q273m49p412L810M466n284j18M153l019j229M798k976l826O339N72p832
4291d793L645O840p076l905Q390P92p763K510M878m424l74L329k590r81N180l676
4307a8m363O724K023q417J769Q079n581n564P798J414p044J750M690l792j291
$$ y = [572, 2087, -1484, 559, 1837, -2683, -118, 4181, -1955, -3731, 4408, 2429, -5548, 282, 5769, -2282, -4278, 3855, 2231, -3809, 459, 2341, -1918, 259, 2195, -3013, -1115, 4296, -1177, -4526, 3469, 3229, -5004, -844, 4860, -1677, -3564, 3281, 1092, -4046, 709, 2797, -2754, -970, 2972, -1950, -1848, 3507, -949, -4034, 2785, 2597, -4945, -828, 5000, -1913, -4312, 3673, 1661, -4393, 444, 3234, -2608, -1786, 2904, -982, -2379, 2740, -414, -3493, 2577, 2454, -5156, -567, 5122, -1600, -5059, 3214, 2765, -4647, -837, 3629, -1655, -1773, 2380, -639, -1868, 2930, -46, -3872, 2467, 3039, -4793, -1148, 5692, -1384, -5289, 3101, 3893, -3870, -1360, 3518, -906, -1280, 2049, -541, -1522, 3658, -18, -4381, 2343, 4366, -4051, -2282, 5797, 216, -5348, 2450, 3864, -3180, -1430, 3260, -532, -1823]
4322a823L991k800p29M681k860m911O449K711q598Q95Q538m544o188O497K446
4337C755o638J829L887m068n18M577l284j924N219j703n380N253L585p995R6Q277
4353D968l578o901O489K856o273M72M690l615q07M159k761l036N703n97o161M376
4369a6M333p058q03Q000l108o623O160L203o905K27N546l037k409M100j524k792
4385b706M786k19o256M126M967p115j635Q052k318o531N178M266o952m91N842
4400B994k700k916M015p22l145M633k91n870M202N135p570k240Q724j300q046
4415e097M516N317n796j690N363k212k454L673q82l485M893R5o240L497N787o898
4431a613l013Q458j59q558L591N795n041k412N175j363k777L854j697l190M961
$$ y = [-1823, 2168, -632, -1361, 3320, 460, -4451, 1998, 4709, -3889, -2994, 5544, 1000, -5188, 1309, 3755, -2883, -1054, 2833, -1235, -1753, 2824, -460, -2384, 2835, 1132, -4248, 1005, 4590, -3405, -3309, 4968, 1390, -5511, 978, 3834, -2439, -1967, 2723, -892, -1699, 2460, -301, -3337, 2366, 1769, -4392, -16, 4317, -2741, -3544, 4456, 1348, -5275, 885, 4088, -2817, -2590, 2956, -81, -2490, 1610, 86, -2706, 2080, 1861, -4395, -269, 4698, -2417, -4052, 4000, 1682, -4849, 329, 4595, -2357, -2848, 2994, 294, -2622, 1393, 671, -2474, 2159, 1868, -4002, 200, 5335, -2235, -4475, 4249, 2949, -5097, -581, 4736, -1060, -2750, 2613, 401, -2053, 1620, 738, -2747, 2146, 2241, -3999, -502, 5285, -1613, -4626, 3832, 3673, -4885, -1294, 4501, -540, -2952, 2223, 860, -1917, 1937, 240, -2950, 2011]
4446B011J614p289K187P072n908m704Q010J152q181K273N996m451k643M927j139
4461I27k649L712j226m033M855K083p402J393P516m939n549P034K496p869J752
4476a899N481m333j738M408j257l437M379j51m688L713L221o329N0P022l882n679
4492e119O770K393p301R02N998m192k183M832j300m068M373Q51n267L091L818
4507C598n921o01O839l252n361O226K397p489J035O894m630l237N289l90m031
4522b634L034J615m974K414M027n352j435P011k929n444N832L062p482P02O759
4537D206l816m460N336J021m441K297J805m253J999L749n585r00P490k622p012
4552e186N968M297p670m90P160k616m982M317J426l912J733J812l948J908L861
$$ y = [2011, 3625, -3664, -1477, 5595, -313, -5017, 2993, 4145, -4036, -1763, 4233, -218, -2861, 2066, 927, -1722, 1990, 764, -3269, 1586, 3669, -3733, -2340, 5176, 237, -5312, 1722, 4218, -3651, -1899, 3582, -751, -2489, 1919, 662, -2775, 1604, 1453, -3235, 478, 3699, -2630, -2580, 4442, 560, -5119, 1651, 4044, -3257, -2355, 3643, -549, -2732, 2100, 800, -3268, 1105, 1956, -3311, -220, 3598, -2323, -2924, 3915, 663, -4698, 1528, 3925, -3564, -2529, 4365, -265, -3502, 1787, 1397, -2634, 400, 2015, -2959, -545, 3482, -1870, -3305, 3706, 777, -4667, 1165, 4227, -3255, -2553, 4206, 390, -4070, 1266, 2287, -2154, 143, 1948, -2305, -306, 3443, -2142, -3042, 4448, 1826, -5186, 782, 5079, -2591, -3081, 4079, 1463, -3519, 798, 2224, -1688, 45, 1857, -2091, -183, 3678]
4567C678n635j350P404j554p883N021O106p410k242O868o54n291L371J257l444
4582a758K301J615m697J651N118n448l028P700k55q394M288O232o111l188O567
4597B593l41m736K532J277l193K544J579n179J482N878m592m754P206J665p871
4612c910J923O523n084l152N909n64m256L238J190m044K233K523m593l63O201
4627C774l629m712O134K482p328Q06O141m018l001N354n60m243L161J878m952
4642b713K007L971m687r76N575k476m804N055K255o202Q15N923l944l431N651
4657B019J39m881K961K236m423L72M547l816k053N538j576m722N002K128o536
4672c065J273O154m361l954O123O15n789K013L969m099l78M015k835k157N035
$$ y = [3678, -1957, -3307, 4097, 2543, -5340, -319, 5787, -1623, -3865, 3003, 2349, -2942, 429, 1686, -1758, 543, 2158, -2539, -888, 4230, -1218, -4246, 3454, 3199, -5195, -907, 5325, -786, -3974, 2593, 2252, -2484, 48, 1325, -1868, 676, 2255, -2924, -1442, 4436, -156, -4910, 2296, 3961, -3910, -1987, 4536, -548, -3700, 2209, 1645, -2611, 627, 1817, -2227, 6, 2529, -2064, -2427, 3774, 145, -4567, 1567, 4049, -3279, -2473, 3668, -350, -3351, 2003, 1443, -2800, 361, 2239, -2713, -706, 3265, -1422, -2398, 3177, 701, -4103, 952, 3207, -2995, -2180, 3743, -201, -3632, 2019, 2158, -2723, 238, 2474, -1949, -1577, 2970, -846, -2899, 2639, 1063, -3659, 1343, 3471, -3065, -1792, 4362, 1, -3953, 2170, 2785, -3004, -991, 2978, -1121, -1499, 2516, -319, -2476, 2559]
4687B559j471n103N267K690p060P87O872l850n377O049K142o223J385M141l184
4702c76r27L465k503j281M478j830n000N207L717p854n37Q165k956o174M689K931
4718C214m949R1L668k564n72L345k760j926N486j405o119M846M711p312j726P608
4734C636j057o839L749L542l983n24L125k611J55L146l101k529N891L19p167L125
4750a123N676n561l251P253k45o369K679L928m414M24K334k462l5L747k787l703
4766c909O262J151p307J331O804m832l579N718N50n161K360L111l839M51L626
4781B737l720j268M604j584m469M909K303o232N93O222l871l815N074Q61m955
4796b611K330K854m380N68L597k700k418M913n83m948L756K946n175P9N304l514
$$ y = [2559, 1088, -4015, 1252, 3942, -3118, -2331, 4541, 691, -4686, 1363, 3505, -2718, -1333, 2808, -376, -1303, 2162, -341, -1622, 2856, 1026, -3974, 1233, 4950, -2904, -3441, 4724, 1768, -4406, 283, 3214, -1735, -1644, 2024, -540, -1112, 2233, -527, -2453, 3033, 1628, -4491, 355, 5066, -2246, -3972, 3636, 2579, -4260, -511, 3031, -952, -1476, 1649, -962, -807, 2339, -762, -3291, 2600, 2919, -4248, -1123, 4553, -1008, -4259, 2994, 2749, -3620, -941, 2987, -1427, -1003, 1331, -1131, -1166, 2581, -206, -3909, 2353, 3504, -3803, -2472, 4332, -500, -4079, 1639, 2189, -2972, -612, 2499, -1340, -889, 2737, -983, -2251, 2353, 769, -3700, 1209, 3512, -2720, -2127, 4095, 224, -3591, 1483, 2344, -2611, -281, 2573, -1807, -1239, 2358, -342, -2760, 2153, 1570, -3378, 378, 3324, -1851, -1772, 3532, 18]
4812A8l620N464Q08n671K386M059m561p94M446j872l215M168L81m658K784K833
4828B956n248L97N443l671l142N315J010o101J608N116l912k414M525n51l560
4843b229L606O9m078L152K843n779M61N888l165n223N968K275o111M16N127k925
4859B95k857L939k25l182K948J21l669K973L399n945q25P033k567o054M947L836
4875D167o241q92N558j904k615K760m40k121K946J82m486K861M325o132j480O838
4891C326j449o518M065M687n551j740N073j337k164K220l41k140L427L76n215
4906c281K357N181n557k839O911q8o476K843M498m352j630M320j443k133K795
4921A106k39l297L646J387n557J438N266l916m141O313J080o222J933M206l703
$$ y = [18, -3602, 1862, 2670, -3001, -615, 3444, -1117, -1911, 2535, 663, -2552, 1616, 1997, -2661, 123, 2956, -2292, -1895, 3548, -123, -3265, 2050, 3060, -3041, -1433, 3683, -229, -2643, 1882, 1331, -2229, 1377, 1446, -2632, 520, 3363, -2416, -1955, 3933, 768, -4455, 1513, 3788, -2323, -1907, 3220, 295, -2562, 1377, 1152, -2030, 918, 1039, -2630, 343, 3742, -2203, -3028, 4005, 1438, -4616, 331, 4167, -2074, -2966, 2592, 688, -1927, 833, 393, -1728, 1218, 1400, -3086, -225, 4100, -2032, -3512, 3326, 1877, -4641, -576, 4111, -1440, -3180, 1893, 556, -1608, 612, 271, -1869, 1558, 1934, -3281, -924, 4257, -1300, -4139, 2772, 2684, -3792, -949, 3549, -803, -2433, 1887, 444, -1689, 1106, 867, -2430, 1216, 2603, -2954, -1516, 3750, -166, -4307, 2006, 3086, -3136, -1203, 3003, -700]
4936g00j296L586j323k303L734l48l936K950K420m836L37N262l270l928N319J246
4952B914n562J501M000l180j763M357j620k857L778L55m194J871L715m814n29
4967b028M854k160l852M648J208n410J960M367l963k140M719q32l526K657J399
4982A901l699J353K837l725o85M972k175m016M287J957n459R79M939l846k477
4997b857M810k55m257K312K052l520R58L077l660o11M501j880m415M538K390n590
5013b407J86N326k745l452L938J194m031J613K422l596Q19K959l267j037M578
5028B500j762m510M411L018n998m98O052k581m130M023J429l433J064J946k816
5043a285L34L471l482j652N249r10n406L820L584n270j402N740j724m034L086
$$ y = [-700, -1996, 1590, 267, -2036, 1698, 1350, -2586, 364, 2784, -2052, -1715, 3547, 277, -3651, 1668, 2914, -2648, -1147, 2853, -327, -2090, 2267, 647, -2210, 1568, 1923, -2271, -400, 3315, -1499, -2028, 2826, 666, -3186, 1462, 2670, -2740, -780, 3587, -376, -2516, 2203, 1371, -2155, 502, 1901, -1798, -445, 2392, -1333, -2018, 2954, 779, -3237, 1050, 3007, -2452, -1473, 3466, -380, -2857, 1953, 1698, -2559, -247, 1805, -1715, -757, 2320, -1340, -1951, 2550, 670, -3745, 793, 3183, -2407, -2221, 3105, 360, -3092, 846, 2040, -1991, -378, 2044, -1552, -733, 2226, -1041, -2078, 2500, 738, -3772, 639, 3657, -2341, -2839, 3213, 632, -3498, 525, 1954, -1479, -415, 1531, -1285, -951, 2520, -962, -2614, 2635, 1725, -3681, 139, 3723, -1547, -2949, 2791, 1067, -2967, 119]
5058A19J937l634J369J610k788N93L433k788k744N336j31n693K708M712n046j645
5074b652M830m89m392K929J819l368P38K746l073j10L508k764k627M877O78n740
5090c090K033M897m309k475M787o9l905K313J812l189O56K559l118m69L890j931
5106C92l325M767P05n585J721M815l509l061M795L28m250J890K204l105N33K683
5122A998l046o02L983j776l954M415J967n395M34N058l200l025M609K75l553J480
5138c32K021k627N1K496k423j206M231j456l913L624K408n272R3N401k690l606
5154c200L965J300m055J063K953l258r2L133k331j573M021q22m018L329K523m971
5170b033n13N362k224l454L590J500l978Q27K894k889n02L436j765k473L757N2
$$ y = [119, 2056, -1578, -209, 1401, -1387, -794, 2639, -149, -2893, 2443, 2312, -3381, -673, 4039, -1007, -2652, 2178, 1689, -2703, 226, 2045, -1323, -585, 2161, -912, -1022, 2486, -278, -2905, 1972, 2650, -3090, -1057, 3840, -469, -2944, 1843, 1774, -2131, 182, 1994, -1195, -539, 2020, -1098, -1567, 2323, 392, -2933, 1834, 2539, -3046, -1325, 3490, -19, -3080, 1715, 2043, -2207, -317, 1887, -1218, -685, 1998, -1048, -1650, 2333, 557, -3397, 1018, 2985, -2410, -1976, 3082, -118, -3143, 1466, 1741, -1812, -332, 1689, -938, -887, 1609, -814, -2020, 2211, 755, -3158, 466, 2874, -2398, -2305, 3096, 406, -3200, 765, 2065, -1990, -927, 2026, -1232, -1324, 1809, -522, -2095, 1926, 1104, -2914, 415, 2938, -2033, -2546, 2816, 592, -2862, 728, 2228, -1750, -923, 1971, -918, -1420, 2016, 251, -2222, 1535, 1587]
5186A587m327K462L420m732o34M832j558l810L200J714l833O41L271k573j017
5201a357L209j610k373L435Q10m345J811L725m378j220M947j594l997L282K498
5216B843m197Q5L759k689j717L529j011k411L139M95m325J951L621m289j422N244
5232B605j398m110K820K652l907j73M050k623j898L256l50k770K466J232m424
5247b572K208L642m146j928M935n28m538K083L747l711j045L622j797j623K656
5262A005p08k341K922J124m010Q51M486l817k888N196Q56n627K025L889l429j427
5278a893L475p79k213K379n34k771K958J725m461N92M670k840l658M485J187m977
5294b655R94M610l598j132K855n23k227K657j80l240L149J659m454R9N066k524
$$ y = [1587, -2740, -278, 3142, -1590, -2224, 2608, 1050, -2760, 440, 2154, -1679, -1038, 2233, -340, -1357, 1852, 242, -2131, 1304, 2114, -2231, -420, 3305, -1073, -2293, 2654, 1060, -2937, 345, 2843, -1354, -1269, 2490, -199, -1916, 1613, 602, -1809, 1330, 1825, -2500, -549, 3072, -1217, -2639, 2605, 1207, -2903, -83, 2569, -1338, -1511, 2539, -84, -1982, 1274, 924, -1846, 620, 1852, -2572, -364, 3278, -868, -2796, 2139, 1611, -2927, -844, 2903, -808, -1853, 1769, -28, -1651, 1005, 297, -2044, 878, 2002, -2008, -1157, 3329, -488, -3376, 1820, 2676, -2951, -926, 2963, -466, -1893, 1582, 803, -1410, 969, 435, -2336, 622, 2347, -2114, -1522, 3148, 308, -3350, 1135, 2322, -2655, -1661, 2949, -649, -1781, 1074, 551, -1676, 981, 801, -2439, 710, 2369, -2085, -1986, 3080, 556]
5310E56m109M007K493m996N15L549k004j676K944j048j986K945N7l583K333K861
5326B858m294p96M791j621m210L781K424m618L79L807j982k032L003j036k238
5341a784K838O15m098K215L051l738j544M786p05m326K924K377l804j77L868k526
5357b8j716L385m65l120K613J061l747J224L413l414j347M006m52m300K799K790
5373B702m277j41L783j846k628L385M41l564K236J999l395L21L093k387j726M087
5389B083n81m285K492K906m102o09M505j786k950L049J004l326J759J584l059
5404a316K75L154k733j863M204J00m845K342L694l686j880M323m79l550K511J427
5420A678l106J158K012l511O60L183k686k004L850Q75m825J649L992l583k093
$$ y = [556, -3553, 454, 2947, -2049, -1534, 2015, 11, -1665, 1279, 231, -1755, 1190, 1247, -2336, -3, 2858, -1436, -2232, 2559, 938, -3272, 509, 2933, -1685, -1306, 2501, 519, -1513, 1490, 454, -1784, 1054, 1669, -2429, -214, 2837, -901, -2445, 2341, 1636, -2690, 234, 2611, -1193, -1370, 2498, -28, -1744, 1641, 1176, -1944, 669, 1730, -2017, -793, 2620, -794, -2141, 1865, 1413, -2887, -88, 2702, -1575, -1716, 2067, 221, -2407, 978, 1419, -2145, 91, 2090, -1305, -984, 2109, -278, -2004, 2083, 1502, -2783, -291, 2615, -1487, -2096, 2409, 623, -2327, 722, 1726, -1600, 159, 1743, -1316, -1041, 2113, -620, -2483, 1721, 1821, -3024, -682, 3012, -674, -2554, 1769, 1290, -2260, 251, 1678, -1428, -270, 1742, -1769, -1109, 2074, -612, -2616, 1234, 2109, -2716, -1067, 2925, -658, -2751]
5435b751M230m29l099K108J462k763R78K016l093r2M146k638k785M154J351n362
5451b567J193M254k953k533M002K91l672K401J218k964J220J879k763o00L703
5466B109j563l287M008J536m708O09M175k616k822L562K44k634J568J460k980
5481a339J054K732l458p84L949r74m003L423K319m370l19M156j590k789K930N65
5497A502l017J578J820l317N96K615k505j306M270r32l936K963K626m253l35M047
5513B416k005k933L313Q68l301J398K276l426L14L214k683j756L910n21l524K036
5529d04L231l529j116L790j413k990L087R37l386J291K334k849n27L312j875j890
5545a997L631p7l991K111K959l396j272L941r89l174K534J729l416M99K895k779
$$ y = [-2751, 1479, 1050, -2049, 59, 1521, -1242, -264, 1752, -1341, -1433, 2713, 75, -2710, 1444, 2795, -2567, -1374, 2880, -73, -2606, 1396, 1687, -1985, 416, 1634, -1330, -110, 1769, -994, -1594, 2109, 546, -2741, 1267, 2803, -1905, -1296, 2879, 263, -2559, 1003, 1247, -1387, 181, 1641, -1339, -285, 2447, -1011, -1795, 2154, 1180, -2823, 600, 2919, -1451, -1770, 2386, 796, -1993, 937, 1502, -1515, 63, 1883, -1434, -838, 1777, -728, -2034, 2236, 1304, -2632, 331, 2957, -1296, -1631, 2416, 411, -2522, 791, 1659, -1642, -244, 2032, -1394, -1080, 2134, -549, -2305, 1605, 1084, -2440, -404, 2827, -702, -1818, 1972, 559, -2431, 656, 1593, -1793, -502, 1832, -1017, -1544, 1768, -107, -1997, 1634, 1557, -2434, -323, 2636, -760, -2032, 1909, 920, -2254, 280, 2009, -1407, -908, 1987, -792]
5561g92o91L470j873k274L357O12m115J371L566l674j334M381j152l466K358K510
5577B254l612M45K796k426r19K998j151k384L035Q69m086J384L674l273k234M540
5593A910o43l614K302K000k840pK624k018r81K986j030k890L217J085m215J065
5609a049L946l053k587M070P98l944J546K517k775n36K872j982j235K976r43k781
5625b160L000J468m271L39M350k503k740L597Q56l820J289K567k802l13K770j430
5641A97j917L216o70k999K590J974l881m70M339j658l135L285J101l804R33K836
5657A937k743m43K855j853j649L082K07l919K465K653m041p60M405j324l535L350
5673F87J618l764O20K658k243j037K824j301k156L010O99l825J839L184l892j262
$$ y = [-792, -1483, 1987, 114, -2160, 1197, 1809, -2306, -935, 2631, -1043, -2377, 2004, 852, -2614, -256, 2254, -1358, -913, 1883, -543, -1462, 1536, 385, -1999, 1036, 1905, -2181, -797, 2877, -396, -2630, 1910, 1267, -2347, -45, 1955, -885, -892, 1732, -286, -1267, 1719, 689, -2201, 1016, 2101, -2114, -1049, 2897, -156, -2743, 1327, 2125, -1819, -273, 2244, -531, -1067, 1805, -177, -1412, 1564, 621, -2160, 840, 2308, -1963, -1624, 2726, 223, -2517, 1080, 1936, -1884, -595, 1972, -830, -1143, 1627, 197, -1720, 1496, 826, -2173, 417, 2391, -1490, -1960, 2379, 721, -2414, 871, 1972, -1832, -899, 1937, -806, -1249, 1606, -247, -1896, 1186, 1393, -2526, -61, 2592, -1449, -2209, 2196, 872, -2663, 687, 2305, -1459, -839, 1819, -424, -1461, 1363, 62, -2094, 916, 1615, -2210, -371, 2813, -1079, -2341]
5689b341M312n98l562K436J734l253J22K966k210j413L207o15l186L273Q52l596
5705a872J145L275l076j682M034j109l037K650J948l620p0L462k070j762L111
5720A327l08k897K436J109l270O07L310k670j912M206m36l929K670K202l455m42
5736a452L792k025k054K853N5l020K324J345l373N83L656k993j938M125l16m023
5752b461K002L122l528q81L530j399k293K790J89k866K015J723l686M77L788k578
5768e6k674M063N29m363J814L041l050j184L370q68k328K419L02k746J660J836
5784A765l158j37L930k120k899L458J448m480R15L618k715j804L148l95k187K005
5800C92P23k720J408K099k921j117M411j675l641L692J493l889J93L567k100j465
$$ y = [-2341, 1971, 1373, -2189, 247, 1981, -1272, -1150, 1816, -394, -1807, 1400, 785, -2401, 872, 1724, -1872, -727, 2548, -528, -2210, 1824, 715, -2322, 328, 2276, -1344, -1414, 2048, -22, -1784, 1327, 1019, -1878, 558, 1667, -1603, -996, 2314, -356, -2268, 1938, 1502, -2427, 243, 2445, -1010, -1452, 2340, 315, -1739, 1114, 1169, -1851, 473, 1818, -1555, -972, 2684, -309, -2247, 1878, 1562, -2461, -459, 2663, -865, -1746, 1784, 385, -1908, 882, 1071, -1795, 220, 1943, -1743, -1266, 2522, -56, -2730, 1333, 1862, -2501, -687, 2354, -696, -1880, 1490, 622, -1706, 713, 1015, -1731, -71, 1765, -1393, -1530, 2400, 280, -2619, 839, 2287, -2193, -1278, 2340, -375, -2179, 969, 574, -1613, 392, 1115, -1605, -197, 1902, -1019, -2136, 2275, 600, -3041, 651, 2144, -1745, -1552, 2015, -85, -1550]
5816a550K460k10k620K458P67l155J339K629l359o74M092j493l743L149K591l908
5832a227m20L595j950j707K554J34k889K382J341l537J303L008l117j851M045
5847A664p5m114K535K479m010q9L543j332k477L272m1k745J595J460l167O49L438
5864B585k655j929L356J59l825K168K627l632n88L860j323l040L347J99k989J917
5880B37J501k780j53L332j941k016L266K86l803J591L198l620p57L634j164k746
5896a935K651P80l371J262K525l139k24L269j437k617L336Q13l834J279L003k936
5912e75j601L658l69l224K372J799l694R48K580k496j025L114q70k864L306P53
5928A812l979J441K879k387k258L768q5l150J721J843k802K0K943k318j061L466
$$ y = [-1550, 910, 700, -1920, 538, 1305, -1850, -511, 2118, -1241, -1915, 2177, 684, -3059, 90, 2681, -1227, -1647, 1948, -2, -1709, 845, 979, -1910, 472, 1813, -1724, -421, 2587, -530, -2381, 1664, 1589, -2525, 10, 2489, -1521, -1610, 1933, 601, -1876, 1396, 1355, -1390, 205, 1665, -1502, -853, 2585, -70, -1999, 1357, 1516, -2309, -141, 2486, -1146, -1734, 2126, 803, -2237, 1110, 1309, -1680, 237, 1738, -1042, -1195, 2137, 196, -1820, 1446, 1732, -2071, -480, 2718, -902, -1659, 1975, 811, -1935, 716, 1496, -1875, -613, 1912, -1227, -1451, 1818, 381, -2236, 1100, 1913, -1921, -642, 2361, -575, -2176, 1482, 1113, -2111, 261, 2060, -1634, -686, 1894, -602, -1627, 1487, 617, -2247, 1059, 1812, -2167, -726, 2153, -234, -2492, 1276, 1191, -1959, -238, 1605, -1197, -1177, 1766, -552, -1613, 1853]
5944A853j301k915K933J405l873O82L527k465k216L688L15l364J753J711k696
5959i63L5K686k297q41K933q02l269L340J362l958j47M539k381k693L498N75l277
5976a660J279K104k635j09K494j774j510L210k48l653K315K832m033l52M412j849
5992H23l179L352O08l009J091K212l049K99K579j342k114L073M36l857K075K590
6008B588l340j057L935j182l164K612J257l004Q68K351k451m94K765j442k290
6023b048L163L60l856J882K664k851j390L863q83k934K286J700l520Q92K535k388
6039e25j017L456j343k709K829Q88l736J391K866k893j489L962k28l388J788J929
6055A781l075M77K645k116j588L402j049k528K488J369l783R28L440k429k248
$$ y = [1853, 552, -2363, 570, 1975, -1898, -1216, 2311, -154, -2370, 1318, 1633, -1731, 22, 1733, -963, -928, 1758, -539, -1380, 1553, 751, -2518, 822, 2184, -1774, -1921, 2618, 237, -2456, 1042, 1617, -1660, -381, 1723, -912, -1021, 1473, -301, -1811, 1399, 1151, -2502, -187, 2645, -1388, -1740, 2672, 823, -2356, 996, 1604, -1405, -314, 1898, -1151, -852, 1727, 385, -1729, 1344, 1780, -2077, -2, 2588, -752, -1809, 2126, 944, -2220, 392, 1649, -1355, -487, 1864, -587, -1081, 1684, 242, -2048, 1115, 1475, -2381, -499, 2165, -686, -2076, 1787, 904, -2030, 256, 1956, -1564, -672, 1863, -525, -1542, 1914, 571, -2138, 691, 1579, -2157, -766, 2100, -793, -2282, 1680, 1452, -1936, -148, 1781, -1294, -817, 1828, -288, -1876, 1526, 477, -2051, 437, 1806, -1977, -1049, 2391, -38, -2286]
6070b286L870m23l385K252K045l190k46L129k087j451K938m32k460K095J453l476
6086a654M27L413k223k154L890q3l786J921K277l139l11L188j991j509K807j16
6102I57k835J911K143l412LL913k534k358L408O23l690J300L014l122q72L160
6118A609j250j965K431L64l002J782K190l576L9L785j937k609L031J300l918Q79
6134h47K711k210j054K944j114k049K544L49l174J787K412l421m20L686j364l178
6150b398K892J699l642L15L217k339j351K543l77k310K443M78k800J254K826l234
6166g84j204L911j102l196K785J710l195PK741j564j846L066p96k012J985J012
6182A518l442R19L169k774j788M068p49l355K343K122l058j82L007j891j143K347
$$ y = [-2286, 1584, 1161, -2224, 28, 2073, -1117, -1363, 1766, -321, -1772, 1166, 734, -1726, 369, 1822, -1654, -1227, 2186, -37, -2191, 1699, 1616, -2170, -249, 2028, -1111, -1422, 1766, -225, -1734, 1073, 957, -1878, 33, 2176, -1236, -1233, 2680, 146, -2212, 1196, 1819, -1871, -571, 2443, -679, -1551, 1609, 359, -1606, 825, 1189, -1813, -31, 2159, -1417, -1378, 2407, 470, -2139, 892, 2192, -1726, -847, 1864, -346, -1400, 1544, 430, -1619, 925, 1274, -1900, -113, 2299, -1122, -1542, 2144, 780, -2398, 494, 2193, -1449, -1134, 2083, -256, -1607, 936, 559, -1751, 692, 1170, -1630, -376, 2450, -784, -1988, 1923, 821, -2375, 410, 2120, -1075, -1068, 1673, 109, -1737, 1329, 533, -1479, 506, 1518, -1924, -1005, 2164, -610, -2398, 1670, 921, -2434, -91, 2031, -1027, -1209, 1798, -93, -1236, 1111]
6198A111k34k702K027J388l163P96K824k084k527M009l85l271J824K401k789q25
6214a600L273j573j681K509J20k778K141J553l130q6L259j992k246L253O77l699
6230b000J601K738l067q39L213j224j844K430K18k648J599J943l262r7L341j767
6246C35k408L300N45l403R14K770k397j306L201q45k265K198O55k772J277K308
6262B107l124o39L858j805k631K815J355l708Q22L015k483j324K811k99k514K876
6278A132P16l423J049K578k433j157K990o91k846K756J251l445P71K764k168j562
6294a718K689k0k590J731J355k890M21K885k450r79K941l37l055K330J560l251
6310a378K08L190k022j985L269j82k804J319K076k917J66K342j646j752L380j60
$$ y = [1111, 877, -1825, 202, 1590, -1573, -777, 2047, -37, -2564, 1445, 1060, -2211, -387, 2014, -775, -1600, 1673, 100, -1581, 928, 1048, -1730, 411, 1964, -1166, -1252, 2007, 15, -2231, 1022, 1699, -2000, -399, 2339, -728, -1567, 1646, 422, -1422, 1008, 1226, -1422, 177, 2120, -1142, -1239, 2102, 335, -2073, 1227, 1772, -1631, -717, 2053, -344, -1650, 1551, 706, -1559, 639, 1294, -1478, -201, 2107, -1017, -1656, 2202, 397, -2234, 581, 1936, -1772, -950, 2065, -418, -1742, 1069, 770, -1744, 1132, 1848, -1575, -526, 2052, -381, -1538, 1452, 761, -2085, 671, 1922, -1523, -752, 2012, -156, -1718, 971, 951, -1639, 92, 1447, -1443, -1022, 1863, -587, -1566, 1375, 1038, -2017, 313, 1873, -1378, -1170, 2020, -2, -1987, 1282, 1100, -1704, -385, 1691, -1226, -1060, 1282, -364, -2116, 1264, 1104]
6326A104l230K251J950l218l01L306j711j983K758K56k867J444J354k029%K676
6342A760j755j618K887k67l172K047K330l429k94L357r24k731K179R09k546R07
6358c60K161k645m5K519j652j628K875R2l258J635K897l343j139L546p37k455
6374a537J779J143k644R49J827k239l37K882j682k001K858N49l023M80L090k261
6390a67j574L013k23k787K053J400k703R42J793k529l24K714j119k634K800J253
6406A908l577M56L433k569j438K514K43k582J888J052k378J86K551j924j555L222
6422A430q15k307J829J739l367J06L354j942k031L031K21k965J850J138k614L89
6438i54K603j846j922L173L1l119K010J530k563L4K824j623k275K763M17k698
$$ y = [1104, -2126, 125, 2075, -1143, -1444, 1862, 151, -1832, 926, 1182, -1685, -241, 1113, -916, -916, 1760, 5, -1613, 1274, 1007, -2165, -118, 2212, -1217, -1511, 1846, 922, -1809, 370, 1279, -1267, -360, 1801, -844, -889, 1630, -22, -1650, 1225, 1317, -1941, -306, 2591, -752, -1891, 1655, 918, -1537, 242, 1385, -1259, -310, 1517, -722, -1059, 1823, 141, -1860, 998, 1547, -1476, -996, 2094, -167, -1741, 1272, 1049, -1738, 315, 1715, -988, -46, 1747, -782, -1106, 1608, 489, -2145, 655, 1908, -1669, -1213, 2220, -349, -1787, 727, 970, -1612, 276, 1328, -1050, -864, 1687, -237, -1792, 1430, 615, -1692, 137, 1876, -1491, -1385, 1969, 27, -2004, 1027, 1248, -1717, 133, 1271, -1343, -954, 1649, -197, -2119, 1054, 1085, -2034, -24, 1506, -1057, -1023, 1801, 178, -2097, 666, 1083, -1615]
6454a615J348K087k712k67K442j296j465K453M00l234J614K308k868m22K693j074
6470C92k343K935L89k936J334J793k030j122K680n86j800K191J02k273J248J810
6486A784k583o03L235j305k557K447R55k743P48K200j663j133K386l40k437K294
6502F85L99k452J032K568k958m84L110j027l015K557J299k864L03K245j412j290
6518a304K505m47k215K277M59k544M96K573k172j196K820l98k686J747J926k603
6534g62K3K323j435j603K361k95j864J918R49l181N51K975k157j666K916K66k878
6551a559J404J728k277m52K372j285j511K646j77k743K058J471k904O3L173j771
6567B36j841K263P66k914J168J672k202k82K482j083k046K601K02k803J654J912
$$ y = [-1615, -267, 1820, -892, -1159, 1283, -13, -1478, 975, 1375, -1859, -245, 2063, -805, -1227, 1466, 392, -1951, 984, 1373, -1563, -229, 1564, -466, -1588, 1092, 506, -1294, 897, 999, -1274, -26, 1784, -799, -1402, 1833, 528, -2029, 418, 1373, -1370, -622, 1578, -85, -1218, 1168, 828, -1609, 685, 1084, -1368, -336, 2232, -726, -1210, 1900, 873, -2142, 415, 1714, -1150, -847, 1398, -14, -1304, 1201, 754, -1461, 816, 1275, -1269, -773, 1800, -372, -1568, 1252, 854, -1832, -85, 1841, -762, -739, 1584, 149, -1454, 907, 612, -1252, 666, 1615, -1566, -1015, 1960, -197, -1863, 1053, 1319, -1559, -155, 1573, -704, -1156, 1216, -69, -1580, 1066, 889, -1854, 204, 1675, -1229, -1166, 2007, 236, -1605, 658, 1424, -1490, -322, 1350, -852, -1134, 1348, 265, -1781, 820, 1022, -1781, -127, 1785]
6583A785k685j49K527j234k131K345P89k651J142J852k324o78K771j074j845K264
6599G04L33k475P93K504k471j055K660k70k250J888J102k797Q23K314k325j122
6615a644L003p62k093J902R17k559P86J901k034m14K384m46l025K449J046k421
6631a010L58K479k167j128K833m41k686J969J072k382M20K309k498k67K385o61
6647E85j928J686J396k785j6K584j403j684K504m5k556J720J455k330nK312j517
6664b7j405K549l77k666K074J737k807k59K741j186j948K225K5j638Q77J253k041
6681h73m7K951j855k124L046J27k998J542J888k462k90K528j263j564J997L08
6697I11k332J530P96j731J35K215j388k347K894Q68l266Q65K542k059j142K407
$$ y = [1785, -900, -1049, 1478, 244, -1887, 458, 1247, -1404, -262, 1590, -734, -1412, 1359, 285, -1560, 704, 1037, -1438, -645, 1859, -612, -1667, 993, 723, -1527, 361, 1463, -1334, -511, 1803, -522, -1644, 1359, 597, -1496, 406, 1323, -1236, -450, 1451, -583, -997, 1387, 941, -2084, 365, 1411, -1010, -652, 1827, -340, -1468, 1365, 924, -1762, 207, 1279, -1103, -683, 1626, -872, -1139, 1246, 585, -1343, 343, 1739, -1046, -1062, 1522, 119, -1565, 939, 894, -1662, 58, 1513, -817, -822, 1490, -27, -1432, 1117, 740, -1926, 148, 1885, -922, -1181, 1560, 374, -1574, 651, 676, -962, -85, 1168, -873, -920, 2031, 176, -1948, 1098, 1225, -1773, -231, 1657, -805, -1095, 1433, 170, -1394, 603, 911, -1421, 109, 905, -826, -691, 1524, 136, -2211, 683, 1551, -1715, -850, 1692, -367, -1509, 898]
6713H98n79j896J909M43j786N97J758j918r43K828j079k000K243R66k947R11K184
6730A589j859j080K321n41k022K404K04k171O83K078k042p59K408p79j894J990
6746E30O52k360O37J889j400j254K230j58k227J515J002j884L52K112j756j265
6762a385K516l35k171J444J699k602P8K327j662j276K521m69k218J489J557k104
6778e91k15J971j480o28J998o32k112J807J653k738p6K786j618j514K401J18k669
6795a539J279K128k644j85K091j072j247K094p4k613J444J971k568l81K869j130
6811D23k021K058R40k463Q71J443j941m02K369j102j635J977L46k251J171J506
6827A289k045o23K766q46k151J889J022k357P14J296j538m23K054q68j611K090
$$ y = [898, 319, -1577, 332, 775, -1011, -414, 1344, -574, -1517, 1311, 232, -1768, 475, 1441, -1506, -595, 1589, -270, -1350, 971, 430, -1592, 812, 1016, -1155, -472, 1606, -436, -1195, 1213, 434, -1460, 530, 1182, -1178, -541, 1348, -52, -1306, 924, 766, -1461, 54, 1056, -828, -476, 1636, -120, -1385, 1131, 796, -1375, 69, 1768, -834, -756, 1571, -91, -1367, 1154, 685, -1533, -44, 1513, -591, -806, 1165, -315, -943, 1055, 423, -1689, 118, 1771, -967, -1043, 1743, 125, -1389, 1012, 1130, -1539, -260, 1868, -776, -961, 1130, 58, -1189, 905, 831, -1782, -338, 1633, -935, -1316, 1553, 423, -1598, 460, 1400, -1063, -192, 1251, -690, -1092, 1277, 175, -1460, 517, 863, -1388, -217, 1289, -756, -1379, 1387, 541, -1610, 279, 1301, -1056, -342, 954, -584, -1007, 1047, 179, -1432, 658]
6843F58O11k570P44J915j911p47K425o43k247K195J016k394K91K254j817r96J908
6860F92k56j951J988P65k989J078K465j771j584K384Q4k395J512J478k469O46
6876c23J753j720j145K440k24k142J388J315k450M47K306j735j703K804J99k406
6892a196Q95J806k128r0K024j382j320K345j6k381J277J512k147l22K492j183
6908A86j851K215L75k129R76J885k218m42K334j332j234J964J27k114J262J618
6924A622k337n37K681j034j582J579K35j922J184J543j819p05K047n69j347J763
6940H02L86k378J276J286k177m45K818j153k281J998J183k656P31J897j339j296
6956a348K237m05j835J598Q36k545J098K089k454o61K620n37k416K120R64k168
$$ y = [658, 1269, -1301, -557, 1358, -553, -1300, 1125, 482, -1765, 430, 1446, -948, -657, 1597, -220, -1216, 692, 436, -1515, 473, 1238, -1751, -673, 1792, 21, -1563, 821, 905, -1490, 22, 1500, -969, -323, 1430, -290, -1435, 1005, 781, -1361, 27, 1342, -1108, -661, 1645, -90, -1793, 1011, 1210, -1196, -301, 1505, -623, -713, 1311, -71, -1391, 954, 938, -1443, -166, 1346, -801, -1123, 1369, 186, -1665, 550, 925, -1204, -228, 1657, -561, -1003, 1331, -1, -1235, 729, 856, -1258, 4, 1622, -715, -1252, 1429, 395, -1187, 392, 627, -1295, -111, 1432, -387, -1092, 955, 386, -961, 802, 1188, -1190, 86, 1372, -805, -1250, 1568, 415, -1866, 132, 1315, -1341, -610, 1287, -52, -1348, 889, 484, -1351, 247, 1083, -1462, -364, 1725, -729, -1390, 1230, 693, -1723, 397, 1361, -807]
6972h07M8J998j699p16K022n30j712J922O54k407N91K027j356j427K169J21k199
6989a301J474J306k650m2K635j609j192K306n43j414J300J059k463N92J973j461
7005c0j593K604J18k346J494R05j980L0K381j554j590K627L8k361J246J409k225
7022h27j00K691j666j166K185J81k695J085K188k141m60J587p89j338J875L38
7038I48k265J185J375j772n51K047p96j365K042J03k252J143J897k343o44K275
7054A027n91j732J666N27j961Q76J334j712n50K152n47j975J646Q82k088M06K217
7071A577k017j048K527m96k033J368J171k058Q25J499k158j63K265q73j939J834
7087B81J134k503M0K404j755q67K266n61j934J565J151k060K73J781j927m10K073
$$ y = [-807, -759, 1239, -460, -1176, 846, 316, -1396, 526, 1180, -1227, -636, 1391, 35, -1392, 777, 898, -1301, 173, 1479, -1171, -1213, 1422, -187, -1379, 927, 384, -1030, 270, 1329, -1134, -542, 1431, -30, -1623, 981, 1099, -1247, 247, 1152, -828, -798, 1583, 29, -1561, 1066, 1104, -1257, -11, 1398, -827, -927, 1764, 98, -1068, 1117, 1298, -1397, -312, 1876, -265, -725, 862, 73, -1265, 610, 948, -1317, -132, 1243, -529, -1080, 967, 171, -1194, 848, 951, -1301, -158, 1739, -604, -1248, 1027, 436, -1296, 370, 897, -1064, -188, 1146, -566, -1116, 1036, 489, -1486, 160, 1042, -1046, -640, 1577, -440, -1488, 1039, 543, -1490, -122, 1049, -1009, -184, 1315, -843, -1006, 1259, 386, -1553, 281, 1415, -1088, -1048, 1356, -399, -1266, 1000, 439, -1495, 70, 1221, -839, -566, 1215, -712, -1122, 951]
7104I51m26k228J948J120k377L35J868p95j304J482l5j443J184P08k201N78K211
7121A576k061r05K201J3k434J689J547k467j41K311j122j592J899K35j999J097
7137a53J304j813K9K059j422j539K225N82k397Q78J507j855j26J923p80j839K116
7154F99K85k084Q93J504j766m34K505j439j828K549M75k742Q43K174k270o91K433
7171A106j262j309K120L88k046P09J773j883n26K136r21j754K183J96k265J249
7187a06J792k354o89K498n69j736J540O70j911O85J543j579r42K075l77j824J494
7204B10Q82k104O23K008k234m73K262k68k451J450J367k067J66J342r14q29K191
7221A161m30k159J515J272k342J58K125j762r55K364n6k530J455J372j920m1J584
$$ y = [951, 525, -1703, 245, 1365, -1012, -677, 1191, 396, -908, 574, 539, -904, 280, 988, -1213, -635, 1576, -485, -1390, 811, 824, -1610, 79, 1626, -841, -982, 1329, 207, -1385, 514, 749, -1250, -153, 1151, -662, -633, 1426, 4, -1535, 690, 1272, -1125, -247, 1260, -595, -721, 1202, 422, -1417, 699, 984, -1100, -207, 1297, -469, -903, 1602, 163, -1665, 884, 1359, -1383, -540, 1634, -636, -1327, 1106, -156, -1465, 655, 1043, -1003, -294, 1479, -404, -930, 1206, 285, -1469, 714, 910, -1355, -106, 1686, -668, -1357, 1141, 572, -1164, 376, 1046, -865, -180, 1363, -216, -1158, 917, 540, -1284, 210, 1092, -1012, -389, 1619, -615, -1088, 1174, 906, -1545, -95, 1272, -795, -629, 713, -201, -1030, 1161, 731, -1428, 87, 1359, -983, -825, 1300, -462, -1417, 947, 891, -1639, -184, 1188, -732, -773, 811]
7238H11q65j061J986m75j852K115Q65k702J51K502j314j609J972N01j811M77J224
7255I15j583m47J892m87j742K329q3j932J302J625k663n5K401j037j941J596R25
7272A015k233Q44J610j840l51K101j094j429J989N42k380P51J872j946l60K175
7288A266r71j695J859O51k550R65J910j745o73K067r90j989K710P15k931R31K113
7305A643j870q32J797l86j579J596R59k010L26J664j810o22K359l54k257J833
7321D57P46k297M41J976j754q33K150k98j532P90J230k283O54K365k278q50K125
7338H09J68k291J454N82j669M89J570j325j354K434K25k706J277J885k355J3K110
7355A316j342j252K299k83k055J328J336k379J58J958q09j635K325l1k382J206
$$ y = [811, -54, -1115, 871, 396, -1456, 659, 1524, -1178, -1027, 1475, 161, -1448, 524, 1025, -786, -309, 915, -668, -1115, 777, 290, -1452, 877, 794, -1138, 164, 1789, -874, -929, 1472, 435, -1506, 90, 1015, -1218, -374, 1236, -604, -955, 1146, 52, -1377, 612, 1154, -1226, -475, 1397, -549, -909, 1266, 295, -1400, 459, 1110, -1440, -475, 1435, -310, -983, 1084, 94, -1895, 815, 1530, -1401, -470, 1643, -227, -1059, 738, 352, -1227, 369, 1328, -682, -356, 1308, -502, -1124, 1235, 881, -1376, 457, 1203, -1094, -653, 1323, -431, -1264, 886, 588, -944, -154, 1076, -1207, -553, 1812, -466, -1316, 809, 977, -1314, 140, 722, -947, -458, 1112, -213, -1567, 867, 1092, -1614, -337, 1548, -807, -794, 1316, -26, -1278, 1021, 738, -1317, 11, 1347, -1032, -874, 1084, 275, -1360, 965, 934, -1448, -242]
7371b42J830k356l39K354p97j427J497j94j622J407J012j709m63K238r52k354
7387b117K666P4j905J166J610k066m70J936n08j729J685M70j732Q47J093j380
7403c60n03K569j501j805J786J218k118K46J974j347j047K128r22j615J875O31
7419A209k058M17J790j581q62K084m61j858J831R86k699N71J848j229r25J719
7435G82l15j495J496M38k203J101J545j561o97J581P0j695J045R72j971M48J680
7452A221j113j363J886K6j444J054J046j948j97K273j711j393K414L9k379J428
7468a61J180j553j96J999j597j121K094M11k263P45J717j875J38J520j158j244
7484a364K432j62k379Q42K171k142m33K116j486q89J784N07k110O76J705j991
$$ y = [-242, 1588, -768, -1107, 1247, 450, -977, 520, 326, -1296, 111, 1123, -586, -1049, 1189, 237, -2117, 549, 623, -1282, -116, 1494, -572, -1042, 894, 386, -1343, 342, 812, -920, -73, 1020, -360, -863, 1706, 205, -1600, 186, 1404, -714, -468, 1506, 159, -888, 1240, 318, -1297, 578, 1209, -849, -432, 1358, -223, -1085, 999, 538, -1320, 511, 1497, -1202, -631, 1217, -12, -937, 782, 467, -1028, 468, 906, -1297, -196, 1349, -212, -909, 672, 742, -953, 92, 1064, -907, -459, 1221, 108, -1255, 631, 657, -787, 267, 1313, -635, -832, 1441, -270, -1663, 751, 790, -1589, -161, 1019, -534, -730, 1269, -328, -1449, 645, 1056, -1207, -462, 1255, -620, -482, 1038, -120, -1364, 1068, 906, -1473, -631, 1540, -602, -1035, 1081, -405, -1294, 490, 997, -1113, -437, 1268, -723]
7500g23l10K029q48j213J803J99k454J432J668j977r54K332m90j743J575M58j782
7517i98R84J320j850p73K448p33j517J556O87k160O08J902k000n02K081j67k466
7534a580J575J423k136J47J545j442o99K532p58j952J840J283k605J76K196j781
7550b36j042K195l19j957J825P77k167K78K036j700m42J576j82k140J872J021
7566A395k029L0K354j560j327J848j37j534J122J055k249L72K196j450j427K309
7582I68q1j961R53J132j814j96K686j630j577K010P16k341M49J875j697r8J941
7599A335j173j838K422N0k073R09J535j488p01K316j251j408K010J72k238J247
7615a74J658k129m40J851o57j233J949K22j994P41J616j860n59J964m69j712J661
$$ y = [-723, -1033, 996, 148, -1065, 738, 937, -1517, -85, 1583, -394, -1348, 984, 494, -1249, 326, 784, -998, -14, 1306, -544, -1317, 1131, 398, -1119, 437, 1124, -1036, -428, 1474, -526, -1028, 1053, 886, -1580, -5, 1418, -718, -571, 974, -468, -1167, 1365, 607, -1345, 495, 1778, -827, -651, 1545, -236, -1278, 917, 598, -1359, 466, 1243, -924, -646, 1390, -310, -752, 824, 642, -1498, 374, 1395, -634, -604, 1750, 190, -1137, 711, 574, -960, 162, 1217, -1032, -660, 1536, 86, -1341, 968, 887, -1074, -121, 1011, -803, -999, 1687, 57, -1520, 490, 1206, -1135, -686, 1189, -508, -606, 1335, 162, -1676, 746, 796, -1277, -368, 1167, -321, -1022, 1294, 43, -1365, 645, 817, -1421, -174, 1484, -645, -1085, 766, 109, -1124, 825, 1047, -947, -206, 1410, -450, -1009, 955, 486, -1226, 435]
7632D35P15k210M40K014j813r56K299l51j672J606J61j940J081J863k095j067
7648a490K561k23k276J215J320k028Q12J234j491p39K041k79j960J360P91j475
7664f27J44J940j765p28K070k73k156J666J193j965P0J538j158r57J928k15k175
7681a470J645J261k533J76K255j012j434J805P5k208J567J245k239K85J958j354
7697B2j440K407j20k024J333J305k324k38K332j010j603J783O10j897Q32J408
7713A376k312K06K206j367j771K195O06k572J278J155j680m20K454j017j704J710
7729C43Q40j946M27J624j869k37J931n69j825J596R45k257M83J754j629o39J888
7746H60q11j228J729M50k059M87J464r65r57J562j14j411J380N94k018N63J760
$$ y = [435, 1150, -1060, -620, 1394, -419, -1375, 924, 573, -1099, 507, 668, -1272, -191, 1672, -423, -1490, 1071, 848, -1428, -213, 1107, -921, -109, 1125, -366, -1105, 936, 657, -1303, 57, 848, -627, -483, 1457, -308, -1036, 1034, 761, -1395, 271, 1464, -501, -431, 1107, -51, -1008, 920, 705, -1470, 175, 1436, -1097, -921, 1334, 322, -1112, 693, 768, -1440, 127, 1372, -867, -582, 1376, 22, -1418, 989, 869, -1155, 178, 1483, -841, -1079, 1253, 243, -1360, 423, 1033, -864, -32, 1376, -936, -730, 1476, 109, -1662, 533, 1139, -1433, -155, 1000, -680, -1100, 1354, 337, -1367, 343, 1183, -763, -336, 1288, -581, -818, 1113, 544, -1281, 315, 1260, -997, -514, 1240, -389, -1028, 860, 49, -1179, 550, 1000, -1059, -572, 892, -73, -1030, 532, 418, -993, 387, 981, -1037, -474, 1286]
7763A286j440j126K300o56j872J894P00k049N93J523j376j245K117M6j922J417
7779A90N65j706Q38J118j305j028K643m57k214J058J564k038J23J636j438n13
7795i64J837N5k180J349P44j725K53J976j580p98J833k74k205J657J268j667m47
7812h68K084j198j023J798j89j622J149J306j956m99J990j136j161K033P9j905
7828a118J128J063j473m85J967p72j298J358M09j731Q96J384k295J40K056r82
7844B47j637J836M63j897N66J427j298m34J746p93j649J813N58k247J087J488
7860A276j922j15J876j050j228J666N99k120M90J503j497n43K412p67k189J941
7876C32Q71k042K36J878j393j234K414o38j419J031J038k215O50K084j839q36
$$ y = [1286, -154, -1280, 1020, 364, -1508, 386, 1086, -963, -370, 1153, -223, -1468, 649, 695, -1227, 190, 755, -951, -113, 1005, -300, -1328, 1315, 858, -1356, -298, 1266, -772, -649, 987, -451, -964, 873, 928, -1252, 97, 841, -884, -631, 1345, -235, -1033, 800, 526, -1679, -22, 1246, -421, -868, 1216, 18, -1005, 793, 604, -1018, 131, 1437, -519, -1018, 972, -164, -1325, 708, 787, -1118, 10, 1073, -400, -885, 1082, 310, -988, 370, 779, -952, -56, 1328, -967, -827, 1229, 247, -1390, 446, 909, -988, -422, 1005, -293, -727, 1019, 226, -1423, 390, 948, -1299, -212, 1276, -646, -761, 1115, 65, -1163, 503, 1102, -1018, -528, 975, -522, -1065, 1347, 580, -1609, 332, 1203, -839, -603, 1275, -118, -1352, 1062, 424, -995, 36, 1074, -1141, -491, 1593, -246, -1082]
7892a082J649q0j752J410N65j587M17J992j805p19J854j96j650J367P11j868N40
7909b34J566j286j181J844K61j850O54J228j206p6J733j465j298K111J49k108
7925a158J205J250j981K14J507j094q78J765K33k092P91J362j575l42J632j066
7941b27j051K095J10k219J140J611k153k89K168n20j562J514K61j680Q40J205
7957A243j990o4J715n60j386J554J38j769R43J897j923j064K420n46j922J440
7973A26O71j547O74J349j844n31K197p70j648J717R09k384P66J414j685l61J601
7990F54O2k008J530Q87k195M75J484j202m22J903r71j495J982M99j964p5J548
8007F92o91p92J526m34j381J178J108k040L60J796j705o80J592j87j683J549Q37
$$ y = [-1082, 567, 487, -1265, 145, 710, -877, -460, 1532, -273, -992, 862, 666, -984, 383, 1094, -774, -234, 1332, 46, -1135, 709, 970, -880, -226, 1002, -204, -280, 1453, -12, -1310, 801, 950, -1158, 47, 1297, -684, -470, 1037, -57, -935, 830, 1063, -1029, -238, 1124, -451, -793, 839, -227, -1278, 817, 927, -1292, -152, 1459, -694, -983, 1185, 665, -897, 617, 878, -802, 38, 1243, -747, -811, 904, 344, -1042, 512, 650, -1119, -176, 1721, -202, -1266, 1154, 608, -1314, 126, 797, -750, -76, 1273, -571, -1102, 1095, 325, -1323, 394, 1303, -1081, -315, 1099, -586, -947, 654, 716, -1292, 238, 1125, -1070, -595, 889, -313, -735, 1168, 197, -1298, 684, 1183, -781, -856, 692, 1, -791, 735, 301, -1080, 98, 1206, -834, -474, 1322, -383, -1063, 529, 342, -1341, 208, 1045]
8024A045j937J36J930j003j161J733k19j476J161P71j947O12J479j237j302K176
8040G61L38k527J402J097j612j48J613r94q11J592k02j532P52J286j599k57J609
8057G68o98j219J884k9j638R62R36j494MJ429r01j085J715K35j971P85J652j524
8075a89m66J329l81q88J071L63j736P45J269j520m14J536m54j339J506L75j949
8092a142N74J967j603o27J572l24j077R75K25j427Q91R69j247n89K054n78j903
8109a290J458Q65j628m35J346k95j149J936m01j324J108P71j894N92J251j119
8125b08q19J827k66j878J690N81j635J18J609j358o10J540l50j436J298Q27j897
8142i67M02J857j218j207J605J52j786J304N58j441J7J818j150j060J391J91j407
$$ y = [1045, -892, -756, 1174, 171, -990, 743, 524, -952, 209, 980, -967, -355, 1124, -113, -1415, 761, 1099, -1428, -26, 1071, -541, -689, 924, -70, -881, 711, 509, -1023, -271, 1015, -584, -841, 768, 70, -1149, 735, 706, -932, 30, 966, -528, -524, 905, 4, -1081, 634, 869, -1102, -317, 1335, -189, -655, 674, 293, -595, 476, 839, -897, -152, 1117, -403, -817, 719, 265, -1074, 432, 807, -1142, -568, 1399, -204, -831, 741, 417, -660, 315, 540, -887, 4, 973, -274, -863, 1191, 613, -1290, 168, 1033, -595, -1030, 316, 21, -1128, 808, 407, -917, 191, 962, -932, -340, 911, -208, -1027, 800, 534, -1344, 346, 927, -708, -590, 1019, -339, -949, 591, 241, -1195, 103, 930, -967, -565, 1292, 74, -1133, 472, 624, -1162, 142, 700, -741, -724, 1094, -56, -1116, 275, 466, -941]
8159i41Q69J020j898N6J835m56j602J213O81j588P76P59j706N32J339j049r92
8176a152J971m9j924R17J221j305m43J711q87j260J735N15j833M51J401
8191A069
$$ y = [-941, -72, 948, -950, -894, 941, 485, -1117, 96, 777, -811, -35, 724, -982, -450, 889, -160, -1152, 819, 770, -1154, -237, 984, -321, -764, 947, 60, -1200, 535, 1050, -783, -332, 1069]
$$ Imaginary data points
##PAGE= N=2
##DATA TABLE= (X++(I..I)), XYDATA
0@%%%Pj5QqJ6j6J6k4M0m8N2o5Q3r6J08j30J58j84K09k41K83l26L66m17M80n43
29b87O09o86P73q64R64j076J199j332J475j638J819k011K223k464K731l024L354
46A765l731M162m655N232n919O745p765R064j0780J3152j6656K2360l3165O0403
60D0212k44630m70779P08166M15787m82660l36921L73973K40794k71669k57364
70b85091K10467L01204j55394l84200J54719M46515j61635m62098K21104M40098
80C25689k61074l91930K81875L33685k41228k88391J52245K51155l7884k24842
90a00700j8077K66674M3246l70311p5067M43098Q1071m63070n0072M43043K6544
101B26379l76970k8532K64300L5426j72336p4031J17576J37839j01372j94614
$$ y = [0, 0, 0, 0, 7, -8, 0, -8, 8, -8, 8, -16, 24, -24, 28, -37, 46, -50, 58, -72, 86, -98, 111, -130, 153, -173, 193, -224, 256, -287, 322, -364, 409, -455, 509, -567, 632, -700, 775, -863, 956, -1055, 1168, -1296, 1435, -1589, 1765, -1966, 2196, -2459, 2773, -3146, 3599, -4166, 4898, -5882, 7270, -9386, 12974, -20191, 40212, -204418, -675197, 32969, 448756, -33904, -370825, 3148, 243942, -27727, -285091, -74624, 226580, 71186, -313014, -158295, 288220, 126585, -335513, -114409, 325689, 64615, -327315, -45440, 288245, 47017, -241374, -89129, 162026, 124142, -100700, -118777, 147897, 191143, -179168, -254235, 188863, 269934, -193136, -243208, 199835, 226379, -150591, -179123, 85177, 120603, -51733, -125764, -8188, 129651, 28279, -166335]
111a66335J31537K23828k01146k29727K77041K20798l18827k11508K87806J99166
121B12633j73009j54761M4616J14101N4192j08303j09960J38330J21381j75270
131c6050p6467K20736K6331k30061J4352J81775m8618j05530O3673M4440k8646
142B5935l066m3757j2695J19577q692j77839N6406J97022j19824j89389J64975
153H653J64265j64782j36841J04402J06726j1698j00608r9787J08489J89802j29572
164C9049k33167J57125K26181j74441j86908J54447J19094j03174m1082N1508
174H632j093n278q057j8925P1897K7199j61734j6238K49639N976k87586J5676
186a19892K71512l5926k10400N2704J47116m0720j06915j4633R3119R9327r3869
$$ y = [-166335, -34798, 189030, -12116, -241843, 35198, 255996, -62831, -274339, 13467, 212633, 39624, -115137, -70521, 43580, 97772, -10531, -120491, 17839, 139220, -36050, -112517, 108219, 134550, -95511, -81159, 100616, 51998, -53532, 10141, 54581, 25935, 22869, -20888, -33583, 85994, 77302, -100537, -44131, 152891, 33067, -156322, 8653, 172918, 8136, -128705, -24303, 82423, 70725, -29883, -129670, -21181, 168621, 39049, -194118, -36993, 189188, 14747, -172161, -17714, 101380, -1794, -42876, 8632, 7539, 2261, -5796, -24721, 47176, 74375, -87359, -103597, 146042, 152018, -135568, -119892, 151620, 115694, -94706, -42002, 105114, 64394, -42521, -57154, 35965, 135292, 41423]
197D1423j73471J15910K04809j64595k07625K06889J77087k26464j31410K07838
207E0391Q2812j65899o3860R6001O7097l8368j01738R557J59745k2165k39135
218a65562M7555K96720p3526l10169R0762K76863r4331k20776O1860J55554L696
229F8646q9834p0573N2091J15814n6168j30152J00811J18182j53661p3117K03923
240H5962K2351k27937J4981K14149k0065j54697J0434Q7692K0112m4280p0386
251f1684L7992J36607n2393j86636Q3119K02861j15646j84170J31122J36503j19572
262H103p5376Q3574K1804l3797q01k4268N448O6838k9263p2479O1498L2620j03753
275e9852K5226J34983p4122j34481R8418R9139r9332n2495O5212Q201l731K5422
$$ y = [41423, -132048, -16138, 188671, 24076, -183549, 23340, 200427, -26037, -157447, 50391, 133203, -32696, -96556, -555, 66542, 28174, -73564, -64007, 95738, 73573, -165562, -118007, 178713, 105187, -204982, -114220, 162643, 68312, -152464, -90604, 64950, 68646, -21188, -91761, -39670, 76144, 19976, -110176, -9365, 108817, -44844, -117961, 85962, 108313, -119624, -104643, 109506, 89441, -65256, -54822, 32870, 52982, 8702, -61684, -23692, 112915, 60522, -126114, -42995, 159866, 44220, -139950, -8828, 127675, 8103, -67273, 16301, 38105, 4308, 3507, -20761, -15313, 51525, 22262, -50217, 11281, 43901, -59852, -34626, 100357, 26235, -108246, -9828, 89311, -10021, -62516, 2696, 10897, 7166, 32588]
287C2588n8783l8205R7998K2171j03682Q684P3718m0541j3103O5734m9700p0453
299g3574R0344M4690r8450N476Q1628n3627m6594P8912K382o9749L9078L5854
311C6370o0327R847N3253m8991k2343O3318k5748m3576P7654L277j15531M2092
323c0705J19921q6031j02026J09939P5981r5971n1743M2853L2578K5305k8305
334A1796q8049M0492J22932o0744j16009Q5289P1120j06505p899J16579m5061
345B3941j05429P4899P8333p3689m9900M0036L9644K2930m0817q9101N1241J28951
357A01039p5335j32357J10163J10436j33494p2849J31171K9584j07515k172O3607
368B2278O29j2092k0789k9776M8221L9205q1201j5846J07886k9348j18624P5133
$$ y = [32588, -26195, -64400, 33598, 55769, -47913, -39229, 34489, -6052, -19155, 46579, -3121, -73574, 16770, 61460, -36990, -31514, 50114, -3513, -50107, 28805, 31187, -38562, 516, 36370, -23957, -14110, 39143, -9848, -32191, 31127, 5379, -38197, 39457, 42734, -72797, -30705, 89216, 3185, -98841, 11098, 87079, -8892, -60635, -17782, 14796, 40101, 11796, -76253, -35761, 87171, 26427, -89582, -4293, 66827, -39678, -47577, 69002, 23941, -81488, -6589, 71744, -1945, -51845, -11809, 27835, 50765, 9948, -79153, -27912, 101039, 25704, -106653, 3510, 113946, -19548, -92397, 38774, 68358, -39157, -41329, 22278, 22907, 10815, -9974, -39750, 8471, 47676, -33525, -49371, 58515, 29167, -89457, -14324]
380a4324J03714j10995p3238J24681M4533j05338k8346N3544K6530R817l9329
391h751o0590O5302Q8839q5641q0072R4692L5559q8437K8336P4949p6993m8256
403f1063R9937J6399r0087Q356N7716j1245q042n203m0512L4122O6558o2988n9588
416e5640Q7102K6220r7157J6652Q3210n5401n3022P3254J1021o5676K9718L6957
428C7238n8737r157N6745j2170k6039J8289k2763o900O9126k2882j02649N7142
440b2757J11801q1614r3576Q6054N3333o8730o887L7002k8533j363M2454k2289
452D895k7402K3539j1939m190O5589k7306j07933O0869J24766q8588j13123R9211
464a612Q2071q8669m5112N8847J6918j8922j2017k1112K8029M6024o0006m7427
$$ y = [-14324, 89390, -21605, -94843, 29838, 74371, -30967, -59313, -5769, 20761, 30578, -8751, -69341, -4039, 84800, -841, -80913, 13779, 49338, -39099, -10763, 64186, -12807, -61063, 38874, 55273, -34814, -26458, 31258, 20013, 11971, 6768, -33744, 378, 66936, 3948, -55640, 31462, 57682, -39475, -22823, 60387, 4986, -48036, 25218, 36239, -29437, 281, 37238, -21499, -30656, 26089, 13919, -12120, 6169, -16594, -23494, 45632, 22750, -79899, -22757, 89044, 7430, -86146, -92, 53241, -15489, -22376, 14626, -13907, -15270, 27184, 4895, -22507, 1032, -10907, -15097, 50492, 23186, -84747, -23878, 100888, 12300, -100823, -1612, 80459, -8210, -53322, 5525, 22443, 3521, -8496, -29608, -1579, 44445, -15561, -62988]
476f2988R7181K6914j26368L944J32302l4908j09094N9892P1178p1261l5806O0460
488A1446J9581k6580k3291j5779M9904N5412q6845p9514J22112Q2679j36599o2006
500h9480J29816L1411j00313k742N3432j3953n665J7999k1932l307J7527k9047
512a6254P748O5314m5427q7685Q1325Q9461j07993p5257J07533M7861q2920j8664
524c4958M3582Lm002o328l0932K9496N0404n8855m6738Q2172K1353r3042J0691
537c7154Q3307l5538m9677M9492N567m8888L0699L4726m5167p384L5578j8687
549c126j928L7954m1121m5028P5770L9706q3723j8201O6583q212k8481K7123j9913
562b597l0799O7347K5096r3536j2050Q7662m853n5051J9239J1595k1247K6844
$$ y = [-62988, 34193, 61107, -65261, -61317, 70985, 36077, -73017, -13125, 58053, -13208, -49014, 11446, 31027, 4447, -18844, -34623, 15281, 70693, -16152, -95666, 26446, 109125, -27474, -89480, 40336, 71747, -28566, -31308, 22124, 8171, 2506, 20505, -1427, -4734, 12793, -16254, -8506, 56808, 11381, -76304, 5021, 94482, -13511, -88768, 18765, 66626, -16294, -34958, 8624, 8627, 4625, -1703, -32635, -3139, 47265, -11590, -58328, 23844, 45197, -47845, -37154, 46153, 10615, -39062, 10430, 15997, -32891, -2192, 32534, -12633, -20017, 15561, -3126, -5054, 32900, -8221, -53249, 22521, 62227, -21496, -39697, 26886, 18674, -9807, 17316, -2597, -33396, 33951, 59047, -34489, -46539, 41123, 36270, -18781, 458, 12053, -9194, 17650]
574A7650O840m9242J6158M6150m3054k0357O4734j8623p3175N1284N8949p3618
586a6304l2978P7236N673o2414R285L0949p780K17j4940k2160N2146K8736r3488
599d5822k1313J23583M611j33341J2663J18295k1507q1563J8474L6768o029j853
611B966j0705p431L1029j0273m7733M7569N4327r0234m7523J27420L4156j43101
623e9533k0046J33126J2523r9065j6098N5161L2391j4279n5409o796P9771K653
635D4399r9783K1966J10131n2743j03117P5670Q0239q4922m8998P5487K3059m9488
647h100j1554J6298J6702R093m1582k1201P7644J8523j11752l673J29401j7624
659E2175j28019L2138J06916l0816o8976J4145K6103R942M910l4023j2971N2714
$$ y = [17650, 24490, -24752, -8594, 37556, -5498, -25855, 38879, 20256, -52919, -1635, 57314, -16304, -49282, 27954, 33627, -28787, -19502, 11447, 3667, 3884, -11056, -33216, 18930, 47666, -45822, -67135, 56448, 61059, -72282, -59619, 58676, 37169, -44394, -25920, 10848, 4819, 2966, -7739, -15170, 15859, 5586, -42147, 5422, 59749, -30485, -78008, 49412, 83568, -59533, -79579, 53547, 66070, -32995, -49093, 6068, 38459, 24180, -31229, -38025, 41746, 44399, -55384, -33418, 76713, 23970, -79147, -3477, 76762, -8160, -57158, 18329, 41388, -8100, -19654, -3356, 13346, 22439, -19143, -40344, 37300, 55823, -55929, -59602, 69799, 52175, -75844, -43706, 63210, 32394, -36582, -22437, 3666, 13608, 18518, -15505, -28476, 24238]
671B4238r24n6976L0658M6269o4969k4429R0892J268r5181J6747P7439k4579m5470
684b5017J5732J0611Q844J7682l8340l3800N8500K6157o6547j481O0465k6780
696F026m2777M1742J2730m1511J8975K4435m3034K630N1561l0273m3904M5503
708B103K3324m2662N709K4019k9076K533L9016k7237k9864M2827Q086l6375K3944
721F347J4261n7107J6124P9543l8927q1250N0475O7213m4373m3606J7781J9852
733F333J9243l202n4087J961P4668j9401p8288M3832O4865o8731l9257Q1741J0710
746D0387q1993O464O4869p564l9087q777J4250L5174k722o7979O822R5863k5453
759C0254j11166N0800J11413p0885r9950P4745Q0352n7944n6911K8348M2538P122
$$ y = [24238, 23314, -33662, -3004, 43265, -21704, -46133, 44759, 46027, -49154, -32407, 45032, 20453, -25017, -9285, 1326, 10170, 27852, -10488, -44288, 14212, 40369, -26178, -27659, 32806, 6026, -36751, 4991, 17721, -23790, -4815, 19620, -23414, -20784, 30777, 504, -43400, 2103, 25427, -17235, -11526, 12493, -16583, -14050, 24966, -2271, -32135, 10692, 18778, -17597, 6347, 20608, -36499, -20375, 59168, 20241, -61009, -10534, 56679, 12306, -31300, -13519, 6333, 25576, 22374, -31713, -29752, 44916, 25515, -52773, -8941, 55924, -12807, -52064, 29677, 40387, -41606, -35142, 29727, 22163, -16924, -25701, -11451, 23723, 21001, -46978, -40156, 55707, 30254, -80912, -30112, 81301, 10416, -89534, -14789, 65563, 7619, -49292, -20944, 21594, 28716]
771B8716m0122l5961N1761N1115o8924m2815Q9689J8594j04980J3153J11460l6734
783C4952j03837M3985Q9400k9832p0083m130N3315M5400m4839p9181M8747R7567
795H1464o3219r8583P8034Q0235q6374n0834Q3937K2409p0539p661M5346R063
807B3278j8714k5433P24N1643L001p9722N766R7258k6468r8133N1676Q6709o8204
820C381p0498O5426N1451m0997l4901N165K7577L0955l1150n8747M2772O6912
832E7346n4028n2602O1552K2783o2594J0083N2817l5151l4885M2166J7700k8919
844c732o009l350k40L9904j609o7394J1758P6988k5507o9434L4299M5180l2324
857a470j2966K0762j4821j539K8040k3464k2121M4875O717n5092J4410N0067l1408
$$ y = [28716, -11406, -47367, 4394, 55509, -13415, -56230, 33459, 52053, -52927, -39774, 71686, 34952, -68885, -24900, 64500, 34668, -35415, -39545, 13770, 59170, 14331, -64850, -16103, 81464, 18245, -80338, -2304, 77931, -8443, -59277, 24660, 47069, -23470, -31131, 14215, 23278, 4564, -20869, -20145, 31498, 34499, -45223, -39457, 57801, 31333, -66800, -15124, 71585, 3381, -67117, -1691, 49760, 8763, -26138, -20973, 6604, 37559, 6409, -52338, -9566, 57346, 3318, -49284, 12268, 35051, -27543, -17460, 35357, 206, -34679, 7487, 25187, -3732, -9741, -13091, -13331, 26573, 24964, -42430, -30672, 46316, 20809, -48625, -14326, 30854, -1470, -14436, 6326, -8495, -10034, 18006, -5458, -27579, 17296, 24013, -31079, -16669, 33398, 1990]
870A990l1661L7326P834k6770J6267O887k9989J5490K6712l2067n819M0737k4988
883A949l6972N5470K4616p4359j1618P5152L879n5787n038K2481J6765R785l6448
896a0125l4331N9051M2104p5235l2875P8086Q525p1002K0015N5238l8901l7739
908c7189M0570K0231k4203j3358k722J9037L0603l5170n2204N8402N8774q0486
920a7715n0814R4058L4487r3585j6697P8572P177n4409r673K7823K8076n321n2417
933c0438n781P4225K622q4394J5586Q2271l8788o7746O0149M6525o9771k8436
945d3976O4404K1873m3498k7957J3622M5064J3779o8617l0758R0008L3700j01677
957c4033k3498R7276L514q0213J5133N4351k5446k9249K1182J1136n946p992j7907
$$ y = [1990, -29671, 7655, 15489, -11281, 4986, 11873, -18116, -2626, 24086, -7981, -13800, 26937, 1949, -35023, 20447, 45063, -29296, -40914, 34238, 38117, -17670, -22708, -227, 16538, 26323, -10125, -44456, 14595, 56699, -18536, -51411, 26675, 35200, -35802, -15787, 39451, 550, -37189, 3381, 23612, -591, -13949, -16671, 2366, 32969, -2201, -54405, 3997, 62771, -17715, -68529, 25529, 60016, -33569, -50266, 28306, 35483, -18926, -28599, -776, 27300, 21979, -30438, -36219, 38006, 40628, -43766, -28180, 54091, 15303, -52443, 7706, 54231, -15540, -43976, 20428, 42301, -1197, -29154, -15532, 29532, 43311, -25306, -56064, 33944, 67644, -34033, -57531, 39745, 43259, -36954, -21821, 32530, 7084, -22165, -983, 10153, 4207, -3785, -21692]
970b1692J7535L9956l6283n1701N6691M6107p3653k9723Q0950J0282p4007N340
982c0198N3841j1207k8592K429P309J8460R773m4870j3741O2957O414o5931R823
995b3533N4520k6912k8905L9119o82m3279K3936L5865k9172j9089J9409j647K515
1008B145J6825k9340k1860N1340J7662o0334n159N0124j1820k6305K4035k066
1020E247k6714K7844J9045m4032m124M2618j1525k7334K4667O447k5661J3081
1032d41J1910k4876J1278K7670l2534j7622M6723r48m7360K1739L4454l5257j1235
1045a6499M0569j2774l5991K7657K3464k6717r273J0599l078J9010O749n0846
1057b7130n341P2165l345p6549J5619O2440k7084l7767K9365R761k3809J0837
$$ y = [-21692, -4157, 35799, -484, -52185, 4506, 50613, -23040, -52763, 28187, 38469, -35538, -30198, 23643, 12436, -16156, -13727, -6418, 12042, 21815, -23055, -36796, 26161, 32575, -33356, -23533, 30987, 4075, -24830, 14289, 13607, -29672, -5736, 30129, 957, -18132, 1277, -370, 2145, 18970, -10370, -32230, 19110, 36772, -23562, -28721, 21403, 9583, -16722, 7313, 5247, -21467, 6377, 25422, -18610, -22734, 19884, 8359, -18975, 5692, 12139, -13522, -441, 11469, -13407, -2129, 25541, -6993, -24615, 22108, 21160, -26200, -4461, 29993, -5264, -16499, 24070, 11296, -24695, 2962, 26426, -291, -9564, 1035, -2043, 16967, 23716, -27130, -32471, 39694, 36349, -40200, -24581, 37859, 10775, -26992, 2373, 12134, -11675, -838]
1069h38J0916j8022L536O962j6830J6916K1836m4325j6298O6240L076p6444J3125
1082c0150P0650k4785n1994K9041K9778k0281j1777K197L939K2888p615m3227
1094c1336K1251N4194l6807n0168M9969L1934n4566n905N0775j7271l9296K8429
1106A203K3410k4643j1032P293O610J9598j2395m8164K2806O5387l4939o7654
1118e2520M3671N2203m6152k6965L8461O46k5646J6677R104j9694N534O897j2417
1131a0201J3755Q845l6261N465N2969k3857n6715L9831M6623m8053k6586M7060
1143A2875P298l4759N420J3278n454R414m437k4780K1632K9331l8189k0442M6539
1156A7726R82m3513K3686L1004m3503j4180N1769j508m5455R418K8118n419m736
$$ y = [-838, 10078, -7944, -4408, 2554, -14276, 2640, 24476, -19849, -36147, 30093, 33169, -43275, -30150, 40500, 15715, -36279, -7238, 22540, 2259, -9518, -7321, -3382, 19506, 11891, -31336, -10085, 44109, 7302, -42866, 7103, 39037, -15529, -21434, 29341, 12070, -27226, 1203, 24613, -30, -11062, -3769, 2841, 22439, 10044, -38120, -15314, 50073, 15134, -52520, -8849, 43354, -2798, -29763, 8698, 9344, -16302, 375, 9479, -10215, -4681, 2216, -10201, 3554, 12399, -23862, -18397, 34572, 10715, -46000, -6169, 40454, -7599, -34185, 12875, 20173, -14586, -9166, 4112, -1342, 8072, 3635, -21145, 487, 29818, -8371, -28813, 17726, 18708, -24805, -1119, 29885, -13618, -27798, 23971, 22463, -22992, -13574, 14544, 9125, 4389]
1169D389r771j6478K8650K9008m5634k7248N4700J2420n1036Q932L6250k9132
1181d950j5942M0595j963l8665J3189K4051j3988m239L800j2756J5712K1348l6763
1194a0571j9418N2817O514n7490J1808N0839k7239l5353L1973J5306k4205K544
1206b475P914j3601J2598J1642k7956j463L1668j6396k2618L5613L267m9089J6641
1219a4255N1891l2354m3262L5148K7092k4974q655K881n335K1129J0061l9099
1231a9732m310M5644q945l8110K4177J8579l5980P023L9159k6079l1410L4547
1243D563J5983l0610K117J5565j2410N346J3608k5571l262L7057j2788l7105K9515
1256B008K6067l8751p886L6891j0699k3910K3858L081k7564J7830K2465l0938
$$ y = [4389, -5382, -21860, 6790, 35798, -9836, -37084, 17616, 30036, -21000, -12068, 24182, -4950, -20892, 19703, 17740, -20925, -7736, 16315, 2327, -1912, 1888, -10868, 4844, 26192, -10571, -29989, 22828, 29342, -28148, -16340, 34499, 7260, -28093, 3880, 19186, -5019, -2475, 5439, -8162, 4436, 16078, -11878, -13341, 18327, 1931, -20687, 14926, 18193, -30896, -14255, 37636, 5282, -37980, -2832, 24260, -714, -9369, -6488, -11823, 9306, 19367, -19732, -24042, 21602, 12657, -25453, -1276, 17303, -18677, -11654, 27505, 1426, -29984, 4563, 20546, -10064, -7947, 7618, -4792, 554, 14162, -11409, -14671, 22386, 9598, -27507, 2008, 28075, -10676, -18562, 18329, 7630, -16280, 7578, 10659, -16905, 925, 23390, -7548]
1268g548j0819K9288l100j3723J4160q854j8967L1371J4259m6421l196M7396j0941
1281A2905l3356K1442J0602k6816J2840K4235k9141j4468L1393K820k0225O417
1293a352k228r752K7349M677m6085Q427N2395k2689m6752L4801L0282l7339j0468
1306a8734L1759m517j6554R697k340l675J8035j0167k2602K8002J5773m3917Q46
1319a8394N1800k1022m8659L8807L8148m7095k5888M1101J6140k1923j3208l931
1331a4124J7358K6786k8239m0415M0973L9060n1365k4258N4307K219n0048J7668
1343a0078L8959k9952k4789K9557J3223j4939j0082p930J4415L1515k5653m5908
1355d1662L9978M8195n3467l9020O0190K2702n5869o225M2553l712k3848K935
$$ y = [-7548, -18367, 10921, 7821, -5902, 8258, -596, -19563, 11808, 26067, -20354, -23550, 23846, 12905, -20451, 991, 11593, -15223, -2383, 21852, -7289, -21757, 9636, 12456, -7769, -1352, -3580, -13332, 14017, 18694, -27391, -18964, 33431, 10742, -36010, -1209, 29073, -8266, -18734, 13025, 8508, -8046, 1651, -689, -4364, 13671, 3504, -19098, 8904, 24677, -19240, -18394, 33406, 12384, -36275, 2532, 40680, -6415, -32303, 8798, 24938, 3015, -10193, -14124, 3234, 30020, 1781, -38634, 2339, 41399, -9966, -34224, 20083, 22302, -27746, -10078, 28881, -1071, -25860, 3697, 16920, 1981, -8101, -16031, -1616, 29899, 4246, -41662, -1684, 46511, -6956, -45976, 14214, 36916, -18953, -25178, 17375, 13663, -10185, -7250]
1367g250N168P733P954k3919j0287L9131O15m8378J6728M7168l5417l7122M9134
1380A1258K2164n2693r352M3115L517k5001o479J763J8196J7123l3373k6411M6149
1393I976K3154n1723q146M7390j1406l4249K7782J7260l4478k4L0339r431j5748
1406i304R251k658J035K0342j7397k7517L3686K4141m4067j0947M5373n668l5799
1419a9529J9149J9614k4499K8J8110j6662l581K3773j1939k1478K2866R239k5590
1432a0499Q162J5653k4111N26L3356j8898l3283L1157K2882l4530o776K6666r897
1445D08r850K0531q631k2815K1158J5746k2834j259J3550j4700M219K6304k5046
1458c219k7724M1544K1753m8995r024M4704m054k9925J1779J1536j0847N297K005
$$ y = [-7250, -2082, 5651, 13605, -10314, -20601, 18530, 19145, -29233, -12505, 34663, -754, -37876, 11258, 33422, -19271, -28623, 14492, 18009, -6992, -13471, -11708, 6488, 23611, -9762, -36173, 9976, 33130, -18593, -26739, 20651, 9245, -25004, 2778, 20038, -14440, -14464, 15875, 6444, -9304, -53, -2711, -1676, 18666, 1269, -26248, 7438, 31579, -12488, -23435, 21938, 16270, -19529, -380, 19234, -5265, -5237, 12873, -3789, -7370, 16403, 4464, -17014, 5852, 15091, -10499, -2337, 13316, -10795, -10269, 23087, 4189, -29094, 2063, 24945, -9585, -16361, 10305, 408, -9442, 11089, 2458, -20357, 801, 16547, -6287, -7546, 6004, -8696, -4477, 21827, -3219, -30943, 10601, 32354, -16641, -25665, 19039, 14985, -14940, -3161, 8375, -2472, 2825, 4830]
1471D830j4112J3450J1799k9419R4L9403j6720l8878L2220K8331m3653j2091M5540
1484B0794k744l7681R333K3154o630o656q498m818K8454Q880m8025n442N9324
1497B9445m670n8626J6861M5558k6098k5210K8020N515k3022O620J2244o074J638
1510B201n917j2877K6157J6930m6706j3672O0687N011o2720O527N3168j5241l6468
1523b2920J6809J7562r480j860n056l971J9940o65l2170J4324L5980k9673l1105
1536c2285M1341J7184m4910M02L9908j4400k8496J9590J4532j2915k851l237k808
1549h945K3997J339m0611O610M8018j7190m3277K6082K8377k7883p159K3052j2358
1562E2j2315K3298K82k1438R932Q759j4247R715J1275k7723p66L7238j1903l6228
$$ y = [4830, -9282, 4168, 15967, -13452, -13358, 26045, 9325, -29553, 2667, 30998, -12655, -24746, 20794, 18050, -19631, -10298, 12856, 6226, -430, -8928, -13746, 14708, 23588, -24437, -29879, 29445, 24775, -33851, -16990, 28568, 2470, -22740, 5280, 10795, -12227, -5607, 6637, 563, 2201, -3716, -16593, 9564, 26494, -20212, -33884, 26803, 31814, -30906, -24379, 28789, 13548, -22920, -6111, 11451, 1971, 111, -4945, -8916, 11024, 10359, -21811, -7487, 28493, -1180, -32285, 9056, 26240, -18670, -18268, 21640, 7240, -21256, -1666, 12866, -49, -2900, -6137, -8945, 15052, 16391, -24220, -17610, 30408, 13218, -30059, -3977, 24400, -3483, -10642, 12410, 52, -12263, 11035, 11317, -10121, -189, 8570, -5677, 4038, 15313, -12410, -13176, 24062, 12159, -24069]
1576b4069K3124K3053k7588n235K4015j2009j3102K2884k937k3242J5952J4843
1588A5689k3761j301K1687j1929j0505J9090p075j7529K4189P532l6361O582L8738
1601B5046j9043l0628K4383J4765k2302K946J3660j5912j477J8912r871j0734
1613a0255J5681n569j3261K5411L034m1099J0634M7885k1706m4196K7897L1928
1625B6384k5178j5829J4651K701N67K764j5604K334K5659j5350k7816L1462K0836
1638B7581m3979p145M8466p478m3793J8092L1309k0804j7035J3579O679M26m278
1651A620j8406J0359L3484k3122m1395L7376M0424m7861l1216M7682J7902l8751
1663a1904l462K3039m653o632L376m220O181P144k0325j265L6021j2393m5336
$$ y = [-24069, -945, 22108, -5480, -10715, 13300, 1291, -11811, 11073, 8136, -15106, 846, 15689, -8072, -9373, 12314, 385, -10120, 8970, 1895, -15634, 8555, 16087, -20274, -13692, 25046, 6003, -24625, -242, 14523, -7779, -4833, 8827, -7085, -8562, 10350, 479, -10255, 5426, -143, -13404, 12007, 15041, -26058, -15424, 32461, 10755, -33441, -5544, 26384, 1206, -14623, 28, 2729, 3296, 6060, -9544, -7210, 18449, 3099, -24717, 6745, 27581, -16398, -23543, 24923, 17445, -26348, -8256, 23053, 2249, -14786, -1207, 5472, 5898, 1620, -16786, -6427, 27057, 3935, -37460, -84, 40340, -7521, -38737, 8945, 26847, -11904, -15366, 7673, 3020, -3612, -236, -4456, 1725, 8869, -11456, -12721, 23300, 10907, -34429]
1676c4429K7995M6500l9012l8675M1409K6588l3674j3955J8064N550J78m806j4284
1689a2551J1936K2028k5313j9620L7413R548m3712M860M2082j8742l1915K5158
1701A172J7626k4084l758J4382l599n79K009j4050Q523K3451k2508k6402L5669
1714G852K1150m2049j0387L8869k260k5594J1279P667j4138R152J0637j9416r41
1727h179J8587r498p636J7979q614k1254K4375J6449l4068n296L3844o750k3976
1740a4037J5410P434j8331R662J4160k1667m436K3655p373j7111J5034M121j7038
1753a0517J0816R861k2124L542K5649j9026k2233L1325J1614l4013P24K7501j0098
1766C021j5116J3748n49r030J3003j21j7022J1552J1105k0851M000K5095k1078
$$ y = [-34429, -6434, 40066, 1054, -37621, 3788, 30376, -3298, -17253, 811, 6361, 6539, 1733, -12551, -615, 21413, -3900, -23520, 13893, 23441, -20271, -15411, 26671, 7929, -23986, 1172, 18798, -5286, -9044, 5338, 1739, 1160, 3169, -10881, -2358, 21093, -1415, -27817, 7852, 29002, -13047, -23434, 15435, 13175, -12419, -1140, 6527, -7611, 1541, 12178, -7238, -8179, 10408, 910, -6726, 11253, 2639, -18615, 5760, 22209, -11859, -17155, 16689, 9939, -14037, 1373, 8807, -9524, 138, 14298, -7369, -11805, 11850, 4477, -12634, 2400, 6521, -10517, 299, 10160, -11964, -8422, 17227, -1799, -24032, 7293, 18907, -15106, -14382, 13119, 3021, -12095, 1653, 1104, -7926, 5077, 4956, -12066, -514, 10591, -10260, -6260, 18835, -2243]
1779b243k3343L5776J6745m1849p837L8219J111k5132J478P205K381Q205j2030
1792a314j5604K3945J4109l3935l893L8537j1257l6073K4957K7131l2280j5629
1804b1306L0637N389k0582j456N762M646P507j4245j5985K8408J5859m2648q440
1817b6454N0825j550n0343J1092M0568j5696k5296J3531R825m426N20p867k184
1830g455J9017n118k4596J9409K3614l5299j5330M6064N082m8248L369M1438p417
1843A4530k7114M484J1405M057J407j6976o197K8904J618l5571Q793L5539k2388
1856B491k7765L1579J5748l3681l308K7922n441j7117P250L851r98O491j1121
1869d099r755K4412N146l4659M783L9228j5975l5206K3572K3791k3603r587J6891
$$ y = [-2243, -25586, 10190, 26935, -14914, -22751, 15468, 16579, -8553, -7075, 130, 2511, 10716, -1314, -16918, 7027, 21136, -12799, -16692, 21845, 10588, -25485, -528, 26603, -5677, -21306, 9331, 14720, -5862, -7318, -1556, 3090, 10597, -3648, -19633, 8775, 24634, -18014, -26454, 24371, 22821, -27522, -16430, 24138, 8442, -16854, -3323, 6502, 2076, 2596, -5271, -7455, 11562, 6444, -18152, 1257, 24871, -10428, -25758, 20306, 25388, -22860, -19491, 21947, 14530, -12584, -8100, 3305, 7362, 8769, -8207, -14404, 14500, 16118, -19453, -10660, 24879, 2491, -25274, 6305, 22053, -11628, -14936, 12986, 7545, -9572, -2322, 1529, 531, 7022, -4099, -13854, 10558, 15704, -18955, -14172, 25056, 9081, -26125, -2553, 21238, -2365, -11952, 4939]
1882D939l784n164J0458o543r472J5352M01j6466J1131J0228k2920J491L0205
1895A9856j4568k9805K3026K1692k4532q259J7578m196o280J1973p153j2078J7788
1908E042N016k0867N258J6336j5632n510K2037q904j9973K0492J1825k6293o43
1921a1816K5639j0544j6836J5751N245j4012P047M636j3848P749J3764j7683p410
1934a2318K3757l932k1154J6200J1187k4818L005K7529j4560k3616J9975J4630
1946A5885j6775m045O680l181O964N589k1177j335K9085p566k8407J7429J9860
1959A9006k5611n839K7398o753k4124J4768J5381j5537m968P649k533M797L810
1972G444j8099J233K7852j1412l1108K2080K6474k9660j6897L1336N704k5361
$$ y = [4939, 1155, -4009, 6449, -94, -9566, 5786, 6187, -10279, 852, 11080, -11840, -10349, 19856, 5288, -24517, -1491, 20201, -4331, -12590, 4988, 792, -5488, 6485, -668, -12746, 5042, 10058, -10809, -5551, 10785, -4847, -10357, 11680, 2776, -17197, 3295, 15120, -11173, -11816, 13823, 3279, -13557, 2194, 7439, -6573, 474, 5110, -8738, -989, 12775, -4908, -12318, 11439, 7507, -13647, 2553, 13740, -11078, -8073, 19456, 4896, -18720, 1255, 15885, -890, -4935, 1745, -1436, 5528, 11117, -10060, -11395, 17690, 10124, -18283, -854, 19006, -6605, -12444, 14954, 8201, -15923, -1155, 14226, -1311, -6279, 1370, -1163, 3634, 7444, -10655, -9422, 18430, 7018, -24090, -2010, 24464, -5196, -22093, 9243, 14947, -10414]
1984a0414K765J3533o049j40K584r688O056J2339j6946n740K4999n683k9072J9895
1998a561K7312l0393k0412L3455J1807k7936m521J5703J441j88m040j2617J1794
2011a56J7789k0970j4677K8459M490l1607R195K8311k0814k1203K6449J1196k3922
2024g460l094J4412n15k161j999r447J0552J5383k2244j4686L2049Q280l7038
2037a7968J961L4912j0784k6520J6052J3772j4643j633Q036n107J287N668j0778
2050e745L236J4714j5322j3951K8581Q170l7397Q16L7679q336l0820J1804J8363
2063A1792r416m746K217m526P046O901j5911k011K0766q565k0128K1205J2762
2076A7386l0026k444L2527p080k7732J2937J7348j2650n725O024k333M961M326
$$ y = [-10414, -7649, 5884, -165, -305, 2279, -7409, -1353, 10986, -5960, -11700, 13299, 7616, -21456, -1561, 25751, -4642, -25054, 8401, 20208, -7728, -12249, 3454, 4895, 4707, 667, -11950, -156, 17633, -3337, -18014, 10445, 14935, -16672, -7477, 20834, 20, -21183, 5266, 16462, -7460, -10554, 3858, 3343, 1182, -817, -10264, 288, 15671, -6573, -21259, 10790, 19070, -17968, -16007, 18905, 8121, -18399, -2347, 11425, -3218, -4851, 3185, -1922, -635, 5033, -5745, -2509, 12205, -3117, -17068, 11513, 19683, -17714, -16898, 20781, 12445, -18375, -6571, 11792, 2376, -2370, -153, -4679, 2367, 9268, -6643, -8654, 12112, 3547, -16581, 4624, 17386, -12640, -15084, 17443, 10363, -17369, -4432, 12916, 266, -5459, 565, -1768, 3193, 7519]
2089G519j6272J72K4800r014k6712J8353K1708k4498j1092K5481p55k0033J0129
2102b14J0827j4072r58J1434o159k263O752j0042p18K0526q709k6103J7871K4733
2116B2905k4722j6506K4998M926j9194N166Q236j0995K531J0354j0469m235J2272
2129E267n976p752J4915j428k0460J2874J9235k2111j2132K5568K671k2720O317
2142e732J4100j0731l128R783o960k358J2529p638j1289J6253M617j9186O191
2155c549J5479j6142p774K3730k843k4496J2122J9568j6576j0214J3327J159m706
2168i15N430p272p142J7892K655k2827N926J9783j5189j0826K1583j58k4539J1649
2182c950K0037j7120j2706J6404L829q169J115k841j703J4613k687k2548J1506
$$ y = [7519, -8753, -8581, 16219, 7205, -19507, -1154, 20554, -3944, -15036, 10445, 9690, -10343, -214, 10613, -3459, -4417, 7017, 858, -1405, 5347, -4695, -5413, 15113, 6404, -19699, -1828, 22905, -1817, -18323, 6675, 11601, -7593, -2427, 5809, -5186, -2655, 7699, -2770, -7005, 5267, -709, -8461, 6454, 5026, -15434, -2560, 16675, -5436, -17568, 8000, 10671, -12049, -5732, 8368, -2363, -5491, 4292, -2668, -5026, 7503, -135, -11424, 4829, 9446, -9740, -3549, 11930, -4212, -11986, 11744, 8901, -15595, -3473, 16095, -481, -10695, 2632, 3791, -915, 4515, -2757, -9899, 7993, 10648, -12179, -6253, 13530, -1659, -12485, 9098, 8940, -15599, -3950, 16087, -1033, -13739, 2665, 6494, -1675, -560, -3401, -5104, 9509, 6822, -15726, -4220]
2195d220K3763k0767j9037K7576R583k7549M27K2085p658j2405R054L189n141
2208a100L754l730m257J3306j337k1262J1459K4900k2681k2995L0659J6649l1717
2221h352r214K5892K797j4782p63K514L390P254j0419j0643J8346O735k4938K869
2235i314K8343j4714k6449K3604K0166k7323j1274K3296M985j3940k861K312N864
2248B695Q272j3677j3363K2714J2452l0349o518L4126l307l0332J0588K2570j4638
2261A233j1764J3208J807o586K861k548j305J0820o205j5531J7119J4361k7214
2274i744r228L2685K348l1495L857K3268p260j1832N636N73K15P140q391q815
2288a1043J5255L831j8825N951J7219j6567j1152K3784K185k3970N663J8902j0590
$$ y = [-4220, 19543, -1224, -20261, 7315, 16898, -10651, -10224, 11861, 4203, -8202, 852, 4041, -1100, 2654, -1076, -5333, 7973, 6636, -14626, -3167, 21733, -948, -23943, 6716, 23365, -8352, -17566, 8326, 11123, -3659, -4422, -1908, 1482, 8736, -1683, -12326, 6020, 12755, -12183, -9314, 19029, 4315, -22134, 1470, 21636, -5687, -16961, 6335, 11320, -2620, -5481, -3169, 2695, 10967, -2710, -16073, 6641, 19093, -11256, -17774, 16352, 13045, -17287, -6699, 15871, 1233, -10531, 2677, 4484, -2102, 759, -1789, -3094, 7726, 1521, -14010, 3109, 17470, -9744, -18972, 13713, 16061, -15434, -11577, 11691, 4431, -7401, -1765, -1192, -977, 6163, -2228, -11043, 4212, 8043, -10782, -4831, 12388, -4179, -15331, 8453, 10638, -13332, -7669, 11233, 643]
2301F43q990J0256r27m635Q912m894j0146J3715O541j8877J292J8585r437j2500
2315a0462J5290K805j6034P956J1504j6083l398J8733m165j5036Q894O754r672
2328b914L742M683j1648L346J4644j2103j1501J7729K699j8009Q163J2754j6750
2341e165n332K1494l157j9976Q283J3177q654l984L196m174O663P882j6143p424
2355a3314K4492R64k6985P494K3736j5197j5935J8705O866j6419Q58R397l540
2368A122r84J223o268O354R800j7110p917K6312J899l2064O514L1732j2949k6663
2382a8999J5029J7869j1249r520L376L006P279k668j5922P003K0259j5314j8360
2395a8211K3036J1970k9061k125K9522n610k5636R112J8183p007r751l63L815
$$ y = [643, -8347, 1909, 982, -3653, 5259, 365, -9781, 3934, 10475, -8402, -7110, 11475, 2038, -10462, 4828, 7633, -8401, -445, 11059, -5024, -8422, 10311, 6146, -8890, 4, 6758, -2914, 828, 5511, -6137, -2791, 11853, -250, -11751, 5978, 8677, -9332, -1169, 11585, -5165, -10497, 10997, 7840, -12136, -3853, 9324, 670, -3314, -118, -4292, 2371, 10253, -5890, -13314, 11178, 12142, -14843, -7349, 16387, 1190, -14745, 3960, 10826, -5593, -4735, 4662, 1122, 138, 1361, -4907, 1447, 11247, -5863, -13780, 12532, 14431, -17633, -11119, 20613, 7664, -18999, -3970, 13899, 2650, -6870, -3494, -488, 6791, 4123, -11799, -4796, 15463, 149, -18211, 4825, 16795, -12266, -14391, 15131, 9521, -16115, -7003, 11180, 4173, -5578, -5941, -2126]
2408b126J1412k782k1066N990K7577j2824k8235K0408K2737k4650j4132K4159
2420F468N222j8621J383R400j917o28k333n390J0318O000j9378j212K5876o948
2434H240k8501J5486K5159k0182j8438K0336R527j3935l626M191K90P127k666
2447C008j4407Q366J5660j4749j1630K0140L122k1652O970J9008j4314j2689J6909
2460C742N148j2874J419M628m286O169J981j3773L658J7728j1129j5391J7008
2473D028Q041j8538J518J5082r385p728J3568j686j2709R337P074j2986M36J0960
2487G012p619k820J0167o737q853J4973L046j8752M106J6871j1221j0134J5347
2500E386k21j4754R562R936j4731k889J3613k929p290N420k622l644J2789k107
$$ y = [-2126, 9286, 6504, -14562, -8572, 19005, 6181, -22054, -1646, 21091, -3559, -17691, 6468, 11690, -6931, -5548, 3852, 1935, 1307, -1026, -6416, 3902, 9902, -9476, -10688, 15188, 8240, -20261, -4775, 20384, 202, -18236, 2100, 11627, -2308, -5934, -1743, -1453, 5674, 3008, -11399, -3033, 12627, -2122, -13752, 6388, 9510, -12142, -5172, 13836, -478, -13167, 3742, 8890, -3984, -2565, 2063, -2223, 3946, 5927, -7846, -4188, 13540, 2411, -12980, 4028, 12069, -6469, -4951, 10131, 746, -6982, 6586, 4900, -7809, 1528, 8602, -4384, -3948, 7012, -607, -3427, 6740, 3, -8850, 6123, 9169, -9583, -5477, 11394, 173, -9961, 5386, 5165, -9589, -27, 9909, -4822, -7711, 5902, 2973, -4317, 1103, -1519, -5163, 7626, 5519]
2514E519j9158J0027J9847j6987j5428K0795P441k0220J813J3637o871n792P836
2527B459j704k890O050n613n803J4512M79k0647Q127K1794j6723j8626K2203J2170
2541A5788k2572n156J7477L83q214p30j486N122R131j2431j1926K0123Q926k4627
2555a0192j678K5179p811k0800J4835J3947j7382o177J4198J106o483p05l249
2568e212N798J1059j2754j5670K1094J4192k6285q212K7228L08k3025O029J5136
2581I686q694o041O816j733k99M622q137j655J4214m235j8156J3596J6254k1237
2595d999r563K3649K294k1928M099J5153o481n502L650k935K764Q018j0356q421
2609a0558J7215L736j9768L958J6901j1887r153J6084L86j6161P316J1761j1150
$$ y = [5519, -13639, -3612, 16235, -752, -16180, 4615, 12056, -8164, -6351, 7286, 415, -5377, 2459, 755, -2135, 3915, -1698, -7501, 7011, 7490, -13157, -5030, 16764, 41, -18585, 3618, 15788, -6784, -11940, 5537, 5920, -2294, -3024, -4510, 612, 9743, -2688, -14614, 5509, 14435, -10192, -11870, 13309, 5498, -15302, -467, 13480, -3902, -10079, 4119, 5225, -1258, -1963, -5212, 586, 11645, -1109, -16779, 4315, 18507, -7778, -15990, 11238, 11546, -11479, -5450, 9686, 992, -5049, 1767, 34, -265, 4357, -3780, -5435, 8779, 4544, -13612, -16, 16238, -4999, -14562, 9087, 11381, -10547, -6448, 8705, 2224, -3278, 372, -2563, 201, 8219, -2137, -10558, 6657, 10393, -9375, -5417, 11484, -403, -9556, 6528, 6914, -9247, -1931, 9830, -1320]
2622a320m003R300l420k927Q311o236q701J3824N035j7704J903J5885q833j0009
2636h895J3483J268j3876P904R701j3893k413J3962l911j0324Q559J967q010O204
2650A726K393j1161N111J2605j3369r259J8866J775j8746N642J3778j1679n952
2663h270J4085k484j1017P269M632p466K650K530q748O664J0895j6308q692K3165
2677H905K813k4581M029K0951r045j2966J0258L916p144L015O43n229P322J840
2691D727j2687N419J5238j4400j2815K1410O874k4174K90K2398o363j5949P670
2704b362Q266m396j031l302k507J2108J433j9388L790K2793j0957k0318J6071
2717B00J4342j9366n103J7794k422j2791O471N560m386O94k308m270J1256M119
$$ y = [-1320, -5323, 3977, 557, -2370, 5941, -295, -8996, 4828, 9863, -7841, -5938, 9947, 1114, -8895, 4588, 5856, -8020, -116, 9585, -4308, -6721, 7241, 3330, -6994, 1565, 3532, -4478, 1726, 4119, -7042, -1931, 10674, -2695, -11954, 6912, 8687, -10059, -4417, 9361, -2318, -8270, 5815, 3331, -7686, -417, 4215, -3251, -601, 1929, -6819, -155, 10740, -5568, -14260, 8905, 11718, -12863, -8834, 12117, 3072, -9894, 364, 4280, -2864, 151, 794, -4435, 2887, 4727, -7960, -2541, 12697, -1703, -14518, 6892, 13766, -10408, -10118, 12280, 5917, -10032, -2362, 5904, 1508, 477, -2825, -5332, 6776, 8209, -11179, -7389, 15404, 4447, -15871, 200, 14542, -4824, -9927, 7867, 5445, -7346, -875, 4685, 299, 993, -1315, -5585, 5671, 9790]
2731I790k0350J175K4633p542k4597J3723J8733j5895j0005J4175J475q523L444
2744B36Q51l735O681j201j0466Q576J0034j6057n121K0815k857k1449J0194J7557
2758A4058j4818r792J3924K590r005K474N0k611P986o43j4024P040J4820j3305
2772a256j0740J7573K780j7769O245J3276j2310o549J3879m45j0346M916L393
2785B647n111N097J280j1865N056J4421j2380j1393J7110M844j7592K755J4047
2798H916r856o276J2697j804j0863P324N228r316K833N543q773J452J0672r702
2812a925q518J6678K744j9612M395J7109j0353j0319J2633J864r771M753L973
2825C651q491L415P156r082o67J0621p025q354J4637J866j8585N901J8120j1779
$$ y = [9790, -10560, -9385, 15248, 7706, -16891, -3168, 15565, -330, -10335, 3840, 5315, -3208, 236, 1087, -2648, 4033, 2832, -7634, 942, 10976, -5081, -10202, 10613, 7756, -13693, -3499, 14058, -760, -10552, 3372, 5962, -3043, -569, -519, -3130, 4856, 4213, -9811, -2771, 12049, -1256, -11996, 5577, 8357, -9412, -3167, 10109, -2201, -8750, 5129, 4684, -5662, -746, 2647, -2464, 2633, 3913, -7952, -2896, 11525, -855, -12248, 4862, 9706, -7886, -5131, 8916, -940, -7216, 5481, 3677, -7186, 138, 5366, -3950, -1117, 4426, -4347, -2895, 7777, -1925, -10443, 6235, 8979, -10633, -6238, 10871, 518, -9801, 2832, 4696, -5075, -322, 3651, -4840, -1425, 5731, -3351, -4018, 6603, -422, -8776, 5861, 7727, -10858, -4957, 13163, 1384]
2839A384j3824J4675O110j1623J047N065m800L188M225j0007K71J3120o871j1733
2853i773J3653N861j7639K273J7339r497j3200J3510O529j3027K28P218l920O52
2867B07L679q474J211J3284q029j4345J5025J0152j8586l037J8141m726j3396
2880h894R821N817j0821J401P744o370p31N586o244q59J1720o913j3182J4345
2894B420J0593j9684l978J9453k213j5241P154P514q490N80N760o962K99Q077
2908E282o809m329J2132l228j3064J1490R083j6898m090J9842l094j7141Q409
2921b415J0070r161k652O245l731L31O442q189l972J3664r95j6505R022J2978
2935A1132j4509o516J7770j889j6245Q214J1281j0678m511Q401j517j265L889
$$ y = [1384, -12440, 2235, 8345, -3278, -2231, 2834, -1966, 1222, 5447, -4560, -4289, 8831, 1960, -9773, 3880, 9741, -7898, -5625, 11714, 2217, -10983, 2527, 9056, -3971, -3743, 3475, -445, 207, 3886, -4588, -3377, 9907, 1878, -12467, 2558, 12710, -5876, -8913, 9228, 4502, -8894, 927, 6744, -4077, -2676, 5068, -1302, -2033, 3553, -2691, -3550, 8170, 1257, -11925, 2420, 13013, -6671, -10649, 8804, 6591, -8650, -1496, 6018, -2472, -1892, 3868, -3094, -2795, 5282, -1527, -5856, 6276, 3048, -10016, 1474, 10557, -6341, -10431, 9411, 6317, -10824, -2415, 7655, -1506, -4158, 2087, -1644, -1313, 5129, -3060, -7032, 6632, 5637, -10868, -1846, 11132, -3377, -9893, 7877, 5988, -10257, -2043, 9238, -1440, -5951, 2450, 933, -332, 3557]
2948C557p031k970J4981k393j8146Q571J6764j4302j0907J7198K580j4789L821
2961c066J0086q013k974P108l082j732N731o163l929J3312r39j7507P465J7487
2975A3784j3786j3614J7420O710j5914m95J0319l528k588M159m856j8R103o485
2989B11q900J2712M867j7377L327J6540j0032j2963J5342O451j5541m26J1188
3002E399l470l276L486m662J32J0601o716j1905J3282Q443j6553k409J6328n118
3016C562j2211J1102M969j2408J651R399o368l592P631l865l960R225l092j0831
3030h788R773Q637j5195k682J6191m183j3025R489O061j1158K029Q572p816l371
3044e466J0290l009p974P650K275r260N147O258j1473k32J4974p045j3196J1933
$$ y = [3557, -3474, -6444, 8537, 6144, -12002, -3431, 13333, -969, -11876, 5322, 7902, -6887, -3066, 7020, -993, -3967, 3141, 59, -1673, 4058, -2105, -6034, 7278, 6339, -11168, -3703, 13784, -2, -13616, 3804, 10514, -5400, -5895, 4424, 896, -1692, 2467, -2389, -2407, 6696, 211, -8689, 4023, 8890, -8487, -5160, 11380, 1348, -11615, 3727, 10178, -5363, -5789, 5399, 1929, -1347, 2139, -2523, -2391, 8210, 1494, -10411, 2871, 11314, -5239, -7648, 8680, 3562, -8649, 2453, 7422, -4986, -3335, 6064, -304, -3896, 3735, -130, -4090, 5135, 2043, -8788, 985, 9622, -5573, -8255, 7936, 3753, -9272, 217, 6278, -4880, -2851, 5721, -2095, -5466, 4824, 1815, -6159, 1491, 3766, -5494, -347, 5911, -5562, -5794, 9180, 2135, -11061, 872]
3058H72Q267j4258k13J1411n611n923Q761q89q053O544L405q313L151O410j0356
3073d795J26J4187q015j3334J3825R451j7057l344J5819k243j0457N234K866l972
3087a709L913r87p215P331P157j3881k433J7090m534j6327J1139J2549j5696n923
3101i526J5632L63j1448K802M391j169K482l657p179J0502Q281j7283n768K1729
3115A0152R2k1099N515J6936r887r983J0426K627o622J462M85j664N815k002j0516
3130h263Q760J1758j6328r241K1058M406k1888J179J8508m993j2341N570N168
3143C353k649J018l970l220J0858J379j5602L883J6682j0277j3969J5453Q145
3156A1084j7365j283J5139m001r244N202K678k468L311m429n400J1410M476j7109
$$ y = [872, 9139, -5119, -5332, 6079, 468, -5455, 3306, 2417, -5636, 908, 4313, -4000, -849, 5561, -4795, -4669, 9518, 1503, -11831, 1994, 11445, -5612, -8956, 6863, 4620, -5837, -603, 2263, -1709, 2204, 1217, -5998, 1333, 8490, -5391, -7824, 9266, 4732, -11595, -456, 12093, -3603, -9526, 6106, 6469, -4979, -2177, 2214, 1045, 3527, -130, -7309, 3193, 11474, -5809, -11577, 10152, 10244, -10855, -5340, 11596, 1709, -8274, 2152, 4779, -1843, -381, 104, -1560, 4255, 2253, -8263, 497, 12255, -4073, -13314, 7744, 12150, -9738, -8559, 9949, 4956, -7385, -1815, 3353, 704, 1722, -2248, -5468, 5390, 6769, -8833, -4950, 11732, 1455, -12514, 2939, 11084, -6281, -7564, 7575, 3574, -5670, -468, 2210, -258, 3053, -1376, -6776, 4634, 9110, -7999]
3170g999k68J9081n386j6781R860J0666j1603l135R512l311m948O971k097n101
3184d539O982J19r394O388Q333j2506l440J5303k605j4513Q360R399j0293k835
3198e241R003l753m168P912k581q243Q677M284j1190J398J0257o589n480J0041
3212D327j609r605Q212N748j2542M77J2486o133q442R698J918r338M466O044q781
3227c074l64Q851n288m679Q275k027p733Q708M524j3958R74J6038o981j3362J0792
3242F96P164r994j029N869l299M70M137o913j342J1376m107j2085J0309Q819j4740
3257d669l319J6544l290j4217P580R191q466l218N471j050P55K382q240L12J3480
3272I246n129j6324J0714J4515j4503r925J5618L722j3177K203O699l569j199
$$ y = [-7999, -8267, 10814, 5428, -11353, -1493, 9173, -2430, -5565, 3947, 636, -4312, 2659, 562, -4539, 2443, 2562, -6832, -444, 7889, -4617, -8057, 7246, 4641, -9872, -1512, 7887, -2406, -5241, 3762, 9, -4159, 3753, 1172, -7071, 1606, 5890, -5300, -3902, 6355, -234, -5714, 4327, 2718, -6887, 1325, 7073, -5469, -4992, 7494, 1361, -7081, 2617, 4535, -4803, -337, 5707, -3074, -3438, 5413, 125, -4554, 3721, 1694, -6039, 2669, 7193, -6765, -5791, 10247, 3266, -10096, 696, 7860, -2134, -3163, 2706, -593, -123, 4014, -2899, -4241, 7135, 3028, -9057, 1252, 10071, -4669, -7988, 8556, 5266, -8951, -1371, 7820, -646, -3864, 1607, 557, 1312, 3694, -4546, -4234, 9246, 4117, -12207, -1493, 13022, -1481, -11406, 4212, 7934, -5243, -3040, 3659, 90, -1109]
3285a109K246l807K383N782q856l635J4580j591j7525P298J7067j2441j2774J4183
3299A801P037j1662k022N833m84R53l97o882M082J0371r749r370J4288N103j6322
3314g420P85J5406o715j1224J0157N282r161J3M792k661J929J610p869K007J1667
3329H598p992j1344J2971Q516j5634l054J4321k892r162O077L123o588K933L914
3343C787o965J110P012o667l204J0415l054j0692R052P600j2905k363J3049l011
3357C164r178O541L269p164L113M524p534K32Q940n191o385Q988M32q997N378
3372A32O072j0060k14J1699o092r654J0300M884j0752L72Q160n127k578O556k977
3387G21m795P748M5r248N949O300j0482p37J2130n817j0426J0389O833j2799j470
$$ y = [-1109, 1137, -2670, -287, 5495, -3361, -6996, 7584, 5993, -11532, -4234, 12833, 392, -12382, 1801, 8838, -2824, -4846, 987, 503, 1456, 1059, -5823, -1741, 8630, -1119, -10489, 3799, 8902, -7420, -6635, 8771, 2056, -9168, 989, 6271, -2890, -2877, 1915, -746, 1183, 2793, -5076, -3069, 8598, 606, -10738, 2233, 10749, -4885, -7939, 6382, 3490, -5672, 405, 3528, -3060, -127, 3787, -3178, -2068, 4944, -1723, -4927, 5488, 2434, -8258, 794, 8394, -4511, -6874, 6175, 3164, -6014, 527, 3796, -3368, -255, 4269, -3265, -3033, 5907, 716, -5669, 3319, 3751, -5246, 132, 6204, -3856, -4070, 7629, 1537, -8117, 2183, 7067, -3685, -3313, 4847, -280, -2858, 3698, 721, -4074, 3674, 3719, -5529, 420, 6720, -3762, -4499, 7631, 1814, -8612, 1777, 8610, -4189, -5659]
3402e659J0350k250n735L817o78j580O020k923r026Q545P653j3199l274J4970
3416G031j669j4124P289R250r775l490Q629p52m978L225j220j614O296k602r582
3431h086Q702R353j4130o126J6854J103j5931L493J1268n858m736M801l51j545
3445a189L922l715l703Q735p8j1615N276J1615j1148q246J5091K704j4180J501
3459e030J1374m300o111M295k46l64M090n072n008J0305K753j3150J481J3593
3473H610p036r900J0264M736j0851M86R092n057l998N603r74k703M588k141o284
3488e565Q481M069j2463N2J4057n500j1187Q727O007r414m8O863m806k303O713
3503C683k829m970O410M60p082M563N294r408J93J0855n317r973R308O308j1022
$$ y = [-5659, 4691, 2441, -3294, 523, -155, -1735, 4285, 1362, -7664, 881, 8534, -4665, -7939, 7031, 5362, -8762, -1473, 7777, -1998, -5488, 3141, 2389, -2589, 636, -584, -2198, 4098, 1496, -8086, 616, 9969, -4161, -10287, 6567, 7670, -8261, -4768, 6500, 642, -4094, 707, 356, -1189, 2733, -982, -4685, 4050, 3972, -7643, -2367, 9248, -1900, -10146, 4945, 7649, -6531, -5030, 6344, 2044, -4067, 228, -18, -382, 3708, -1364, -6372, 3933, 6686, -6464, -4983, 8610, 1574, -8326, 1938, 6674, -4177, -3691, 5401, 344, -3654, 1949, 975, -1728, 2860, 719, -5565, 2916, 6985, -5478, -5426, 8631, 3131, -8056, 671, 6678, -2736, -2784, 4079, -727, -3030, 3683, 854, -4116, 2294, 2754, -4328, 235, 5529, -3879, -3686, 7169, 1852, -8121, 1187, 7495, -3527]
3518c527o41Q802l795m604O423j573m726N867J122p436L594O261q686r85J0248
3533F344m424r417R419N478j1673p16J0632l153p252N436J930m426L674m22o255
3548d825N102O189r716k421J1708k719j0898P714P040j0910j531J0462k802p751
3562e358N053L099m275J934O61n234M612N650j0290k991J3831j862j3705O260
3576b615J0031q596m899R257p55o430M325J663m427L198J732o714L628O575q373
3591b400m288J2286l69j3576N318J1254q075o358Q136J001n022K195O81l635M656
3606A804K252q557K270Q738o863o498J0623J414j1392L464J0057p392o075Q725
3620B570J350o766K602K056l698L402K275p889J327R751o410p680R551M039j1418
$$ y = [-3527, -4168, 4634, 839, -3765, 2658, 1085, -3641, 2226, 3348, -4088, -494, 5767, -2919, -3904, 6344, 1920, -7497, 1922, 7400, -4273, -4989, 5643, 2490, -4762, 674, 2604, -1822, 1852, 1430, -4825, 277, 6466, -3250, -5671, 6037, 3318, -7580, 134, 7174, -3736, -5267, 5195, 2393, -5358, -305, 2794, -1481, 453, 1114, -4120, 492, 6142, -4148, -7139, 6692, 4830, -8875, -2615, 7416, -1180, -6079, 3178, 2423, -4007, 318, 1981, -2446, 752, 2484, -4230, -602, 5973, -2400, -6688, 5598, 5229, -8347, -3029, 8225, 150, -6208, 1928, 2929, -2093, 102, 783, -2852, 1804, 4056, -4501, -2231, 6507, -356, -6854, 3769, 5183, -6209, -2745, 7312, -80, -6155, 2570, 3920, -2846, -244, 1812, -1886, 1516, 3791, -4098, -2771, 6980, 570, -7110, 2441, 6480, -4938]
3635d938J903R052o008m811Q147j84p281M128L250m912J418L462n955N35Q044
3650E850n917p116J0198L884j1940P44J0408m921o634O989J695o931K912M322
3664C543n821R70M451m623j379P179m306o325Q937L664j2123P63J2343n438q783
3679f948P106M031o373N78L170l486J678L666n917j085Q336l470q587Q413N554
3694F666j1407n12J1770l992r814O723N714o596r95L853k689J577K481o260o09
3709d090J0161l747j0602P591Q352j0225m310J1151q75q914M761M639n688K57
3723a539L738l502O77L505n284j486R244k000j1353O887R605j0181n827J0992
3737C476J070q537K882L817m256J337K715n021Q72O098m938m503Q746K26r865
$$ y = [-4938, -3035, 6017, 9, -4802, 3345, 3161, -4120, 8, 3258, -1654, -236, 3226, -2729, -2194, 5850, -67, -7183, 3015, 6899, -5041, -4297, 6111, 1190, -5444, 1545, 3240, -3691, -779, 3543, -2278, -1308, 3143, -1480, -2859, 4320, 14, -6311, 2626, 6290, -5833, -5070, 7273, 1835, -6948, 158, 4189, -2184, -1606, 1564, -1922, -244, 3422, -2495, -3580, 4756, 1286, -7301, 1112, 6666, -4741, -5253, 6517, 2525, -7289, -566, 5148, -1448, -2443, 1410, -1279, 298, 2779, -3481, -4090, 6071, 2324, -8278, -687, 7665, -2560, -6870, 4281, 3406, -5508, -747, 3892, -1796, -1539, 2199, -1303, -626, 2879, -2405, -3891, 5353, 3353, -8000, -1113, 8492, -1689, -7516, 3476, 4546, -3991, -1109, 2708, -1548, -211, 2504, -2517, -1645, 4453, -485, -4988, 3758, 3984, -5881]
3752e881M148R139q238n600J0110M89p958K188M951l891J57K747m466M51P058
3767E404n293n885Q562K372r935K131Q692o424m790Q520L68q031L819N067n873
3782a296r04M645l067j672N933l469n083P590K426j0083K070R348o405n855Q810
3797B988J248q822L286O061n985k022N920j976k837M134j839m099P044P50r699
3812e848K770J0283p090p545R529L756r882R58O741l915k333M062j691k163M747
3827B379k413m566O852J891r808K036J1263o812r096R695N369r908j823P863j355
3842A567l286K190k059J43N278l716o034P859M874j1191j264J1854l121j0598
3856g504P449O315q081k404O835j291k622K093j969r09O452l256p839P804O801
$$ y = [-5881, -1733, 7406, -832, -6432, 3678, 4167, -3791, -1603, 3348, -543, -386, 2361, -2105, -1654, 5404, 111, -5774, 2788, 5160, -4775, -2644, 6048, -376, -5166, 3354, 3722, -4309, -490, 4577, -1296, -2200, 2445, -622, -2294, 3639, 170, -4913, 2677, 5103, -4980, -2910, 6438, 33, -5822, 2988, 4236, -4586, -1300, 4761, -1224, -3246, 2674, 698, -2139, 1995, 156, -3943, 3101, 3851, -5848, -3078, 7205, 115, -7430, 2099, 5855, -4027, -3069, 3672, -243, -2576, 1486, -205, -2368, 2379, -34, -4600, 2252, 4143, -5665, -3629, 7634, 822, -8274, 1421, 6790, -3118, -4941, 2922, 1567, -1719, 471, -1588, -1445, 3833, 117, -5917, 1942, 6816, -4375, -5639, 6215, 3094, -7504, -55, 6260, -1821, -4225, 2610, 1319, -1303, 790, -1179, -2088, 4364, 1108, -6731, 1073, 7874]
3871G874j1244l848J2333r0j0778M006O541n258j839M004k047r91M164l393l096
3886c662O946k00q991N105Q239r164m944J0702J358j0206K624O600m264j663L679
3901B159l209l60N511l807n489P607K707r438J331Q596n443n364P972O68p296
3916c855L087N462o054j269N646k516l609N950j272n917N418L250p918L79P834
3931D616m281m877O808Q30p199L859N010p397j486Q476k786n802M816J870n193
3946b736K528K720n463J031O739o000m140Q940L39r406L982P074o941l516P988
3961C139q61o224L567K920m117J866J374m713K050O165p199m494J0540J673j1897
3976f211K208J0564n493o816O492K212m816J123J548k974L346J612o531J414Q141
$$ y = [7874, -3370, -7218, 5115, 5025, -5753, -1747, 4794, -464, -2303, 1701, -346, -1337, 2827, -566, -3662, 3284, 3084, -5907, -802, 7437, -1727, -6671, 4031, 5389, -4817, -2193, 4407, 143, -1520, 2159, -1050, -1410, 4101, 294, -5195, 2412, 5119, -4319, -2988, 5608, 165, -5199, 2773, 3441, -3855, -768, 4694, -1360, -2629, 3017, 501, -3108, 2842, 1570, -4347, 1071, 4321, -3597, -3218, 4616, 335, -4542, 2266, 3096, -4103, -244, 4766, -2631, -4117, 4359, 1573, -4229, 587, 2457, -2736, -208, 2512, -2951, -1920, 4819, -1181, -5321, 3619, 3958, -5448, -1466, 5608, -1333, -4849, 3139, 2278, -3946, -379, 2541, -1576, 290, 1664, -3049, -999, 5166, -2033, -6527, 4013, 5686, -6211, -4003, 6561, 1068, -5748, 744, 2956, -1860, -737, 811, -2163, 1183, 2795, -3736, -2322, 5819]
3991E819n718p079R881L811j1674k21J1224k930q165M238M006l330L16n55k026
$$ y = [5819, 101, -6978, 2903, 6714, -4960, -5181, 6043, 3113, -5052, -814, 3192, -138, 178, -377, -2403]
$$ [...]
8191g8
##END NTUPLES=NMR FID
##END=
