##TITLE=1H_Ser 4630-i-K
 CDCl3, 8 sc, 
 4.3.2020
##JCAMPDX= 6.0         $$ Bruker NMR JCAMP-DX V2.0
##DATA TYPE= NMR FID
##DATA CLASS= NTUPLES
##ORIGIN= UXNMR, Bruker Analytische Messtechnik GmbH
##OWNER= root
$$ XWIN-NMR		Version 3.5
$$ Wed Mar  4 16:43:17 2020 Russian Standard Time (UT+4h)  she@DPX200
##.OBSERVE FREQUENCY= 200.1315
##.OBSERVE NUCLEUS= ^1H
##.DELAY= (6, 6)
##.ACQUISITION MODE= SIMULTANEOUS
##.ACQUISITION SCHEME= undefined
##.AVERAGES= 8
##.DIGITISER RES= 18
##SPECTROMETER/DATA SYSTEM= spect
##.PULSE SEQUENCE= zg30
##.SOLVENT NAME= D2O
##.SHIFT REFERENCE= (INTERNAL, D2O, 0, 15.7039)
##AUDIT TRAIL= $$ (NUMBER, WHEN, WHO, WHERE, WHAT)
$$ ##TITLE= Audit trail, XWIN-NMR		Version 3.5
$$ ##JCAMPDX= 5.01
$$ ##ORIGIN= Bruker BioSpin GmbH
$$ ##OWNER= she
$$ F:/spectra/data/she/nmr/H-F/1/audita.txt
$$ ##AUDIT TRAIL=  $$ (NUMBER, WHEN, WHO, WHERE, WHAT)
(   1,<2020-03-04 16:42:30.31 +0400>,<she>,<DPX200>,
      <created by zg, POWCHK disabled, PULCHK disabled
       configuration hash MD5:
       00 E9 B6 7A A2 85 ED C7 34 08 36 98 17 FE 4E 26
       data hash MD5: 16K
       97 48 16 27 AE CD 0E EB 14 BB 47 69 27 AF 03 E8>)
$$ ##END=
$$ 
$$ hash MD5
$$ AC EA 24 3E CF 70 3D 24 61 8A 7A B3 51 2B BE 81
##$RELAX= 
##$RELAX= 
##$RELAX= 
##$RELAX= 
##$RELAX= 
##$RELAX= 
$$ Bruker specific parameters
$$ --------------------------
##$DU= <F:/spectra>
##$EXPNO= 1
##$NAME= <H-F>
##$PROCNO= 1
##$TYPE= <nmr>
##$USER= <she>
##$AMP= (0..31)
100 100 100 100 100 100 100 100 100 100 100 100 100 100 100 100 100 100 
100 100 100 100 100 100 100 100 100 100 100 100 100 100 
##$AQSEQ= 0
##$AQ_mod= 1
##$AUNM= <au_zg>
##$AUTOPOS= <>
##$BF1= 200.13
##$BF2= 200.13
##$BF3= 200.13
##$BF4= 200.13
##$BF5= 200.13
##$BF6= 200.13
##$BF7= 200.13
##$BF8= 200.13
##$BYTORDA= 1
##$CFDGTYP= 0
##$CFRGTYP= 5
##$CHEMSTR= <none>
##$CNST= (0..31)
1 1 145 1 1 1 1 1 1 1 1 1 1 1 1 1 1 1 1 1 1 1 1 1 1 1 1 1 1 1 1 1 
##$CPDPRG= <>
##$CPDPRG1= <>
##$CPDPRG2= <>
##$CPDPRG3= <>
##$CPDPRG4= <mlev>
##$CPDPRG5= <mlev>
##$CPDPRG6= <mlev>
##$CPDPRG7= <mlev>
##$CPDPRG8= <mlev>
##$CPDPRGB= <>
##$CPDPRGT= <>
##$D= (0..31)
0 1.2 0 0 0 0 0 0 0 0.06 0 0.03 0 0 0 0 0.0002 0 0 0 0 0 0 0 0 0 0 0 0 
0 0 0 
##$DATE= 1583325749
##$DBL= (0..7)
120 120 120 120 120 120 120 120 
##$DBP= (0..7)
150 150 150 150 150 150 150 150 
##$DBP07= 0
##$DBPNAM0= <>
##$DBPNAM1= <>
##$DBPNAM2= <>
##$DBPNAM3= <>
##$DBPNAM4= <>
##$DBPNAM5= <>
##$DBPNAM6= <>
##$DBPNAM7= <>
##$DBPOAL= (0..7)
0.5 0.5 0.5 0.5 0.5 0.5 0.5 0.5 
##$DBPOFFS= (0..7)
0 0 0 0 0 0 0 0 
##$DE= 6
##$DECBNUC= <off>
##$DECIM= 24
##$DECNUC= <off>
##$DECSTAT= 4
##$DIGMOD= 1
##$DIGTYP= 9
##$DL= (0..7)
0 120 120 120 120 120 120 120 
##$DP= (0..7)
150 150 150 150 150 150 150 150 
##$DP07= 0
##$DPNAME0= <>
##$DPNAME1= <>
##$DPNAME2= <>
##$DPNAME3= <>
##$DPNAME4= <>
##$DPNAME5= <>
##$DPNAME6= <>
##$DPNAME7= <>
##$DPOAL= (0..7)
0.5 0.5 0.5 0.5 0.5 0.5 0.5 0.5 
##$DPOFFS= (0..7)
0 0 0 0 0 0 0 0 
##$DQDMODE= 0
##$DR= 18
##$DS= 0
##$DSLIST= <SSSSSSSSSSSSSSS>
$$ [...]
##$SUBNAM2= <"">
##$SUBNAM3= <"">
##$SUBNAM4= <"">
##$SUBNAM5= <"">
##$SUBNAM6= <"">
##$SUBNAM7= <"">
##$SUBNAM8= <"">
##$SUBNAM9= <"">
##$SW= 24.9337058887773
##$SWIBOX= (0..15)
0 0 2 0 0 0 0 0 0 0 0 0 0 0 0 0 
##$SW_h= 4990.01996007984
##$TD= 16384
##$TD0= 1
##$TE= 0
##$TE2= 300
##$TE3= 300
##$TEG= 300
##$TL= (0..7)
0 120 120 120 120 120 120 120 
##$TP= (0..7)
150 150 150 150 150 150 150 150 
##$TP07= 0
##$TPNAME0= <>
##$TPNAME1= <>
##$TPNAME2= <>
##$TPNAME3= <>
##$TPNAME4= <>
##$TPNAME5= <>
##$TPNAME6= <>
##$TPNAME7= <>
##$TPOAL= (0..7)
0.5 0.5 0.5 0.5 0.5 0.5 0.5 0.5 
##$TPOFFS= (0..7)
0 0 0 0 0 0 0 0 
##$TUNHIN= 0
##$TUNHOUT= 0
##$TUNXOUT= 0
##$USERA1= <user>
##$USERA2= <user>
##$USERA3= <user>
##$USERA4= <user>
##$USERA5= <user>
##$V9= 5
##$VALIST= <valist>
##$VCLIST= <CCCCCCCCCCCCCCC>
##$VD= 0
##$VDLIST= <DDDDDDDDDDDDDDD>
##$VPLIST= <PPPPPPPPPPPPPPP>
##$VTLIST= <TTTTTTTTTTTTTTT>
##$WBST= 1024
##$WBSW= 4
##$XGAIN= (0..3)
0 0 0 0 
##$XL= 0
##$YL= 0
##$YMAX_a= 239603
##$YMIN_a= -184793
##$ZGOPTNS= <>
##$ZL1= 120
##$ZL2= 120
##$ZL3= 120
##$ZL4= 120
##$ABSF1= 10
##$ABSF2= 0
##$ABSG= 5
##$ABSL= 3
##$ALPHA= 0
##$AQORDER= 0
##$ASSFAC= 0
##$ASSFACI= 0
##$ASSFACX= 0
##$ASSWID= 0
##$AUNMP= <proc_1d>
##$AZFE= 0.1
##$AZFW= 0.1
##$BCFW= 1
##$BC_mod= 2
##$BYTORDP= 1
##$COROFFS= 0
##$CY= 11.3945322036743
##$DATMOD= 1
##$DC= 2
##$DFILT= <>
##$DTYPP= 0
##$F1P= 16.9975609425685
##$F2P= -3.02152046262296
##$FCOR= 0.5
##$FTSIZE= 0
##$FT_mod= 4
##$GAMMA= 1
##$GB= 0.15
##$INTBC= 1
##$INTSCL= 1
##$ISEN= 128
##$LB= 0.24
##$LEV0= 0
##$LPBIN= 0
##$MAXI= 10000
##$MC2= 0
##$MEAN= 0
##$ME_mod= 0
##$MI= 1.114404
##$NCOEF= 0
##$NC_proc= 0
##$NLEV= 6
##$NOISF1= 3.799351
##$NOISF2= 2.8
##$NSP= 1
##$NTH_PI= 0
##$NZP= 0
##$OFFSET= 15.70392
##$PC= 1
##$PHC0= -9790.729
##$PHC1= 20.40082
##$PH_mod= 1
##$PKNL= yes
##$PPARMOD= 0
##$PSCAL= 0
##$PSIGN= 0
##$REVERSE= no
##$SF= 200.130013532006
##$SI= 16384
##$SIGF1= 3
##$SIGF2= 2
##$SINO= 400
##$SIOLD= 16384
##$SREGLST= <1H.CDCl3>
##$SSB= 0
##$STSI= 0
##$STSR= 0
##$SW_p= 3612.71676300578
##$SYMM= 0
##$S_DEV= 0
##$TDeff= 0
##$TDoff= 0
##$TI= <>
##$TILT= no
##$TM1= 0
##$TM2= 0
##$TOPLEV= 0
##$USERP1= <user>
##$USERP2= <user>
##$USERP3= <user>
##$USERP4= <user>
##$USERP5= <user>
##$WDW= 1
##$XDIM= 8192
##$YMAX_p= 0
##$YMIN_p= 0
$$ End of Bruker specific parameters
$$ ---------------------------------
##NTUPLES= NMR FID
##VAR_NAME=  TIME,          FID/REAL,        FID/IMAG
##SYMBOL=    X,             R,               I
##VAR_TYPE=  INDEPENDENT,   DEPENDENT,       DEPENDENT
##VAR_FORM=  AFFN,          ASDF,            ASDF
##VAR_DIM=   8192,          8192,            8192
##UNITS=     SECONDS,       ARBITRARY UNITS, ARBITRARY UNITS
##FACTOR=    0.0002004,     1,               1
##FIRST=     0,             0,               0
##LAST=      1.6414764,     0,               0
##MIN=       0,             -184793,         0
##MAX=       1.6414764,     239603,          0
$$ Real data points
##PAGE= N=1
##DATA TABLE= (X++(R..R)), XYDATA
0@%%%%%%%%qJ6j6J6k4L2l5M3n6O7p5Q8j07J27j46J69j97K25k55K92l33L77m25
31b25M80n40O03o75P54q39R33j036J151j276J412j563J730j917K125k356K619
48A380k918L260l660M134m704N406o294P461r076J1468j5426K3512o9655J71104
62A15992P1508l00803p1490K05545R3096j85095o1456J65224P0590j74585p8495
73a49969J53311J04013j29415r7828J03266R7630q9989q4171Q3565R4921o8434
84A6900r0377N0393Q7181l7117p2255L8558P3469m1229p8453M0310R1329l3151
96D5558j01699J6225J02623l837j00401q506R4742J2958r3649k3277Q8542L4333
108F3612p5996l5550O3679K7481n8412j5629O6162J2706q0416k7581Q1997N0083
$$ y = [0, 0, 0, 0, 0, 0, 0, 0, 0, -8, 8, -8, 8, -16, 16, -19, 24, -32, 35, -40, 48, -59, 68, -78, 91, -106, 119, -136, 156, -177, 200, -225, 255, -285, 318, -357, 397, -442, 491, -545, 606, -670, 742, -821, 909, -1008, 1117, -1239, 1380, -1538, 1722, -1938, 2196, -2508, 2898, -3396, 4065, -5011, 6457, -8969, 14543, -55112, 115992, 187500, -113303, -184793, 20752, 113848, -71247, -132703, 32521, 103111, -71474, -149969, 3342, 107355, -22060, -119888, -16622, 81008, -8981, -93152, -9587, 85334, 16900, -73477, -23084, 64097, 26980, -45275, -6717, 66752, 25523, -52930, -12620, 78709, 45558, -56141, -39916, 62707, 58870, -41531, -50037, 44705, 57663, -35986, -59263, 29279, 63612, -12384, -47934, 15745, 43226, -15186, -30815, 35347, 48053, -32363, -59944, 22053, 72136]
120G2136o1463o3772K6684N0648j545k3150j292L474q061J921J3929J633p685
133C457K300K56j2963m07K4142Q263k5323j3989J8462Q748j9764o398K4455R932
147B1171k6302k1623J3937K3056J491j2610p392l329J194J0952J1890o178j9508
160a3251m013J6933Q714j3659j0380J4545J4269j8325k7815J3482M3230Q56n4041
173b9455j9993N3515L8290m4257m9485L2373N2078k3186n0851J8464N2423j4858
185A5058n7248P012N8533L414n5486j2757M8376J9418l9341j8843L4893K0784
197B3813k8768k0858K7584K7174j9439k6394J7422L1168j4101l5781J1858M4850
209C8528j949m8236r929M4707J6543m0814j7848L9913J5305m9000k1724N5756
$$ y = [72136, 10673, -53099, -26415, 24233, 22688, -462, -1754, 1720, -6341, -4420, 9509, 11142, 3457, 5757, 6013, -6950, -7357, 16785, 25048, -275, -14264, 4198, 12946, -6818, -13216, 11239, 21171, -5131, -26754, -12817, 10239, 11730, -880, -8272, -11601, -10407, 545, 12435, 6257, -13251, -17264, -331, 8383, -5276, -15656, -1111, 13158, -5167, -32982, -19500, 23730, 24586, -29455, -49448, 4067, 42357, -1900, -51385, -19012, 33066, 9880, -40971, -22507, 29916, 15058, -42190, -35178, 23355, 26769, -28717, -41474, 6902, 26320, -13021, -31864, 3029, 23813, -4955, -25813, 1771, 28945, 9506, -16888, 534, 31702, 17601, -18180, -6322, 38528, 36579, -11657, -21586, 23121, 39664, -1150, -18998, 20915, 36220, -12780, -34504, 21252]
221B1252L4082n7463m8212M6988N0831m0749m6899L9800M2239m8485m7979N4181
233d14N8711n4254p3511M7632Q4570l5653r2134K3232R6545p352r6294o245R2902
246C7735K1121q4259l0455P6040L9083o7306m4929N7108M9735m8117n2275M0066
258f453N1640l5415n2632L0728N2828k7383n4033K2293N3878j9862n2648J6569
270b0490N2112j6175n2687J5662N5908j5434o0513J2703O5722n609o9074n519
282d3394O6298J7408n4743k2885M1041K1292k8862j2557K4786O085k4928r26K7653
295A6268O46k7962k266K7820L964k4751n918J9870N396j4604k726Q315k384p764
309f096P154P449r262j0247R359J0364j0682j0518J2609R901j4753j2045J7927
$$ y = [21252, 55334, -2129, -50341, -3353, 47478, 6729, -40170, -370, 41869, -6616, -54595, -414, 58297, 4043, -69468, -21836, 62734, 27081, -65053, -41821, 54724, 47372, -48922, -55167, 37735, 58856, -25403, -55858, 20182, 59265, -8041, -52970, 4138, 53873, 5756, -46519, -6453, 45187, 9772, -42860, -12132, 40696, 13313, -40720, -18427, 35451, 15589, -37059, -20490, 31622, 15447, -37240, -21578, 34330, 18896, -41617, -28914, 36808, 31199, -37875, -43394, 22904, 40312, -14431, -37316, 3725, 25017, -3845, -16402, 8384, 14469, -10459, -11385, 16268, 16914, -11048, -13314, 14506, 18470, -6281, -12199, 7671, 13067, -1537, -4263, 4052, 1668, -6096, 1058, 8507, -755, -11002, -1643, 8721, -1961, -12479, 130, 10031, -4722, -16767, 1160]
322A160J4208k0043j7243K2620K1984k3087k8380K2197L6467j6073m1681R330
334a8541M3749k085m1675j813L8994K351l5931o8L5424m998l9728Q382M6522p925
348B2658n7503J547O4834Q102o9026j9814O7229K8767o3414l5427N9705L9942
360D7600n5526m3422N2204M8027m6904n1303M1647N6396l3918n7874K6587N9273
372D2787j8490n6463J2880N3841q247m9908O334M7927m734m7426K912M8252j101
385B8564n0045l603N1375J0061n3301j8704N0393K7370m5367l4970L6636L7904
397C6313k7626l8288J9249L4974j3692l0976J0360K8490j0114k7497J0110K8397
409A9700q630l1214N713L2931o03l3011m992L0431R986k7025j3519K3049J6272
$$ y = [1160, 15368, -4675, -21918, 702, 22686, -401, -28781, -6584, 29883, 13810, -27871, -18541, 25208, 23123, -18552, -20365, 18629, 20980, -14951, -15019, 20405, 15407, -24321, -15939, 30583, 22658, -34845, -33298, 31536, 39638, -29388, -49202, 18027, 46794, -16620, -52047, 7658, 47600, -7926, -51348, 856, 48883, 1979, -49324, -7677, 48719, 14801, -43073, -16486, 42787, 24297, -32166, -19286, 34555, 26308, -23600, -17266, 30661, 25927, -21499, -18587, 29665, 28564, -21481, -25084, 26291, 36352, -16949, -35653, 14740, 42110, -3257, -38227, -1591, 36313, 8687, -29601, -10352, 24622, 10930, -20046, -9686, 18804, 8690, -18807, -8697, 19700, 11070, -20144, -14431, 18500, 17897, -15114, -20106, 10325, 20311, -6714, -20233, 2816, 19088]
422A9088k0151j9519J6152K2241j2966k5231Q291K6448m196k6868k487K5535P632
435A3969k2639j3943J7985J6391j2618j7589P742J5707m264j2903L391J0067m308
448c012p786P388Q506q992j0648J0598J6560q069k0348N027K4509K218k3947p446
462a5442K2286J2284j6530j3509J2537J3278q170j1834N950J0277m322q569L024
475A260O837k770n693J558L949k476j673K410k092k992L459M569n173o997N726
490i8Q510m335r050L140Q255j672o575L122M997n668l096J0539L990j5493p086
505a0520J9493J3524k2040j9952K0686K5496j6778k9940J0610L1929n313l2340
517a5145J23L0612J507k8972k893K8567K133l0584k615L2548M680l4917q938L6606
$$ y = [19088, -1063, -20582, -4430, 17811, 4845, -20386, -12095, 14353, 10157, -16711, -19198, 6337, 13969, -8670, -22613, -4628, 11763, -855, -18444, -10702, 5005, 741, -12162, -8771, 1296, -3012, -10798, -3410, 5096, -3896, -14544, -3946, 12614, 4545, -15803, -10776, 13733, 15951, -7996, -15442, 6844, 19128, 2598, -10911, 1626, 14904, 6734, -5100, 850, 11127, 6805, -1764, 1260, 8097, 5327, -366, 1192, 5141, 2665, 992, 3402, 1310, -1682, 1777, 6346, 1173, -5824, -98, 8412, 4077, -4973, -1833, 6422, 4750, -1825, 1297, 6294, 626, -2470, 8069, 12059, -3434, -10520, 8973, 22497, 457, -19495, 1191, 26687, 9909, -20031, -9421, 22508, 17195, -15145, -15022, 15590, 17097, -11875, -14768, 13799, 15932, -14652, -17267, 15281, 19961, -14956, -23894, 12712]
531A2712J1925l7461j5952L7655K0112l8542k4672L8279K9254l8039l3161L7077
543h13L7809l6725m2819L3980M8167k8647n2910K2037N3813j4356n2734R389M9695
556B5886o005m6723N121M4033m836m2428N629M3026n644m4766M130M8010J072
569B6505m9244p565M8170J5331m4556k0353L9473K5229l3674k6947K8719K7342
581B8430k3837k6166K0540K6033j7490k6826J5374K7271j2204k7755R537K6952
593A9859q027k5980O899K4473o855k4923O196K3454n942k4324N184K4344m151
606A0207k6753k2K6648M021k3052q131J7296Q554j1426o136O783K512l054K631
620G8J175o505J68J1252K405j2899n122J3073Q411r782p710P315N462o136k414
$$ y = [12712, 24637, -12824, -28776, 8879, 28991, -9551, -34223, 4056, 33310, -4729, -37890, -813, 36996, 271, -42548, -8568, 39599, 10952, -41958, -19921, 33892, 19536, -33198, -23809, 25886, 19881, -26842, -21721, 22312, 17476, -24952, -19323, 23703, 18059, -26707, -22577, 25433, 26505, -22739, -30304, 17866, 33197, -11359, -31712, 7761, 32990, -684, -27631, 1088, 28430, 4593, -21573, -1033, 25000, 7510, -19316, -3942, 23329, 11125, -16630, -7093, 19859, 11832, -14148, -7249, 17224, 10369, -14554, -8358, 15096, 9154, -15170, -9986, 14358, 10207, -16546, -16568, 10080, 14101, -8951, -17082, 214, 8768, -2658, -8794, -2011, 501, -2553, 78, 1253, -5252, -5084, 6168, 8573, -4326, -9448, 3625, 12036, 2254, -5456, 1859, 7321, 1185, -1229]
635a229P437M51r422k86J0962p90j2499l44J2285L42j2845k301J2443K079j2946
650f663l957J3536N224j3983r511J3887J2809j1369j6585Q625J8645m520j9613
663a3475R73J9587M243j7683o775J5099P601j1842n582J2249L097j3592j568J6670
677I002K135j9253l458K1331N606k2096j0264K1854J3483j8762j6931J3425J6832
690A2904r213j5245O386J2380n234j1611L240J1250p65j0102k346P021M781m752
704a306o004L387O990j382q806R41Q647J110r011p75R371M78j1288M93J4422Q60
720H127j7985k067K0347O168k2389j0165K2785J4446k0063j8522J5512K0021j0904
733E311j8435O702J6331m997j4403M334J2826k959j2474L728J1496l195j2492
$$ y = [-1229, 6208, 6659, -2763, -3049, 7913, 7123, -5376, -5720, 6565, 6907, -5938, -8239, 4204, 6283, -6663, -10620, 2916, 8140, -5843, -15354, -1467, 11342, -27, -16612, -7987, 10658, 6138, -13475, -12502, 7085, 11328, -6355, -13130, 1969, 9570, -2272, -7854, 4395, 7492, -6100, -7668, 9002, 11137, -8116, -11574, 9757, 15363, -6733, -16997, 4857, 18340, -422, -17353, -3928, 12904, 3691, -11554, -5168, 7212, 1978, -9633, -6393, 4857, 4092, -6010, -8356, -1335, 3446, -1306, -7310, -3923, 3067, 1685, -7121, -6180, 2467, 3577, -5434, -6209, 3162, 3640, -7648, -7155, 7267, 8127, -9858, -11925, 8422, 14590, -7799, -17964, 4821, 19267, -796, -19318, -3806, 16215, 5311, -13124, -6422, 9909, 4912, -9491, -5157, 7669, 4710, -7764, -4036, 7460, 4265, -8227]
746h227M265J4972j748j7358j251J8293N851j6679q207J5547J0296j5372j2166
759a1784J6695J4701j6176j7746J4714J9311j2333k1132R805K1192q262k1159
771a2174N791J8180l920j6255L461J2836o305j1477Q862J1120j1184j2591J1953
784a703J3407j1396j4269J0160J5075p047j4589M484J2043j747p685R13M803k897
798d48j396M693o83p288J135R096n23j0943j991J0879K748r596l358Q306K017
813B648q877k947J0508M549j1476q034R815R740p353r622O296R088o725q408P729
828c069J0050p942j1168R236J3479j0609j5454J3247K0403j2938k5670J1546L1037
841B2148p780l3170L741L3447M06l2047l230L0144M704k8166m846K6927L495k6978
$$ y = [-8227, -3962, 11010, 9262, -8096, -9347, 8946, 14797, -1882, -10089, 5458, 15754, 382, -11784, 4911, 19612, 3436, -14310, 404, 19715, 7382, -13750, -3945, 17247, 8985, -12174, -6383, 11797, 7877, -8378, -4917, 7919, 1614, -9863, -1001, 10119, -1065, -13656, -1703, 11704, 308, -13961, -3801, 11274, 4227, -10362, -5878, 6165, 4418, -3267, -2354, 2449, -448, -1844, 2849, 2166, -5122, -3987, 5109, 4586, -6357, -8348, 2531, 5279, -4317, -7675, 631, 2648, -6229, -9176, 1332, 5881, -5595, -13629, -3814, 5926, -1427, -11049, -4753, 4335, -2390, -10798, -3069, 6981, -961, -12129, -2893, 10586, -23, -15477, -2230, 18173, 5235, -20435, -8889, 22148, 14368, -18802, -15061, 18386, 18792, -13255, -16485, 13659, 18363, -9803, -14649, 12278, 15773, -11205]
855a1205k394K7969K749k9411m337L0198N659k9275q274K8856J0021k7223j1388
868a8055K5042J3404k3629j4625K2145J6988k0435j9594J8336K2489j3516k3664
880a5114R362K3177n794k1229K840K0629j890j9703M09J8336j09j8259K12J8699
894A1566j537k2073K89K4675K156k6268p041K4324J0459k2236j2599J8790J3058
907A3563j6391j3355J3874J2739j1142j0821R261Q741q800o153R000O064q361
920a781n777Q203N330n678n113M968M332m114l635L299M382l347m879K149N149
935C488n62o072k130M577N431l447p307j88P968K446p046m117N211N043l083m086
951c874N46L118J807l06j582k671J092M109J880m248l222L432M287k073m138J318
$$ y = [-11205, -13599, 14370, 17119, -12292, -16629, 13569, 19228, -10047, -18321, 10535, 20556, -6667, -18055, 6987, 20391, -3238, -17863, 4282, 21270, 835, -18759, -423, 22066, 8550, -15114, -5752, 17425, 11631, -9598, -6758, 13871, 11981, -7722, -7313, 11023, 10914, -7345, -7133, 11566, 10029, -12044, -11755, 12920, 15076, -11192, -18233, 6091, 16550, -5686, -18285, 505, 13563, -2828, -16183, -2309, 10430, -712, -11533, -2272, 6469, -2331, -8484, 516, 6580, -1781, -7558, 645, 5975, 297, -4816, 152, 4484, 370, -3265, 34, 4416, 1069, -3810, -1661, 3488, 2926, -3146, -5276, -699, 4732, 1285, -6022, -6210, 1758, 4204, -2842, -6959, -1748, 3295, 212, -3874, -3328, -210, 1597, 1291, -291, -2962, -1870, 2239, 4119, -129, -3351, 81, 4368, 2295, -1843, -525]
967e25L824n19k979k34J148j56Q53O63j645k557R46L152p23l091K25K081q98k529
985b964J014L703k04m692j904M361M275k733n951R47P191J806o953m856P105P236
1001G381n309q579M451Q759k715q109L673O741m173o469O297O913q347q449J0155
1016B220J1124j1121j4811J0655J7765r252j9844O551K0811m680k1199K562K0434
1029A1215o40k0330o37J9548J693j9001l491J9781M588j9055n910J7856Q430j7133
1043c086q347J6717Q641j6744q800J7525J0477j7763j3452J8266J6140j7408j9716
1056a7550J5858K2288j3524k5231J0258K5717p128k5649L349K3832k034k2693
1068a2507J319K0811j579k0917J525K1105j604k2702J360K3718J10k4592j809
$$ y = [-525, 3299, 2780, -199, -433, 715, 559, 1412, 2075, 430, -2127, -1181, 1971, 1248, -1843, -1618, 463, -435, -2964, -1950, 1753, 1549, -3143, -5047, -686, 3589, 856, -5095, -4148, 3043, 4849, -2104, -6960, 145, 7381, 2072, -6507, -2056, 6703, 3988, -4121, -448, 6293, 2120, -4349, 1948, 8861, 514, -7935, 2220, 13344, 2223, -12588, -1933, 15832, 6580, -13264, -6713, 14098, 9418, -11781, -9219, 11215, 10575, -9755, -10392, 9156, 10849, -8152, -11643, 8138, 12726, -6329, -12239, 5617, 14047, -3086, -11433, 5284, 13925, -2819, -11619, 5906, 16383, -1380, -14832, 3434, 19574, 2166, -17550, -1692, 20596, 7072, -18159, -7901, 17816, 10688, -14961, -11612, 12220, 10186, -12507, -11188, 9623, 8044, -12873, -11348, 9757, 8153, -14549, -13189, 10529, 10639, -13953, -15762]
1081a5762K4621M265k3408o514K2269Q051j9964q935J8423J0192j7075j0692J5352
1094H23J1100j3282j1884J1600J1457r822j0157P261R704o330q470O205P493p108
1108a410o583Q022P435q257q716Q442J0476o859j1627N688J2212k787j1213R70
1122d207R325O17o605m64N323o73l400K193L283m315k863N343M148o507n592P151
1138B757O321o881o970N727P041n914p067N289P054n431p345M485P806m719p741
1153e588L551P490l575o893L696O110m601n945N563O574o509q131O910R879n860
1168B671j2202M755J3228j557j4009j013J3801K793j1747m441R734M577q456m212
1182f078O893L709o961l149O766L289q207l760P867M936q387o680P657P548o378
$$ y = [-15762, 8859, 13124, -10284, -16798, 5471, 13522, -6442, -15377, 3046, 13238, -3837, -14529, 823, 11923, -1359, -13243, -1643, 9814, -8, -10165, -2904, 6800, 470, -8000, -1795, 5698, -1410, -7993, 29, 7464, -793, -9509, -1067, 9409, 2550, -9077, -3389, 8823, 6036, -5177, -4207, 5118, 5735, -870, -1334, 3989, 3316, -84, 2109, 5392, 1077, -1786, 3557, 7705, 1198, -4394, 2757, 9078, 2197, -4773, 954, 7995, 2081, -4986, 303, 7357, 1926, -5419, -934, 6872, 2153, -5588, -2037, 5453, 1878, -5015, -1319, 4791, 190, -5755, -192, 6382, -127, -8258, -1348, 8531, 2671, -9531, -4776, 8452, 6895, -7114, -8127, 5674, 8467, -3280, -7721, 2013, 6590, -1866, -6078, 815, 4524, -2437, -5586, 1180, 4469, -3738, -7498, 369, 5305, -3082, -9762, -2105, 5443, -935]
1197i35q697M771R138k849r872J978R748P6r531j623R898L869q938n241Q261P047
1213G100o285p663M720Q095k305p189J044O680n16o261J254N777j794o331K111
1228a563P747k591q884J350J0457K29j1659k785J1227N837j0430q123Q669R330
1242H811o371j0038M968J0305l638r811K385R388j540q701Q01R411q68r908N27
1257d279J0437P1j0784p66J0417J100j1136q25J0750J658j1444k526J1974L859
1271H506j2441n701J1939P162j0718q629R127R288p662p986N412O938m548n012
1285d325M508L447m948k792O022K915o843l641P782M218p350n383O632O669n315
1300A596o833M327O006l155n251L198L912k802l566K612L640l479l250M031L198
$$ y = [-935, -9632, -4861, 4277, 1428, -8444, -6466, 3282, 3358, -6173, -7796, 2102, 5971, -2967, -8208, 53, 7100, 815, -6848, -2128, 5967, 3662, -3527, -2483, 4197, 3681, -2580, -1326, 4451, 2657, -3674, -1563, 6184, 3593, -5291, -3941, 6516, 6745, -4914, -7699, 3528, 9365, -1065, -9188, -519, 8811, 2440, -7598, -2630, 7675, 4037, -5774, -3389, 5999, 4459, -4242, -3441, 5970, 5102, -4806, -4279, 6158, 6229, -4555, -5321, 5096, 6196, -4940, -5765, 4985, 6643, -4801, -7327, 4647, 8506, -3935, -9636, 2303, 9465, -1253, -9882, -755, 8533, 871, -7115, -1703, 5235, 687, -4325, 183, 3630, -1318, -4110, 1912, 4827, -2016, -5657, 2125, 6343, -1007, -6390, 242, 6911, 1596, -5237, -910, 5096, 1941, -3310, -112, 3800, 998, -2568, 44, 3684, 205, -3045, 986, 4184]
1315D184n190l677N396M352o254n435P667N717q815p080R223Q944r094j1234Q172
1330c124J2655o481j3233N120J3260m351j2742M236J2422m676j1200N547J1918
1343I351o864j3063P263J4815p120j6654O186J7710m594j9034K468J9255p68j8572
1357i621j478J7844K733j7107l755J6369M337j5650n543J4539O956j3955p553
1370a1884J3099Q464j1877r536J2120J0519j1131j1462J1052J2308j0271j3096
1382a1695J0195J4630q704j6661O906J8599m435j8753J368J9285J56j7748j752
1395h609J5919K659j4583k591J2955K725j2297k145J1938J381j1496k062J1925
1408E719L002j1530m495J1173N227j0115o014Q475O911o530p164M473O931k888
$$ y = [4184, -1006, -4683, 713, 5065, -1189, -6624, 1043, 6760, -2055, -9135, 88, 9032, -62, -11296, -3124, 9531, 3050, -10183, -5063, 8197, 3846, -8896, -4660, 7762, 3086, -8114, -2567, 9351, 2487, -10576, -3313, 11502, 4382, -12272, -6086, 11624, 7030, -12004, -9536, 9719, 8951, -9621, -11099, 6745, 9478, -7629, -11384, 4985, 9322, -6328, -11871, 2668, 9624, -4331, -11884, 1215, 9679, -2198, -11734, 386, 10905, -226, -11688, -636, 11672, 1401, -11695, -1500, 13130, 4426, -12235, -5329, 13270, 8835, -9918, -8550, 10735, 10891, -6857, -8609, 7310, 9969, -4614, -7205, 5750, 8475, -3822, -5967, 5971, 7352, -4144, -6206, 5719, 8721, -2809, -7304, 3869, 9096, -1019, -7033, 1442, 8353, 1823, -5341, -868, 6063, 3175]
1422C175o574J245O429o7n981j791N946K339n044l397L868L437l042l631J986
1437a102L375j801l132J805K452k537k458L278K995m343m416L872N838l382o113
1452e669J834N607m39n070p69M217J921k812k428J382K224M66j369j290P02J340
1468a53K11q80l12P61M10o84M32O27o13p62J102R97k013m71J892Q56k636q82K912
1487G94J012l226p63L553P33k957j597K822J053j683m1J126p82j042L159Q59m420
1504a400j731N947L847o373n813O469O879n541o889M138P266l859p004L362O729
1519F027l022o449L178N726l920o070M259O793m539p898L641Q289k580r289J920
1534c934R580j188r955m67J0710K169j1158l908J1372M663j0396o372J0112Q255
$$ y = [3175, -3399, -2154, 4275, 4208, -1773, -3564, 2382, 4721, -323, -3720, 148, 3585, 543, -3088, -1102, 2273, 472, -2660, -855, 1597, -940, -3398, -120, 2875, -1468, -5884, -2012, 3826, 444, -5669, -3835, 1772, 1333, -3737, -4506, -289, 1632, -1180, -3608, -2226, -2, 464, -905, -2195, -1493, -153, 58, -822, -1134, -373, 37, -647, -215, 412, -201, -963, 139, 1136, -877, -1348, 544, 1400, -1236, -2118, 794, 1806, -1420, -2183, 1370, 2103, -854, -2451, 371, 1424, -259, -300, 826, 44, -998, 2161, 3020, -1400, -3131, 2816, 6663, 290, -5523, 946, 7825, 2284, -4605, -467, 6799, 2940, -4064, -702, 6027, 3005, -3444, -266, 5460, 1540, -4530, -271, 6522, 1983, -5915, -2274, 6015, 3435, -5854, -3934, 5646, 4458, -5497, -5964, 4746, 6915, -4243, -8151, 3221, 7884, -2512, -8884, 1228, 9483]
1548I483r799r427Q438J0406p067j0608O324J0688o537j0442O981J0493p675j1570
1562a0312Q439J2615q530j4088P698J5275n891j6428M116J5953k048j5711P99
1575h113J4546O99j4036j111J2686J231j0914j317R652J653r120k229R131K979
1589E737q390l341P664L992o921l947O665M580o498n012N777N700m918o454M196
1604a170P031l135p636J933P417r48o739l27N659N61m563l77L561r36k755J714
1620g10K703k612l090L205L873l998l907L680M262k716m431L025L553k319k929
1635b411L048J780k662j085L624K14m484M89M920n5o098K56N874K31o282o06O440
1652C193J311p136k189O972L123o585l582N618L702m535l923L882L877k574l838
$$ y = [9483, -316, -9743, -1305, 9101, 2034, -8574, -2250, 8438, 1901, -8541, -1560, 8933, 1258, -10312, -1873, 10742, 2212, -11876, -4178, 11097, 5206, -11222, -7106, 8847, 6799, -8912, -8113, 6433, 7132, -6904, -8015, 4671, 5902, -5012, -6329, 3323, 4976, -4144, -6373, 2758, 5737, -2653, -5994, 1670, 5662, -1259, -5206, 1459, 6039, -459, -5471, 306, 6006, 1088, -5366, -1170, 5861, 2726, -4910, -2977, 4440, 3492, -3247, -3574, 2085, 2646, -1917, -2294, 1267, 331, -2424, -710, 1993, -619, -3709, -504, 3369, -629, -4536, -856, 3406, 690, -3741, -716, 2837, 518, -2411, 637, 2417, -245, -1330, 2294, 2508, -1976, -1487, 3433, 3378, -2720, -2464, 3410, 3641, -2641, -3247, 3193, 4504, -2632, -4821, 2151, 5274, -1311, -4893, 725, 4427, -108, -4031, -149, 3728, 1154, -2684]
1667b684K782K982j962l596L175L458l156m398L264N607k406p179J613P769k93
1682D976q125j421Q453K348p723l822P282M113o328m519N241M079m651m206L991
1697c12M254l994l786L318L658l442l389L031L743l109l640K246L561j798l706
1712c365J543L652m38l963m93L712K159l467l408K324M678j122n213k25N746J356
1728C476n851k322M975L053m015l077L127K811l183k658L517K553m171k684M380
1743f9L518m955l607M573M728m301n113L118O137k164o288J675O387q46n560m70
1759c237N979J268n524j759N397K567m716k506L530L622l583l021K713L210k805
1774A135k680K943K333l453k596L919K886m561l783M310M508m000m602K713N441
$$ y = [-2684, 98, 3080, 1118, -2478, 697, 4155, 999, -3399, -135, 5472, 3066, -4113, -2500, 5269, 4976, -3149, -4570, 3883, 6231, -1492, -5314, 1968, 6081, -247, -4766, 475, 4554, -97, -4303, -312, 3942, -52, -3838, -520, 3138, -304, -3693, -662, 3081, -28, -3668, -1422, 2139, 341, -3365, -1822, 1830, 1392, -2571, -3064, 648, 2807, -660, -4068, -1744, 2934, 1812, -3401, -3626, 2120, 3476, -2375, -4697, 278, 3331, -684, -3761, -634, 2177, -1006, -3664, -147, 2406, -1765, -4449, -69, 3449, -1506, -5113, -540, 4188, -113, -5226, -2108, 4029, 1865, -4423, -2748, 3639, 2793, -2767, -3237, 2742, 4010, -1514, -3273, 2124, 4691, -25, -2531, 999, 4621, 1038, -1983, 730, 3940, 1135, -1545, 1398, 3731, 278, -2318, 1601, 4487, -74, -3857, 453, 4961, 961, -3641, -928, 4513]
1789D513k387m926R41M521n35l413J122K260j525j538K158R28k420j103L348Q58
1805B802l273j558M016J163m100j810M245J718l877k263L582K431m445k116M113
1820F28K128m158k203M023J323m106j131M402J516n097j877N615K555o113l802
1835f297O751N209o305o540N763P477m623q410L983Q117k740q136K276P943j867
1850B601p621J974P838k101q322K252Q811j905r635J250J0182m38j0471q08J1419
1865E026J133j0694k505J0574L264j0392l968R591N363r291n480Q090O305p179
1879a63o724O534O812n635o424N100O035m567n119M173N978m511o149L929P313
1894F582m047p588L311P848j996q207Q48P715K77p133j649O065K201n454k073
$$ y = [4513, 2126, -2800, -1859, 2662, 2127, -1286, -164, 2096, 571, -967, 1191, 2119, -301, -1404, 1944, 2802, -471, -2029, 1987, 3150, -950, -2760, 1485, 3203, -674, -2937, 645, 3076, -1369, -3485, 628, 2756, -1402, -3605, 418, 1741, -2365, -3496, 906, 2422, -2675, -4552, 1063, 3618, -2495, -6297, 454, 5663, -642, -7182, -1419, 6058, 1435, -6975, -2992, 5125, 2385, -5751, -3475, 4468, 2601, -5020, -3046, 4792, 2691, -5631, -3379, 5432, 3527, -6108, -4858, 5324, 4886, -5585, -6393, 5026, 6159, -4535, -7040, 3534, 6798, -3594, -7562, 2029, 7392, -1899, -7379, 711, 7016, -163, -6887, -353, 6459, 824, -5600, -500, 5535, 968, -4151, 22, 6000, 1489, -4660, -731, 6582, 2535, -5053, -1742, 6106, 4110, -4097, -3249, 4466, 4743, -2390, -4039, 2026, 4227, -1227, -3300]
1909c300M085J917l551k000L423J451k853j505K847J320k686q55K394J018j902
1924a97j092J594J909j970j432J180K043j132j562L13J789j19j021q17O29J298
1940A413m17j289j133J499J313r39k099N0K411O72k068j471J325K122j313k003
1956a927R76J539m49j041Q31R13j411l39J222J054j658r20J631J498k160j708
1972a949J914K544j853k426R32K749p42k995N43K472J08k328p70J973O46j149
1988c31j227R28Q97o1j172n96J017N75J61r63o44R58P90j222J58L22M25m95k38
2007g18J393o10j137L65K232p16k674M67L197P37l762j614L673K588l432l227
2023c238L301L234k184l865J475M198j324l709N46M054m58m118M8M231K77m640
$$ y = [-3300, 785, 2702, -849, -2849, 574, 2025, -828, -2333, 514, 1834, -852, -1707, 687, 1705, -197, -1289, 305, 2214, 244, -1188, -8, 2035, 903, -659, -346, 1443, 1324, 303, -514, 115, 1413, 996, -293, -1426, 73, 1386, 447, -1652, -1602, 809, 1481, -587, -2058, -733, 1389, 76, -1927, -951, 588, 139, -902, -71, 842, -569, -908, 314, 1368, -290, -1210, 421, 1919, -241, -1949, -35, 2509, 656, -1770, -838, 1911, 1169, -1826, -1283, 1189, 1297, -1031, -1801, 172, 818, -331, -1558, -630, 267, 206, -966, -1562, -545, 30, 191, -772, -1416, -458, 332, -890, -732, -410, 15, -480, -718, 675, 65, -1072, -707, 1525, 809, -1865, -1398, 1799, 2536, -1226, -2840, 833, 3421, -11, -3238, 63, 3297, 1113, -2752, -1277, 2921, 1597, -2112, -1566, 2488, 2030, -2088, -2040, 2191, 2468, -2172]
2039b172k29N094O20n152q91N224J082n655j253O241K128o574k603O692L636o375
2055a87m965O381N537n790n617M978N580m055n614L403N123l062m925K862M543
2070D192l369m560K967M730l141n197K804N490k413n631J703N739j251n764N40
2085c161N448M44m963j179M692J421m181j391L385K026l453j598K717J579k409
2100f23j512K083J208k586l37K462J56k869m74L428K98l387j103L389J899l803
2116a771j542L155J481k716q01K285J76k262P39K564j127k845J295L786j246m673
2132c502J577N214j358n021R84N155l01n075k11N616q3m822n31M528Q25m101j103
2149b209M662O93m673q42M783R47m729j020M520J567n072j465N021K345n022l390
$$ y = [-2172, -2401, 2693, 3313, -1839, -2730, 2494, 3576, -2079, -3332, 2909, 5037, -1537, -4140, 2552, 6188, -187, -5152, 1229, 6766, 976, -4641, 337, 5917, 1862, -3752, -349, 4774, 1712, -3213, -351, 4192, 823, -3737, -770, 3960, 819, -4378, -1574, 3916, 1503, -4128, -2425, 3314, 2063, -3701, -3161, 2287, 2731, -2232, -3411, 1281, 2702, -1479, -2870, 515, 2541, -912, -2510, 207, 1786, -623, -2135, -52, 1156, -1430, -1767, 695, 851, -2018, -2492, 936, 1234, -2153, -3256, 133, 2032, -1771, -3313, -158, 1323, -1393, -2194, 91, 267, -1995, -1256, 1308, 181, -2664, -1369, 2417, 1171, -3502, -1925, 3289, 1931, -3090, -2106, 3049, 2748, -2327, -2538, 3078, 2995, -1827, -2358, 2170, 2995, -1106, -2209, 2453, 3146, -1527, -2369, 2414, 3361, -1368, -2388, 2132, 3699, -1373, -2838, 2183, 4528, -494, -3884]
2165c884M548M307m365m878L552N598k822n676K183N540j372n522Q80N453j032
2180B510m803N27N287j165n165P98N374k17o107L10N922L78o438o50O015P86n629
2197b267j369N099J703m474k118L575K686l463k562K609J984j662k341J602J917
2212I19o15k145O19J736l37p68k94J070L80j689j05K244L31j982j365K138J600
2229A737j990k038J756K614j406k957Q42K847R8k823n32K276P09j696p38R81J053
2246G33j310k81R62N4l24l48O38L97n92m07K38J169r89o62N66R67j52j588K02
2265g27J712M09k422l27K125J063k191j223K074J630k272j872K137J385j552j625
2281a676J744P44j501l26J523J51k138M61K149l50k618K34L161J65l247k05K876
$$ y = [-3884, 664, 4971, 606, -4272, -720, 4878, 2056, -3620, -1437, 4103, 2731, -2791, -1911, 3542, 2510, -2293, -1766, 3521, 2356, -2809, -2011, 3363, 3146, -2961, -2651, 3271, 3649, -2789, -3439, 2576, 3362, -2267, -3636, 1463, 3166, -1308, -3426, 149, 2835, -628, -3190, -581, 1403, -259, -2600, -998, 919, 304, -1841, -1222, 514, 177, -591, -885, 185, 565, -1124, -1229, 1015, 1346, -636, -2001, 137, 1737, -253, -2291, -535, 2079, 673, -2284, -1442, 1405, 1503, -1320, -1852, 424, 1133, -563, -1301, -320, 733, -577, -858, 104, 158, -166, -514, 124, 521, -71, -478, -240, 929, -60, -722, -156, 811, 659, -929, -727, 985, 1394, -1028, -1355, 770, 1833, -358, -1581, 493, 2123, -149, -2021, 116, 1501, -51, -1676, 68, 812, -689, -1015, 508, 659, -1479, -1018, 1131, 781, -1837, -1603, 1558, 1723, -1524, -1729, 1147]
2298A147P79k809k82K228J75k253N91J849n23k090O18K441q01k432P89K940p41
2315A626k920J31L603J08l968k19L759P79m302j165M071J763m097j995L344K645
2331C163l289k982K908L609l440k854K700L380l084l682L628M019m162m429M295
2346b20N068l827n932L434O683k879p410K729P160j768p340R93P506j185o989
2361c977P86O585q44o457K39O798o64o131j26N948P93o395p03O021R84o056q95
2378d094N514J981n313k704N369L020m763l788M593M316l998m004K531M392j823
2393A229m339J689L996j134m214J700L434j378l914K139L744j603m587J674M573
2408C009j134m328Q14M510j60m627k9M258j13l492Q5K932K84k506l38K527k56
$$ y = [1147, 1926, -883, -1165, 1063, 1238, -1015, -424, 1425, 902, -1188, -570, 1871, 1070, -1362, -573, 2367, 1626, -1294, -1163, 2440, 2548, -1420, -1639, 2120, 2899, -1403, -2568, 1503, 3266, -831, -2826, 518, 3163, -126, -3108, -200, 3409, -31, -2885, -185, 3195, 111, -3571, 57, 4076, -86, -4515, -220, 4848, 1021, -4911, -1477, 5206, 2327, -5083, -2354, 4806, 3038, -4302, -3309, 4197, 3012, -3977, -3191, 3394, 2550, -3907, -3668, 3130, 2466, -3665, -3791, 2157, 2950, -3445, -4148, 1873, 2857, -3199, -4094, 1420, 3401, -1912, -4616, 753, 3773, -990, -4778, -185, 4131, 133, -3871, -1340, 3052, 1229, -3110, -1421, 2575, 1441, -2773, -1073, 2361, 983, -2931, -792, 2952, 1349, -3238, -1564, 3009, 1875, -2453, -1639, 2871, 2711, -1916, -1945, 2313, 2200, -1292, -1207, 1725, 2009, -497, -835, 1692, 1436]
2425A436j898L07J882o78j524P46J466r41j457J189J366r24j785P33J742p04j280
2442c24J38J533j30r51m81M31M71k35l21J40m68J01M96K4m85p81P60O43o92j035
2462a166O20J448m73j370k33J387Q19j481r64J355R16j284j101J029J184j178
2478d92n80R98M84r85n05P50R55r89o88L88J351j330p31J296L90p28j239Q16J030
2497A91J53j546j27R80O74p84r23P00J089N4j434k65J640P96j661o73J127J296
2515A287j278r58J344P47j066j056J651J063j842j244K162J529k300j653J874
2530B60K193k009k476J862K815j564l222R17L713q42l817P23L476k19l469q9L243
2547A495O08l310r70L402J073k908j176K942J115l134r75L112J201l055j449L085
$$ y = [1436, -462, -155, 1727, 1049, -475, 271, 1737, 796, -661, 528, 1894, 970, -815, -82, 1660, 956, -324, -186, 1347, 1217, 266, -215, 216, 687, 452, 131, 271, -197, -96, 400, 424, -61, -842, -82, 561, -131, -1166, -546, 902, 429, -941, -1174, 213, 1032, -449, -1413, -58, 858, -426, -1527, -498, 686, -492, -1072, -74, 410, -575, -1080, -330, 625, -364, -1052, -664, 687, -643, -1374, -78, 312, -416, -1655, -839, 191, 344, -1202, -1329, -349, 325, -459, -1382, -682, 407, 461, -973, -1238, 402, 1198, -463, -1136, -9, 1287, 9, -949, 395, 1142, 76, -980, 671, 1734, -108, -1352, 810, 2339, 39, -1614, 260, 2453, 444, -2032, -170, 2645, 1081, -2141, -1224, 2489, 1647, -2170, -1447, 2029, 1810, -1659, -1748, 1495, 2103, -1207, -2177, 1225, 2298, -610, -1786, 1156, 2271, -863, -1838, 1274, 2475, -580, -2029, 1056]
2563A056J676l298k120K964K930k983l067K587L529k526l305J734L295j622l316
2578b466J739L027j522k841J455K710j316l089J594L053j663l275J732K896j398
2593F36l043J286L112j010k981N70L157j08l038k1K855J49k653j8K553k03k269
2610a026L09K098n88j799J39K330o62k698O75K875o67k901OL055J09l089k24L085
2628A027O04k949q21L040J65k492k12K485P6k392O3K488L75l138L9L181j19l078
2646a658m62L596N04l282j317L543J759l887j574L307J838l028k075K874K126
2661B264k804k255K505K485k477j734K056J901j968k565K393K525k288k111J683
2676c90L328k063l344J728L481j005l427L31L907n70k978l34L430K38k785o97
$$ y = [1056, 2732, -566, -2686, 278, 3208, 225, -2842, -255, 3274, 748, -2557, -823, 2472, 850, -2466, -727, 2300, 778, -2063, -608, 2102, 786, -2303, -709, 2344, 681, -2594, -862, 2034, 636, -2407, -1121, 1991, 981, -2000, -1430, 1727, 1619, -1419, -1440, 1415, 1564, -1089, -1107, 1446, 1243, -1026, -717, 1381, 793, -1006, -867, 1463, 801, -1897, -1222, 1653, 986, -1915, -1909, 1146, 1255, -1834, -2058, 1027, 1631, -1318, -2139, 901, 1066, -1426, -1638, 847, 923, -1469, -1406, 1082, 1457, -1681, -1642, 1539, 1420, -1658, -2120, 1476, 1980, -1302, -2619, 924, 2683, -1204, -2778, 529, 2367, -661, -2736, 138, 2264, -540, -2795, -290, 2195, -282, -2016, 40, 1941, -27, -2592, -199, 2326, 38, -2073, -390, 2938, 875, -2469, -741, 2740, 1735, -1692, -1361, 2546, 1976, -1002, -1336, 2094, 2332, -453, -1150]
2692a150K767P05k792n25K293N17k312p32K422Q10k643l95K015O78k060r64J615
2709B49J625k028j335J521J636r52j981N69J931j78j822k44J571N89j128r03J227
2726C47O94j230m23M30O60o44k51M43M81r80m38Q69O59o10j152O09J097r5j803
2745a337OJ584N0j102o65J250O84j085r62O79J122n80r75N24J068j42j345L82
2763h44J130k16j065M05J127l51r20J22J763p27j301L67J637m71j832N60K092
2780A476m82j948m1J930L20j921k83J320N72j135o08J242N38j375k3J368k78j561
2798h89N72J277k32j447J89J882k82j916J03J930M26j917o81K048P73j786j203
2815a153K065P12j750r07J504J351k027r73J746O05j716o23J791Q34k195r17K254
$$ y = [-1150, 1617, 2322, -470, -995, 1298, 1815, -497, -1229, 1193, 2003, -640, -1035, 980, 1658, -402, -1366, 249, 1874, -154, -1489, 32, 1668, 716, -1265, -696, 1235, 1057, -765, -1009, 562, 1151, 23, -880, 347, 1041, -189, -612, -182, 478, -166, -417, 26, 507, -473, -911, -42, 617, 7, -1145, -536, 561, 466, -1337, -1331, 253, 303, -799, -1464, -214, 470, -615, -1577, -898, 224, -356, -1331, -807, 261, 119, -1226, -844, 286, 70, -995, -590, 537, 186, -734, -612, 1151, 424, -877, -510, 1127, 656, -1176, -616, 1476, 994, -954, -995, 935, 1255, -666, -949, 371, 943, -192, -800, 442, 980, -395, -418, 950, 672, -889, -317, 960, 728, -719, -530, 1352, 1070, -846, -743, 1187, 1613, -304, -985, 1063, 1836, 50, -1153, 912, 1624, -126, -1033, 471, 1822, -205, -1178, 568, 1173, -543, -1166, 625, 1459, -736, -1653, 601]
2832F01J573k795j875K962K196k603k524K473K395k151k910K029K701j464k844
2847b236J480K716j575k533J499K676j450l189J613L338j443l551J708L195j374
2862H74l475J500L244q43l103j70L581K5l161n96L264N08l104p94L200P33k702
2879a019j319K920R59k440j083K441J294k088j826K080K093k527j649K277J956
2894B069j868k347J541K868j540k720J429K815j476k669J075K293q10k094P03
2909g31K035r08k119J101J828p50k002J152J642j037j498J175J122r43j246Q81
2925b98P52J50j597O41J094M9j099K98N93j76k09j99J0K2m7N19j19m38J09N15
2945E70J66q02N3K6M56K00r59K82N45k42n82J75M16J72m70k08M08J05o84L22N54
$$ y = [601, 2174, -621, -2496, 466, 2662, 59, -2465, 8, 2403, 252, -2658, -629, 2072, 608, -2236, -756, 1960, 385, -2148, -649, 2027, 577, -2612, -999, 2339, 896, -2655, -947, 2248, 874, -2601, -1101, 2143, 1300, -1803, -1973, 1608, 1633, -1528, -2124, 1140, 1648, -1456, -2250, 950, 1683, -1019, -2338, 582, 1541, -899, -1982, 459, 1753, -335, -2161, -81, 2012, -515, -2164, 113, 2069, 201, -2146, -605, 2263, 723, -1997, -568, 2247, 771, -1898, -823, 1470, 660, -1434, -731, 1304, 396, -1723, -622, 1206, 456, -1546, -394, 1248, 211, -1287, -112, 1010, 67, -1179, -298, 454, 604, -993, -352, 742, 791, -308, -10, 583, 407, 198, -1, 9, 31, -16, 503, 384, -54, 55, 570, 736, -66, -13, 13, 469, 669, -290, -8, 537, 295, -287, -112, 304, 476, 6, -202, 206, 311, -373, -51, 503]
2966E03m04m12L61N70k19j026N03R11k8j314K49J267k19j416L75J395J5j728K22
2985c95P84J22j072L60Q95l95o04K93L53m54k68L53M48p62m37P25R1l3n22L54
3005a64J96l75K40J25m45L86K6Q6p83J5R36J37r40m55J134O58j331n85J450K39
3025E50p75n46L29R57q86l58M90N09k19q34N39O45l63j024Q34P50m31j368P65
3044d36J077n96q01R6J296M17k004r1J426P13j448r51J975Q94j453j350J706R29
3062A399j182j288J612R58j203j361J810R64j659j194J625J473j851j649K076
3077E30J271j865j240J171J871j388j728J124J768r89j664Q21J436m90j548P09
3093b11J210q53p23M01J240p70j253R66Q07q95q69O59J360p38j411Q95J250m73
$$ y = [503, 99, -313, 48, 618, 399, -627, -124, 787, 759, -555, -306, 961, 742, -674, -299, 1096, 1111, -617, -395, 389, 511, -561, -201, 694, 299, -305, -12, 341, -113, -381, -28, 420, -342, -779, -54, 37, 4, -518, -164, 32, -343, -103, 22, -423, -37, -11, 75, -708, -693, 243, 380, -560, -1015, 119, 777, -554, -1139, 311, 550, -225, -771, -442, 515, -371, -729, -239, 270, 51, -783, -244, 401, 38, -986, -152, 598, 167, -1201, -436, 641, 45, -756, -660, 636, 1053, -951, -1042, 384, 1097, -351, -1302, 673, 1567, 114, -1236, 470, 1399, 217, -1071, 541, 1499, 296, -1065, 745, 1709, 50, -1144, 481, 1954, 103, -1546, 530, 1801, -64, -1304, -133, 1738, 350, -1378, -254, 1514, 525, -1139, -318, 1118, 628, -920, -211, 999, 146, -577, -176, 1064, 294, -959, 7, 814, -81, -950, -291, 1069, 331, -1080, -185, 1065, 592]
3111E92j405k71J771j5j557k45J464J2p89l49R37r3r25J79R03j80j081K80J161
3130C89j97j415J30J889k90j975O07J750l47j821K79J847k03j748J45J770j96
3147F14j667l18K454m41j943L01K130k96k209K29K297p9k347K73K000P1j879o28
3165a438K173P72j790j054J734J131j658j110J437J322j529j380J654J130j087
3180C07j516J528J024j355j048J164J158j039j283O64K452j292j894O02K391o79
3196A184k120O1K197l53j557j52J621J98j828R2J348J66j677J21J315K35j425
3213e74P6J162J87j611o5J147J90o96l61Q90J89n89l16O87K88n61p60N47L85J95
3233D10l43m37L79K20k11N7n25M50Q3k24k9L46k11k72K95j10jk23K80R4J25o46
$$ y = [592, -813, -1084, 687, 672, -885, -1130, 334, 346, -443, -792, 145, 52, -873, -694, 209, 29, -1052, -772, 389, 192, -1223, -1093, 796, 506, -1469, -862, 888, 541, -1280, -1001, 846, 643, -1105, -960, 810, 614, -1053, -1371, 1083, 642, -1301, -1000, 1130, 834, -1375, -1146, 1151, 1072, -1275, -1002, 998, 1069, -810, -1438, 735, 1507, -283, -1337, 397, 1528, -130, -1240, 197, 1519, -10, -1390, 264, 1394, 307, -1209, 319, 1343, -12, -1060, 104, 1262, 223, -1060, -396, 2056, 764, -1130, -528, 1863, 1184, -936, -875, 1322, 969, -588, -740, 881, 1079, -749, -657, 691, 857, -820, -699, 616, 851, -574, -498, 664, 851, -760, -825, 322, 512, -184, -545, 345, 534, -55, -371, 316, 604, 43, -717, -170, 215, 410, 67, -370, 9, 229, 18, 75, -450, 0, 83, -141, -170, 176, -35, -307, -12, -122, -123, -346, -66, 28, 153, -493]
3255d93L40kK78m32p9L79L31o58l93P11K4p4k52J24L25R1k23k56M13M0m86j36
3277d28L21L03j46l25J98K43m79J88R9Q9m48m1L82Q0o47K00N61M11q01p41R18
3298f3O45p00m38O50J41l52j86O05j30o21J63O60l9q35J40R93m33r22M95J007
3318G80j85j069K29R00k7j269N14J225l00q44m51J211R1p88l87J042Q0r92J41
3337i9J039K8j613O8J284L71j634k92J601N26j221j213J510J153j319j426J557
3354C20J467j346j569R37J804j232j526J220J573j104j956J050J803q15j911Q45
3370d40J829j116j614P31K080p48k148N42K124o05k332N84J891J90k002m42K072
3387E96j0j488m15J753O20j804k17J332M81j537o02J634M09j218p39J350O01j340
$$ y = [-493, -153, -155, 123, -309, -388, -9, 322, -336, -729, -18, 6, -68, -320, -196, 129, 220, -3, -259, 154, 194, -292, -428, -107, 196, 50, -275, -77, 166, -313, -125, -26, 63, -385, -426, -44, 36, -611, -411, 150, 561, -240, -981, -63, 582, -118, -556, 94, 235, -117, -303, 302, 172, -449, -286, 374, 335, -500, -360, 633, 200, -722, -227, 780, 595, -474, -245, 655, 628, -641, -127, 1098, 798, -46, -497, 714, 805, 17, -370, 672, 752, -240, -99, 940, 968, -645, -577, 707, 1078, -556, -848, 753, 1279, 58, -1155, 355, 1508, 189, -1237, 320, 1787, 441, -1128, -191, 1613, 381, -1145, 75, 1648, 544, -1412, -362, 1441, 626, -1285, -440, 1389, 273, -1341, -610, 1470, 722, -1426, -884, 1240, 635, -1697, -1113, 778, 968, -1034, -1476, 596, 586, -902, -1317, 436, 1056, -748, -965, 367, 848, -689, -1291, 343, 752, -466, -1205, 145, 746, -594]
3405e94o71J500P83j347j132J522O01q70r35R72N07k93j182Q43O47n80l84K23
3423c90Q93n20n80L73J044q41m76M16P67p60l82O85P30p96r45Q50O60n95l69L45
3443A09M71k85n17L87O89n63n81O82K25m79m47O45L55n23m14O35N60o86o14M83
3463A32P92l52j295P51O97m00r18M16R77n77q88O18Q67m59p88Q3J212m56q11O36
3483B37M97m16r07J29J219k32j011J2J137l79q11j6P98Q8n38n45O72O9k37l98
3503f32J27P14l17k53K56J23l19m83J83P41k92l77oM02j98j42m8O73O8k48n62
3524e90O39N93o94o32L90M92o5o55L79N15K03q24l05O71M37o71k88L23L69k77
3544A0m96L62M58k27m05J28P25j96r43O01O32j76r93J84J232m65j315O47J211
$$ y = [-594, -1265, 235, 1018, -329, -1461, 61, 662, -208, -1143, -171, 336, 43, -1139, -296, 351, -229, -613, -390, 503, -17, -597, -224, 820, -21, -497, -81, 686, -74, -456, 229, 959, 163, -782, 68, 728, 133, -236, 109, 580, 295, -222, 165, 854, 291, -290, 392, 617, 138, -309, 336, 691, 168, -246, 389, 949, 263, -351, 132, 924, 572, -723, 28, 725, 325, -593, -177, 800, 223, -665, -47, 820, 361, -427, -344, 868, 412, -399, 237, 734, 318, -589, -460, 759, 527, -484, -472, 665, 286, -525, -541, 257, 345, -193, -738, -66, 3, -234, -632, -505, 209, -108, -361, -105, 18, -301, -784, -601, 140, -152, -529, -535, -133, -331, -473, -521, 152, 220, -28, -590, 49, 642, -52, -684, -294, 198, 133, -522, -143, 372, 575, -249, -554, 117, 554, -117, -405, -82, 287, 10, -486, -124, 334, 107, -298, -170, 555, 359, -584, 17, 649, 473, -520, -336, 896, 431, -884, -237, 974]
3563I74k89j314O9J407O9j278m07J143O35j351j65J295l26o42l46R77M14j387
3581e22o1R55L12r04k36P70N18j305j55P45O36o91q70J213M54p58o00L23P36m55
3601A05o59L48P22m58n04N73L75l58n09L64O24n44o62O15O33q18m36N34J102p06
3621C41j359J193Q44o87j194P15R19n70j080P44R30r57q64P23J179j105r25N59
3639e94J304p10j250J112J138q55j374N71J690m18j817O79J235k28j567N44J575
3656A035l56j559oJ635k72j385J35J475k3j534L6J209L54j769k20J645O53j992
3674i39l64J588P15j583r06J332J037r27j211J047J354r79j595J108J077l97j479
3691a122R26J490j000j327J053J239p13j579P71J435o00j397O17J218l10j443
$$ y = [974, 685, -629, -560, 847, 916, -362, -769, 374, 1009, -342, -507, 788, 462, -180, -526, 451, 865, -522, -583, 372, 684, -220, -456, 314, 832, -473, -628, 117, 753, 62, -808, 405, 859, 101, -499, -176, 560, 105, -554, -206, 516, 58, -446, 127, 502, 144, -365, -1, 623, 79, -583, 32, 665, -153, -589, -55, 1047, 341, -1018, 175, 1019, 332, -862, -147, 772, 202, -878, -134, 796, -161, -1025, -302, 877, -228, -1153, -594, 710, 0, -1250, -138, 1000, 145, -1229, -658, 1032, 614, -1203, -524, 711, 483, -1084, -540, 1035, 679, -880, -886, 749, 477, -908, -773, 702, 679, -855, -819, 390, 744, -1025, -1245, 400, 1053, -939, -1303, 285, 1000, -583, -1489, -157, 880, -47, -1258, -211, 1143, 164, -1431, -323, 754, 357, -1122, -196, 1294, 294, -1033, 20, 1259, 546, -1033, -262, 1173, 573, -824, -207, 1011, 701, -742]
3707g42L08J148J25j516Q6J228k51n77M0O08J31r38M0P04Ok61n77P86qr9n07M48
3729A82M40N1n49j11M91j0o73m5O23J62p01J66M50p9k31n38N97K90q20J97M89
3750C81j34l13M7k25M94m51Q3J56L12k81m18J67r8k1L40k41p6P7J1k67O2O18k23
3773@k39M1R3K06n53j31O57J97m20j06M43k09l11j56M96k4l95q4Q09l09m96K0
3795d71N15k85k3O1O69m73k66L2N53n12p5M5Q57q46k47L40L92j31o19O69R9Pm43
3818a52M97P9k80l57K09N18l07n89J47O42Lq62K61R23l02o25J0O45N1q74k71J074
3840D40M07o78p98J446k08p85l16P91N81j135o84J385Q40j495o92J193P00j223
3858b31q85J385J157j256j110R62J226j298r81P93J147p65j372J115J033n42j349
$$ y = [-742, -434, 714, 839, -677, -591, 637, 386, -191, -151, 457, 588, -350, -310, 394, 400, 139, -438, 348, 340, 241, -266, 182, 622, 673, 124, 13, 504, 494, -179, -224, 399, 561, -140, 26, 476, 397, 166, -372, 225, 515, -305, -108, 381, 247, -66, -19, -244, 250, -201, -118, 38, 350, 69, -349, -182, -280, -301, 39, -202, -278, -201, -190, -457, -395, 223, 0, -239, -198, -105, 101, -452, -583, 74, 271, -149, -255, 188, -21, -332, -488, 8, -16, -411, -495, 314, 5, -491, -471, 44, -241, -264, -203, 466, -7, -273, -241, 312, -200, -275, -230, 627, -219, -466, -126, 266, 135, -484, 185, 284, 291, -152, 345, 424, 144, -213, -4, 514, 207, -382, -235, 407, 410, -452, -191, 732, 430, -195, -185, 460, 511, -363, -634, 440, 847, 169, -629, 817, 609, -176, -492, 299, 880, -255, -939, 446, 1286, -209, -901, 292, 992, -231, -1116, 269, 1426, 170, -940, 22, 1248, -50, -1031, -238, 909, 144, -1228, -113, 920, 378, -971]
3875i71M57J325k54j473P13Q56n09j116P37P58j87j103K49Q83J13j386K66J032
3893C90K37j261K0Q92M38j034k07P16L84m53q21P00Q16r26o04Q19O24j152p5L66
3913a31M31m27p26R65M34q37l84M43O88o81j90M47N10p88n59R49J20n69R5L72
3933A62L4n31p08J408K2m53l41M54r9k85R6M65j47J5l69O43J89q08j54L95O70
3954F58o55m71L36M88p38J05N04r2k37m45P24K52n11m35O96P8j34p78L54R95l56
3975C38n16J14N17n0p73K62L57J76m31j56P09J65o04k82P84m36m38J76N27m7m92
3996a00J37N1N73o57l82R11N7o23l28N24m8k15k73N23K19m10O2k13K47K01m39
4017a83k48K18M14k50q1k18M27k44k35K36M58l41J6j14K10Q2o08R0L36O3o04j26
$$ y = [-971, -514, 811, 557, -916, -203, 653, 144, -972, -235, 523, 336, -767, -518, 365, 478, -908, -642, 390, 627, -634, -614, 278, 716, -318, -525, 191, 575, 122, -699, 1, 817, -109, -713, 106, 730, -422, -497, -131, 300, -127, -853, 112, 546, -291, -675, -232, 456, -225, -415, 32, 542, -246, -805, 144, 264, -305, -210, 162, 196, -335, -1043, 365, 387, -66, -407, 47, -52, -337, -241, 224, 77, 92, -277, 366, 555, -253, -407, -12, 658, 3, -468, -132, 356, -382, -277, 227, 135, -102, -547, 177, 429, -82, -517, 179, 257, 123, -655, -301, 694, 338, -178, -64, 453, 403, -370, -108, 249, 425, -6, -162, 547, 712, 108, -174, 610, 174, -264, -88, 439, 392, -100, 37, 88, 661, 4, -378, 533, 590, -33, -361, 163, 115, -100, -373, 150, 369, -41, 21, -192, 55, 256, -183, -431, -213, 201, -49, -130, -348, 79, -165, -400, -164, 294, -47, -31, -145, 65, 147, -461, -371, -35, 28, -576, -702]
4039g02O87J69m04k53J54N79l37m73O63L47l93p54M81L01K8o34J46N82n3o48L79
4060a35K28Jl98RM67Pl90l42P55K69r13j7P97J23q75J54M79K98j200K87P05K46
4082E55o73j21O76J90l26n96N81oj69k48K68L18m39j39J51N03p22O7J79N07m20
4103A36m62M41L67m15l07N20K30l90m17O03K64n36k93P72k51O7o30N88K73o24
4123f4m38M98M54n51m11M10O96n73n78J47O53m14l85N06M36k74m49K2P54m56n53
4144e70J42R25l81o99L16O70n04n10L03R02k92q36L9J283p04q58J64J307m93q79
4164f75j24J159K67j137J61P12M35j385J26R23O5j126j55R87M00p29o09J049K46
4183E90q73m68J159J83q68m77P66P39m84q83N91M55o78m04N99N60l71m56J49O28
$$ y = [-702, -15, 154, -250, -503, -349, 230, -107, -580, 83, 430, 37, -717, -236, 65, 93, -541, -395, 187, 134, -514, -135, 93, 94, -304, -295, 172, 179, -211, -553, 202, 471, -442, -459, 338, 461, -414, -260, 219, 517, -683, -396, 309, 555, -118, -239, 437, 627, 301, -295, 286, 280, 111, -137, 131, 449, 10, -129, 22, 525, -197, -130, 49, 556, 136, -326, 115, 482, 67, -240, 280, 510, 120, -297, 306, 570, 34, -259, 513, 262, 329, -301, 287, 560, -64, -502, -4, 450, -101, -512, -102, 594, 21, -557, -410, 243, -171, -556, -50, 386, 112, -337, -315, 439, -17, -570, -428, 497, 116, -583, -267, 403, -101, -611, -308, 594, 302, -534, -495, 788, 84, -774, -610, 697, 204, -675, -799, 360, 627, -510, -349, 363, 798, -587, -461, 462, 527, -599, -754, 233, 633, -96, -705, 344, 590, -283, -751, 408, 591, -277, -754, 12, 751, 267, -616, -25, 430, -248, -652, -53, 507, 136, -320, -171, 457]
4203D57l10l78J85J60J19l16j89O84l28l69O3M46J76r57K42K81J97l14j08K60
4223AP2k87J76K23J64j84k58K03L23l42j98J48K1k71M11k98J86R3m9o2rK0j31
4246d8J21P8k01ML2L69k92J29J21m87M2m0J95rj13J62P7j45q9K1J50j86j54J66
4270i7J52qk76J44K37m55M8K74j3J9L1Q0J61k61rM5j04k57N82n1j15j70K7j2j64
4295a92R6O1j96M26k77P2K95m18K45j37R1l09J14j42L37k52J17r3N15l17m45M07
4317bJ36r6j66N3J39J74m45N02l69K93m59J35L70k13j94k14Q81n01k47L12r3L06
4339C02q37M64K72j13k84j09P32k9l79m54P83J29o79o9Q28m2l11l82J43N65n81
4360e1lL86J49l43l79M07O60j178j52P43K06l20l83K92O14n08l75M42L64m40m34
$$ y = [457, 147, -231, -46, 114, 233, -83, -272, 412, 84, -285, -222, 224, 400, -557, -315, -34, 163, -151, -259, 1, 73, -214, -38, 185, 349, 165, -93, 110, 433, 91, -107, 41, 62, -209, 202, -96, 90, 183, 134, 72, 63, 83, -48, 73, 151, -50, -46, -14, 355, 63, 192, 313, -174, -132, -172, 23, 14, -99, 63, 140, -5, -94, -73, 77, -109, -263, -97, 55, 47, -229, -85, 152, -303, -255, 19, 6, 25, 56, 136, 297, 36, 27, 72, -32, -289, 293, 242, 127, -43, -16, -28, -192, -96, -35, -231, 195, -82, -10, 285, -133, 112, -25, 66, -243, -129, -271, 66, -186, -69, -162, 353, 36, -409, -2, 134, 38, -128, -75, 64, 238, -207, 295, -74, 219, -240, -105, 265, 52, -142, -356, 525, 24, -223, 89, -4, 302, -535, -71, 201, 88, -196, -305, 427, 398, 19, -435, 348, 477, -202, -271, 557, 515, 204, -178, -35, 530, -51, -54, 332, 481, 138, -241, 166, 826, -352, -504, 239, 445, 125, -258, 34, 648, 140, -235, 207, 571, 131, -303]
4381c03J10N56k33l74K07K88Ro87J01M75l36j36J17J48K24o74M02nK35m45K01
4402a20K91J24o18r6P86P7n75l90R25k15l63k61P12Q7m83j83K65K30n48K58J4
4423h3J41p9j25J40K33o42J75L34j91O9j30N48n64K5j75M91j34m84L19J69M24
4444D61o69J61K07j74Q9m45N05L2l33j77N66Jn87N3L42J33n9j65M86k73n0k89
4466a85O6M66k18l37L95K31k34n35M09M71o02j8L53L84p39l64M85J19j01K0l5
4487C1L63J0o70J54M97R2o75K19L10j47p2l7J51L2m46N61j68P8k48k68M23m7k76
4510a33L1J53J95l89J68K41k51K29k64j41O09m58l64K11L57k29j54j2J63K78m21
4531a81J62O5K2j21k22R5N01m92p9L73n9O2r5k55L34l42N6J31J33l31J19j30K37
$$ y = [-303, -193, 363, 130, -244, -37, 251, 260, -427, -326, 149, -187, -323, -206, -58, 166, -508, -106, -111, 124, -321, -120, 171, 295, -323, -419, 367, 444, -131, -521, 404, 189, -174, -435, 277, 364, -119, -302, -37, 193, -355, -97, -83, 58, -21, -146, -6, 227, -415, -240, 94, -97, -28, -158, 390, -174, -149, -324, 167, 33, -451, -132, 37, 461, -208, -47, 160, -14, 75, -370, 135, 167, -166, -343, 223, 224, -363, -310, 32, 165, 106, -59, 427, 154, 104, -185, -119, 347, 129, -208, 187, 418, 184, -351, 58, 529, -73, -91, 262, 646, -93, -457, 28, 147, 46, 66, 31, 394, 404, -266, -112, 385, 477, -198, 21, 331, 184, 112, 75, 226, 258, -188, 373, 205, 283, 35, -233, 190, 143, -133, -102, 51, 246, -143, 25, 266, 15, 244, -20, -161, 448, -10, -374, -163, 194, -35, -189, -201, -38, 240, -181, -19, 46, 68, -53, -275, -180, 321, -171, -250, 123, 64, 126, 31, -224, 110, -232, -176, -45, 88, -243, -124, -254, -17]
4554a7Q7k79J80J53k85J14J01k49o9K48k94j10N64J15o19L19j81M72l72J19k1
4575b4L5j98j49O84l60Q8j34N03k75l49J78L82n7q85L41M80k55k63M5K10n5J47
4597H9J82K9m25q6N4Q6L36l20l72N08k02l3J51J81R9m39K4M84j8m43j63L75K30
4620C27n96j12L67K77j37o7k1M43n91JJ64P01n29n50M37L20n25n6J57L34j30p04
4642d90M31N18n14n12O62M61k95m68J2O68m70k29j18Q75l39p65M80P92o52l36
4662b89N48J75j71n73K04K87rn81LP48mo98K41K87j05o87K34O13j13n50O9N25
4684A54k47k79L3L44K34m12k37N48k0m40l3Q6O22j90p68M36O02m59l51J56O22
4705D01l09m81L45L73r7p67N77L19j3o18J23L15j67j52L66o6l53Q1K64K39l50
$$ y = [-17, 70, -209, -29, 124, -161, -47, 54, -195, -264, -16, -310, -420, 144, 259, -360, -41, -222, 250, -122, -3, -24, 11, -187, -336, 348, -12, 76, -58, 445, 170, -179, -1, 381, 324, -561, -220, 260, 5, -258, -213, -3, -58, 89, 271, 300, -125, -211, -157, -71, 265, -55, -427, 81, -121, -154, -3, 178, 277, -162, -138, 346, 328, -115, -278, 97, 327, -269, -381, -14, 263, 126, 59, 38, 481, -110, -109, 55, 756, 227, -323, 114, 434, -91, -147, 10, 344, 214, -490, -59, 459, -55, -567, 95, 556, 261, -207, -195, 473, 3, -226, -344, 531, 192, -573, -93, 699, 47, -289, 259, 434, 263, -310, -106, 181, 172, -409, -406, 342, 338, -360, -119, 168, 63, -624, -390, 223, 110, -440, -371, 154, -93, -372, -339, 5, 239, -173, -410, 138, 118, -322, -355, -269, 353, 163, -605, -169, 433, -26, -377, -221, 401, 92, -389, -44, 329, 232, -535, 42, 361, 348, -270, -147, 168, 1, -151, 215, 149, -204, -123, 141, 380, 30]
4726C0j15j29K62K6j49J04L71l3o18L03L5N4j43J39j80L47k14l4J65J00l01J8
4748C8jj52L04k11M36j87j08j55K87j24j83K67l13K33K3k55J98K33l70J78j05
4769C3Mj79n9J49K16l38J11J5L93m88L26k29J90Q0m54M14o8k60r2L26j13q6O8
4792d1J36m89M64j11jJ31l02J86Np2OL4p2J27J4k30K59J5k41K29l77J75J39q5
4816a01l7j67N9N36m06l67O11j26K0k30J55Mj57r8K62K99m62l5M40K66l30j00
4838C6j61K05j95j90N05P4n68L91q0L05j19m25N17q0n2l65M58J17r0m64J93M12
4860D24k07k70o5N08Q8q15K36M66m9k41l91J36M35n89J97K19K91l28k11L81Q2
4881B97k50N7N8K92l54m43M27L12l24j93J55M60l48k73J37M38k43m02K45j1J16
$$ y = [30, -85, -214, 48, 74, -75, 29, 400, 367, -251, 52, 87, 141, -2, 137, -43, 304, 90, 56, 221, 321, 20, 38, 37, -115, 189, -22, 414, 227, 119, -36, 251, 127, -56, 211, -102, 131, 154, -101, 97, 330, -40, 138, 33, 37, -142, -201, -52, 164, -174, -63, -48, 345, -143, 183, -46, 144, 224, -230, 184, 116, -144, -236, 90, -23, -109, -41, 95, -394, 70, -41, -42, 89, -213, -27, -22, -94, -88, -54, -126, 1, 15, -215, 44, 59, -182, 47, -330, -155, -16, -101, -138, -305, -246, 290, -116, -483, 128, 2, 22, -208, -53, -49, -206, -304, -42, 257, -205, -240, 200, 466, 136, 36, -125, 80, -115, -305, 200, 274, -294, 97, 17, 322, 203, -222, 295, 215, 163, -202, 256, 373, 283, -181, 12, 424, 217, -53, -118, 390, 478, -337, -101, 365, 316, 75, -316, -180, 255, -334, -137, 82, 373, 45, -166, 215, 297, 47, 104, 162, 454, 100, -343, 84, 396, 72, -121, 34, 494, 146, -127, 10, 448, 205, -197, 48, 37, 153]
4902A53k44n4L96j92k16R8P5J62m61K58N98k04j053Q16L36n42r0P1L9j04P7J42
4924F1L06m27p2oK45K23m53j29L46k37j1P8K20J55o41q0M03K04m62P8J03L12n46
4947c30j5K25J04p6l41P42k41M7l47K24J58l70l42O20J63o73Q4K64M18m50K40
4968A04nK10n25m26N08N19o21k47M52J70lk26J88J00k23J57k65M44j57l76K67
4989D5K26P2p41L84M71k98o14L19N64l12j12N6L7K43n01l0N47l0m63j17N81j04
5011B23j91K17OJ31k94k58K30M28j79l96M59L9l21k52J18K04k38k18L09K71k55
5032C3k36Q3N19l21o6R1r1M1P6j87K31J5P6k27k97K58O4j27k97M22L1l01K64J39
5056A93J29n74k6K43L08n50K7O6J08J24j43r0N0NKJ16J46j56n15J90L98j74r3
$$ y = [153, -91, -145, 251, 59, -157, -59, 16, 178, -283, -25, 573, 369, -684, 132, 468, -74, -164, -93, -54, -158, -81, 61, 367, -60, -132, -138, 107, 330, -123, -252, 94, -143, -154, -76, 144, 299, -342, -422, -19, 185, -277, -199, -96, 216, -330, -345, -120, -16, -92, -433, 309, 68, 115, -232, -8, 150, -220, -562, 58, 221, -452, -368, -104, 314, -136, 104, 99, 309, -216, -642, -134, 385, -236, -483, -31, 139, 136, -90, 98, 198, -25, 132, -133, 311, 154, -222, 45, 271, 343, -398, -14, 457, 159, -455, -136, 428, 116, 4, 60, 97, 340, -161, -191, 356, 326, -137, -254, 327, 223, 32, 249, 255, 386, 92, -166, 64, 492, 313, -83, 376, 415, 94, -158, -40, 164, -74, -292, 17, 288, 33, -203, -120, 399, 78, 12, 103, 12, 53, 129, -58, 173, 188, 264, 37, -260, -2, 62, -65, -362, 60, 91, -210, 54, 193, 322, -252, -278, -35, 273, -277, -250, -184, -76, 48, -95, -185, -135, -130, -128, -12, 134, -22, -537, -347, 51, -123, -216]
5079b16M8L94k49m62M82L90j39k15k18M55m13q4J03M23j03o20N74j82lj15J96
5100D6R2n37N34l84J50K61j92k58J35N72l96J42k18r0l0M5L27l54J93l50L17M46
5122D51m35j7K40j28r2n6M90L2m93P6J44K14m25l39M88j04p3O4j84L57j48l67
5144c05O41q2K7o74K04N25m81j88K88N58l08k18p3L53j35k36L06nl63nK11K90
5166C30k42m65J24P10j75n26m4L16L96o92K35K61j3m89%L76j4j17l43M06N8k37
5188a45J8K02R9n87K67K58K83p05o6K89L50q2n76K92L27q3k79K22N2j0l63Q2L71
5211B16pm50j37O01m64mo3N30m07k05J58K92J05m32O31j47m16n0OQ5J57P4p7k52
5235b56M07m28K68K24L2l60k33J63K97l18J68K91m59J56j35L87m9l97K41K01k80
$$ y = [-216, -168, 226, -23, -485, -3, 387, 248, 33, -185, 270, -143, -227, -124, 299, 196, -424, 150, -32, -35, -150, 46, 138, -399, 135, -249, -99, 162, -30, -288, -153, 419, 23, 165, -53, -143, -173, -128, 199, -155, 38, -312, 5, 451, 16, -1, 239, 111, 19, -37, 453, 485, -8, 68, 212, 426, 1, -338, 150, 46, -27, 37, -147, 210, 62, -305, 336, 254, 281, -393, -189, 336, -145, -333, -45, 513, 205, -13, -86, 267, 132, -104, 202, 197, -166, -171, 40, 330, 88, -377, -253, 457, 282, -244, -288, 28, 424, -268, -33, 228, 215, -274, -274, 102, 88, -29, -372, 34, 92, -145, -127, 75, 174, -413, -146, 112, 395, -310, -376, -87, 263, 181, -395, -103, 224, 141, -138, 84, 136, 126, -237, -155, 216, 209, -241, -378, 223, -241, -245, -308, 222, -185, -390, -232, 60, 165, -267, 364, 217, -199, -249, -243, -158, -1, 73, -4, -256, 151, -277, -9, 215, 247, -113, -346, -183, 114, -204, -36, 255, -204, -48, -183, 204, 155, -242, -1, 200, -80]
5256h0J87k00LL13m83K23J27l60K47j26K19l10J80j57N16j56j4L41k94L1p3R6
5278B30j5l68K45k32L93l89J41P6Q0n2j98k9K52l05o3M53k74N1r2L80j22p8Q7
5301A71k34R0k8O0lj00Q2K64k69k68K74rq3k65L63L69m75N6j18K15J29m32j3J13
5325a11L99l42M8j06M4j18K18L04j66l19J22L1J55n7k28k07O52o01K56k1J1K9
5347gr3J01R8j67j96pJ91p3ql9L67J42l41l24P03k15k53Kj4O00l19j65J74j2k08
5372f3P1J57Q9k11l43N57R2m5m36M99l19o7R0K9K92l84N3L39n9o08L5K52l8K15
5396A97k85J07L29l00j49KJ29Jk56K90L15k05l37j36P98o35J41O7K1j98K32R8
5418B26j91N0m1k80L32j20J50J16k33j7o11M89J87R6m03M01K52p85O4J79L91k77
$$ y = [-80, 107, -93, -90, 223, -260, -37, 90, -270, -23, -149, 70, -240, -60, -217, 299, 143, 129, 470, 176, 207, 134, 230, 215, -153, 92, -140, 253, -136, 5, 81, 161, 109, -89, -118, 134, -171, -234, 219, -55, -4, -96, 284, 162, 84, 171, -63, 27, -1, 59, 56, -44, 38, 302, 33, -235, 39, 30, -53, -318, 45, 414, -61, -5, -123, 92, 221, -211, -224, -111, 288, -54, -6, -112, -68, -186, 32, 336, 170, -149, -27, 4, 159, 102, -126, -333, 319, -282, -26, -47, -36, -7, -100, 1, 99, -68, -264, -271, -80, -153, -161, -200, 167, 309, -32, -356, 347, 132, -121, -119, -133, 467, 148, -17, 157, 145, -63, 8, 165, 254, 43, -300, 257, 349, 304, -132, 367, 48, -19, 71, 100, 392, 8, 61, 400, 341, -267, -232, 20, -18, 197, -88, 19, 348, 48, -101, -99, 30, 31, -225, 65, 380, 175, -162, -298, 500, -135, 6, 73, 94, -104, 128, 226, 35, 85, 44, -236, 96, -24, 126, 242, 9, -8, -619, -130, 57, 153, -250, 151, 403, -382, -318, -139, 252, -25]
5440b5k01j76Q05p35l3L21J31j03j50RJ79j2j55J10J46j70O5k37K79q3l69K4K73
5463a07K99n33J01M08j74o9kN3L4k79j00M36L97m37j47n6M02n11K75nL66j99J9
5486A71m38K83J63o91N24K57j1n21K73J55l69P2J6Q4M20m75J58R0J95j84N5k54
5508b7K03l07L40n6j94M66n32L04N2l94k5N82k42k44P5J72j7r9j41J68r3q0J03
5531A4L1J64M77m61l70L0M21l98j6J22Q6l56K90j42K48k78N7k9J47j09M8J59k27
5554i2L7O9J45Q6p6k20J64J79n47K20O5N9k3j85J45J7J03k57q1n3K50P2m14J97
5578a40K1k15J56J82K97l89R0p7L28j05l20j28J27L84l05JR1J80k06J55M6j12
5600F1l4P4l7p4M1j44N0L67m48l4P8Q7J6J60j29kj73K5J79J80l95K22OM4o1l50
$$ y = [-25, -226, -402, 403, -332, -365, -44, 87, -16, -166, -157, 22, 10, -145, -35, 111, -59, 6, -231, 48, -35, -404, -380, -107, 192, -341, -240, 168, -6, -75, -77, -24, 10, -269, -369, 67, 464, 27, -120, -176, 226, -285, -10, -15, 351, 152, 171, -267, 16, 179, -512, 12, 269, 258, -263, 10, 165, -204, -132, -116, -32, 388, -87, 71, 161, 356, 172, 227, -27, 176, -131, 209, 153, -41, 425, -107, 197, 249, -145, -170, 412, 170, -74, 1, 173, 156, 57, -84, 84, -9, -89, 14, 45, 209, 686, 225, -145, -115, 306, -92, -108, 14, 100, -256, 34, -108, 140, -138, -81, -110, 37, -72, -24, 135, -92, -55, 14, 159, 245, 169, -51, 113, 292, -255, -35, 30, 89, 66, -119, 26, 43, 146, -111, -192, -245, 5, 77, -337, -140, -119, -334, -178, 4, 301, -88, 2, -75, 253, 148, -172, -300, -173, 211, -94, -93, -2, 178, -28, 127, 173, 61, 27, 101, 64, -10, 31, -113, -63, 304, -144, -178, -100, -13, 3, 163, 34, 32, -141, -116, 63, 243, -152, 70, 76, 120, 59, -291]
5626b91M13j71J82J11o2j9m53L7K05J00J19m63M31J24n78K32n9J2q3K32M40q3
5648C76k32m63N12Q7r4j99L07p9l73m5O03k68%k15M76k5k99j82K23J83j51k25
5670h3J84K32l87l2J98L34m66k02K85R0K46l07l17M02r6L2j77J05o2j01J82j21
5692f1j85M76m43L52j3m93N04l82J22K2J17l86M59l27m3J27K12R0j64m0K4k48
5714b80K79K28q5k12n2N8J34l20j44K22Q3j32J76j52L26j48j61N40l02j24j14
5735a80M7J97j71j23J97K04l88K9M06k65q9P3k5J17m76O29r5q1J8NM4M3J51m70
5759b03K36K72m06j3K32J42l04Nl9J52J51q9n22L95N4k3J02n0N2j92J75M5J5j29
5783E8K3J3pq7P4R8J43l77K95j17K1k02K48l7L6l35O5j04J32J52r2j93K93m6l6
$$ y = [-291, 122, -49, 133, 244, 182, 163, -290, -253, -48, 52, 171, -292, 139, 263, -315, -83, -142, -130, -213, 19, 459, 376, 144, -319, 193, 280, 186, -13, 294, 215, -158, -203, 400, 132, 132, -83, 393, 368, 69, -113, 110, 293, 142, -83, 101, 333, -54, -86, 112, 446, -20, -222, 63, 153, 399, 92, -225, 177, 81, 113, -64, 41, -21, -122, 60, -61, -246, 230, -213, 139, 126, -367, 137, -245, -123, -101, 16, -370, 89, -238, -281, -154, 58, 148, -16, -56, -32, -280, -1, 227, 142, -70, -122, -64, 70, -250, -394, -172, -89, -221, -45, -197, 129, -19, -180, 360, 58, -66, -180, -133, 64, -107, -230, -33, 171, -217, -188, 218, -47, -136, -63, -88, 29, -447, 182, 87, 6, 24, 29, 73, 116, 267, -203, 33, 305, -101, -114, 118, 260, -44, -39, -78, 74, 225, 136, -386, 9, 63, 40, 142, 92, 144, -48, 127, 172, 187, 58, 81, 94, 87, 0, 74, 172, 315, -62, 233, 116, 137, -65, 183, 146, 182, -153, -88, -192, -60, 92, 0, -193, 100, 54, 18]
5808A8J25l8p5l9o4P2j1l70L99K50j68j29r5M07l09rj08Q9K39k06j5j4Q8r4l5
5833i2p6J86Ml8j21K17K43n89L24j18K85m70J80r1K99l00jm0J86j8j44J95J12
5856A33m0QL5r5m4o3n20P89k96o9j75L23J14j28K46k80K59j29r8L65j02k01K4
5879E6j51l02K56R8L10M7n20J66L58M5m92M8L1J44j34N0P7j8J62m80K46K92j05
5902A84l07N1J10j92K6L40m2l88K69j9O8K73m63J2K03Rp6P4J15m5k20K13l0R0
5926B55o03N08J43j26n31M43R7l28j98N18m5k95L08M7Q5j92m22J73K02O3k79J30
5948d7k7Lq3j35K12q4J65m6K89j76l9K6R1j68m1k8J43L1l72O78n22K45n7Q8l44
5973a98J7M62l15K82l20R3j20J89J80o22L35n6J07j17J5j24L56j80n4K84o7j40
$$ y = [18, 143, 105, 30, -9, -73, -1, -12, -382, 17, 267, 99, -30, -125, 282, -27, -36, -144, -55, 184, -22, -37, -51, 37, -57, -92, -168, 18, 22, -16, -137, 80, 323, -266, 58, -60, 225, -245, -65, -156, 143, -157, -158, -198, -12, -30, -174, 21, 133, 93, 101, 136, 41, -3, -66, -586, 203, -93, -162, -337, -14, 100, -28, 218, -62, 197, 68, -30, 335, 233, 32, 56, -95, -397, -141, -43, 267, 314, -206, -40, 318, 363, -129, -81, -50, 94, -40, 10, 87, 69, 231, -249, -3, 289, 184, -123, -72, 38, -154, -128, 212, 170, -218, 51, 32, 100, 373, -90, -78, 125, 134, 58, 132, 247, 202, -18, 195, 165, 255, -348, 160, 303, 177, -354, 89, 186, -142, -340, 178, 133, -162, 146, 193, 278, 86, -336, -163, 39, 102, -177, -47, -74, -71, -154, -289, -77, -161, 4, -42, 247, 71, 32, 58, 149, -19, -60, -88, 55, 86, -286, 392, -130, 115, 58, 146, -198, -181, 281, -34, 248, -72, 21, -99, 90, 270, -352, -17, -73, 34, -83, -68, -192, 164, -16, -70, 214, 147, 7]
5995Gk40M10j71Q5l86K37M3L07k63k17L80k98K88k7l77M22L5l71K37k70L18j0
6017A39n1J47pn77K32L08l13j28K69R3J3K2j75K50k19r9K46k42L07j95l11M23
6039A32k8k45N7J98k27J93j6j47K74k13M4m1N1R7m26K52K52k08K75k25j87J82
6061D4q1n5J64j48M5rk97L93o3o9P5l0J23j29J09P4j62N8K00l46K5M11k16j96
6085h0J20q5KJ39j84nj69L65k74KO71k27j63l50J08L32m94L13O6K3J21m87N83
6108C27m85M3q1M20n1m81O55l54r4K22l18L29r9M4j0R2j94J75j67J31K17Q4l29
6131G6l05L47k02J78p3l5K68l33j30N16l11k7M5l3k86k2j8L38M4m5J60J66k24
6154I4n4o2J1lj4n6J80J39k95J9lN0r5p5K55K57l10j57L73J2k08k37N12j58k77
$$ y = [7, -233, 177, 6, 91, -295, -58, -15, 292, 29, -188, 192, -106, 182, 155, -222, 200, 235, -136, 101, -169, 149, 139, 88, 235, 228, -349, -117, 191, -122, -250, 19, 112, 125, 147, -28, 222, 3, -96, 150, -92, 215, 20, -291, 132, 104, -141, -84, 114, -113, 80, 64, -83, 191, -22, 22, -19, 32, 129, -297, -45, 207, -1, 274, 49, -138, 44, -37, -92, 72, -76, -31, -40, -337, 56, -7, -76, -1, -31, 92, -37, 72, 146, -16, 42, 242, -104, -79, 332, 116, -80, 40, -45, -43, 96, -88, -93, -262, 103, -171, -169, 502, 275, 112, -238, -130, 202, -292, 21, 87, 110, 231, -256, 327, -158, -115, -196, 224, 173, -308, 347, -7, -101, 121, -197, 132, 33, 77, 67, 159, -35, 140, -27, 104, 321, 405, 76, -229, 118, -84, 94, 21, -14, 254, -79, -209, 307, -4, -31, 14, -19, -305, -327, -345, -7, 37, -8, 152, 318, 94, 40, -22, -11, -14, -28, -84, 96, 235, -60, -41, -44, 6, -89, -164, 91, 348, 38, -119, 254, 266, 58, -179, 333, 175, -102]
6179a02J97o7j16J02o1m2K03K12m15N49l30m5o6K94l59J01j83L8K26k75K36n51
6201d54M00j04J19K5L9j32j9O6k0J65l43K39j76O8r5p0J55J93j31J84J9j54k75
6224c01K63n8K59j72K74J0n76K17m4J83R%j94m3J99r1n4l3q0l2K05K17j89j54
6248a85M2K17k57n2K00M3j46J94m1k43L79m12P7j2O68l90l17M12O8j50k53J59
6270Aj47J85j10M94l29J16j01j73K0K39k65n4L37j89j5k26K47q8P7j07J43j25
6292g0m0n4M36o5j97k82L25N2k57J53L3K99k25k59M01k14O6k09K63r5J66l40Q1
6315c2O6K23l34k7J82j45K8J35J2j09N7p9kL22l29k74K36j9P0k86O6K73m16M23
6339D1Q1l06K89j99p2K41J2O5k87M4N10m86M4Q2J59Q5j27l93J84l20L93J48k15
$$ y = [-102, 95, 28, -88, 14, -47, -89, 114, 326, -89, 460, 130, 85, 19, 313, -46, 55, -128, -90, 136, -139, 97, -454, -54, -158, -39, -14, 25, -107, -126, -60, -80, 85, -258, -19, -195, -127, -222, -292, -137, 56, -75, 109, 128, -26, -301, -38, -96, 163, -9, 265, 275, -301, -84, -128, 55, 64, 64, -130, -173, 26, -65, -119, -152, -232, -264, -59, 158, -31, -185, -143, 74, -183, -235, -35, 8, -138, 56, 15, -228, 151, -261, -184, -196, 472, 82, -235, 177, 245, 95, -158, 1, -146, 39, -71, 423, 94, 210, 109, -64, -44, 195, -70, -124, 213, 24, 9, -217, 30, -58, 19, -88, 55, -70, -110, -164, 272, 207, 10, -272, 53, 105, -152, 1, 34, 333, 108, -151, 250, 36, 102, -107, 156, 61, 227, -113, -32, 34, 257, -77, -104, 78, -67, -39, 96, 108, -1, 56, -23, -25, 297, -32, -306, -70, -89, -19, -305, -239, 34, -382, 41, 122, -184, 105, -94, -166, 75, 87, 152, -135, -91, 419, -67, -23, 59, 218, 303, 176, -217, -33, -353, 40, 188, -27]
6362b7j03J87j14K17l13L9R1K83k50m3k44L84m8J8j03j01J76j00J83j22j59L17
6384A68k32J74M4Q4l15K86l60K05n8J07K6k21J85J24P0l77J35J61n6Qj20k33M15
6407B20j24j46J40J15k78n3L57k6n62M09P9jl2K12n74N27k98O6J86k74K0j97L54
6430A20k26K02j6m1j6Lj04r1J52j64n5M65K0j41l33k8M27k51Q9J7M7Lk22Q4l1
6455i0Rm3K27K04k78j54q8K39k01M87l34k92L28k10J36K79l60l6L1j36P2K93q0
6478CK00j4k91N0p5J23j84J72P2j67J05j53J31P5q7l22M10l7l79J34J51L87l34
6501c0J38l16J50R8k02kJ70l5J33l93J72J4j03J56J38J47k41N3o3j34j16L60j21
6524b7M9k6k60K43j37J46j6o9j47J56K0J93k8p4K56j51j82p8K58k12j4K03n4j06
$$ y = [-27, -130, 57, -57, 160, -153, -114, -23, 260, 10, -33, -277, 107, 59, 77, -26, -127, 49, -51, 132, 10, -149, 168, -64, 110, 154, 238, -77, 209, -151, 54, -4, 103, 129, -92, 93, 217, 287, -90, 45, 206, 150, 158, 38, -195, 220, 96, -50, 90, 205, -73, -126, 231, 205, -357, 52, 131, 130, 98, 310, -264, 263, -35, 31, 217, -57, -37, -234, 120, -106, 96, 80, 39, 23, 26, -78, -169, -17, -181, -236, 229, 249, 108, -225, -253, 174, -77, 12, 29, 76, 79, -143, -59, -90, -81, -124, 103, 307, 29, -125, -213, 26, -175, 312, -22, -314, 14, -196, -60, 219, -141, -177, -146, -282, -210, 83, 3, 203, 189, -102, -52, -127, -4, -188, -16, 56, -111, -6, -159, -28, 47, -40, -362, 48, 11, -368, -234, -83, 304, -30, 108, -208, -58, 40, -162, -164, 6, -29, 104, -289, -117, -103, -206, -50, 88, 235, -6, 47, -16, -150, -266, 94, -27, 22, -4, -264, -21, -158, -12, -28, -97, -244, -88, -68, 125, 97, 23, 279, 128, -54, -132, 126, -86, -100, 103, 49, -57]
6548e7J20j09l9L3M1L6K01o4o8j19m7J30J07L9l6R9k24K6o4j7K21k79Q3J79L0
6573B22j54J88j91l07M42j05j28M6p5L9p0J73j51j47r7J45O9K3j55K29j61Q8J15
6596C8P5q4j47L11p4j43k7n9R2J11j79J15O5j33j33M2k3K02n4j82J91k22O1jL94
6621B36n62K90K09l35j42L90j39J03j31L88n38L44m70L05j3o9L33k38K9J5q9K78
6643A94K0l29K86l95K79J06J00j90L6j24J30j4rj09j61K43P5j77K17l9j82J23
6665H0j1p0P2l04N0K60Qj27j6J04Nj39K41j24j65J72J91k77J98k36J15N8k28J24
6689a9Q5L05m36j32J88K67m44M79j43j32j33J08j33K20Jk25J40K29l94L3K03m
6711F3j69J81k65M08j73n3l33N14j08r6k94J01L56j20n6J13Q1l40OJ44k05L85
$$ y = [-57, 63, -46, -85, -52, -11, 25, 226, 162, 94, -25, -72, 58, 165, 204, 168, 267, 43, 69, 5, -12, 209, -70, 13, 192, 222, 68, 256, 65, -242, 200, 95, -33, 13, -62, -23, -93, 80, -71, -218, -315, -170, -101, -78, -233, -4, -165, -77, 38, 113, 29, -118, 193, 119, -24, -51, -110, -18, 93, -86, 29, 94, -39, -172, -130, -153, 49, -5, -187, 4, -218, -157, -158, 236, -326, -36, 173, -162, -304, 86, -53, 50, -81, 307, -231, 113, -357, -52, -65, -134, 199, -39, -10, 5, -84, 194, 214, -115, 171, -224, 55, 161, 261, 71, 107, -17, 113, 99, 90, -19, -180, 63, 138, -39, 178, 139, -43, 80, 69, -1, 71, -233, -183, 77, 85, -42, -58, 46, 51, -88, 153, 29, -136, 36, 227, -50, 148, -88, 27, 85, -143, -19, 66, 371, -65, -197, -9, 258, -186, 293, 150, 18, -115, -7, -140, 80, 81, -144, -4, 225, -169, -136, 67, 63, -106, 75, -190, 218, 45, -8, -341, 173, 65, -31, -325, -224, 132, 12, -44, 69, 150, -190, -184, -40, -245, 140]
6733A40o9k28K44Jm04M31m79L21k45L33j29J76Ol2k27p6r4L38J3J06l4j48J63
6756A07l03K41J64k80j6J9PjL12n90L35k19J43M14m09k9L1L61k99M95p08K83k35
6779a77L82j08j49J72n8j06k4P4J43O7jl24J41K21j2j76k79M7L44ll13M2Q8o6
6803g5J15M7k30L83o0jj21k16J44P6k0J04k66K98j82o4j91L95j94j3J58l87J25
6826a75L22m16N2O6J24R8l00N28j65k78M22k74J20Lk36J49p1q9K24q1L7q3k06
6849b29J1K38J35l93r8M26q8mm4p7K75l8q2J0j06J90k94L46p4m3m67J0O55k97
6873c8j96K69p6j67K6J38j84J50j19k6K97N8K07m73L6J69j7P9k53J04K71p6l3
6896A46l09K2j07K85j01J95n1l5j52J1J26k49K37J52m90L84j27M2j27M99l28J62
$$ y = [140, 71, -157, 87, 88, -316, 115, -364, -43, -288, 45, -84, 92, 98, 66, -161, -237, -331, 7, 20, 126, 92, -56, 107, -196, 45, 209, -71, -87, -68, -61, -62, 250, -340, -5, -224, -81, 333, -76, -105, -74, 287, -12, 483, -225, 58, -177, 205, 97, -52, 120, 62, -44, -68, 6, 149, 216, 215, -109, 32, 253, 241, 65, -214, -167, 177, 174, -139, -97, -9, -75, 40, 87, -143, 240, 180, 179, 58, -158, -14, 62, 42, 146, -120, 178, -4, -68, -259, 136, -58, -71, 87, -300, -175, 147, -269, -217, -151, -27, 71, -229, 299, 134, -144, 278, 4, 124, 127, -109, 40, -31, -120, 104, 23, 60, -23, -229, -218, 20, 155, -238, -336, 90, 2, -2, -46, -123, 152, 114, 32, 42, -64, 126, -168, 178, 104, 61, -406, -396, 259, -38, -234, 35, -41, -208, -182, -44, -228, -78, -197, -223, 74, 132, 339, -134, -98, 71, 54, 133, -120, -16, 255, 179, 146, -163, -141, -248, 37, -64, 131, 80, 45, -107, -96, 30, -219, 18, 170, -320, 64, -63, -21, -148, 351, 23, 185]
6918A85l77J68J14j91r1J77j14M01l02J09j08JK26k83J39l1r2J03m7N9r8j60Q8
6941a24p4J25J68k90J95J22n50M08l04M80l4j02j73o5K91Kj69n8M0J41J76k09
6963dp4K49k77k79M22p6J60p9k59L17j91J61p8N2K5ln4J26q0j46l4J62Lq3P0o9
6989c9R6N8r8o2J36j79J04k5j4j56O4j85L88P6o7r2K20Om6q3J13k0j69mp1J07
7015E8k53J50O5N8l3k7n63M02K24k01P5j49O5K27N9J36q4l14k26J64J66K24k64
7038d1k8l1j51M37j49L01j98j53R4k25k50N66J18k70k58L80q0p1P1l03M39n0j15
7061C3O7Kj41q6K8M88l96k85K0J51L10K32k83J2k33R1J86J9l36J86j60P8K34k63
7085d6m7J5J69p1O8K00k17k63j67J58K92M2j83j68L07K9l08L52L1j32j38r6L07
$$ y = [185, -192, -24, 90, -101, -192, -15, -129, 272, -30, 79, -29, -28, 198, -85, 54, 23, -69, 34, -13, 46, -52, -212, -124, -198, -73, 95, -195, 0, 122, -428, -20, -324, 156, 122, 20, -153, -218, 73, 75, -94, -152, -112, 29, 205, -4, -78, 171, -106, -385, 37, -39, 121, 42, -217, 100, -91, 70, -8, 44, 69, 66, 12, 138, 58, -88, -122, 40, 43, -40, 30, -39, 57, 115, 17, -45, 91, -88, 16, -9, -23, -179, -115, -300, 88, 164, 97, 5, 225, 231, 185, 102, 215, 195, 26, 22, -49, 58, -195, -45, 20, 78, 45, 18, -545, -143, 81, -120, -45, -194, -129, 98, 157, 293, 209, -105, -331, -167, -1, 223, -41, -69, -100, -251, 186, 37, 338, 140, -13, 81, -144, -394, 172, 290, 20, -238, 142, 62, -9, 62, -241, 198, 148, 33, 100, 102, -39, -125, -97, 391, -5, -290, -270, -119, 191, 423, 140, 152, -81, 10, 196, 215, -121, 65, -95, -17, 217, -46, -93, -78, 91, 20, 88, 288, 71, -192, -359, -201, 91, 133, -50, -218, 89, 118, -190, 162, 193, 61, -77, -173, 134]
7108A34j28J39j06k04n6J87J59j69J58l38N64k97PK9r0N6J7M6k9r8O6l98M05j28
7132g4L1l5k69K36J32o9j36K0m0nL5K72j27J43k60l6K69k06J24k39M74l98K72
7155A14J8l0J11j68j0j37J85P5j49J11j42K25l50M60k49J77k26k82N17m87K55
7176A8M26l45O7j24k39K8q6L47N4l50K26J12K6j52O5K44p13L09J44J36j20Q1m6
7199A08j19K29J26m84l6L39M1j64l10N35p7m00K02J84j90n20L12P1P0K55l33J6
7221a45J99r3mJ04j30L05l35J24n8J66J17j38J14j54j15J22M1r9q6r1M63l35k2
7244e0R9J0j45k52N48k86J13k79K85j97oJ89J11o5M4m32K18J66J1j90l41M15J01
7267F7p8j52R8L04j46l99J41K48l98K58k1J7k48K22J1J55j31O5J57k27L19j40
$$ y = [134, 6, 145, 39, -165, -221, -34, 125, -44, 114, -224, 340, 43, 50, 79, -11, 45, 62, 108, 79, -19, 47, -351, 54, -74, -43, -78, -347, -111, 21, -48, -184, -164, -204, -209, -174, 98, -29, 114, -146, -182, 87, -119, 5, -234, 240, -158, 114, 132, 102, 213, 45, 35, -102, 83, 158, 9, 120, -22, 203, -147, 313, 64, 241, 15, -267, 250, -237, 18, 444, 99, 166, 42, -197, -169, -255, 92, 146, -204, 22, 134, 160, 8, 73, 317, -396, -87, 57, 193, 73, 154, 108, -11, 218, 344, -140, -176, 163, 204, 40, -270, 265, 188, -212, -10, 174, -16, -536, -224, -153, -83, 172, -161, -145, 54, -39, -43, 61, -69, 236, -99, 25, -33, 133, 250, 112, 226, 72, -43, 79, 120, 21, -65, -156, 307, -28, -50, 49, 59, -86, -338, 210, -76, 37, -242, 43, -154, -160, 29, 140, 75, 119, -313, -95, 71, 82, -108, -449, -34, 67, -11, -163, -65, 239, 93, -306, -165, 83, -315, -57, -78, -61, -309, -87, -76, 79, -52, 13, 170, -57, 262, 122]
7289A22q1J7Ll9O2L3k69J76J95k97J5L61l52j7K61k67j78Q8j05J82R3J28q7P8
7313A22p9j08P2J21j91P1j86j13L41M9q3l39L70k82K49r7K22k48m7k6K47L9J71
7336B75k73l7j26M0J18J68j20j92M50l01J90n36M53l07j7L58r9Kj53j00J44J31
7358F8m62N21j49J64l42L11%j95L4j56K19j18L73o82L60J68k15Q8o4o1J78J80
7380B20j73o5q2J64J50l92Q8j15K55j20K16j97L30l83o8R4P6N6M9l60K68J15j5
7403A11r1l3L96p47O64j64l88K77m6j4L26m90K37j65K57l07O0M00k85M8J10k73
7425a17N4L40k60k23L14j63L8Q9l4m7m3%K34Q0k49J84K10l72j69M2m0L1Pj25J89
7450c0K44q8P8m45K98n8q4L65n1k42Q1l47K03K89j58j86O9o0J0L04k06j9l9m0
$$ y = [122, 41, 58, 61, 22, 84, 117, -152, 24, 219, -78, -63, 298, -54, -71, 190, -77, -255, -167, -272, -90, 3, 131, 44, 122, 43, -65, 7, 128, -63, 8, -178, -291, 50, 99, 16, -323, 47, -235, 14, -83, 139, -109, -156, -182, 65, 104, 275, 2, -35, -161, -121, -3, 165, 45, -147, 303, 2, 192, -344, 109, -198, -215, 143, 44, 46, -107, -207, -63, 68, -394, 127, -22, 142, -200, 111, 111, -84, -50, -206, 13, -105, 268, -414, -54, 114, -101, -13, -77, -138, 40, 220, 47, -18, -100, 64, 214, -178, -90, -205, 50, -70, 146, -51, 279, -104, -172, -78, -2, 54, 103, -257, 11, 126, 111, 20, -13, 383, -364, 300, 136, -252, 25, -21, -35, 291, -199, 38, -127, 130, -177, -117, 283, -2, 46, 156, -117, -63, 277, 17, -206, 108, -55, -17, 72, 38, -9, -52, -52, 182, 262, 13, 197, 407, 35, -134, -92, -132, -101, -94, -219, -30, 214, 126, 204, -241, 57, -1, -85, 280, 229, -13, 68, -279, -76, 213, 55, -131, -62, -122, -112, 192, -14, -33, -72, -112]
7474a12O3J58k87J09J94l3k6r6K67k27k47m1K95Ol63M28O5J95k85J2N4q2J15L1
7498A93j72j32K32n7M0j55Q9j05J64K5k22p5n0L32J3j05o1J49j09J16j13j48J30
7521b1J11j67L36l05J90j15k02J81p5n3K05k62J61LL3o5l5mJ94J22j68P4j03K4
7545E9PR0j79J69k04P0K21j95O5l1k71K97QJ31k66j6L88m43J97K21l26M8j6J25
7569A49l54Q6n1L42j15k11J12N9l86L36K76l18r0J12R5k1j5j40J43%J26L4l64
7592a95p4M74j41j44L0J15j43K39M2j75m7K28l24j24N99m89K33P6M3l36J44j69
7614a38l5J97j03P6J3K33N2j24k30J59L0n1k36J54M4m4L6k25J89p1r0L6Kk30L02
7639e4J59Q2k51o7j92L38KK78m39K06p0j54j63L54K03k93J44k85K49lp7n6K94
$$ y = [-112, -49, 109, -178, -69, 125, 92, 66, -30, 237, 10, -237, -278, 17, 23, -340, 88, 153, 348, 63, 75, 129, 47, 162, 193, 21, -111, 121, 64, 104, -51, 38, -67, 97, 122, -100, -175, -225, 107, 120, 15, -46, 103, -6, 110, -3, -151, -21, 90, -77, 259, -46, 144, 29, -173, 8, -67, -120, 85, -177, -16, -13, 20, -45, -80, -84, 110, 232, 64, 138, 35, 59, 66, 156, -23, 146, -58, 12, 233, 38, 103, 72, -199, 98, 106, 237, -29, -45, 343, -100, 97, 318, -8, 40, 24, 149, -205, -119, -170, 172, 57, -154, -42, 17, -369, -33, 243, -75, -165, -53, 42, 21, 6, -134, 9, 9, 135, 169, -195, -269, 205, 64, -80, -50, 65, -78, 161, 203, 28, -19, 209, -115, -239, 360, -129, 104, 180, 223, -113, 31, -138, -173, 24, -79, -3, 10, 243, 295, 171, -59, 100, 130, 79, -157, -3, 41, -3, 33, -192, -3, -74, -164, -128, -126, -356, -54, 105, 187, -64, -131, -323, 15, 17, 295, -144, 62, -8, -162, -325, 29, 232, -61, 83, -202, 47, 44, -33, -89, 205]
7662B05j22k97K3N15j85k44J9K62j24l83L10n8r4K06k00nK53j68J64N6j22m9q2
7685a20J88l12K51J12j77L18l52L0R3P0L2l0K17m18J32p1k10L33N5l44L53j19
7707C1K39m20J35K4J53o1m7K01k86k14K43rO4J81j91R4j28j14j82M21k42J54k3
7730B3J3K64j95K6j12q0J59l3J50p4j86P2m3L38k23j75K8Kj18L40j79O3j6j76
7754a32J04k7j05J05m1p1M4j61L66q8k01K96j40J56j29j68R9j06K70j49k30K77
7776c1M36m13K9l70O83m83J35J09l38L22k08L01j69Lk7j6j20N2J70L7m8m5k41
7799b32K07j94K70k09K56j05n1L0RK6L5Q1j59N8L2j01K02l84J78Q4q9K23m06K12
7823b7L42M1o01J88j66L72J47m87J95Q0q7J08r6O0J50m9k9j56k12L73N9j12k55
$$ y = [205, 83, -214, -191, 324, 139, -105, -86, 176, 52, -331, -21, -79, -173, 33, -167, -172, 81, -87, 77, 133, 11, -38, -120, 68, -244, 7, 119, -58, 260, -92, -62, 31, 101, 133, 103, 320, -98, 34, -37, -247, 86, 141, -203, 150, 31, 270, -150, -15, 9, 162, 101, 54, 255, -31, -245, -2, -11, 53, 234, 43, 137, 9, -105, -287, 134, -108, 46, 23, 36, 300, 105, 131, 19, -61, 98, 65, 215, 141, -45, 27, -16, 322, 99, -76, -48, -46, -164, 176, -3, 60, 44, -132, -28, -55, -160, -55, -96, -167, -123, -284, 82, -6, -207, 89, -51, 105, -24, -192, -93, -199, 71, -78, -308, -31, 405, -8, 21, -349, 334, -149, -14, 95, -243, 79, -129, 172, 3, 6, -21, -37, -157, -105, 65, 102, 54, 9, -232, -25, -219, 51, -158, 98, -7, -58, -28, -19, 7, 42, 123, -36, 22, 54, -47, 155, -229, -51, 33, -56, 167, -239, -27, 315, 356, -245, -57, -223, 149, 296, -191, 4, 84, -3, 105, 9, 69, 219, 170, 141, -15, -227, 146, 205, 93, -162]
7846a62J51oJ7n0J06q0j41J98p6k05M0J39j17J93j20j83L12l79N10k36J79M0j58
7869b8k10L14%j58J21k86K48k9J98j43J66q3j01J81k80M30l74J76l23J64O2j56
7891a11j69L20M2l02M23j34n0r5J77k51n7M97k60M0J26j61J0J54j71m4P4j37j69
7914b48J76n4R5J5J43L4j53J76k55P6J1j86J95J88l03J28L76o71N04j78Jj25l7
7937i2j49K79o4Q9j2k76K27m35M23M2p3J46L97m63j25K2K46j4M5q0k46J51jk34
7961a97L18p2rJ30K41o30K47MJ71j45L9j79q4N5J99k79p3L62k1J80k43J1J20k25
7985h0J34J25m23M98m79M53l33J16k7j01J13J03r7j97j5K76j61k0Q0J27m24k8
8007c60O5L81o2k5Q9N0k16M10l76k17q2M32j3K1J06k54J12l60M92J00k11J8Pk14
$$ y = [-162, -11, -17, 0, -50, 56, -24, -165, 33, -43, -248, -208, -69, -186, 7, -113, -296, 16, -363, 147, -89, 90, 130, -28, -238, 76, 76, -82, 39, -247, 1, -28, 170, 27, 193, 110, 9, 190, -90, 340, -34, 142, -181, -17, 45, -111, -280, 40, 82, -220, 203, 69, 19, -76, 101, -150, -207, 290, 30, 70, 196, 35, 45, 199, 28, -16, 58, -79, -248, -72, -126, -31, -16, 127, 161, 8, 184, -71, 5, 16, -170, 25, 213, -90, 38, 414, -257, 247, 69, 70, -55, -92, -241, 38, -26, 63, 51, -225, 2, -433, -10, 32, -41, 105, 502, 39, -86, -64, 182, 168, 213, 133, -113, 38, 37, -197, 121, 49, 40, 170, 411, -219, 28, 32, 203, 58, 97, -82, -166, -111, 88, -191, -264, 98, 77, 257, 14, 25, 145, -80, 54, 179, -244, 254, -225, 228, -105, 11, -16, -117, -4, 99, 2, -195, -210, 66, -95, -115, -35, 92, -332, -360, -295, 86, 24, -1, 88, 138, -78, 332, -44, -261, -343, 89, 76, 97, 203, -51, 61, -299, 193, 293, 82, 100, 107, -107]
8031a07J59j45j02pK58o0j85J70J54k02J46m85R3J29L2J87o9O7Lk4J21l8p3r4
8055g2J56j32P5k07J07R4P2k74K46K39m27K57k60m1M75j81K95n29J25k67J10L26
8077A87k61o8J68k72J77J97l38L36l01L81J37l38L55k87l9j43n3R6M0N2l77K53
8099i8k40N79l88K90l65J98n4P8kK87k47J50J26m35K28j67J25l73O50l50R0l8
8121D4J20j14J08l1k17K8K23O5o6l10J60P0q5J79j77Lj62L89j05j96j40o0jL25
8145E0N1K6P6j70m1N6j20Q8k49J42j83K18J29L8N5j16q3o9k23K94LL6j75Q8Q9
8170A0jk81J79P4K41l80n6L07j66J77j39J43l2P5j51j58J52j27N1j34J96
$$ y = [-107, 52, -93, -195, -202, 56, -4, -189, -19, 135, -67, 79, -406, -313, -184, -152, 35, -34, 33, 36, 12, 133, 95, 22, -72, 84, -48, 27, -180, -73, 21, 93, -181, 65, 304, -123, 134, -126, -167, 308, 127, 422, -107, 18, -249, -139, 187, -74, -142, 26, -246, -69, 128, -210, 126, -175, 206, 343, 5, 360, 73, 34, -109, -162, -66, -26, 26, -351, -98, -338, 241, -147, 143, -222, -24, -78, 0, -2, 285, 38, 188, 314, -121, 107, -60, 65, -308, 342, -8, 82, 44, 164, 50, 158, 127, -90, -62, 161, 226, 160, -150, 10, 80, -5, 174, -3, 0, -162, 227, 122, -74, -214, -274, -275, 50, 101, 127, 203, 33, -8, 48, -72, 16, -233, -91, -274, -56, 73, 111, 166, 50, -33, -102, -325, -31, -28, 8, -167, -79, 10, 9, -272, -93, -19, 222, -158, -214, 93, -73, 104, -35, 108, 76, 151, 0, -158, -6, -133, -82, -216, -20]
8191b0
$$ Imaginary data points
##PAGE= N=2
##DATA TABLE= (X++(I..I)), XYDATA
0@%%%%%%%qJ6j6K0k8L4m2N3o2P3q8J04j25J49j72K00k32K66l06L51l99M51n08
30b69N73o45P23q10R05j009J123j246J383j535J701j882K083k307K555k832L145
47A656l503L911m383M939n604O417p432Q747j0531J3092j7110K4361m1463J50973
61A24070J15533l43655n0114K29552R8433k05466p0531J61091O6824j79497p0304
72a24064J59308R5119j47373j00516J11659R9872r7642q7743Q4947R0849p8585
83E831r1214N8439R2387m2174p7552L6995P3199l9974p3357M1501Q5702l7652
95C2131r6138K4806J03514r236j01350k495R7592J0875r3855j7274R2536K9017
107G0123q3206l6959O8021L1378n9845k2831N9797J0905p4108j8718Q2505L8412
$$ y = [0, 0, 0, 0, 0, 0, 0, 0, -8, 8, -8, 12, -16, 18, -24, 29, -33, 40, -48, 56, -69, 80, -92, 108, -124, 142, -164, 187, -212, 239, -269, 304, -341, 382, -428, 477, -532, 591, -655, 728, -807, 894, -988, 1095, -1212, 1343, -1489, 1656, -1847, 2064, -2319, 2620, -2984, 3433, -3999, 4748, -5783, 7309, -9801, 14560, -26903, 124070, 239603, -104052, -154166, 75386, 173819, -31647, -102178, 58913, 125737, -53760, -124064, 35244, 130363, -17010, -117526, -5867, 94005, -3637, -91380, -6433, 84416, 5831, -85383, -26944, 65443, 23269, -54283, -17288, 55911, 15937, -57420, -15919, 69783, 32131, -64007, -39201, 64313, 55077, -46273, -48768, 48824, 59699, -34156, -51430, 41106, 70123, -13083, -50042, 17979, 49357, -10488, -33319, 26478, 37383, -36725, -55443, 27062, 65474]
119F5474p5344n9654M3757O0424j1521l7366j962J1057l114J473J2440l7j2119
132f492n42L626o751P40J8880L735k5323j2521K1704J2204j8025o361K2268P319
146A4461k6664j5718K2177K3891n469j8674n995M174N551Q082N185j0255j7167
159a6421L87J8754O592j5087r701J3069J0865j6243j9719J7152L6331p137m9567
172c0725r194N5178L0268m9904m5160L8842N1332k7268n2370K0331N0973j7783
184A4520n5492J0549N7677k522n8427r049N1992J6179m4015j9556L6166J9211
196A7233l1617k0292K8671K4355k3485k6695J8433K9547j5466l2638J4973M1256
208B4275o083m6336k783M8501J4988m1321j6375M1091J6631m2762j6255N3039
$$ y = [65474, -9870, -69524, -25767, 34657, 23136, -14230, -16192, -5135, -8249, -6776, 5664, 5627, -6492, -7034, -3408, -10159, -9419, 9461, 13196, -12127, -24648, -2944, 9260, -8765, -15126, 7142, 14461, -12203, -27921, -5744, 18147, 12678, -5996, -11991, -7817, -2266, 5816, 11001, 746, -16421, -16034, 2720, 9312, -5775, -15476, -2407, 8458, -7785, -27504, -10352, 25979, 18842, -30725, -39919, 15259, 45527, -4377, -49537, -10695, 40637, 13369, -39001, -18670, 32303, 14520, -40972, -30423, 27254, 24732, -33695, -42744, 9248, 25427, -18588, -38144, -1978, 17233, -14384, -34676, -6005, 18350, -5135, -31830, -13397, 16150, 684, -31954, -16981, 24275, 18192, -28144, -30927, 17574, 32562, -8759, -25134, 15957, 32588, -10174, -26429, 26610]
220B6610K8080n7477m1907N2758N0625m3349n0319L8226M3363m5012m4890N0884
232G592N1971n6088o6687N0566P8884m2659q9333K9530R4469j5885r7108R87R4534
245D0773J3492q8952k5409P9945L4553p0798m2066O2217M8027n2495n0937M4037
257g613N2114l7447n1664L3273N2682k8770n3402K4892N3817k1084n3368J7369
269a9201N2162j6465n2458J5533N3323j6246n7777J3568O2930j0072o7835K14
281d2324O8065J1955o1146k1294M7929K3304l4079j6910K6506Q919k3923k302
293a5300K6323J270k7919j291K9318L452k5971m387K2624O772j6668l802J1542
306E963J117p422N240P513q239q785R447J0055r689j0552J1009J0020j4137j1158
$$ y = [26610, 54690, -2787, -44694, 8064, 58689, 15340, -34979, 3247, 46610, 1598, -43292, 7592, 59563, 3475, -63212, -12646, 66238, 23579, -65754, -36224, 58245, 42360, -54748, -53761, 40773, 54265, -34687, -60096, 19849, 54402, -16396, -58462, 3755, 51782, -713, -51650, -7613, 44501, 7054, -44610, -11337, 41345, 12575, -40827, -15935, 37882, 16798, -36570, -19201, 32961, 16496, -35962, -20429, 32894, 16648, -41129, -27561, 35369, 25297, -42538, -42324, 25741, 37696, -23450, -44744, 3185, 26489, -7590, -24500, 2006, 10925, -12998, -15300, 11023, 12293, -15626, -16917, 12401, 15853, -10118, -14505, 8119, 14891, -1777, -5579, 5963, 7080, -342, 4898, 12411, 4172, -4613, 4834, 14889, 5200, -5352, 5657, 15677, 1540, -9618]
320i618J5899J2845j9227j5844K1006J9255k3589k5052K3314L2714j9890l9136
332b7323J3186M3356n176m2963J68M0288L037l6867j424L5002k072l7163P126
345a0825M2962q668n2246N528O0538L057o7840j4421O7729K4674o6436l3381O0936
358A1607L7200n8284m2056N3169M4972m9378n0759M4387N3444l8332n7504L0971
370b0563N8410k2487n7811J5343N5975j0293n1697P599M9411n382m7026M334M7931
383B3744k280m8458j056N1067O246n2147j4310N2394K3529m8022l2080M1272L6680
396C6579l2051l8358K3024L6534j6257l2833J1823K9232j0158k7486J0015K7919
408A7983r414l0068P906L2298k944l3071k140L2143P746k8287j1947K5591J5081
$$ y = [-9618, 6281, 19126, -101, -15945, 5061, 24316, 727, -24325, -1011, 31703, 11813, -27323, -14137, 29219, 24043, -18920, -18752, 21536, 24573, -12294, -13718, 21284, 19212, -17951, -10825, 32137, 23469, -28777, -23249, 37289, 40346, -27494, -41915, 25814, 50488, -15948, -49329, 11607, 48807, -9477, -51533, 1636, 46608, -2770, -53529, -9142, 44302, 5970, -51534, -20563, 37847, 15360, -42451, -27108, 28867, 18574, -33123, -25524, 23887, 18505, -28521, -24187, 23744, 21464, -26994, -28050, 23017, 29263, -22884, -37194, 15200, 38729, -9293, -41373, -101, 36579, 4528, -33830, -10806, 25728, 9471, -23362, -11539, 17693, 7535, -19951, -9936, 17983, 8569, -21499, -13593, 18705, 15761, -17310, -19450, 12693, 20439, -7848, -19795, 5796, 20877]
421B0877k0973j8134J8800K1253j4913k3710J1250K5926o107k6653N91K6555N079
434A9841k4493j0995K0808J4955j5930j7411R550J7004o178j4896L445J0842m122
447B420q995N395P884q835r764R690J3501j0011j8821P216K2590j507k4519m132
461a7888K3100J0393j9247j2691J5031J3589r429j2174P384J1270m727r037L795
474f31Q060k510o306K660M563k311k662K376k83k989K451L431m695o321N364P521
490G718n255r497L457Q919l094p525K355N538m370m230P905L727j2800n517J8056
505E387R859k0935j5901K1465K2856j8373k8330J3944L1749q070l2428K617L1413
518A5253R71k9512k596K8314K051k9204k240L1087L697l3924o940L5840J0008
$$ y = [20877, -96, -18230, 570, 21823, 6910, -16800, -5550, 20376, 14269, -12384, -11793, 14762, 19841, -4652, -15647, 5161, 20116, 4186, -13225, -3675, 13329, 7151, -7745, -4300, 6542, 2420, -6575, -1180, 6704, -2131, -11895, -2205, 11296, 1285, -17536, -10320, 12270, 10763, -13756, -17888, 5212, 15605, -3642, -16333, -1302, 12287, 2858, -9316, -1932, 9338, 4611, -4426, -631, 7429, 4919, -1387, 1273, 5836, 3525, 863, 3239, 2956, -33, 2418, 5849, 1154, -5167, 197, 7718, 2463, -7034, -3577, 5342, 2248, -5277, -2922, 2616, -1754, -5984, 1921, 5648, -7152, -12669, 5387, 15246, -5689, -21590, -125, 22731, 4358, -23972, -10028, 21721, 13651, -18777, -16160, 15253, 16224, -13288, -15884, 12430, 14481, -14723, -16963, 14124, 17821, -16103, -23043, 12797, 22805]
531B2805l6697j3809L7080J7852l8065k2617L8183K7400l8147l1589L7925L5351
543C5672l7154m0087L5267M5612l1681n0611K5580N3405j8269n3333J1905N1278
555B7584p774m8194N304M5399m507m3568N139M2353n359m4014N381M6485j462
568B2767m9147m291M9856J1519m6797j8118M2232K3659l6559k5979L1173K7639
580B7954k5492k6875K2138K6355j8539k5979J6960K7145j3516k7369J0983K7651
592B1416p788k6212P170K5673o307k5045O610K4337n853k4045N626K4523n290
605A4815k6151K116K6910J310k5790o395K0046Q221j4752p971P927M144m967r86
619a523J889m317m85Q065J278j2533l869J3614P036j1234q481R069O919o262m034
$$ y = [22805, -13892, -27701, 9379, 27231, -10834, -33451, 4732, 32132, -6015, -37604, 321, 35672, -1482, -41569, -6302, 39310, 7629, -42982, -17402, 36003, 17734, -35599, -23694, 27584, 19810, -28384, -23080, 22319, 17812, -25756, -20617, 21736, 16377, -27637, -22256, 24229, 22767, -26380, -30671, 19185, 30704, -16093, -34211, 8021, 31680, -4879, -30858, 315, 27954, 2462, -24413, -2275, 24080, 5541, -20438, -3478, 23667, 10151, -17218, -6235, 21416, 13628, -12584, -5414, 20259, 13952, -11093, -4483, 19854, 14001, -10044, -4418, 20105, 14815, -11336, -9220, 17690, 19000, -6790, -13185, 6861, 15082, 330, -7641, 286, 4430, -537, -1523, 366, -3951, -4436, 3629, 4907, -7626, -11495, 2119, 9155, -2079, -10560, -1491, 5428, -834, -4868]
634d868P371J750p873J69J0276j8j1521M28J2660J79j2500r29J2217J836j2651
649c474k820J2305M483j4231p556J3938J0671j3191j5051R696J7685p178j9456
662a4179K368K0076J371j9193n408J6498P725j2739o830J2070M377j2475j626
675g965J5544J658j7648j980K0271M708k1590p275K2687J1977k0669j5135J6474
688A057J7036j0606j6111P511J3641n905j1843M258J1754k159j0430j882Q591
701D912L916o070n793L929O137k400q066J015R101j03r154j080Q950M45r871K69
717c863J2350K20j6193j328J9107M178k1864p909K2528J2528k1805j6796J8048
730g99J9454j3145j9835Q377J7362o087j5423M603J3349l530j2986K640J1630
$$ y = [-4868, 2503, 4253, -3620, -3451, 6825, 6807, -4714, -4286, 8374, 8553, -3947, -4876, 7341, 9177, -3474, -6294, 6011, 10494, -3737, -11293, 2645, 13316, 125, -14926, -5230, 12455, 5277, -14179, -11811, 8265, 9636, -9557, -14965, 1533, 9258, -3481, -10311, 1759, 6136, -6339, -7965, 7579, 9237, -8411, -10391, 9880, 14588, -7002, -14277, 8410, 20387, -282, -15417, 1057, 18093, 7487, -8624, -1113, 12528, 6623, -5220, -962, 10792, 8633, -1797, -3679, 4912, 8828, 2758, -3035, 894, 7031, 4631, -3435, -2420, 6681, 6578, -2576, -3656, 5294, 5739, -4132, -3863, 8487, 8707, -7486, -8814, 10293, 14471, -7393, -15302, 7226, 19754, -2051, -18847, -799, 18655, 5510, -14325, -5948, 11414, 5327, -10096, -5493, 7856, 4326, -8660, -6020, 5610]
743E610l454j2430L720J3775l457j6848L58J7968L612j7571p380J6563R358j5350
757e526j0938J6448J3731j6611j6218J5739J9201j3215k0176J1630K0816q878
769F003k0980O744J9918m618j7670L257J3921m502j1769P610J0813j0434j1810
782a3517J1413J2750j2048j4013J0902J4535q814j4761N095J4198l157r668J186
795e899O154j362k806M059M55n437J127Q400o50j0094k28J1236K732j0227k889
810e429Q633K378q281k258R570L462j1138o776J0575R045q494j0338O293R048
824F290o080r110P452R027p988j0788Q766J2513j0182j4050J1842J8103j3644
837B151k2938J3299K8507r797l1647N652L3408j097l3228j439L1790M084k8977
$$ y = [5610, 2156, -10274, -6554, 7221, 3764, -13084, -12726, 5242, 8854, -8717, -16097, 466, 9824, -5526, -16464, -16, 13715, -2896, -19114, -3375, 15826, 2611, -17565, -5935, 14881, 6003, -14977, -8233, 11685, 7067, -10603, -7346, 6575, 2073, -9696, -2086, 8727, -1707, -13517, -2104, 10646, -1402, -15415, -4513, 10022, 1208, -13553, -8458, 5740, 2583, -7085, -5899, 255, -1107, -3913, 146, 601, -4836, -3709, 4691, 4041, -6053, -6281, 4955, 7687, -2540, -5429, 3204, 5582, -2699, -4957, 4613, 8075, -3063, -9839, 736, 9781, 1287, -9051, -2758, 6290, 210, -8900, -1448, 7579, -409, -11197, -2431, 10082, -100, -14150, -2308, 15795, 2151, -20787, -7488, 21019, 11222, -20425, -14773, 18635, 17538, -15690, -17129, 14661, 18745, -10232]
850a0232m894K7311M738k6374l008K6968K189k8413l094K9383N373l0426o992
863a7471K9041Q870k7585j1517K6272J2081k4096j4216K2693J5853k1683j8334
875b0092J9550K1482j6041k3492J1707K3345p002k2249M142K1109k174j9843R12
888h646J9497J25j8245Q0J8051q75j9764J225K3253O26k6035m955K5483Q720k3602
903e062j1711J9912J2448j7776j3241J4343J2917j2730j2409R822R774q913p683
916a0309Q618O094q928n895Q442O225o801n450N439N218m191m209M434L903l165
931e75m185L113N272j438n578q47N471M409m408o521J561P845J179p684l775O335
947A74M799m483m761J382M241J81j623j877j113J695L738L21m336k294M590L808
$$ y = [-10232, -15126, 12185, 16923, -9451, -12459, 14509, 16698, -11715, -14809, 14574, 19947, -10479, -17471, 11570, 20440, -7145, -18662, 7610, 19691, -4405, -18621, 4072, 19925, -1758, -20092, -542, 20940, 4899, -18593, -6886, 16459, 9457, -12792, -8650, 12459, 10285, -9558, -8646, 10851, 10976, -7269, -7189, 10862, 9987, -9777, -8552, 14701, 15327, -10708, -15663, 9820, 18540, -5062, -16773, 3139, 15587, -2189, -15430, -1087, 11830, -900, -13309, -3487, 6287, -2626, -10309, -1691, 4403, -4525, -10420, -1978, 4247, -2554, -8004, -2565, 2653, -1538, -5747, -1313, 2590, -575, -4760, -1647, 3625, 2187, -3391, -4238, 1233, 5642, 1234, -5287, -3726, 4119, 5298, -2386, -6161, 174, 4973, 490, -4271, -2889, 1352, 1533, -90, -1967, -3080, -1385, 2353, 2674, -1662, -3956, 634, 4442]
963D442l003l761K425M254j291k899L23K592m04N43M33j449j680J565K993r04
979D179k715K71J851q78j495P80K652j061m362j113M528K810l927n110J601N951
995C962P71p320l435O526O249o285q358M426R216l432q861L404P337l821o469
1010f090N159O227o907p267R515R609j0875j2631J0959J6429j0120j8866P817
1023g041K0594n829k1268L721K1007j864k1161k32K0390O51j9729k190J9003L719
1037I771j9090n696J8587P031j7655q307J6693Q777j6461q486J6862J0061j7333
1050e246j1636J8023J5479j7818j8157J7405K1615j4787k3975J2334K5874q069
1062A1042k6145N141K5026k362k3633J791K1751j730k1086J754K1131k092k2045
$$ y = [4442, 1439, -2322, 103, 4357, 3066, 167, 490, 3082, 2678, 3221, 3654, 2205, 525, 2090, 5083, 4179, 1464, 1735, 3586, 2708, 1213, 1993, 4645, 3584, -778, -1891, 2637, 5447, 1520, -3590, -1989, 3962, 4733, -2587, -6022, 504, 6753, 468, -7890, -3464, 5752, 2320, -6541, -3137, 4200, 379, -6090, -931, 5296, -1611, -8878, 637, 10246, -629, -13260, -2301, 14128, 4008, -14858, -7041, 13553, 7724, -13544, -9823, 11184, 9320, -11841, -12073, 8317, 8968, -10761, -12951, 6052, 9771, -9319, -15015, 3572, 10603, -7052, -15359, 1334, 10111, -6350, -14836, 2026, 12087, -5246, -16882, 1141, 16620, -1198, -19355, -1950, 19665, 4878, -19097, -6763, 19111, 11042, -15103, -9962, 15064, 12702, -10931, -9140, 12611, 10881, -10205, -8451, 12680, 10588, -11457]
1075a1457J783K2651q36k4028j060K4675L141k4370n399K3020P122k0967q518
1088a4243J9467R673j8034r822J6016J1428j4685j1827J3076J1583j0507j1622
1100i497Q420J0816p034r221O201P116o503o499P154O768q037q539Q418R219p309
1115A473j1656O275J2229m180j2078J399J1060j72q054n94O034l76l646J498L300
1130B512l053k922N254L501o146m385O464O265o522p073O803O827n838o542M860
1145EP312n613p028M894P562m634q005L895P725l540p355L476O244m180o178M882
1161e38N935n912p575O833Q772o364j1144N050J3038l328j3604K28J3770K276
1175G437j2493m009J1009M738q704m855P987M018o554l505O815L329p424l327
$$ y = [-11457, -9674, 12977, 12141, -11887, -12947, 11728, 14869, -9501, -14900, 8120, 15242, -5725, -14243, 5224, 14897, -3137, -12959, 3057, 14485, -200, -12027, 1049, 12632, 2125, -9497, -1077, 9739, 2705, -6516, -315, 6801, 298, -6201, 953, 7721, -316, -8855, -437, 8782, 1473, -10183, -3908, 8321, 4141, -7937, -6538, 4522, 4350, -3704, -4298, 1736, 1360, -2286, -788, 2512, -541, -3463, 1791, 5292, -854, -5239, 1225, 7490, 968, -6105, 698, 7525, 1687, -4855, 5, 7317, 1704, -5324, -430, 7132, 2498, -5507, -1612, 6113, 2573, -4782, -1306, 4938, 758, -5420, -538, 5397, -515, -8090, -1257, 7515, 1151, -9993, -4943, 8095, 4767, -8837, -8609, 5161, 7437, -5056, -9065, 1944, 6682, -2022, -6877, 1110, 5128, -1426, -4931, 1884, 5213, -2211, -5538]
1189e538Q176M294q635n566P842P067p082q322N650Q366l868r453K189R306r99
1204C427r543q28R445K682r572m539R012O037p054p438N560Q128l023p855J746
1219c815P756o13o108J033N685q91o005K498O697k295p950J733J0103p80j1147
1234d099j536J1587M513j1437o737R539Q708p802r822N889J0228m423j0160L027
1248b525R741k136r090J253R250j374r408O97R976j05j0274o69J0787J036j0767
1263c608j470J0859J869j1724k197J1944K898j2487m486J2287O460j2345p793
1276i793J0070Q286q409q597O041P678n027o113M470M096m724l263N401K665o165
1291c384l448P515L720p541n176P150O107o051o679M741O719l773n386K852N150
$$ y = [-5538, 2638, 6932, -1703, -7269, 573, 7640, 558, -7764, -2114, 6252, 2384, -7069, -4880, 4426, 3427, -6116, -6944, 2501, 5183, -4389, -8928, 84, 6121, -933, -8371, -2811, 5317, 2294, -5561, -3815, 3941, 3328, -2780, -1747, 3938, 3047, -2958, -460, 6237, 3942, -4008, -2275, 7828, 7048, -4099, -5635, 5952, 10465, -972, -7709, 1830, 10538, 2736, -7086, -1197, 9031, 4608, -5552, -2525, 7216, 5080, -4010, -2757, 6493, 5119, -4289, -3592, 6384, 6279, -3995, -4664, 6123, 7159, -3608, -5078, 5781, 7650, -4074, -6271, 5673, 8571, -3916, -8402, 3885, 10345, -2000, -9793, 277, 8563, 154, -8443, -2402, 5276, 249, -5864, -1394, 2702, -2022, -5285, 116, 2781, -3384, -6832, 683, 4403, -3138, -8314, -1164, 4943, -1108, -7787, -3046, 3673, -100, -5486, -2634, 2516]
1306B516k655l950K926L617l204l224M005L306m319l571N179M048n867m274P228
1321A761M747q071o365R147Q057r091j0245Q438J1909p287j3235O054J3331m633
1335D517j3148M145J2783m350j2221N490J1979o383j2273P520J3958p449j5581
1348a1013O885J7380n221j8452L485J9389j673j8876n55J8522K025j7531l421
1361i056J6424M269j6166m808J4710N687j3975p471J3374P950j2975r136J2335
1374A162R687j1908j0741J0974J1599j0308j2784R999J4069r435j5739Q143J7645
1387A2363n742j8810L191J9019o63j7762j714J6989J943j5015k524J3187K900
1400G362j2528k194J1751J605j1538j862J1573K570j1830l467J1384M705j0442
$$ y = [2516, -139, -4089, -1163, 2454, -750, -3974, 31, 3337, -982, -4553, 626, 4674, -1193, -5467, 1761, 6508, -1563, -7928, 1219, 9276, 185, -10060, -1622, 10287, 3000, -10235, -4181, 9150, 4517, -8631, -4486, 8297, 3947, -8274, -2784, 9195, 2812, -9461, -1941, 12017, 4568, -11013, -4128, 13252, 8031, -10421, -6936, 12453, 10780, -8096, -8651, 9871, 11896, -5635, -9056, 7368, 11637, -4529, -9337, 5373, 11060, -2915, -10386, 2988, 10938, -2037, -11173, 1162, 10849, -1059, -11800, -826, 10773, 465, -12319, -2320, 11749, 2314, -13425, -5282, 12363, 6621, -12189, -8998, 10021, 9358, -8404, -10118, 6871, 8814, -6201, -8725, 4462, 7362, -5166, -7360, 4391, 5996, -5542, -7404, 4169, 6739, -5091, -8558, 2826, 7531, -2911]
1413b911o195R522O908p627p259N483P106l221o963J723O849l03o363p04N643
1428A688K483n184k915L974L190k879l605K735L553k063l100J572K832j875k361
1443a955K864K157l753l340M193M932l705n913K474N506r34n382k15M763Q48l505
1459i65k407K048K813p86j833r09J266J075j14j052m09J127K37q15N21P34k03
1476C28r27J275O49j555p01K129P18k233o42K601L64k603r48L249Q74l088r80
1493a490K504J089k080r46J389J55j341J975M25l381j404N434K888o655m562O982
1509I82O074o124o517N191P189m467p058L581P364l435o262L085N739l390n782
1524c830M239O316m564p655M210P860l298q401J923R164j275j0321K71J0475J455
$$ y = [-2911, -9106, 416, 7324, -303, -7562, -2079, 5027, 1806, -5157, -3434, 3415, 3112, -3251, -3955, 1688, 4171, -1013, -3928, 46, 3236, 357, -3248, -513, 3040, 977, -2123, -551, 2281, 406, -1955, 909, 3066, -687, -4027, 166, 5098, 1393, -4520, -2046, 3460, 2526, -2856, -3071, 1692, 2540, -965, -3372, -1324, 1489, 703, -1130, -2039, -773, 302, 188, -864, -1273, -146, 91, -724, -203, 531, 328, -599, 676, 1325, -230, -931, 1198, 1916, -317, -959, 1642, 2006, -597, -1545, 1704, 2578, -510, -1490, 1014, 2103, 23, -923, 466, 621, -720, 1255, 1680, -1701, -3105, 2329, 5217, -1438, -6000, 982, 7056, 932, -5585, -394, 6795, 2328, -4730, -1149, 6215, 2780, -3482, -397, 5342, 1952, -3830, 409, 6725, 2161, -5494, -1284, 6576, 3278, -5123, -3200, 5964, 4689, -5632, -5361, 5114, 6569]
1539F569j1237k879J1022L952j0782n854J0502P440j0268r092R590R808p889j0491
1553i609O785J0424o341j0745O992J0335p123j1222Q279J2320q773j3287Q026
1566c939J4767o550j6272M780J6787l147j5953J355J5611o16j4441q60J3398J495
1580F415j2138j045J0297J418r673j731R320K293q729k961Q292L491p393l917
1594f061O869M812o676m859O219N999n479o130M819O827l653p364K956P699j336
1609D642p464L32O335P67n031n05L909m46l249J674K424k454l043L207L116l191
1625A023m193L350M373l485m510K776M002k692l082K696K177k981j465L728K61
1640A978l883L47M613r5n518k48O424K58o704n09O867Q08p221j413O907K491o990
$$ y = [6569, -4668, -7547, 3475, 7427, -3355, -9209, 1293, 8733, -1535, -10627, -1037, 8771, 882, -9609, -2824, 7600, 1259, -9486, -2494, 7841, 718, -10504, -2225, 10095, 1322, -11965, -3939, 10828, 4278, -11994, -7214, 9573, 6426, -9527, -8172, 7439, 6823, -7618, -8478, 4920, 6415, -5723, -6768, 3529, 4947, -4726, -6457, 2863, 5156, -3573, -6534, 1758, 5249, -2144, -6061, 808, 5620, -1056, -5915, 304, 6303, 824, -5306, -487, 6340, 2687, -4677, -1721, 5978, 4642, -2822, -2490, 3845, 4612, -419, -924, 2985, 2539, -710, 964, 3388, 934, -2109, 1098, 4214, 1023, -3170, 180, 4553, 1068, -3442, -666, 3336, 644, -2438, 258, 2435, -546, -2011, 1717, 1978, -1905, -1558, 3055, 2960, -2558, -2806, 3618, 3876, -2828, -3337, 3530, 4338, -2883, -4296, 2611, 5102, -1888]
1657a888l452N876L884n252m025M200M030l751l783K740L215k325l369K576L409
1672B085l016l918L038N288l288n984K305P640j262q036k01Q517J484p553l286
1687f187P112M396o503m248N930M186m843m650M691M350m571l420L444L885l092
1702D80l622K983L343k621l788K273L698j880l872J716L618r43l495O4L603J164
1718B721l455k412K702M025j699m947N49N667O08n278k079N184L069m355k925
1733b625K836L610l156k832L289K431l601k363L716L084m537l446M438M101m338
1748F07m815L502N623l335n847K251N727j267o082o1O239R75o202j467N605K444
1764C897n338k290M295L392l891l080K941L535k520l094K775K603k964k678L824
$$ y = [-1888, -5340, 536, 4420, -832, -4857, -657, 3373, -378, -4161, -1421, 1794, -531, -3900, -1324, 2085, -931, -4849, -1811, 3477, 189, -5795, -3490, 4150, 2888, -5148, -5349, 3168, 4652, -2901, -6187, 925, 5321, -1182, -5430, 500, 4686, -157, -4807, -116, 4234, -337, -3757, -313, 3572, 480, -3142, -159, 3184, 563, -3225, -952, 2746, 866, -3006, -1290, 2328, 1385, -2110, -2046, 1557, 2721, -734, -3146, -444, 3581, 1882, -3065, -2516, 3151, 3759, -1519, -3598, 1586, 4655, 300, -2625, 211, 3821, 665, -2167, 1122, 3553, -48, -2411, 1305, 4389, -148, -3594, 844, 4945, 607, -4208, -706, 4917, 1582, -4265, -2014, 3713, 2446, -3636, -3697, 2542, 3517, -2685, -4152, 1453, 3897, -1441, -3731, 564, 3956, 65, -3015, -74, 3461, 941, -2153, 622, 3225, 261, -2417, 1407]
1779A407K660m350l425M414M346m537n056L531N247k856n286J569M869r56m136
1794b559R66K680q23k074J425J512k204j090K964J034l490o68L642R74l906r39
1810b556L649J632l640k110M210K027m161k334M137K246m109k151L921J788l718
1825a169j850M161J301m701j531N110K311o178l086O307M363o203n800N866P071
1840E972n442p969M517Q499l265q362K723P928k007q015K310P740j761q476K432
1855c176Q679j851r372J683J0241j071j0611M26J0452P84j0643j658J0917K416
1869G216j0649l319R989M565r411n585Q714O119q087o338O888O602n942o346N030
1884e54O302m715n956M720N725m280o167M693O542m155o866L208Q109l072p767
$$ y = [1407, 4067, -283, -3708, 706, 5052, 515, -4541, -1010, 4237, 1381, -3905, -2336, 2533, 1577, -2559, -1593, 1087, 264, -1810, -385, 1127, -1077, -2167, 797, 1831, -1659, -2327, 1315, 2289, -1617, -2556, 1093, 2725, -915, -3025, 1185, 3212, -949, -3283, 854, 3100, -1009, -3160, 761, 2549, -1169, -3019, 1142, 2443, -2258, -3789, 1321, 3632, -2546, -5632, 675, 5038, -1165, -6965, -1099, 5972, 530, -7439, -2922, 5577, 2312, -6050, -3327, 4601, 2594, -5421, -3111, 4629, 2868, -5608, -3176, 5503, 3652, -5720, -4037, 6204, 5133, -5478, -5052, 5400, 6184, -4459, -6117, 4800, 7216, -3433, -6752, 3237, 7802, -1609, -7194, 1520, 7639, -448, -6786, 102, 6704, 762, -5584, -554, 5748, 1033, -4923, -203, 5522, 1242, -4925, -232, 6310, 2155, -4711, -1503, 6606, 3534, -4233]
1899d233J637P646j62p524r86O607K030n706k091M383J938l773k227L020J871
1914B430k954j392K465J035k587j191K600J083k528j089J447J690j298j977J522
1929g44J947j471j749Q16J753k98j269l91R58J245l70j589m77J536J170j423j412
1946a768M78K158J20j941j474J923J726j669j935J242J747j006j111L89J203j147
1962a065m27J263N65j559p51K149P90j380j753J979K188j720k723J826K804r21
$$ y = [-4233, -2596, 5050, 4888, -2636, -3622, 2985, 5015, -691, -2782, 1601, 3539, -234, -2461, 559, 2430, -524, -1916, 549, 1584, -1003, -2194, 406, 1489, -1039, -2128, -681, 1009, -289, -2266, -744, 1203, -268, -2017, -1201, 552, 254, -1015, -1406, -448, 797, 427, -1162, -1639, -103, 1067, -356, -1768, -1290, 868, 988, -953, -2427, -504, 1222, -447, -2382, -1140, 607, -399, -1510, -1121, 82, -1065, -1492, -229, 336, -1223, -1974, 175, 965, -415, -2168, -189, 1999, 279, -2444, -618, 2186, 1265]
$$ [...]
8191B57
##END NTUPLES=NMR FID
##END=
