##TITLE=1H_Ser 4630-VH1
 CDCl3, 8 sc, 
 23.3.2020
##JCAMPDX= 6.0         $$ Bruker NMR JCAMP-DX V2.0
##DATA TYPE= NMR FID
##DATA CLASS= NTUPLES
##ORIGIN= UXNMR, Bruker Analytische Messtechnik GmbH
##OWNER= root
$$ XWIN-NMR		Version 3.5
$$ Mon Mar 23 15:34:12 2020 Russian Standard Time (UT+4h)  she@DPX200
##.OBSERVE FREQUENCY= 200.1315
##.OBSERVE NUCLEUS= ^1H
##.DELAY= (6, 6)
##.ACQUISITION MODE= SIMULTANEOUS
##.ACQUISITION SCHEME= undefined
##.AVERAGES= 8
##.DIGITISER RES= 18
##SPECTROMETER/DATA SYSTEM= spect
##.PULSE SEQUENCE= zg30
##.SOLVENT NAME= CDCl3
##.SHIFT REFERENCE= (INTERNAL, CDCl3, 0, 15.7039)
##AUDIT TRAIL= $$ (NUMBER, WHEN, WHO, WHERE, WHAT)
$$ ##TITLE= Audit trail, XWIN-NMR		Version 3.5
$$ ##JCAMPDX= 5.01
$$ ##ORIGIN= Bruker BioSpin GmbH
$$ ##OWNER= she
$$ F:/spectra/data/she/nmr/H-F/1/audita.txt
$$ ##AUDIT TRAIL=  $$ (NUMBER, WHEN, WHO, WHERE, WHAT)
(   1,<2020-03-23 15:33:19.65 +0400>,<she>,<DPX200>,
      <created by zg, POWCHK disabled, PULCHK disabled
       configuration hash MD5:
       00 E9 B6 7A A2 85 ED C7 34 08 36 98 17 FE 4E 26
       data hash MD5: 16K
       22 94 D9 6D 4C 2A B4 CF 84 33 E4 2E EF 70 2B 7E>)
$$ ##END=
$$ 
$$ hash MD5
$$ B1 40 51 8B 27 33 A7 5E 51 1C 64 86 AD E2 97 4D
##$RELAX= 
##$RELAX= 
##$RELAX= 
##$RELAX= 
##$RELAX= 
##$RELAX= 
$$ Bruker specific parameters
$$ --------------------------
##$DU= <F:/spectra>
##$EXPNO= 1
##$NAME= <H-F>
##$PROCNO= 1
##$TYPE= <nmr>
##$USER= <she>
##$AMP= (0..31)
100 100 100 100 100 100 100 100 100 100 100 100 100 100 100 100 100 100 
100 100 100 100 100 100 100 100 100 100 100 100 100 100 
##$AQSEQ= 0
##$AQ_mod= 1
##$AUNM= <au_zg>
##$AUTOPOS= <>
##$BF1= 200.13
##$BF2= 200.13
##$BF3= 200.13
##$BF4= 200.13
##$BF5= 200.13
##$BF6= 200.13
##$BF7= 200.13
##$BF8= 200.13
##$BYTORDA= 1
##$CFDGTYP= 0
##$CFRGTYP= 5
##$CHEMSTR= <none>
##$CNST= (0..31)
1 1 145 1 1 1 1 1 1 1 1 1 1 1 1 1 1 1 1 1 1 1 1 1 1 1 1 1 1 1 1 1 
##$CPDPRG= <>
##$CPDPRG1= <>
##$CPDPRG2= <>
##$CPDPRG3= <>
##$CPDPRG4= <mlev>
##$CPDPRG5= <mlev>
##$CPDPRG6= <mlev>
##$CPDPRG7= <mlev>
##$CPDPRG8= <mlev>
##$CPDPRGB= <>
##$CPDPRGT= <>
##$D= (0..31)
0 1.2 0 0 0 0 0 0 0 0.06 0 0.03 0 0 0 0 0.0002 0 0 0 0 0 0 0 0 0 0 0 0 
0 0 0 
##$DATE= 1584963199
##$DBL= (0..7)
120 120 120 120 120 120 120 120 
##$DBP= (0..7)
150 150 150 150 150 150 150 150 
##$DBP07= 0
##$DBPNAM0= <>
##$DBPNAM1= <>
##$DBPNAM2= <>
##$DBPNAM3= <>
##$DBPNAM4= <>
##$DBPNAM5= <>
##$DBPNAM6= <>
##$DBPNAM7= <>
##$DBPOAL= (0..7)
0.5 0.5 0.5 0.5 0.5 0.5 0.5 0.5 
##$DBPOFFS= (0..7)
0 0 0 0 0 0 0 0 
##$DE= 6
##$DECBNUC= <off>
##$DECIM= 24
##$DECNUC= <off>
##$DECSTAT= 4
##$DIGMOD= 1
##$DIGTYP= 9
##$DL= (0..7)
0 120 120 120 120 120 120 120 
##$DP= (0..7)
150 150 150 150 150 150 150 150 
##$DP07= 0
##$DPNAME0= <>
##$DPNAME1= <>
##$DPNAME2= <>
##$DPNAME3= <>
##$DPNAME4= <>
##$DPNAME5= <>
##$DPNAME6= <>
##$DPNAME7= <>
##$DPOAL= (0..7)
0.5 0.5 0.5 0.5 0.5 0.5 0.5 0.5 
##$DPOFFS= (0..7)
0 0 0 0 0 0 0 0 
##$DQDMODE= 0
##$DR= 18
##$DS= 0
##$DSLIST= <SSSSSSSSSSSSSSS>
$$ [...]
##$SUBNAM2= <"">
##$SUBNAM3= <"">
##$SUBNAM4= <"">
##$SUBNAM5= <"">
##$SUBNAM6= <"">
##$SUBNAM7= <"">
##$SUBNAM8= <"">
##$SUBNAM9= <"">
##$SW= 24.9337058887773
##$SWIBOX= (0..15)
0 0 2 0 0 0 0 0 0 0 0 0 0 0 0 0 
##$SW_h= 4990.01996007984
##$TD= 16384
##$TD0= 1
##$TE= 0
##$TE2= 300
##$TE3= 300
##$TEG= 300
##$TL= (0..7)
0 120 120 120 120 120 120 120 
##$TP= (0..7)
150 150 150 150 150 150 150 150 
##$TP07= 0
##$TPNAME0= <>
##$TPNAME1= <>
##$TPNAME2= <>
##$TPNAME3= <>
##$TPNAME4= <>
##$TPNAME5= <>
##$TPNAME6= <>
##$TPNAME7= <>
##$TPOAL= (0..7)
0.5 0.5 0.5 0.5 0.5 0.5 0.5 0.5 
##$TPOFFS= (0..7)
0 0 0 0 0 0 0 0 
##$TUNHIN= 0
##$TUNHOUT= 0
##$TUNXOUT= 0
##$USERA1= <user>
##$USERA2= <user>
##$USERA3= <user>
##$USERA4= <user>
##$USERA5= <user>
##$V9= 5
##$VALIST= <valist>
##$VCLIST= <CCCCCCCCCCCCCCC>
##$VD= 0
##$VDLIST= <DDDDDDDDDDDDDDD>
##$VPLIST= <PPPPPPPPPPPPPPP>
##$VTLIST= <TTTTTTTTTTTTTTT>
##$WBST= 1024
##$WBSW= 4
##$XGAIN= (0..3)
0 0 0 0 
##$XL= 0
##$YL= 0
##$YMAX_a= 87498
##$YMIN_a= -32082
##$ZGOPTNS= <>
##$ZL1= 120
##$ZL2= 120
##$ZL3= 120
##$ZL4= 120
##$ABSF1= 10
##$ABSF2= 0
##$ABSG= 5
##$ABSL= 3
##$ALPHA= 0
##$AQORDER= 0
##$ASSFAC= 0
##$ASSFACI= 0
##$ASSFACX= 0
##$ASSWID= 0
##$AUNMP= <proc_1d>
##$AZFE= 0.1
##$AZFW= 0.1
##$BCFW= 1
##$BC_mod= 2
##$BYTORDP= 1
##$COROFFS= 0
##$CY= 11.3945322036743
##$DATMOD= 1
##$DC= 2
##$DFILT= <>
##$DTYPP= 0
##$F1P= 16.9975609425685
##$F2P= -3.02152046262296
##$FCOR= 0.5
##$FTSIZE= 0
##$FT_mod= 4
##$GAMMA= 1
##$GB= 0.15
##$INTBC= 1
##$INTSCL= 1
##$ISEN= 128
##$LB= 0.24
##$LEV0= 0
##$LPBIN= 0
##$MAXI= 10000
##$MC2= 0
##$MEAN= 0
##$ME_mod= 0
##$MI= 1.114404
##$NCOEF= 0
##$NC_proc= 0
##$NLEV= 6
##$NOISF1= 3.799351
##$NOISF2= 2.8
##$NSP= 1
##$NTH_PI= 0
##$NZP= 0
##$OFFSET= 15.70392
##$PC= 1
##$PHC0= -9799.216
##$PHC1= 27.00082
##$PH_mod= 1
##$PKNL= yes
##$PPARMOD= 0
##$PSCAL= 0
##$PSIGN= 0
##$REVERSE= no
##$SF= 200.130013532006
##$SI= 16384
##$SIGF1= 3
##$SIGF2= 2
##$SINO= 400
##$SIOLD= 16384
##$SREGLST= <1H.CDCl3>
##$SSB= 0
##$STSI= 0
##$STSR= 0
##$SW_p= 3612.71676300578
##$SYMM= 0
##$S_DEV= 0
##$TDeff= 0
##$TDoff= 0
##$TI= <>
##$TILT= no
##$TM1= 0
##$TM2= 0
##$TOPLEV= 0
##$USERP1= <user>
##$USERP2= <user>
##$USERP3= <user>
##$USERP4= <user>
##$USERP5= <user>
##$WDW= 1
##$XDIM= 8192
##$YMAX_p= 0
##$YMIN_p= 0
$$ End of Bruker specific parameters
$$ ---------------------------------
##NTUPLES= NMR FID
##VAR_NAME=  TIME,          FID/REAL,        FID/IMAG
##SYMBOL=    X,             R,               I
##VAR_TYPE=  INDEPENDENT,   DEPENDENT,       DEPENDENT
##VAR_FORM=  AFFN,          ASDF,            ASDF
##VAR_DIM=   8192,          8192,            8192
##UNITS=     SECONDS,       ARBITRARY UNITS, ARBITRARY UNITS
##FACTOR=    0.0002004,     1,               1
##FIRST=     0,             0,               0
##LAST=      1.6414764,     0,               0
##MIN=       0,             -32082,          0
##MAX=       1.6414764,     87498,           0
$$ Real data points
##PAGE= N=1
##DATA TABLE= (X++(R..R)), XYDATA
0 0 0 0 0 0 0 0 0 0 0 0 0 0 -8 8 -8 8 -8 9 -16 16 -16 24 -24 31 -32 40 -46 52 -57 65 -75 84 -94 104 -118
35 -118 131 -146 163 -179 199 -219 243 -270 298 -330 366 -407 453 -506 568 -639 723 -827 957
54 957 -1126 1352 -1676 2179 -3085 5216 -24010 16480 52343 -2752 -32082 -18595 2801 -7104
68 -7104 -5049 13867 20498 -3810 -17261 -3961 16287 13936 4905 3830 4810 -1381 -3559 2900
82 2900 9768 7531 741 -6546 -7650 -2511 4689 3241 -2720 -4695 -1310 -850 -5886 -7769 864 11195
98 11195 7846 -5952 -8312 3825 10472 4708 1209 7910 11930 4593 -2027 3618 12548 13078 8950
113 8950 7740 3931 -3929 -3378 10281 17472 6924 -6072 -7673 -3966 -1276 5585 10855 347
127 347 -16985 -16705 456 9382 2020 -4688 -2557 -4178 -11322 -6258 11413 16402 -1656 -14430
141 -14430 -4582 10303 11329 4316 3127 4216 860 -2204 3186 11220 10353 884 -6234 -1487 4784
156 4784 3598 -1914 -4266 -2369 -397 -2052 -7327 -9361 -4049 1015 -2430 -10790 -11884 -5048 -439
171 -439 -4150 -8033 -3953 651 -3008 -8019 -3925 3455 2940 -1604 701 3900 -715 -4397 3371 12059
187 12059 8187 -3277 -6306 95 4703 4623 4407 4408 -651 -7507 -6885 1117 6063 4249 -1194 -8395
203 -8395 -12354 -5589 6684 10023 -303 -10370 -8723 -882 3933 4593 4667 3654 -1011 -3638 1947
218 1947 9668 9428 3587 2352 5313 5075 2753 4499 9778 9236 3258 -940 1757 5490 4150 1392
234 1392 1828 2889 1122 -1369 -2025 -1349 136 2610 1721 -3508 -6806 -2435 3298 2742 -775 -446 2091
251 2091 164 -3462 -682 6682 8643 2891 -923 1209 3419 3539 5734 8681 5389 -2097 -3625
266 -3625 2497 8059 6773 1910 -1960 -4025 -3626 -92 4281 2506 -3998 -8572 -6185 -2339 -667
281 -667 -910 -1867 -5648 -9098 -6227 -575 856 -2139 -4309 -3525 -2252 -2673 -1336 1878 1986 -2120 -3634
298 -3634 32 2762 584 -1039 1093 2392 -817 -3597 -1377 678 792 -1040 -1889 -1890 -3468 -3851 -2479
315 -2479 -936 -1853 -3591 -3549 -3901 -4832 -3084 406 741 -2938 -4772 -3293 -1732 -707 2170 4393 2282
332 2282 -3185 -4888 1586 8213 6561 1459 -716 397 12 1671 5703 6880 2893 -2325 -3459
347 -3459 -166 2949 4727 3794 643 -3543 -4515 -275 4436 3570 -669 -2447 -1899 -1356 -317 3050
363 3050 4730 1681 -1320 -454 1821 2900 2869 3816 4654 2821 594 1553 3934 4455 3200 3771 4311
380 4311 1094 -2098 10 4181 4719 2197 -539 -1615 -1944 -1873 92 2806 1800 -2317 -4746 -3466
396 -3466 -498 872 1340 735 -2476 -4771 -2858 1168 2698 2208 1019 -1224 -3130 -2315 1945 5221
412 5221 3442 -1422 -4090 -1822 1253 1958 1798 594 -2361 -5221 -3299 229 920 -1209 -3483 -3849
428 -3849 -4007 -3428 -2172 -1805 -2699 -4402 -4252 -3015 -2549 -2781 -1434 -110 -1180 -3671 -2760 -7 35 -149
446 -149 176 1198 763 -492 -402 1622 2121 1380 685 483 104 -1097 273 3102 2314 -1323 -3192 -1865
464 -1865 -310 -244 180 803 -1177 -3669 -3883 -324 2640 1463 -986 -2451 -2242 -1197 1468 4419 3678
481 3678 -330 -1737 329 2351 3480 4370 3945 1489 -733 -207 3640 6128 3839 608 111 253
497 253 260 989 3450 3657 400 -2114 -1507 133 1081 1028 924 -207 -1507 -1532 26 1231 1051 574 1042
516 1042 574 -991 -1398 1238 3503 2587 1137 503 352 -144 496 2878 3571 1521 -1074 -1928 -510
533 -510 1130 1450 1589 194 -3185 -4799 -2542 492 580 -1142 -2514 -4082 -5154 -3617 -339 1138
549 1138 -1813 -4821 -5188 -2626 -825 -110 253 -637 -2447 -3861 -2106 1219 1570 283 -310 -1173 -2329
566 -2329 -1360 1272 2180 177 -2018 -2062 -559 -202 -579 -449 -15 -1102 -2756 -2438 -785 -852 -1311 -1479
584 -1479 -789 -1418 -2445 -2010 -531 -65 -664 -1527 -1075 -1369 -1422 286 1870 1545 -698 -1603 -452 870
602 870 1084 1860 2037 546 -1442 -401 2286 3158 1796 -169 -681 -470 276 1743 2680 2304 -479 -1454
620 -1454 -281 1025 1312 2184 1827 -171 -2119 -649 2571 3801 2214 -85 -358 313 1229 1785 3091
637 3091 2695 184 -167 913 1618 2085 1756 1944 418 -533 -524 821 1642 894 339 257 -509 -2092 -1478
656 -1478 389 1376 28 -1609 -1689 -1355 -1257 -684 890 742 -1009 -2224 -1703 -489 427 993 792 -488
674 -488 -2216 -2616 -338 1857 1717 -181 -897 -1570 -1827 -564 1690 1886 -478 -2935 -2813 -817 450
691 450 354 209 -647 -3074 -3055 -1553 399 182 -1074 -1659 -1990 -2155 -1760 91 23 -710 -1457 -1742 -1186 -754
711 -754 -25 923 816 -616 -1801 -887 738 1018 139 257 -205 -300 -311 271 449 408 575 658 -123 -1201
731 -1201 -695 1011 2144 1118 -944 -1058 192 731 442 1737 1545 -105 -1001 269 1875 2556 1534
748 1534 640 139 -275 841 1997 3052 1610 -530 -373 908 1443 1544 1544 1327 13 -1032 276 1989
766 1989 2077 731 -393 -672 -435 144 1002 1800 727 -986 -1459 -272 691 845 676 249 -578 -1131 -203
785 -203 820 1309 440 -81 -31 -19 -625 4 1129 1413 307 -899 -346 -211 -208 207 786 372 -1132 -1690
805 -1690 -1163 81 -125 -54 -249 -1431 -2437 -2095 53 1037 -66 -1312 -1870 -2091 -2036 -595 1027 371
823 371 -1349 -2691 -2164 -404 837 1105 75 -868 -2109 -1456 34 1014 534 65 -739 -1528 -1426 -46
841 -46 1800 1289 -550 -1529 -1365 -104 309 615 416 43 -603 -1124 -465 408 595 318 367 115 -789 -540
861 -540 753 1253 1035 43 220 333 151 521 1399 2200 1047 409 160 890 962 1689 1735 1167 76 -572
881 -572 899 1522 1799 1300 725 -441 -240 347 1466 1571 807 -137 -483 173 767 878 1384 939 -433
900 -433 -971 187 1534 1678 845 -80 -214 262 743 1190 1571 715 73 -262 239 550 714 815 578 -433
920 -433 -979 19 830 783 20 -561 -279 -887 -955 -109 438 -303 -962 -1378 -689 -719 -485 -284 -71 -860 -1209
941 -1209 -1122 -727 -179 9 436 -173 -1240 -1346 -814 375 373 24 -832 -1232 -1061 -853 209 814 54 -1395
961 -1395 -1929 -1262 -625 110 468 -288 -1451 -2041 -1157 -121 445 150 -559 -971 -1195 -1018 258 1094 581
980 581 -557 -914 -906 -16 559 1166 901 55 -763 -661 357 978 942 382 -229 -41 -422 481 1044 934 300
1001 300 156 153 -370 -323 437 1147 1145 -91 -712 -305 512 959 1121 1158 457 -202 -342 516 1492 1206 873 725
1023 725 -170 164 673 1814 1811 575 188 -29 116 658 1342 1225 713 -315 -739 518 1098 855 340
1042 340 43 -258 -647 -15 669 854 -75 -459 -407 5 166 277 255 158 -662 -972 -257 477 481 -113 -264 -291
1064 -291 -739 -397 -192 301 -67 -636 -586 -673 -705 -265 -36 -521 -802 -1221 -808 -768 -530 -452 -299 -528 -807 -1309
1086 -1309 -907 -6 -268 -596 -820 -874 -1040 -651 165 744 9 -1097 -1427 -926 50 592 253 -87 -582 -844
1106 -844 -134 223 411 49 -669 -586 -828 -338 625 1159 159 -762 -722 -482 -248 321 600 31 -137 -606
1126 -606 -258 -7 638 643 255 -355 -569 -333 587 1040 679 471 193 365 529 496 536 1322 959 203 187 227
1148 227 707 868 883 575 54 -417 -66 628 850 618 456 -127 -757 -504 306 771 659 -44 -383 -204
1168 -204 -63 320 734 1030 68 -520 -633 172 784 578 418 -193 -60 -360 21 464 332 59 -434 -443 -153
1189 -153 -102 263 -15 -145 -872 -1059 -564 -83 -190 -239 -588 -661 -548 -655 -26 279 -622 -985 -578 -557 -481 -422
1211 -422 -183 -537 -444 -735 -284 -294 -532 -280 54 -163 -669 -652 153 -9 -308 -473 -393 -720 -622 -278 -359 -338
1233 -338 -521 -538 -885 -491 -256 206 168 -451 -835 -598 44 469 319 69 -331 -571 -127 -95 672 845 522
1254 522 -430 -471 208 555 805 647 504 -129 -255 341 554 702 335 -29 -114 -253 121 758 810 384 300
1275 300 17 -90 256 10 1044 924 321 -304 158 409 642 768 732 367 23 22 401 865 677 511 294
1296 294 213 -2 -69 807 1069 530 -78 83 126 -46 338 561 92 -257 -602 -472 393 527 458 51 -324
1317 -324 -476 -507 69 570 194 -257 -544 -236 92 -130 518 119 345 -680 -579 123 423 217 -14 -215
1337 -215 -760 -574 -456 91 -114 -361 -622 -527 -665 27 75 -40 -132 -690 -588 -532 -539 -429 -508 236 -155 -618
1359 -618 -590 -78 504 73 39 -366 -333 -297 74 186 364 121 -196 -277 119 251 -81 204 415 -288 -475 232
1381 232 376 158 191 115 -262 -317 -154 425 312 140 -244 -212 -140 320 316 209 252 -175 73 475 702 368 346
1404 346 468 208 -213 311 559 896 361 -90 123 310 149 378 620 313 -108 -56 -17 180 444 445 523 -86
1426 -86 -257 -93 145 633 210 53 -145 216 -166 78 347 792 182 148 -42 15 114 335 716 308 -287
1447 -287 -131 -243 150 817 162 19 -547 -424 -484 -117 81 241 -604 -497 -216 -301 -167 346 -77 -763 -751
1468 -751 -710 -367 -119 -363 -220 -47 -334 -449 -162 48 79 -429 -459 -256 -191 -26 76 109 152 -425 -30 45
1490 45 -46 213 -136 -29 -178 -310 -320 -249 28 -369 -119 -209 -477 -306 49 0 -103 -47 -17 -75 -300 180 164
1513 164 497 58 -281 373 8 455 291 252 -47 -107 103 344 1008 441 -123 -259 -163 36 461 612 427
1534 427 -191 -106 -99 274 653 379 220 140 -45 -24 192 498 510 532 223 270 329 234 324 677 276 -96 9 440
1558 440 556 506 651 537 22 -111 64 288 569 399 289 88 136 -70 -78 252 426 -105 -360 -381 -248 -5
1580 -5 310 15 176 -509 -573 -224 190 35 -4 -17 -450 -478 -187 285 358 -22 -199 -437 -286 -39 126 466
1602 466 137 -319 -513 -254 -90 -22 141 -182 -269 -641 -575 -279 -120 -97 -437 -664 -251 -288 -137 -156 -8 -538
1624 -538 -295 -383 -273 83 114 -341 -186 -71 -321 -40 -44 141 20 -10 -30 -362 -7 97 615 57 -142 22
1646 22 -196 -78 -98 280 79 -28 -126 98 204 22 195 -159 -97 -194 111 167 466 328 12 31 127 282 231
1669 231 350 656 292 45 376 629 738 278 94 272 27 -63 693 400 339 140 96 -134 -12 -64 86
1690 86 408 -301 -49 -520 -32 71 79 386 170 -188 -58 331 415 255 -6 264 131 376 46 180 432
1711 432 149 -167 24 21 -99 -28 223 -144 -158 -257 -445 -314 -211 437 -49 -273 -444 -495 -239 -163 -143 -584 -662
1734 -662 -386 -571 -291 -95 -62 -15 -523 -393 -582 160 199 283 -247 -515 -522 -221 175 54 103 -437 -328 -510
1756 -510 -411 63 207 -30 -384 -575 -397 41 -144 257 -81 -58 -534 -379 66 72 11 -120 94 -527 -134 -127
1778 -127 -93 383 351 -38 -129 -126 20 236 440 202 245 -204 147 266 208 448 390 184 167 167 355 226 80 164
1802 164 38 281 117 22 453 185 18 -186 91 259 152 -87 35 341 34 -75 339 765 176 220 -20
1823 -20 52 148 109 331 319 21 109 75 313 189 263 206 -26 191 -269 169 85 71 -191 91 -63 -249 -91 -243
1847 -243 127 56 -527 -277 -47 -61 -3 45 -219 -113 -533 -202 265 132 123 -148 -131 -145 -310 -178 95 -191 -353
1870 -353 -176 -391 -401 -250 130 184 -168 -560 -512 -124 -33 82 -299 -325 -544 -420 30 -202 -49 -269 -349 -279
1892 -279 -400 -2 194 285 -26 -409 -144 218 32 207 127 -23 -284 -333 -246 -201 18 -269 -166 -187 -266 -67
1914 -67 183 201 346 343 -118 -178 248 95 83 287 364 -57 -132 120 199 314 335 100 61 60 -16 670 571 167 -9
1939 -9 8 106 202 221 531 261 -4 51 139 274 113 47 94 247 -259 -214 -33 419 -57 80 -80 -74 100 188 356
1964 356 197 -365 -10 -323 311 -143 -48 90 -66 8 -48 236 -229 109 121 -128 -156 -2 -286 -1 80 -356
1986 -356 -390 -172 -405 39 -22 132 -210 -363 -379 -429 -52 -100 -150 -446 -140 -229 -474 -130 248 -88 -465 -381 -13
2009 -13 -208 88 101 101 -98 -148 59 -100 -287 31 -217 -336 -576 -73 45 339 -460 -440 -61 -272 51 260
2031 260 335 76 -97 -269 5 290 -63 -94 75 93 25 -208 204 66 306 322 75 226 155 168 11 415
2053 415 346 86 44 52 286 139 92 369 197 -107 -2 -52 265 273 326 -113 -211 -118 76 443 258 134 144 28
2077 28 70 52 185 404 -89 190 74 134 134 134 212 -61 68 -30 20 335 341 -34 10 -60 104 74 -36 107 -191
2102 -191 -328 -388 147 -198 -154 -264 191 -211 -259 -140 115 -55 183 -313 103 -165 -111 -148 -96 40 -53 -141 -369
2125 -369 -15 -299 -40 -112 -156 -179 80 -231 -156 -212 -131 -98 -97 -182 -239 -11 -333 -80 -309 -379 -501 -165 18 130
2149 130 -3 -236 -214 -221 100 0 -115 -253 -333 -257 -12 329 -191 109 -68 -45 119 47 -39 217 -243 -28 -29
2172 -29 -54 307 283 211 181 -164 -487 132 146 358 179 82 -36 110 -10 -137 398 146 -27 148 182 461 307
2195 307 152 30 58 -28 -82 41 470 370 -87 303 41 -131 38 209 170 275 -48 -48 -135 225 160 222 261
2218 261 99 63 -151 105 -142 279 44 -212 -14 -264 40 5 87 -115 -359 -94 -299 -49 -124 -13 5 -228
2240 -228 133 -143 -250 236 -96 87 -250 -295 -77 -9 -216 -232 -49 -270 -302 -231 -246 14 -377 -337 -568 -406
2262 -406 -237 55 -282 -118 -183 -297 216 -156 -73 195 -337 -303 -269 170 309 -33 206 -215 35 -112 -116 -228
2284 -228 -121 75 122 43 -128 195 149 55 33 -197 -151 41 87 342 -125 16 81 -104 -162 154 -109 49 -187
2307 -187 -63 12 -74 -137 -13 206 -61 -30 -59 375 417 419 114 29 44 50 284 22 254 62 -271 184 3 -117
2331 -117 455 51 -14 -201 -176 132 386 113 46 59 -246 137 -16 -149 93 238 256 -194 167 -38 16 337
2353 337 466 2 -404 -64 -57 31 60 122 296 -76 -210 -125 196 -280 -120 119 -20 -91 -119 154 336 145 -1
2376 -1 -345 -287 -57 -62 57 72 -129 -80 -15 -117 -286 -150 -89 -174 83 -408 142 214 -265 -275 144 -231 -122 29
2400 29 -180 92 -236 -191 143 -61 43 -64 -161 -242 112 -244 -257 -83 113 156 -193 -104 -130 92 259 99 66
2423 66 -12 -138 -259 -169 97 86 78 276 32 22 -47 130 58 315 54 -51 336 -25 22 207 -92 -103 117 156
2447 156 104 -25 171 123 -62 -127 32 265 77 295 -209 162 117 18 349 281 56 -183 183 95 281 23
2469 23 415 77 41 -222 100 316 147 -55 196 55 -66 172 178 187 -87 102 71 -171 -255 -25 66 68 -284 -278
2493 -278 -133 -144 -10 44 53 -200 -223 -283 394 126 -17 16 -27 -29 -348 -62 262 278 -27 -305 -131 -237 16 -86
2517 -86 -143 -30 -317 -294 -88 -328 -97 -169 -421 -247 -526 -163 127 78 30 -272 -80 -57 -123 -262 -27 -135 -45
2540 -45 9 -83 171 20 -170 -121 133 93 -372 102 141 188 -175 56 175 -267 -74 65 178 -270 45 -199
2562 -199 -137 161 -262 73 222 -265 63 179 144 235 92 66 40 -87 41 -81 175 166 -24 45 -69 384 219
2585 219 20 -70 215 -57 47 232 191 -97 318 -39 144 -147 29 62 -84 -233 -340 -10 29 -40 -32 -72 19
2608 19 74 -251 42 25 72 -220 -25 -197 -229 123 188 -137 45 -219 -51 3 213 150 23 88 -123 -126 12 194
2632 194 -121 -283 -85 -240 -12 90 -89 -117 71 -404 -340 -226 -88 -32 78 -23 -466 -432 -443 233 -114 -1
2654 -1 80 149 -231 -151 308 -166 269 -10 -188 -253 -166 -292 -114 154 -263 -206 -309 107 -259 -140 35 -27 2
2677 2 -171 -101 139 54 127 118 -121 -286 261 58 196 85 -95 172 -1 172 -151 46 117 -9 -304 -78 -100
2700 -100 370 346 214 110 171 -299 -9 9 -16 -18 -103 -236 79 150 348 272 354 48 79 302 3 118 -176 9
2724 9 -102 176 9 106 291 118 150 -9 17 146 209 110 66 179 -161 40 93 -100 35 373 242 -118 318
2747 318 -34 117 -226 -157 55 -24 -237 -106 306 -93 -1 -39 -222 -64 96 73 81 -118 -75 -161 -69 156 81 -73
2771 -73 -331 -79 -209 231 78 52 -149 -305 -287 9 -109 97 162 -185 -286 -165 -52 -18 -293 -58 -135 -348
2793 -348 -138 5 -63 -281 -75 -499 49 134 -310 242 -57 -107 -126 -201 -19 114 121 120 -56 55 55 48 116 141 27
2818 27 232 -166 41 85 -22 332 61 -141 -100 -92 221 220 99 195 110 -41 188 18 -298 370 -51 90 127
2841 127 109 126 52 143 0 190 244 8 157 -47 70 229 -2 237 -83 36 -113 266 27 -54 -78 -397
2863 -397 186 170 -23 171 -250 -154 -156 -68 232 -295 -180 -197 -170 -74 115 104 254 369 -48 -326 93 -149 311
2886 311 61 -224 -106 42 -60 -133 -1 115 -143 -328 -58 -412 33 -349 -70 -41 -323 -249 -413 -108 -238
2907 -238 -196 68 -360 40 161 -67 -104 -246 -76 -210 -75 -401 240 -404 -41 -261 -332 -82 182 -134 -167
2928 -167 -170 -214 -109 -96 -274 -135 -56 -104 -61 107 -285 -60 97 -317 -88 -32 -23 131 -124 29 -26 135 -130 175
2952 175 129 245 -215 -172 98 -261 209 38 259 259 -148 27 35 255 54 156 245 279 -91 -175 145 -28 136
2975 136 121 191 -205 -74 54 136 168 278 -16 20 13 174 191 94 160 343 -340 229 66 -147 233 48 104 -62
2999 -62 48 141 303 47 -6 29 -108 124 4 213 42 22 -229 -84 4 -128 -155 7 -207 0 -180 13
3021 13 -92 227 102 -368 -33 -229 -95 248 56 -180 -332 -324 -224 93 -72 -24 345 -139 109 26 -153 -66
3043 -66 -26 -20 -71 -157 -8 -207 -278 -53 -369 -97 42 -27 -179 -295 140 -12 14 -98 -23 -111 258 161 -283 -41
3067 -41 -54 97 79 34 -281 -152 -127 -72 183 58 253 -60 357 -165 125 130 126 -11 71 -54 -118 137 194 34
3091 34 178 -61 -53 92 -136 119 278 216 138 136 -66 115 92 218 -261 189 -149 -136 37 104 135 174 197 90
3115 90 -43 167 -74 152 -141 -112 -52 -90 -194 71 -82 -51 -211 -36 -81 -128 163 -21 -3 -255 117 30 -33
3138 -33 470 187 151 -15 -232 -101 194 275 -5 -111 -100 -25 -170 -199 122 66 83 -434 -235 -42 72 192 93
3161 93 -151 -275 -269 -247 -161 -222 -124 -155 157 3 89 -253 -54 -9 -245 -234 -322 -157 78 79 -119 -107 -191 -145 -162 12
3187 12 -110 -65 -126 -153 207 -20 29 60 20 -173 191 193 99 -16 115 -45 62 177 -147 234 -175 -75 124
3210 124 -24 -44 167 238 -125 146 -42 85 -113 344 196 245 65 192 8 -5 -17 159 181 158 144 122 328
3233 328 110 27 258 -228 127 -90 50 91 -150 -60 31 -80 -11 -150 255 280 -44 -132 -303 183 -157 -29
3255 -29 206 69 47 328 9 389 362 26 -42 -302 106 -142 -140 53 -69 -66 -144 -166 -33 74 -57 -175 -155 -294
3279 -294 -267 20 -157 -61 74 9 -140 77 96 -34 31 3 -60 7 72 -120 -120 -132 -298 -190 89 -196 -104 -90 109
3304 109 198 7 22 -250 -49 -15 -286 -278 -265 -114 57 -183 -42 61 -108 -48 -340 31 71 97 67 133 124 88 -151
3329 -151 76 -29 -124 -72 -38 -101 42 30 373 -30 -37 -90 -177 14 34 83 57 -15 236 -104 121 204 196 -100 -87 -151
3355 -151 32 125 279 87 10 305 73 311 87 -6 124 1 27 -36 178 92 175 -86 -6 231 83 30 -113
3378 -113 306 14 121 248 6 84 96 30 -92 -31 10 -90 186 71 79 23 143 -104 -55 43 58 379 -59 90
3402 90 -171 -249 8 132 103 -95 -111 -325 38 -55 98 -154 96 88 -158 -6 -288 3 -64 -200 -7 -287 66
3425 66 92 124 -3 -59 203 -112 -33 24 198 -81 -41 -204 -41 156 0 -247 -257 37 -253 -152 -184 173 -26
3448 -26 240 11 86 153 -271 21 -82 203 -115 -141 86 -41 272 -306 -303 107 -45 -152 -152 30 34 125 -49 -90
3472 -90 -117 -111 -43 41 207 -118 157 34 -23 -72 105 -90 7 169 324 329 109 55 166 -88 33 -18 219 13
3496 13 188 302 75 -141 69 257 38 -104 209 -79 -55 2 -4 91 65 257 217 -254 -3 -49 -191 -103 -157 -39
3520 -39 -7 114 135 30 -22 -54 -58 -68 -137 -63 -187 -23 -111 144 50 -38 129 -91 -202 234 -86 -256 -113 -232
3544 -232 103 -156 -362 41 -400 78 -68 -259 241 20 -93 134 -42 -226 -92 -192 -201 52 -275 -2 -101
3565 -101 -98 53 -148 -27 -6 39 -175 -52 -326 -217 22 -28 -107 19 -118 -146 127 20 -3 -127 -233 -136 -127 61
3589 61 -86 -121 -16 282 -45 -73 -60 161 58 45 -35 136 217 -3 276 0 70 334 -186 205 -213 -200 -19
3612 -19 136 -125 13 -98 -266 170 23 -124 140 181 116 143 -120 176 -88 20 9 -79 193 56 22 223
3634 223 71 -166 -79 77 -64 -14 113 -32 -113 -81 188 59 108 -13 340 69 128 -40 -111 -216 -85 321
3656 321 61 -93 83 -117 -142 0 38 162 -178 -67 194 146 -257 -97 -367 -41 31 -200 -98 -505 253
3677 253 148 100 -84 -116 -112 103 -157 152 286 4 -132 -198 -225 -82 -190 -86 -149 -69 135 23 97 -81 -11
3700 -11 -54 -81 -208 -130 1 -11 51 106 -248 -272 -38 2 -15 -7 -114 -106 -193 -5 223 -13 177 -92 -236 -88 -356
3725 -356 102 -82 243 77 7 -213 11 4 201 -128 -10 49 68 358 -56 -57 -244 15 -37 140 -50 264 208
3748 208 13 33 89 110 -128 -2 35 1 60 249 451 171 208 7 132 -49 -134 -12 173 -93 162 41 -159
3771 -159 -110 167 123 -158 211 -126 -82 67 -114 159 -83 78 -212 -14 -179 -262 -107 -23 -101 248 -286 174
3793 174 45 -17 163 -121 288 -64 226 213 -162 -90 156 -190 -19 -370 -154 40 -205 -129 -179 192 -223 -53
3815 -53 -302 -170 -181 129 14 -423 -130 3 -268 -148 -41 -46 -52 -107 249 -190 -154 -86 -69 -11 -150 -50 -14 -331
3839 -331 -150 87 86 -66 172 -245 -73 -244 238 104 312 200 -306 365 -175 -114 226 193 -84 61 -225
3860 -225 32 -143 252 -204 -8 -66 -248 3 253 176 -21 293 -87 40 -148 -62 -109 118 55 -3 51 74 274
3883 274 245 -75 -86 72 -101 117 248 -213 -28 -47 74 -59 -28 -145 -49 -15 90 -189 6 -44 142 -8
3905 -8 276 -81 16 54 -16 74 129 -88 -30 -421 -349 -107 -147 -145 152 -23 -223 -178 202 -289 51 -172 -110 -28 -131
3930 -131 -79 26 180 -17 49 122 -73 89 29 -17 -68 223 49 157 -281 72 -208 17 60 -94 -152 -55 -137
3953 -137 178 -107 -68 -57 -95 144 -66 -101 -258 -213 -101 63 -94 -365 -131 -30 146 -77 209 -44 -1 -150
3975 -150 -21 -33 179 10 162 253 152 -40 65 406 184 357 132 -180 -168 160 -62 -142 -240 123 87 -225
3997 -225 135 -89 -265 38 57 154 187 -35 106 81 -150 65 131 10 146 142 227 -168 -158 -89 4 147 88 24
4021 24 114 -22 64 26 44 75 32 -47 119 214 187 140 123 -261 -77 -102 201 -122 29 160 -6 -60 -57 261 38
4046 38 128 432 4 -141 161 -15 -257 188 27 93 -109 -140 -8 -15 -242 -170 30 33 -188 -53 149 -166 -21
4069 -21 73 -21 -21 184 -177 -135 -237 -195 138 -51 356 48 -150 -144 -173 -59 -172 189 73 159 46 -117 -230 172
4093 172 99 -280 -117 -56 36 -2 29 89 96 85 270 96 -6 322 107 -52 198 -139 75 179 -16 -101 140
4116 140 -247 -270 -56 62 166 -91 101 -36 127 62 66 -106 147 -79 -94 -191 140 -101 58 23 -87 -39 -19
4139 -19 7 -10 91 -50 -116 139 184 52 106 52 -184 205 99 156 -113 45 -54 -22 23 -35 -74 -1 57 161 129
4164 129 36 -96 -212 -29 -138 87 464 -110 -92 149 -4 -131 109 466 50 -67 -117 226 211 -268 -72
4185 -72 15 136 -54 38 179 37 34 -178 64 -314 -294 126 92 -56 -137 -16 -77 179 65 -91 -334 -20 -292
4208 -292 230 -288 148 -171 198 -71 83 -213 -180 -13 303 402 50 -263 -212 145 37 -78 -175 26 -277
4229 -277 -71 -20 336 6 -205 179 149 -219 -238 94 -50 44 317 51 -71 -69 162 208 99 -200 52 -61
4251 -61 122 71 32 76 -135 -210 -138 29 207 36 -17 283 52 215 247 114 112 173 -100 158 48 -172 -326 1
4275 1 114 143 -98 11 196 43 46 -222 90 50 -38 79 188 -7 215 -83 286 181 -311 309 -19 11 -61
4298 -61 -9 159 66 68 81 -38 19 154 35 44 135 136 108 -232 -245 -46 -67 -198 20 -29 -294 -91 99 -169 14
4323 14 23 -34 -296 -87 114 -354 166 134 108 29 378 92 44 335 -193 -168 76 126 69 -224 -37 295 -392 -217
4347 -217 115 -63 -56 55 -146 -79 324 64 -122 -9 -180 -180 16 -115 -148 79 58 -12 356 174 -53 44 312
4370 312 188 -114 101 -27 137 15 -193 -19 194 -161 24 -192 -69 -292 -70 75 290 79 359 -144
4390 -144 0 224 96 -297 15 125 -170 196 -95 97 -11 186 191 427 163 -118 -120 287 231 84 -47 300
4412 300 14 7 166 55 148 27 -11 -283 -45 -31 -28 -162 292 89 26 -91 -216 162 5 -30 113 59 36 229
4436 229 -259 135 -119 -175 29 55 -46 103 -63 -199 -203 121 -215 -207 95 -208 -36 -10 161 116 100 -4 -79
4459 -79 -177 -160 -74 159 -36 -41 -129 23 -169 -228 -110 20 -56 252 -123 103 136 304 56 -166 -262 -108 39 -123
4483 -123 99 -101 130 24 114 29 106 -126 -193 -40 -36 -204 28 -146 211 77 -292 107 -44 3 -16 224 -32
4506 -32 -17 175 -100 -84 -187 149 -323 135 34 -233 74 -18 217 119 317 265 -271 163 111 63 320 49 23
4529 23 -107 194 -105 158 270 39 -177 -123 189 62 -274 -248 167 -113 142 21 229 77 7 141 -33
4550 -33 -7 251 111 80 134 83 79 -165 -39 10 93 -157 -68 32 -81 -300 130 -35 152 -255 69 -103 275
4573 275 242 -243 5 -78 -184 -20 -60 51 -27 -73 -5 -160 105 -124 -373 61 9 -18 2 213 30 -33 -143
4596 -143 -247 -79 31 -91 -451 -202 70 102 -176 -143 -71 -110 -54 24 117 110 123 -125 51 -223 64 -95 -53 -3
4620 -3 -82 -110 -32 376 -231 65 -59 239 30 143 -23 -235 243 -104 -4 -167 74 -166 36 -125 -39 36
4642 36 103 -80 -26 -149 31 5 -369 188 21 158 -41 -264 195 218 114 70 7 -50 63 -282 3 -29 111
4665 111 -101 162 -256 63 -38 26 -91 112 132 117 204 -14 228 -70 167 245 -13 3 -238 182 -8 104
4687 104 168 4 191 -270 -18 -295 -87 -36 32 -132 88 -13 73 -25 137 -61 102 10 -326 19 11 -86 -169
4710 -169 245 35 -207 -101 196 199 -212 -168 -188 -353 -245 -265 254 99 12 -165 -68 -19 4 -398 81 -70 -67 11
4734 11 -46 -148 -4 226 243 -85 -21 63 -191 -179 -78 -189 -7 70 94 59 -66 -337 -11 291 -163 59 -230
4757 -230 44 100 -34 -195 -152 -202 -127 206 272 -194 -10 -7 61 -69 -195 332 56 -11 -219 145 5 299 -2
4780 -2 -110 -122 -31 8 61 266 283 -55 -55 22 -167 -229 -207 5 -82 194 -251 199 214 63 254 -57 -127 -81 85
4805 85 -26 265 -197 -74 -116 -233 -77 51 67 133 154 11 18 -129 6 87 189 -88 -101 -17 -286 252 -39
4828 -39 -244 -62 -95 -85 127 10 -60 -59 -128 25 -52 -63 -78 246 -48 1 -218 56 130 -64 -76 -114 -155 114 142
4853 142 -102 -96 -96 -151 -4 125 36 -158 189 -219 -33 186 180 118 255 60 223 -193 -31 143 -113 -101 25
4876 25 273 -30 169 61 204 112 -140 245 234 -40 -442 78 -133 -369 62 -29 208 -34 264 -35 137
4897 137 -80 -12 -60 127 19 10 41 -216 15 -180 -12 -101 101 34 120 -93 -118 -206 15 -115 -386 -15 -63 -112
4921 -112 167 -50 25 -70 108 23 268 -43 -183 20 119 -12 -111 -193 152 180 9 96 110 175 449 86 67 2
4945 2 -51 222 87 50 -93 107 28 -100 -33 63 308 104 -85 -385 -210 59 -178 -147 284 188 213 165 192 -262
4969 -262 97 -110 -37 60 -224 99 -69 -48 -455 143 -29 23 246 -154 -63 145 -247 -167 -100 31 27 -201 17
4992 17 -48 -175 -16 24 -221 194 93 43 -194 109 -194 -39 -28 313 -72 -9 133 -15 254 189 122 199 -75
5015 -75 -22 -103 309 -111 379 -9 155 60 -222 -4 49 49 232 177 9 153 -119 227 128 -183 -103 68 162 -19
5039 -19 -142 110 173 0 -109 216 -130 291 39 -13 -191 47 258 -18 -35 22 122 47 -54 -188 230 65
5061 65 91 58 62 98 179 56 -9 -165 -196 -61 81 -1 -274 39 -211 -177 -118 -63 3 58 209 -243 258 -34 -13
5086 -13 196 -191 -96 -195 328 131 -202 -36 176 227 78 -55 105 -32 -208 -139 75 96 -132 -171 -18 -217
5108 -217 58 160 -233 -103 18 192 -93 -94 -127 48 -66 210 236 -178 26 -6 148 82 -39 54 -149 -21
5130 -21 -153 -367 0 -137 -154 364 3 -327 -343 111 -297 -84 -124 -126 130 153 -4 -230 -156 -114 250 464 -52
5153 -52 35 -102 -39 -98 187 221 -24 24 -9 148 33 -4 69 26 49 -66 -432 64 156 -22 -98 302 -129 26
5177 26 -40 54 102 -47 54 -138 -110 323 156 34 266 -3 -144 253 160 -232 -29 24 -19 -129 1 -73 138
5200 138 405 -209 -158 68 -77 133 -149 -215 -15 206 152 -56 7 -390 -107 -73 35 169 183 -178 110 -99
5222 -99 -348 59 73 -153 49 -373 -21 145 -57 -37 49 112 -71 183 83 -12 -10 70 4 -107 -215 -39 69
5245 69 48 -35 159 24 -52 43 -9 -13 3 293 146 95 -139 -29 64 12 139 63 -99 -20 -221 -124 271 -51 74
5270 74 19 -14 -189 -196 -67 -33 -61 -16 -36 -351 -9 -122 -32 -314 85 146 -155 -189 -174 -196 -77 -72 -125 -111 21 371
5296 371 20 -14 151 108 -5 -104 -138 148 49 443 44 173 -272 30 80 288 301 187 -128 -74 71 -263 54
5319 54 -104 60 -250 219 203 -16 -309 131 -43 -350 133 -62 -35 17 99 -144 -59 -34 23 294 57 -28 44
5342 44 -13 16 -269 41 322 282 -124 70 146 68 2 17 -253 81 -375 1 84 -222 17 253 95 114 -71
5365 -71 274 -13 -275 175 -5 -52 -118 -10 -129 27 20 3 -113 -19 -36 -98 78 27 -59 -17 -55 -10 -130 -171 -150
5390 -150 41 8 -124 -63 -21 -34 -3 150 -61 73 -270 -152 252 93 -12 -51 -174 7 409 193 -143 18
5412 18 313 18 83 313 232 50 161 201 2 30 -188 -308 363 76 142 161 -136 -117 68 -64 6 -290 101
5435 101 57 129 155 -132 -159 -140 86 -1 200 -236 -245 3 64 -16 27 -147 -195 179 252 -294 168 -130 -2 -143
5459 -143 78 -53 48 216 41 53 72 149 -191 28 101 -107 58 36 -243 -30 -129 -134 15 103 -136 174 78
5482 78 53 131 -226 56 109 -20 293 -147 -124 -86 -194 57 -248 -117 22 -53 -39 -104 -63 -130 114 -274 -178 216
5506 216 90 -136 241 47 -55 -151 76 -99 -63 113 113 101 -114 150 -66 -35 -260 -207 186 38 11 -91 218
5529 218 217 -138 -89 55 105 -26 -20 -78 58 -40 -62 132 224 -97 232 -165 -78 -295 -81 -38 -70 50 86 232 -153
5554 -153 -11 -423 63 122 267 -21 -171 -31 67 -197 -78 13 -68 -16 -49 -97 221 35 -44 0 73 -227 -32
5577 -32 14 29 123 19 204 140 -6 49 44 -48 -146 -117 248 -75 101 -115 141 84 49 205 250 -177 355 189 241
5602 241 -161 -218 -97 24 44 -147 -44 -75 -25 96 -302 97 -28 104 -18 18 -2 -75 -173 57 12 79 91 113
5626 113 -129 -243 -75 -101 -90 34 121 103 -276 -191 90 -214 85 185 -95 -191 -375 -209 143 272 -162 25
5648 25 91 -164 157 266 -4 -126 -188 -115 428 -22 -40 56 105 -60 -99 154 26 -159 -86 85 62 57 -84 58
5672 58 -315 22 28 -182 171 390 78 145 -108 -60 201 25 -79 48 189 -31 -18 145 19 -41 -314 -91
5694 -91 -67 -212 -66 104 46 15 -67 -280 221 -164 -120 -95 -108 18 -82 159 181 214 93 -40 141 -159 -2
5717 -2 -110 1 -33 139 120 288 94 -9 -9 328 200 264 176 -43 60 -139 -258 -44 157 -63 -80 -72 104 -12
5741 -12 -175 -234 62 -175 174 -133 -34 117 -100 90 168 -133 19 -355 -217 -94 -29 158 -251 142 57 30
5763 30 -86 -433 -11 -163 -13 105 193 -38 188 27 352 -35 94 -129 -377 98 -211 -179 -181 92 -112 197
5785 197 -94 -62 -44 117 60 150 -312 36 -146 -105 82 -288 142 -47 341 4 -288 -27 115 45 309 79
5807 79 178 -211 59 -44 -153 -119 54 -22 -45 346 -95 -225 -274 -66 -116 41 162 117 64 157 -93 108 189 92
5831 92 25 202 -127 41 -175 42 -240 48 18 -375 44 92 245 -237 262 17 114 83 54 282 199 -198 398
5854 398 71 81 15 -198 -308 -143 79 16 271 29 267 -298 -113 -26 -241 198 -68 -73 -12 126 -140 102
5876 102 -222 164 133 -69 -9 42 70 0 229 -8 10 -38 167 -8 20 225 276 -56 157 -35 -176 138 169
5899 169 -37 -121 6 -78 117 -25 81 147 -206 339 454 2 -71 77 -283 413 355 36 112 -141 202 175
5921 175 7 217 -186 -54 -97 41 -66 -130 -76 82 -169 45 58 41 -44 184 62 383 -122 47 -36 16 -210
5944 -210 22 2 9 424 -9 194 82 -160 121 174 -166 73 188 -333 190 -117 27 0 -41 -93 -79 47 57
5967 57 372 -96 109 -229 193 -65 202 -16 18 150 68 -106 122 73 -233 121 33 65 78 -81 -115 109 -119
5990 -119 33 -86 118 148 54 163 108 201 26 49 -20 130 -27 -202 233 -32 -49 51 129 143 49 -133 -257
6013 -257 183 19 18 311 -231 172 -3 -86 29 -243 158 36 16 111 -231 -148 -79 248 -137 105 -17 22 174
6036 174 116 -231 -85 91 128 -158 33 -181 -46 -107 87 152 194 -25 132 -236 -207 120 115 295 115 -5 96
6059 96 283 161 363 -77 287 -58 84 42 54 -294 212 -173 -4 161 -62 153 12 223 26 -7 50 -37
6081 -37 189 -130 256 16 2 72 80 -3 161 245 -15 -273 26 90 -166 365 -201 53 -50 1 54 67 79 -46
6105 -46 332 272 -174 -32 97 -46 -161 98 -86 -21 -153 -96 51 56 -244 -199 -105 -147 53 -33 348 60 106 -205
6129 -205 -190 49 346 267 -104 -42 18 -161 -236 -218 -186 -133 342 12 -32 244 127 -80 -222 -121 -179 124 -108
6152 -108 -252 -21 280 113 191 -264 -163 -22 -316 245 -64 30 -381 39 90 -16 73 71 39 -80 -121 42 129
6175 129 35 -278 156 95 -125 -32 296 -301 -198 119 -123 35 -100 64 73 82 219 91 -155 439 -191 102
6197 102 112 -40 203 -125 -284 41 -76 -315 -52 42 -302 89 -46 210 -53 -208 -32 255 -51 20 -90
6218 -90 122 -132 140 65 -197 -103 -1 -120 -164 197 -15 26 -13 146 117 -202 56 -177 -97 196 -56 84 56
6241 56 -27 -50 -113 -129 257 -153 -25 -337 19 21 27 69 30 121 272 -356 87 -44 -86 271 99 -253 -138 153
6265 153 -83 71 -21 -122 -120 130 144 3 155 -204 330 -141 153 -216 76 -197 146 83 -65 290 -188 171
6287 171 199 33 -23 -121 -300 -37 -189 230 -67 84 -26 -131 177 -77 68 -73 -167 295 142 -277 65
6308 65 -186 -26 -55 -293 -34 124 -75 -57 96 189 -170 -315 -62 -101 -111 58 7 -191 -223 122 -24 324 -314
6331 -314 -174 -130 129 -133 -200 -173 -195 -87 -40 8 97 127 -2 -173 -392 -104 -173 -134 -75 37 -21 68 142 111 118 -198
6357 -198 339 141 -227 -24 204 44 -121 188 -127 -198 159 42 138 233 -25 87 19 8 86 -8 209 8
6379 8 1 -78 76 202 -137 94 126 158 44 4 126 -253 -191 -26 -133 -175 47 204 -22 -77 311 -68 -39 -303
6403 -303 26 -57 -97 -18 -347 181 -138 122 203 184 121 -22 -214 -30 43 -133 114 388 -270 -44 -250 306
6425 306 -41 -21 149 105 -87 -167 -75 -105 23 -72 72 -144 -33 25 187 229 144 -102 -200 -153 54 -186 7 -150
6449 -150 -43 -264 -43 239 -296 213 51 157 149 -101 144 150 31 166 55 57 -104 177 230 247 -181 94 -46
6472 -46 116 111 23 154 -88 -127 53 133 -160 -37 112 -134 182 126 -57 320 -320 15 11 113 -74 -26 171
6495 171 -157 253 78 155 230 83 -45 -183 179 178 -81 -72 26 244 8 60 107 -108 -70 156 -186 -143 -6 18
6519 18 24 -251 -143 219 -117 -28 -14 -43 115 -108 -76 -88 28 -21 144 6 228 -5 -141 -52 17 -13 -119 1
6543 1 114 199 3 142 44 -206 68 116 -41 233 -274 -131 312 205 -170 61 243 25 20 89 143 0 -68
6566 -68 -149 -80 -34 116 -91 87 -66 68 210 -61 -29 -193 -9 208 -293 -86 135 101 -152 105 206 -136
6588 -136 -37 164 -42 283 -157 235 364 -329 213 -108 261 -257 42 381 76 34 -94 -10 46 0 209 -215
6610 -215 -7 -205 -222 154 -23 121 270 198 240 -141 -101 -80 40 -109 195 -94 -83 74 53 141 -71 -222 -429
6633 -429 15 -106 -18 -88 -209 283 -31 -58 -78 -111 70 -256 -267 -30 -87 -5 199 -183 -81 72 -147 -82 216
6656 216 -13 -41 126 -161 149 121 114 -21 -89 -60 -140 -159 182 134 26 131 -36 87 68 -227 204 -19 -105 -86
6680 -86 96 -253 -250 34 238 45 2 -76 49 -32 -288 62 -31 -25 -226 20 -151 376 -28 -46 -103 -35 217 75
6704 75 -135 -38 36 -57 -163 88 147 -99 159 -247 -293 144 -299 34 26 143 -53 -215 -56 300 -164 29 -9
6727 -9 227 170 -11 346 -59 191 192 475 -302 -66 -203 112 76 7 -14 152 174 -15 159 -55 -150 23 46 48
6751 48 -36 -18 87 -146 276 -19 -24 99 -80 -133 38 -189 60 162 -9 64 2 -195 -33 -162 119 17 73
6774 73 149 84 6 36 215 -109 -305 17 278 136 -24 -105 -32 318 -218 -53 -111 255 -144 72 53 -341 212
6797 212 22 67 -376 157 130 -63 -11 -5 -27 -16 -6 -236 -171 0 -201 51 169 59 80 -47 -63 86 209 -208
6821 -208 -149 -184 204 -148 -72 189 77 17 96 110 34 94 47 -54 2 149 12 318 -11 -34 -262 62 -71 48
6845 48 -71 -9 38 -64 41 192 -187 -57 222 -158 69 113 189 300 -398 -261 101 254 -332 -70 243 -217
6867 -217 -30 -239 21 -61 98 211 29 -40 -205 -170 -68 -64 -99 -89 17 -197 -39 28 -123 132 41 28 -23 -51
6891 -51 200 351 -75 -163 38 -39 144 -101 58 56 -102 50 -38 -318 17 -242 192 -222 175 -83 -156 67
6913 67 -118 -3 223 -120 -98 -211 184 -125 134 32 -194 141 126 -115 120 -313 137 214 -87 187 -15
6934 -15 -54 -146 140 -183 75 -69 -5 -40 355 205 120 45 -266 96 -83 -78 73 60 118 -354 -30 -226 -271 81
6958 81 -78 250 -51 56 -21 32 326 118 -8 83 -16 -7 51 -37 -13 20 -128 -130 -49 200 -67 -209 3 71 -22
6983 -22 -192 39 39 144 162 330 358 185 -223 259 43 -60 158 152 186 -37 197 -130 28 -20 -149 220 -183
7006 -183 151 161 -57 146 -50 177 -223 139 -110 -90 -125 -230 213 230 119 110 -197 147 201 -287 -8 151
7028 151 -191 91 272 121 31 -71 -97 -426 48 71 123 76 29 72 -53 -190 -13 162 -10 439 -4 -53 -93
7051 -93 34 139 -181 -27 -63 10 25 -138 -31 87 -194 42 149 -117 17 -242 -99 -177 -113 -79 -75 -81 -303 285
7075 285 -33 -93 184 -263 -7 -218 -203 75 -101 -99 -122 77 247 9 -54 146 6 -81 -186 -81 82 7 -65
7098 -65 104 169 159 171 -52 -127 -79 29 -90 -182 -12 223 138 152 -116 -135 41 91 190 220 28 124 -17 -232 -278
7123 -278 -189 -87 -255 -160 -13 39 -187 59 48 -254 -11 110 -68 144 -25 79 77 40 -30 187 142 62 133 97
7147 97 -167 -131 35 163 215 85 -30 -242 77 222 -29 136 -96 -320 207 -87 184 133 147 -222 -87 178
7169 178 229 -76 -182 307 -55 86 -19 325 65 -394 251 249 232 -18 235 -138 -90 -226 -107 146 -190 45
7191 45 93 -126 -208 -176 -190 -125 93 -43 -218 54 -259 -78 -71 117 163 -280 -186 -73 272 -66 -318 36 94 132
7215 132 135 317 -110 107 199 -206 -148 186 -2 -64 -143 -160 11 119 218 413 -5 -65 -183 186 -71 74 143
7238 143 235 -46 119 -71 -44 116 175 236 74 211 51 18 37 -171 -64 -38 -323 48 -244 119 154 158 -218
7261 -218 -274 11 97 -112 59 -83 11 -46 -118 -50 23 -82 53 -156 161 156 81 -76 198 0 -199 79 189
7284 189 59 133 165 -74 34 27 -154 223 37 -172 155 158 -199 118 -140 163 240 -67 10 -249 -133 -143 -36
7307 -36 51 -183 129 152 -41 77 0 -46 47 -162 -42 -113 -97 -41 -151 263 62 -148 214 131 -131 78 298
7330 298 -138 48 119 -119 -219 -138 -81 272 65 181 264 -70 -37 -239 234 -42 -281 -98 77 113 163 74 98
7353 98 165 59 119 -198 -171 190 85 362 -161 -138 90 33 -16 23 -44 -307 282 192 327 201 -12 -13 41 170
7377 170 57 64 -157 187 37 -161 131 -7 -49 155 -181 -96 -103 -129 48 234 64 -156 357 116 -81 -244
7399 -244 -225 124 66 48 -271 161 -24 263 147 -112 112 -147 185 -301 -209 -92 57 -83 107 128 -69 -46
7421 -46 -226 22 -124 -132 -92 -164 21 61 9 -166 136 -23 -5 -83 78 -30 -163 47 118 -156 58 -13 -101 -167
7445 -167 -53 283 -363 24 -200 64 -232 32 -58 -67 66 99 -288 66 128 3 -1 267 -161 -32 22 -216 -46
7468 -46 204 56 -61 -88 165 288 -82 254 -55 278 186 -101 -28 132 52 -210 -231 56 -12 -205 -114 -56 141
7491 141 31 189 -19 162 83 -165 265 303 -247 16 -23 -83 -95 26 38 -28 37 221 79 -294 29 -80 40
7514 40 -250 147 -133 36 -103 69 323 -21 -133 -142 69 58 -204 -134 -315 137 -382 -141 -94 -98 -113 -81 -59 -76
7538 -76 -16 -311 138 -51 30 -176 418 50 -159 156 191 -292 -10 -77 -96 -208 140 120 -205 -149 54 -160 -90
7561 -90 -398 145 27 -25 47 140 50 239 -40 127 6 -117 87 12 127 -124 14 251 79 -23 -17 -69 39
7584 39 -307 -47 110 9 123 -59 175 158 -329 -118 182 45 -66 -69 21 22 -115 -59 -7 -367 -68 -241 -168
7607 -168 -104 436 40 -173 -213 347 74 151 -78 -204 19 -110 101 -79 316 58 146 -94 49 2 -10 123
7629 123 33 -150 137 303 -124 -42 24 48 119 -65 154 -83 82 9 -53 317 -104 -82 -99 -218 108 75 29 66
7653 66 -271 274 19 -125 0 -101 92 10 -49 137 171 45 124 -8 -185 319 207 -42 108 27 -19 43 -26
7676 -26 208 158 74 142 86 12 248 244 125 -70 -293 -308 -123 -25 -19 -83 -99 -12 73 -137 -137 -16 -127 -120 170 -131 -15
7703 -15 23 -84 -45 -21 40 34 -112 -130 21 -169 -64 7 -54 15 189 22 52 -35 226 214 305 -55 -205 188 39
7728 39 176 223 93 20 -174 -205 -101 157 29 173 124 -112 26 -136 -287 147 33 215 127 139 91 -131 -329
7751 -329 161 38 -79 -130 155 54 130 -94 -34 166 132 -80 77 60 -44 -253 65 60 -102 115 -140 -197 -33
7774 -33 225 -33 108 143 384 -38 -190 129 22 46 65 -97 -68 15 -60 158 204 16 -66 -103 299 7 -40 -253
7798 -253 261 312 -74 -248 -241 11 87 130 -17 94 137 -131 32 110 110 -29 -70 87 -190 182 -206 -116 -109 -80 -16
7823 -16 113 45 242 -162 -228 -133 -319 -130 100 -47 -70 -30 -74 70 -33 294 129 53 108 -55 -151 -111 44 121
7847 121 25 -81 44 -131 269 66 -313 -45 -129 -52 -38 7 100 3 221 -33 123 -111 -243 -99 -281 145
7869 145 -31 0 267 150 201 -64 -34 73 -213 318 147 -35 -61 75 151 214 -102 -18 203 12 232 234 -1
7892 -1 51 193 -5 62 49 149 151 100 -209 -4 218 -4 219 45 198 97 -64 -67 344 19 267 172 165 5
7916 5 -241 22 -99 -177 178 -215 318 -276 126 231 -151 60 256 -16 125 -36 94 -17 -131 139 21
7937 21 175 -117 -62 57 194 -55 77 144 217 -74 -191 164 -130 -195 8 -27 64 27 117 11 -53 -214 73
7960 73 -290 -14 92 -130 -29 -129 -114 72 -140 118 -66 -39 -187 -122 -265 28 -241 306 204 6 -43 -94
7982 -94 -90 13 36 -169 -82 59 -108 -161 149 -144 42 60 -42 -195 -284 -208 -84 -157 -111 -7 -18 -33 -140 39
8006 39 -122 -13 260 130 177 162 135 -263 62 42 38 32 37 -6 -109 79 -148 -296 78 -238 -347 24 79 -186
8030 -186 73 61 -7 -188 68 20 10 269 -1 -57 191 -42 -30 49 11 105 204 -174 -74 54 -128 63 149 -30
8054 -30 -10 245 -185 158 44 -5 80 -82 88 104 -32 52 -182 -216 -3 119 -102 -34 -106 -101 154 127 16 284
8078 284 -153 206 -70 38 -120 -167 -49 -40 113 46 -71 277 144 26 250 -204 -106 -37 -62 2 182 -138 145
8101 145 10 21 -206 -173 -36 41 94 -69 -93 -50 103 -94 62 -141 -38 -53 -121 -116 -50 123 251 55 -77 -317
8125 -317 -47 44 -215 -121 -78 2 -200 118 -78 112 -185 -24 35 -147 -33 -68 175 -108 -38 181 -259 153
8147 153 -93 -94 -135 -20 62 197 265 178 -158 -51 -67 -25 -219 -140 124 -178 -117 -38 -178 -167 131 209 88 77 -105
8172 -105 285 -33 354 -65 43 362 -60 -162 50 68 -185 -20 -79 -171 29 90 200 61 -127
8191a27
$$ Imaginary data points
##PAGE= N=2
##DATA TABLE= (X++(I..I)), XYDATA
0 0 0 0 0 0 0 0 0 0 0 0 8 -8 8 -8 8 -14 16 -16 23 -24 30 -32 40 -45 53 -59 68 -77 85 -97 109 -124 139 -155
34 -155 173 -192 214 -237 264 -291 324 -357 395 -439 486 -539 599 -667 745 -836 946 -1075
52 -1075 1236 -1439 1707 -2073 2616 -3493 5165 -9508 45813 87498 3050 -23484 -70 31808
66 31808 18539 13825 23981 25416 -1348 -11811 4956 23369 12724 -3022 -6391 -2119 -5548
79 -5548 -5903 618 5505 -815 -8187 -11614 -7697 -287 5839 3182 -2196 -2169 3488 5402 2631 2622 10918
96 10918 17262 11168 -949 16 13857 19943 11077 4611 9481 11596 3262 -2318 3790 11640 8233
111 8233 -512 -3714 -4901 -9216 -6608 4139 5622 -8264 -20584 -15680 -6071 -2335 131 82 -10277
126 -10277 -22120 -15665 3844 10087 -1473 -9929 -5846 -2356 -5245 -6 12947 11922 -7186 -16610
140 -16610 -2166 13606 10018 -1769 -4396 -1658 -3560 -5533 -970 4224 61 -10340 -13801 -6644
154 -6644 341 -2534 -8842 -10284 -6636 -4731 -6425 -9646 -8103 -2249 2250 -2003 -8790 -6828 1679
169 1679 5632 1075 -2587 1675 6473 3520 -842 3786 10418 7688 1222 2045 5544 1697 -900
184 -900 5597 11403 4401 -7026 -7290 1333 5686 2127 -1511 -2287 -5510 -8590 -4540 3679 6175 594
200 594 -6005 -9142 -6975 1900 11450 10110 -2157 -9047 -2734 7979 10977 7680 4457 3079 473
215 473 544 6871 12369 9195 1215 2 3604 3803 1176 2137 5678 3820 -3038 -5539 -1083 2984
231 2984 613 -3375 -3232 -1902 -2718 -4727 -3502 -1435 96 639 -1099 -5347 -6099 -127 4766 2732
247 2732 -2122 -1383 1371 868 -2164 592 6174 5167 -2387 -6019 -1727 2226 1357 1410 2071 -2293 -8073
264 -8073 -7284 -335 3827 -257 -6285 -8903 -7013 -3801 -405 1220 -2328 -8082 -9807 -4752 1223
279 1223 1643 -381 -1872 -4016 -4802 -423 4546 4348 -280 -2276 -190 1767 1844 2202 3895 2514 -1470
296 -1470 -2707 1132 3960 407 -1959 192 1478 -1493 -3603 -1000 1444 -27 -1990 -2654 -1914 -1452
312 -1452 -1932 446 2111 649 -1273 -844 163 325 2102 5233 4375 833 -673 2329 4863 4794 5428
329 5428 5046 2049 -1752 -915 5744 10020 5443 -1413 -3073 63 1710 2049 3689 3401 -1216 -5325
345 -5325 -3469 1365 3469 2549 -221 -3021 -4985 -3230 1739 5961 2917 -2006 -2788 -607 1107 2203
361 2203 3924 3892 282 -1942 150 2927 3354 2309 1821 1216 -554 -2362 -1011 1370 1235 -955 -1065
378 -1065 -897 -3409 -5565 -2681 1049 202 -3593 -5857 -4895 -3521 -2480 -876 10 -1985 -5899 -6372
394 -6372 -2717 851 1268 340 -1262 -3703 -3964 -765 3064 2792 301 -1727 -2416 -2506 -690 2672 3936
411 3936 224 -4457 -5683 -1798 2060 1158 -543 -2475 -4279 -4405 -1764 1492 599 -2336 -3896 -3153
427 -3153 -1859 -205 556 613 -377 -1470 -1108 987 1650 809 1711 3048 1684 -16 1230 3438 3461 1440
445 1440 1502 1900 1585 723 842 2431 2829 1113 -83 -128 -146 -692 712 2633 1216 -2055 -2558 296
463 296 1871 1466 729 638 -696 -2138 -301 3507 5367 2943 -148 -658 716 2356 3855 5019 3119
480 3119 -884 -1547 1638 4278 3816 2008 894 -1369 -2493 -596 2864 3435 179 -2892 -2904 -1335
496 -1335 -1275 -446 749 -194 -3328 -4644 -2197 119 437 -437 -1157 -1755 -2633 -1951 56 976 372 -369
514 -369 -547 -546 -1469 -1816 987 2286 162 -2002 -1844 -1268 -1578 -447 734 367 -2229 -4915 -3648 -1066
532 -1066 -290 -61 -1459 -2872 -4292 -4473 -1221 1228 500 -2229 -3239 -3338 -2372 -24 2494 1915 -1125
549 -1125 -3636 -2732 752 2242 1650 757 -355 -1452 -1590 289 2737 1760 -435 -1512 -1728 -1274 -106
566 -106 2018 1862 -499 -3080 -1911 80 585 -321 -457 204 -610 -1284 -482 1266 1041 200 435 1134
584 1134 726 627 1568 2507 2605 1707 965 1354 1333 1440 2841 3419 2273 -155 -138 1470 2345 1801 1088 641
604 641 -817 -2064 -420 2205 2239 -225 -2082 -2149 -727 184 766 1094 115 -1837 -1848 20 1381 1471
622 1471 1080 459 -1153 -1939 246 3201 3383 501 -1600 -999 435 1247 1618 1674 230 -1698 -1844 -127
640 -127 897 323 -341 -969 -2183 -2444 -1500 -294 -204 -1152 -1709 -1765 -1756 -2371 -1905 314 422 -1640 -2432 -1896
660 -1896 -770 28 201 884 442 -1309 -2167 -803 950 1400 1000 692 -1037 -2104 -1161 1222 2068 783
678 783 -1485 -1880 -1474 -677 585 2025 1270 -1250 -2950 -2003 812 1791 1288 341 -469 -1603 -975 987
696 987 2785 1919 287 -476 -5 648 1701 2677 2205 1182 267 410 1524 1690 1908 2301 1638 362
714 362 -189 1072 2444 2292 739 511 191 453 453 1296 1356 1278 749 680 -109 -235 602 1850 2063 350
734 350 -1036 -242 1412 2015 1420 1338 718 -91 -554 1081 2806 2574 827 -233 172 320 1096 1965 1736
753 1736 86 -1468 -1058 836 1247 391 -86 -233 -1510 -1929 -575 1007 873 -1008 -2277 -1941 -839
770 -839 -482 -48 -53 -1313 -2756 -2093 -390 405 117 -396 -1229 -1931 -1577 -503 132 293 -816 -1173 -721
789 -721 -686 -1149 -370 324 -228 -1336 -2157 -1062 -537 -486 -146 15 -998 -2279 -1973 -884 120 -13 -550
808 -550 -718 -1770 -2063 -754 862 1111 -199 -1702 -1545 -683 -380 962 1775 644 -1201 -1773 -371
825 -371 1375 1743 1000 -152 -737 -1009 221 1649 1761 1053 -254 -1016 -413 -180 1152 1924 1188 -683
843 -683 -1239 54 1153 1528 843 440 97 -78 3 1134 1400 1349 527 530 61 50 389 1736 1776 1007 100
864 100 429 793 979 974 1369 1359 395 -408 51 921 1043 814 856 -60 -711 -1114 258 1535 707 -284 -1028
885 -1028 -864 -1052 203 934 839 -613 -1310 -981 15 433 767 578 -295 -1342 -1484 325 1124 730 -752
904 -752 -1231 -726 -265 275 317 -185 -893 -1394 -1570 -675 92 -490 -390 -1075 -1699 -1614 -922 -201 -410 -1555 -1611
925 -1611 -771 -796 -764 -360 191 -615 -1479 -1275 -414 45 -330 -237 -68 -243 -772 -650 213 174 148 270 196 -1016
947 -1016 -939 358 888 653 -387 -1275 -974 -481 66 1192 1103 -63 -1633 -1146 141 618 1126 927 -494
966 -494 -808 -543 332 1551 1636 488 -543 -525 19 922 1447 1813 1150 -214 -483 191 1206 1386 1122
985 1122 666 -266 -373 140 1154 1272 814 -54 -247 -2 271 616 856 667 136 300 98 135 -92 1057
1005 1057 919 378 -793 -838 209 900 975 741 429 -231 -291 -463 632 1152 522 126 -203 -747 -214 422
1025 422 845 254 -741 -1443 -807 -374 179 290 142 -950 -1634 -927 -75 212 -110 -871 -1289 -1035 -857 53
1045 53 305 -122 -957 -1086 -874 -245 -327 -53 -199 -508 -760 -941 -211 181 -228 -644 -728 -266 -843 -513 171
1066 171 162 -601 -1291 -788 -376 -279 131 150 -334 -1156 -851 -253 270 -76 -438 212 -42 -332 -319 164 682 664
1088 664 -81 -87 -502 -208 530 724 858 471 -568 -327 412 1080 905 504 -47 -249 1 567 1248 1141
1108 1141 421 -196 -219 240 788 1218 1312 430 -579 -283 848 980 1177 810 392 51 -446 733 908
1127 908 1487 817 -14 -123 -82 460 476 1338 677 -117 -7 231 277 232 355 600 -155 -573 -586 179 171 336
1149 336 352 -230 -507 -560 -102 194 517 -113 -644 -508 -985 -407 501 817 -65 -724 -1121 -337 -23 321 175
1170 175 116 -654 -918 -683 313 739 -304 -648 -981 -487 -549 -61 147 -181 -955 -998 -612 -913 -157 -16 -521
1191 -521 -556 -1188 -1131 -88 281 -2 -972 -565 -463 -144 126 147 -81 -278 -588 79 318 -225 156 290 -132
1212 -132 -251 -148 78 486 117 -82 242 -29 -341 -49 202 667 -150 135 -228 -260 442 219 711 416
1232 416 150 -11 -14 647 808 621 491 191 -193 163 774 1129 631 82 50 -12 180 549 893 925 139 -386
1254 -386 409 494 894 749 555 -84 -566 -343 564 765 487 369 -1 -354 -232 -19 440 538 -48 -122 93
1275 93 223 158 818 712 298 -184 -583 -31 550 374 488 -25 -200 -114 -303 -33 484 -113 -112 -616 -722 -582
1297 -582 -235 114 118 -626 -1255 -878 -640 -104 241 46 -754 -896 -885 -539 -75 225 -316 -858 -862 -647 -165 320
1319 320 344 -18 -748 -650 176 -100 -35 3 41 -246 -523 -507 -92 205 -51 -169 -560 -580 -243 -331 15 -47 -406
1342 -406 -595 -250 -382 88 484 142 -29 -412 116 121 486 167 252 278 111 9 12 865 846 117 396 146
1364 146 -199 438 467 664 526 27 -10 1 544 447 417 154 -149 -289 54 421 292 205 0 -23 -35 196 450
1387 450 846 623 369 -47 219 575 646 885 416 174 6 141 600 705 408 -140 -98 -127 143 521 450
1408 450 470 -16 -240 -416 -157 152 94 162 -464 -668 -786 -309 -227 -102 139 -32 -672 -339 -119 298 294 225
1430 225 -283 -310 -117 -168 207 545 115 -282 -474 -378 -122 28 338 -257 -123 -855 -696 -346 77 -38 -196
1451 -196 -452 -822 -903 -585 129 3 -414 -610 -820 -167 37 -122 -34 -228 -375 -730 -81 59 397 -202 -235
1472 -235 -631 -396 -52 595 625 17 -179 -395 -248 124 161 210 387 -199 -346 24 107 22 80 -390 -94 105
1494 105 32 141 289 191 302 -193 -165 78 54 602 354 527 494 -10 370 315 470 406 605 -170 -199 -1 452
1517 452 814 120 248 -23 -72 103 569 357 187 -119 -62 173 390 170 -201 -226 -158 -104 60 270 173 295
1539 295 -189 -153 -320 -155 308 353 111 148 -151 -116 172 339 350 179 -316 -257 -54 8 264 77 -187 -251 -428
1562 -428 -861 -433 -146 14 -142 -735 -563 -130 -382 -207 232 -550 -761 -613 -347 -278 13 93 -221 -470 -655
1583 -655 -435 114 350 -75 -159 0 -336 103 72 245 23 -441 -602 -408 -119 0 181 -8 -216 -389 -596
1604 -596 -58 283 191 -127 -463 -469 -140 -48 384 510 -96 -214 -346 -34 351 542 237 112 80 -32 59 595
1626 595 264 450 378 248 -270 209 507 544 34 413 -167 -112 15 44 496 315 16 104 88 221 249 107
1648 107 -19 28 -71 -128 211 641 286 360 -35 -44 232 169 529 526 -85 -270 73 -27 147 154 198 424 -122 -309
1672 -309 -105 52 -87 -286 50 -242 -237 -272 12 218 -73 -375 -351 2 -113 -38 -56 -175 -331 -403 -156 -75 409
1695 409 16 -271 -30 -377 -82 50 126 43 -251 -284 -201 -262 -237 -36 71 -150 -435 -398 -329 -192 -290 -381 -196
1718 -196 -407 -530 -280 -216 116 -182 -622 -580 -367 -487 197 269 110 -130 -346 26 274 -235 68 62 -48 -279
1740 -279 -89 52 370 120 -125 -79 -106 -506 286 574 397 40 -289 -237 25 112 477 197 10 -141 243
1761 243 423 529 239 178 17 -13 92 147 602 512 294 118 49 187 97 437 506 334 198 -49 313 112
1783 112 379 462 238 122 64 -333 433 254 228 195 55 -89 84 -113 388 440 -82 -220 16 125 43 68
1805 68 408 465 -37 -246 -109 374 223 1 38 -199 -308 -224 220 388 11 -91 -257 -549 -136 31 -86
1826 -86 -132 -390 -291 -181 -75 -16 -543 -402 -206 -344 -247 -163 -267 -27 -165 105 -182 -51 -269 50 -21 -255
1848 -255 -293 157 -113 54 -115 55 -218 -125 -214 -75 307 -202 -280 200 -421 -24 -279 -65 -125 -334 -353 -523
1870 -523 -1 -51 -76 134 -86 -387 41 -120 305 314 7 -52 18 -40 -15 195 114 103 38 150 146 -63 257 301 -11
1895 -11 225 -5 -149 409 417 265 210 37 45 19 -92 168 557 452 88 -22 143 -69 191 436 315 -167
1917 -167 -146 220 137 300 212 415 261 -383 -30 96 133 436 -167 293 66 10 27 363 254 -34 172 -1
1939 -1 -222 -12 44 -66 -84 -726 -151 -81 -43 69 -386 -70 -106 -232 -196 23 70 -14 -395 -441 -355 -57 207 74
1963 74 -268 -114 -310 -135 12 127 -3 57 -189 -168 -217 100 -55 -132 -135 -381 -85 -137 -170 -272 -108 -157 -88 -362
1987 -362 -53 6 -3 228 -133 16 -325 -152 205 37 -144 -100 -364 -59 102 82 278 31 88 26 49 201 -69
2010 -69 105 -86 -33 -296 -432 197 47 5 -49 -136 59 70 37 86 112 -153 -13 74 505 237 223 77 -27 -2
2034 -2 296 274 596 288 116 181 85 271 231 148 153 391 36 -1 2 212 -87 397 57 -46 -30 187 129 184 43
2059 43 -227 -358 26 123 203 247 266 -130 -165 -89 -97 118 173 -78 -329 47 -59 230 354 -38 166 -17 -226
2082 -226 -256 147 -139 -73 212 -249 -228 -188 -34 85 -218 -111 -14 -315 -69 -85 -67 126 -159 -498 -130 -202 -199
2105 -199 -154 116 -122 -262 -169 -269 -212 109 143 -230 35 -274 -181 -6 194 -8 38 -515 -143 134 -91 186
2127 186 254 -484 -113 -29 -82 346 45 -264 8 13 90 74 41 -57 114 22 56 -45 68 359 196 52 192 214
2151 214 401 165 390 83 116 -41 309 250 114 173 -29 -4 252 22 230 310 218 134 -24 129 185 300 365
2174 365 -28 38 -122 -202 -59 65 334 84 17 -174 40 248 28 284 86 222 -55 4 216 428 -105
2195 -105 -13 73 170 98 -184 197 147 -204 -46 -118 121 -175 164 181 -29 -356 -448 -250 50 2 49 -182 -194 -520
2219 -520 -96 -29 -94 -9 -102 -103 -215 -68 -107 63 180 6 -615 -238 64 -158 -238 -257 -210 -102 162 138 16 -99
2243 -99 -154 -240 -315 -167 -177 278 -188 -179 -68 -279 -528 -136 218 -119 -176 -36 -248 -129 -57 -40 52 48 -217 -126 -91
2268 -91 261 -238 -53 315 -115 21 9 29 356 -37 127 459 254 168 -144 -40 173 -260 -115 44 57 136
2290 136 261 43 -11 158 -85 104 313 372 57 217 11 -98 -14 160 168 154 -159 335 270 271 240 94 105 94
2314 94 28 23 223 92 -78 74 -71 -64 118 99 -16 85 9 -245 -98 161 -120 72 -24 -141 -163 69 80 -198
2338 -198 -200 -274 -369 240 19 -52 11 -226 -114 -530 -83 -199 192 47 284 -138 -376 -139 341 58 -105 -262
2360 -262 -192 -256 -350 -5 121 -198 69 -140 -636 -153 -265 -114 185 -135 -380 -148 -96 -196 -54 91 164 -21
2382 -21 -208 184 56 148 -216 201 -162 -1 -193 -121 28 268 190 -435 -100 -71 -68 162 -282 -212 59 156 342
2405 342 169 374 75 -56 -23 431 106 114 426 -18 166 408 92 323 76 -201 270 196 -12 -187 123
2426 123 535 104 -26 36 -194 -107 315 235 50 -96 -10 210 324 114 34 156 -151 397 -86 338 238 -125
2448 -125 -388 138 -190 -95 182 327 -48 -108 80 187 102 13 192 -24 -457 79 -118 111 143 26 -18 -353
2470 -353 -296 -358 -99 -4 177 59 -74 -457 -177 -146 266 -168 -314 -346 -357 -250 85 -13 90 -163 -91 -304 294
2493 294 52 128 -31 -20 25 -267 16 -37 -76 -127 -402 49 -62 -101 -57 66 -64 -244 58 -240 324 -74 -37
2516 -37 -2 96 274 199 -250 -110 -25 383 14 -60 70 -52 228 257 315 -236 148 73 134 124 56 191 -222 241
2540 241 -36 309 260 416 53 7 161 88 12 534 312 -91 -206 20 13 273 274 221 -215 -6 -138 128 -8
2563 -8 245 184 103 80 15 119 98 190 72 8 184 196 278 -91 189 61 75 164 70 162 48 64 59 242 -95 -197
2589 -197 58 118 -195 -194 97 52 -194 35 4 -164 -231 -211 13 159 -274 -70 62 13 -116 131 -294 -17 -45
2612 -45 -220 -420 -208 90 79 63 -266 -328 -152 -7 -99 -217 -177 -300 -15 -215 -282 -78 47 125 -216 -291 -311
2635 -311 80 67 54 104 47 70 45 -173 -87 -45 234 71 -63 123 134 73 213 345 73 27 64 -35 13 -326 -1
2660 -1 -50 -152 -27 -111 156 392 39 118 -142 -28 292 -87 186 207 -47 196 -82 22 361 177 108 86 10
2683 10 -91 149 287 330 336 289 10 246 -25 230 285 84 219 -121 -59 52 179 -62 -57 -227 -110 -12 -159
2706 -159 -151 -63 -141 -257 159 112 81 5 370 -286 -181 6 -15 -138 73 165 54 44 -141 453 184 -282 9
2729 9 -288 -339 -114 -94 -259 -97 -106 -247 141 -395 85 -73 -20 -98 -78 -103 -177 -160 -87 -47 -120 -389 -23 -426 6
2754 6 -104 -19 -90 -96 -88 36 -176 -41 -244 -157 -257 -121 188 127 -151 19 319 156 -58 124 40 -123 175 -251
2778 -251 -154 -246 -189 -84 187 -119 -151 152 36 -5 85 -192 177 -228 -14 208 217 -55 108 -5 89 -115 104
2801 104 153 -65 273 95 45 157 163 252 250 -13 74 100 -215 190 311 318 27 -121 46 249 99 118 293 273
2825 273 -99 -268 -14 159 154 463 -68 71 -102 -2 239 47 271 32 -184 -70 -168 81 330 10 251
2846 251 39 75 -329 -92 21 177 -231 -28 -302 -5 157 -80 1 -221 -109 -259 -1 303 198 -198 -344
2867 -344 -389 46 -166 -76 55 -87 -330 -490 -133 6 0 -243 -286 -100 -60 -20 162 70 69 -374 43 61 -119 -188
2891 -188 -194 -37 -296 -156 -223 -49 15 -415 -81 -245 -64 -27 55 270 -58 10 -104 113 -215 148 164 -59 -37
2914 -37 -3 81 166 102 -211 -48 -31 214 155 127 342 196 -43 -209 -33 -152 -167 123 241 273 -83 -53 -136 58
2938 58 207 278 283 -101 -15 478 -16 479 233 72 105 -87 -94 71 109 59 -164 72 -78 331 56 -34 273 -45
2962 -45 188 393 7 -565 -308 62 -48 -128 15 208 279 -102 -420 -359 -106 58 35 300 -156 105 -86 -86
2984 -86 51 -165 82 351 -92 -129 -212 -14 164 66 506 -39 -149 89 -205 -78 132 49 -47 11 -61 -251 -137
3007 -137 64 -48 -227 38 -168 90 117 60 95 -70 -57 -62 -41 -210 -73 207 -132 -301 -201 -194 454 5 214
3030 214 63 -180 138 85 121 -299 284 153 278 43 79 -14 -170 -19 -92 69 168 370 245 -40 -186 71
3052 71 162 -73 -32 76 301 -239 -85 -27 -102 7 -20 273 -16 228 -59 84 75 200 -159 -43 228 61 -51
3075 -51 227 -163 -124 -123 -58 -196 345 209 233 -219 -9 65 -190 178 117 -102 136 -27 104 181 225 86 -17
3098 -17 -57 -285 17 182 -161 -319 -8 96 186 285 90 5 -230 -112 -8 -253 124 37 257 -59 87 111
3120 111 -197 -256 -63 160 -23 -343 -213 -256 -160 -22 -14 -214 243 -303 -162 162 200 99 -53 159 -109 -121
3142 -121 -342 -101 17 136 -294 -319 -104 31 -288 38 83 194 -25 127 -228 30 -18 -16 166 213 -49 101
3164 101 3 -163 161 -177 17 -112 -94 107 40 -62 -32 -2 69 272 159 30 -165 204 253 -191 -37 133
3186 133 -77 -228 -9 224 235 374 58 90 121 -304 -84 423 -134 200 -12 11 -48 234 210 138 308 146
3208 146 -200 363 -95 262 -261 24 -22 -60 0 -75 79 270 97 -7 96 121 207 314 -309 -125 2 49
3230 49 -179 47 78 -150 79 26 80 -19 105 105 -282 -112 122 -310 -48 -216 -53 -57 -30 46 -366 114 10 41
3254 41 -233 -236 -352 12 -251 -21 84 -20 -231 11 269 -176 -9 -175 -108 -34 -181 -247 39 -53 45 26 -76
3277 -76 -123 94 -47 47 -225 -35 -315 -23 170 -205 145 -111 63 -149 -19 -265 -102 -127 -76 -24 105 346
3299 346 200 215 -150 524 -47 -96 124 34 -56 -74 -72 132 82 -264 349 -63 0 -56 422 -67 -237 -15 131
3322 131 -115 86 -211 177 496 228 84 -8 289 35 65 301 183 159 151 -102 101 -13 22 232 313 -112
3344 -112 478 51 -133 431 -287 27 116 -159 173 -299 1 99 -139 141 100 -50 -207 -35 212 386 207
3365 207 -206 -115 -25 122 -25 -58 -279 6 133 -34 74 242 -106 88 161 -42 -204 -14 -78 -76 65 -32 -26
3388 -26 40 92 -370 -284 -95 -39 0 70 -288 -199 130 -141 -80 45 -94 -392 -275 306 -88 -260 -167 55 -97
3411 -97 -57 -104 -136 19 -24 222 -102 -118 -111 -103 5 -75 -30 359 -187 141 60 -52 131 74 236 323 7 60 160
3436 160 31 -86 -123 -200 23 -282 166 -160 -99 29 -161 -61 -61 99 181 -43 -199 -254 35 -232 197 -162
3458 -162 344 451 29 -3 -61 -44 243 275 200 213 102 262 468 331 -66 85 -18 -109 -394 81 54 -153 -4
3481 -4 183 -236 15 53 -317 -91 -37 62 14 60 114 3 46 46 -96 12 226 -22 146 40 259 22 87 13
3505 13 -322 81 -93 -365 -132 -118 -186 66 -6 -40 -394 1 -155 184 -158 -401 173 -160 -256 149 5 -189
3527 -189 136 -76 52 157 -9 -145 -352 -114 62 -81 -61 91 147 -359 -399 -196 96 275 121 -123 180
3548 180 -126 -91 -188 12 -31 88 25 108 -2 189 -21 -81 117 257 -2 -279 20 68 121 16 -216 -17 -116
3571 -116 183 121 168 -129 53 169 -205 -115 -124 193 -142 49 -62 24 14 -80 35 157 -92 -324 154 230 -29
3594 -29 249 -185 65 64 -132 107 -91 105 -71 -141 -358 127 -85 224 113 22 275 73 -304 205 -12 43
3616 43 -16 210 -298 -207 -217 34 22 62 89 -83 -197 54 165 -91 -208 -9 -210 -190 103 -57 117 121 124 -172
3640 -172 142 78 -30 -199 171 -82 -196 -32 -93 -140 448 -21 -243 30 -75 48 135 306 -301 -168 -44
3661 -44 -81 -38 -151 33 40 32 -189 -11 155 -70 -53 -111 -108 245 85 266 -197 -109 -148 -64 73 -8 -157 -178 53
3686 53 26 225 -85 350 219 42 84 182 -14 -149 -70 11 74 23 368 148 172 -2 37 48 -54 -103 -104 -1 236
3711 236 138 285 -219 37 -78 -2 133 -111 82 -230 -64 7 33 378 -128 -228 1 148 74 -130 -97 -60
3733 -60 176 -114 -151 -162 2 49 322 -37 135 189 4 87 -147 228 94 -271 -64 -74 132 226 -40 -159 211
3756 211 -301 112 232 26 136 147 82 -34 7 181 82 -281 -112 46 128 -15 81 -86 233 -275 -335 -97
3778 -97 7 3 -138 -165 -336 261 -38 40 140 -27 88 61 222 108 -56 -174 31 -193 -33 -9 -17 65 -266
3801 -266 -27 -98 -151 310 -18 -182 -81 -10 201 -137 -137 216 -91 141 -60 55 -90 132 6 -244 -93 -124
3823 -124 58 -14 -100 214 -143 30 32 -128 215 -17 280 21 -268 42 54 -73 63 93 -46 -132 21 -47 361
3846 361 -17 179 -22 -31 -112 11 128 -32 81 127 148 -43 240 128 -128 144 109 2 87 -92 -167 -234 -14
3869 -14 155 150 316 -164 113 148 174 -142 119 85 12 98 -89 -134 67 -62 46 -177 -67 10 66 70 -23 -115 -104
3894 -104 -166 -126 205 -175 58 231 56 -313 93 -50 186 186 99 -165 318 -159 -109 168 -167 127 264 148
3916 148 31 -20 25 13 -237 -190 31 -79 28 -89 -24 217 118 -56 9 106 -60 -98 1 -40 -117 75 156 -206
3940 -206 -103 -442 288 39 -88 -27 -101 16 70 -111 15 146 93 -146 -127 -189 110 46 152 34 -368 197
3962 197 -56 -48 -159 154 280 -136 -75 -14 35 -16 -174 90 -146 -38 157 214 87 29 -29 -79 114 -59 -23 -66
3986 -66 -166 161 151 -26 -214 230 -336 271 -250 -80 248 171 -140 -206 -139 -225 20 -24 156 148 -194 -192 -78 -64
4010 -64 352 -28 363 89 -238 -211 -37 101 107 -154 149 31 105 -337 -38 -9 59 -80 -25 61 -48 -106 55
4033 55 -95 -115 -79 -70 -60 -53 -143 50 -226 -143 -327 15 8 155 -77 156 -189 -36 178 -97 -267 -110 -50 -311
4057 -311 208 -93 137 247 80 334 107 65 -243 -5 -16 238 -45 0 210 -48 -286 53 24 -16 289 -131
4079 -131 209 -75 -122 58 46 156 63 152 -17 -227 114 167 -75 -130 140 -72 -211 128 119 -100 -187 25 -228
4102 -228 24 -45 -134 231 -67 210 -173 -26 -144 14 79 16 158 -144 -14 -104 5 230 -37 -57 41 -153
4124 -153 -145 -341 -90 154 89 144 -68 127 62 45 40 -243 282 -25 108 -241 23 70 -311 -46 -169 -48 52
4147 52 6 -20 137 178 -248 -181 124 191 -571 62 333 64 -90 -191 -355 -39 -77 -76 48 -177 20 77 32 -148
4171 -148 -266 -112 -110 -65 53 -172 -262 154 -13 20 -95 -60 2 106 -113 314 -117 283 -293 -165 -52 -197
4193 -197 93 -137 149 -55 180 -15 -27 313 84 67 -90 5 -125 69 61 165 151 260 119 54 106 -119 -9
4216 -9 154 -9 -223 -34 18 70 -100 220 -129 139 2 140 -29 -99 25 -36 -89 -30 4 34 107 40 42 113 46
4241 46 25 50 -52 216 40 215 -314 -98 -278 110 68 40 51 80 88 148 286 86 13 -310 163 -77 27 -44
4265 -44 -245 20 91 -91 123 195 33 107 65 96 -149 -80 150 2 46 134 65 -64 -55 -189 -185 39 -131 -169 67
4290 67 244 227 -37 -107 48 -76 -13 -71 -182 95 -84 -77 139 30 -99 -166 99 -175 -307 -140 27 29 111 -205
4314 -205 -34 35 -333 -514 -148 -46 -100 -47 81 23 -218 215 71 -163 157 -284 -105 0 -371 -32 -70 -116
4336 -116 -14 59 61 145 46 -419 -59 -169 167 17 -70 225 -155 126 -85 -53 -13 111 52 -78 -162 -172 54 -176
4360 -176 70 -48 -64 52 63 194 -327 117 342 280 48 -35 213 23 -223 33 257 315 -15 49 178 93
4382 93 -43 22 251 -18 -15 -23 -5 203 54 -23 -37 -30 126 -81 -313 183 59 -128 241 247 241 71 313 -40 -50
4407 -50 77 -68 -110 1 165 23 -314 4 345 11 -240 -19 -12 175 -26 -71 -307 125 -246 -246 -153 -64 134
4430 134 -63 -130 -13 -162 -49 11 -153 17 103 67 351 -11 266 14 46 -80 232 -278 -72 -45 11 -44 -141
4453 -141 54 -209 75 -255 87 143 42 -30 -11 111 338 -70 -213 -87 -26 -30 -196 133 -186 -290 37 -138
4475 -138 -119 -82 -81 -64 -20 -128 -66 86 241 180 -58 225 228 -124 107 53 -63 -238 -108 110 -208 86 99 -116
4499 -116 94 54 159 188 197 -19 -5 -32 -18 191 -31 303 89 -41 171 14 -47 262 115 -40 -223 -102 -23
4522 -23 -223 -133 -68 21 -123 -99 -302 -49 -47 -169 -78 -120 -168 -315 -23 86 176 31 -150 -144 -41 256 -32 -11 9
4547 9 267 -109 129 71 8 46 -15 -275 98 -163 202 -67 13 102 -191 35 -98 284 -243 -282 -135 -30 84
4570 84 -71 137 -329 111 -96 119 261 139 -179 25 2 -320 49 -44 -138 -144 -72 109 -315 -120 65 164 -3
4593 -3 -72 104 106 -110 -15 -168 -100 -115 -1 -3 31 -28 160 -175 45 21 -68 -137 14 264 22 242 45 -95 112
4618 112 259 249 66 3 -214 -196 19 -274 -79 -104 -224 21 99 205 -98 65 -174 -128 -206 -15 119 362
4640 362 -341 286 316 -72 171 -112 -202 -191 54 -114 367 -119 -166 221 -5 302 220 -160 -15 42 242 -262
4662 -262 -75 204 26 -205 -147 124 101 -113 -91 -75 221 32 255 -143 -19 -67 134 -158 -209 -90 -176 52
4684 52 -93 -123 151 -11 -104 78 -26 -102 130 230 50 -43 47 -9 -220 111 -133 -298 -239 -80 0 -97 -351
4707 -351 -123 -68 165 141 225 9 78 224 -6 80 83 -71 -138 106 203 -123 -161 -50 86 87 -124 0 -73 -58 -463
4732 -463 -175 -29 126 -29 30 4 305 -46 -200 -101 101 196 55 -44 -185 205 -97 199 -339 -66 -365 80
4754 80 196 265 -58 45 175 144 96 -71 279 -143 -50 135 -109 166 -186 81 200 -123 173 43 58 35
4776 35 36 -170 133 77 132 15 -166 104 41 -3 -112 -44 -50 307 -8 64 -113 -129 -9 37 12 -226 -169 198 -90
4801 -90 106 -193 13 -130 -326 -92 107 187 -105 121 -35 162 -96 -247 96 25 18 -163 -107 -329 75 208
4823 208 215 -174 59 -124 -134 -131 -180 175 7 86 76 209 -33 107 -210 63 195 -275 51 -354 102 22 -87
4846 -87 116 265 -83 -183 174 -123 19 -148 -9 277 117 -91 175 30 5 106 -67 21 103 118 -66 8
4868 8 -276 -89 135 -145 -92 251 252 -444 139 58 423 66 116 -342 -297 31 216 86 71 33 225 -127 232
4891 232 23 -130 -98 173 -217 98 72 117 77 182 -9 117 100 27 -98 112 416 -84 -9 -91 125 229 -58
4914 -58 -227 -46 91 -3 -6 170 -41 -7 69 -136 -197 85 -140 144 62 29 -151 146 358 -203 103 42 -186
4937 -186 -64 -275 -21 -126 149 39 -109 317 120 -49 -279 241 -70 52 -223 227 -195 10 -347 1
4957 1 125 -319 -322 22 -17 27 -21 -128 3 32 103 -138 2 -190 -35 -40 -214 96 -160 -276 -197 183 -117 -102
4981 -102 78 32 116 252 -53 -27 -74 -40 -49 -179 27 -41 -55 390 -44 -249 104 -189 -306 -29 10 -27 44 -260
5005 -260 -229 154 76 -140 -64 289 223 90 -64 -126 -222 -218 -278 -58 -31 15 -89 -36 77 -63 127 211 -234 -40
5029 -40 -140 77 -162 -248 -254 242 -67 256 -39 83 196 -43 257 -239 181 -42 -31 -92 204 -90 -59 19 42
5052 42 -79 195 172 -157 -9 50 -15 87 -134 -86 -51 58 -96 -178 165 26 -73 -236 -6 172 -52 197 -15
5075 -15 96 -97 -131 -56 123 -74 -31 35 198 -24 200 44 -57 153 204 -182 -163 -187 16 -60 144 -50 192
5098 192 85 -48 21 121 -93 -157 -52 -91 -143 -42 -58 127 -253 -15 -164 -44 0 -82 -132 -55 151 9 -60
5121 -60 -77 -98 -31 -162 244 106 2 -71 51 6 78 47 28 -118 -59 145 26 -235 -123 61 -209 55 -32 -88
5145 -88 -327 42 -22 -21 -415 69 68 -160 -62 50 18 96 223 -232 242 102 -21 180 37 123 16 -63 82 120
5169 120 351 164 -317 -46 -83 139 52 -370 -28 18 -82 -20 246 17 -180 13 -77 -93 108 -136 160 149
5191 149 -91 190 -72 204 86 -11 291 -72 -12 -116 300 63 69 -141 -23 -50 -34 -74 -309 39 42 -125 -174
5214 -174 -124 -210 -11 -61 232 65 -43 228 53 120 103 130 -213 -135 25 83 -63 44 174 252 -57 99 -145
5237 -145 -156 286 156 141 -66 167 149 -189 -41 69 36 -8 318 117 20 138 96 -26 90 153 -283 -34 81
5260 81 103 -110 -48 65 -9 -1 -55 1 -8 -29 -51 108 60 -311 384 162 -12 150 -128 148 62 99 176 -70 139
5285 139 337 340 31 -5 -240 60 -84 65 -138 -82 203 -196 -171 27 171 -93 95 -66 -98 245 -298 145
5307 145 276 15 -85 195 203 -93 -62 178 -117 35 259 -61 20 214 -220 -150 190 -40 172 -179 -92 -25
5329 -25 330 228 -191 121 -73 -202 -1 -229 4 104 187 65 128 442 -14 -292 195 98 -77 -36 -336 170
5351 170 291 64 52 123 115 -138 176 -95 -164 33 52 -139 -260 200 -363 254 -105 -193 410 -83 -11 68 1
5374 1 -90 22 119 -110 -40 -238 145 186 115 109 215 135 13 92 16 84 -12 269 -137 72 3 54 186 336 -96
5399 -96 322 164 -94 191 -89 -16 169 157 44 -187 49 -166 -104 -34 -250 37 230 -293 64 -114 -92 36
5421 36 -106 54 27 -224 196 30 -93 -126 38 2 -146 106 117 -305 319 34 -93 49 -38 123 60 54 20
5444 20 -25 37 119 -112 233 36 164 46 -127 109 -269 -108 -26 -177 -112 -73 17 -13 -9 300 71 85 -66 -27
5468 -27 -27 16 79 144 -61 20 -46 106 112 139 -197 -103 155 28 78 -39 4 27 -213 -118 196 -87 140 -200 -94
5493 -94 64 -228 186 -201 114 -237 -55 -2 -203 -343 20 320 278 9 225 -125 -10 -14 -115 318 -134 69
5515 69 -190 -105 15 -11 -129 46 -57 -133 34 -68 74 36 19 276 130 161 106 -92 215 -197 62 -221 -89
5538 -89 317 44 457 98 -58 -57 158 173 116 -161 97 121 -193 158 -94 54 1 -221 32 -135 123 125 19
5561 19 -72 -168 8 50 24 -189 189 109 154 -96 113 -26 129 59 210 -163 19 -155 -32 -61 -40 -166 79
5584 79 309 -71 -97 60 -70 81 -65 -117 -258 11 -100 -174 215 44 -255 -6 -18 114 -125 43 15 -284
5606 -284 -123 224 24 101 126 446 -88 158 34 -284 -20 -159 -101 -36 -64 29 367 59 -190 83 278 -113
5628 -113 -19 50 -222 27 -129 87 -31 97 -118 -261 112 226 -77 215 29 73 106 -157 -69 109 6 -10
5650 -10 41 -189 86 209 69 68 -72 346 -145 180 130 -38 -203 -189 -236 -89 -11 11 6 248 -151 110 235 54
5674 54 176 -105 163 -154 -145 192 352 102 11 -67 9 -228 130 -39 16 -173 -17 169 -101 163 209 -228 233
5697 233 17 -155 -46 -124 105 242 218 -194 -306 -56 69 216 -124 188 195 -97 -355 -143 140 -124 266
5718 266 113 162 -94 -23 26 -158 52 -249 -150 41 -116 -31 68 34 82 107 32 99 -34 173 172 90 -155 -136 159
5743 159 -14 177 -10 262 -224 138 -32 -351 -117 -359 53 219 61 102 -292 -161 -322 27 -74 95
5763 95 -88 -147 -165 -35 -137 -102 -94 -138 136 68 -279 154 -130 -8 -24 -10 -231 262 -2 321 5 125 -64
5786 -64 -113 224 -95 92 -350 95 -65 99 131 221 103 -86 -47 -135 207 180 17 76 160 -77 146 18 -261
5809 -261 -29 -283 -51 -36 119 -160 -88 46 -370 -263 15 14 29 -222 -47 6 -354 -42 325 -61 -271 -163
5831 -163 177 -81 -365 -84 280 316 -140 23 70 -196 -128 6 -111 60 -294 35 -14 -68 -102 -151 7 2 -351
5854 -351 -324 -144 94 -154 -43 -290 35 -275 -118 142 -119 -117 23 70 30 -250 -150 110 -102 -86 -325 122
5876 122 61 -16 33 -295 -34 -174 -109 40 -71 -45 -320 -37 58 88 -50 134 413 19 194 -47 -8 -217 22
5899 22 -110 -152 19 248 68 -77 -55 -324 146 209 129 -129 -100 -134 -131 -198 -145 -431 -212 -81 33 -222 200 13
5923 13 -91 203 62 287 -154 -180 62 87 205 -18 -147 -38 -14 -300 158 198 232 246 -152 44 162 8
5945 8 72 -29 -104 -119 49 95 302 51 -123 -84 -73 195 115 115 29 73 165 68 9 157 74 -35 -125 -135 -152 9 329
5972 329 200 -228 1 -184 -137 -135 187 -93 122 100 64 -19 -153 -19 27 37 160 32 214 125 -245 -14 -38
5995 -38 103 254 301 124 -112 64 -97 165 -115 -186 8 244 -8 -1 -288 -212 -292 -116 101 352 -73 191
6017 191 -304 -111 -233 -10 -169 -65 158 -166 132 122 119 -129 4 162 -113 -143 -162 33 10 253 149 353
6039 353 135 -52 199 109 -86 21 -80 79 113 254 -22 54 -13 -88 181 -13 54 -25 -33 -102 197 -110 1
6062 1 145 89 123 -85 136 -29 -150 -46 -208 39 -133 -141 146 4 157 -83 -22 22 -78 -24 -48 -206 -41
6085 -41 -118 -151 170 -20 0 30 185 -253 55 222 39 7 85 74 -234 53 137 -61 -276 -161 17 -9 129
6108 129 152 -82 136 -117 222 -41 -235 -62 181 -350 -436 -99 76 141 248 -40 -61 -18 -194 -62 43 25
6130 25 14 23 -24 -32 -119 58 53 -349 217 -131 109 -35 -154 -164 50 281 -297 -145 83 151 -60 130 112 -146
6154 -146 -235 91 194 -26 -105 -155 125 -196 -101 -44 21 -173 143 -75 -75 -47 393 -107 -306 -93 -117 216 92
6177 92 61 33 187 126 96 63 84 89 -39 32 190 63 -9 0 -5 49 103 -38 206 155 49 112 180 -134 233 86 113
6204 113 50 -209 242 102 -10 125 -118 296 25 85 -7 -159 -148 66 -37 299 -184 -137 -160 -331 -311 16
6226 16 158 -212 -38 28 -29 276 -151 -61 8 49 133 53 -135 -66 89 214 -181 -233 105 -69 -119 -131 86 -47
6250 -47 102 178 -102 29 -190 -163 25 141 -22 -174 161 -166 -240 -206 -169 -9 55 -84 228 195 55 -21 -16 191
6274 191 235 22 -215 -88 238 290 -115 -191 15 17 16 -40 -25 -141 -6 -40 -145 232 246 128 -111 -169 -124 277
6298 277 -100 -1 17 -106 -191 -26 -278 177 80 -61 528 -147 159 217 -33 -139 111 69 -245 31 -108 184
6320 184 164 -31 -353 -150 27 -166 -43 -46 217 -253 -304 -80 108 -33 -114 197 -205 -35 284 269 76 244
6342 244 -89 -163 -142 -22 -169 276 29 176 76 -116 -19 -124 -265 236 41 153 26 305 -121 101 -122
6363 -122 -1 -5 335 186 -159 122 2 -86 -124 26 117 -45 44 311 192 279 -78 -2 -186 94 -53 -78 19
6386 19 170 121 162 145 119 266 -335 68 -95 -102 -17 178 -173 110 -64 40 140 -274 274 -25 118 -134 133
6409 133 -25 11 156 -16 422 -264 -302 -255 162 -77 -21 152 -36 169 308 45 174 -60 -252 45 -171
6430 -171 -170 153 83 -169 -49 -133 6 106 175 122 -345 -28 -111 -127 65 130 178 301 249 141 108 191 371 179
6454 179 104 241 189 -289 245 -26 38 117 -75 389 -100 -286 92 142 -141 233 31 0 -202 -5 -70 251
6476 251 -248 -49 39 -213 -132 -221 -304 63 70 -262 -55 -227 -12 -238 243 -249 -117 -204 -84 -130 -11 -26 74
6499 74 3 -35 -112 -81 121 138 53 -119 -161 -119 -310 -69 286 76 0 193 -113 100 -8 621 121 -188 -128 -102
6523 -102 113 -285 28 -237 43 97 372 95 86 -12 -88 -53 82 -217 93 -86 -146 -203 -112 15 50 46 -217 -137
6547 -137 -88 10 20 76 12 -101 -257 -256 123 58 94 26 -74 255 54 -54 -57 91 96 -372 87 -85 184 -11 -228
6572 -228 140 -290 124 241 187 -38 17 -10 -231 81 278 236 -165 23 -4 -187 -154 62 0 45 0 -85 -8 -88
6596 -88 -313 28 83 -163 176 -151 204 -62 16 52 -348 5 -50 -113 -42 302 -157 -61 79 45 -76 153 62
6619 62 -298 40 70 139 -82 14 173 -251 63 -58 -143 72 -47 15 -111 56 7 -51 -198 -11 117 -2 -122
6642 -122 -23 -154 173 -77 195 -281 -43 -176 161 101 139 72 -8 193 170 -1 162 226 46 100 -118 -143 -144 165
6666 165 122 -11 -14 -325 -100 -176 56 -141 0 80 -74 118 143 25 284 -24 82 25 -90 -210 -305 -130 -147
6689 -147 37 167 65 90 174 -85 -1 152 -115 310 79 -226 162 57 164 238 -63 95 -120 -108 48 169
6711 169 -274 138 23 64 -150 -42 67 18 -69 -48 -87 102 54 -83 -43 83 -285 -43 212 135 236 24 166
6734 166 -246 120 68 -139 -297 124 170 60 -303 92 -91 74 -98 -75 145 -29 -4 -281 131 -217 -26
6755 -26 50 55 76 236 -37 108 -27 -157 116 187 -237 -226 -212 -189 -289 35 110 14 272 -44 -152 -165 27 0
6779 0 -156 -66 -33 39 289 -99 237 65 -11 286 -324 -312 3 -290 -108 11 -81 305 -59 -19 238 -27 -27 63
6803 63 -170 -54 68 21 -25 121 -55 511 -100 -43 -189 -17 333 5 -125 -6 43 161 -3 121 184 -25
6825 -25 114 -159 64 101 50 -163 90 -76 -169 124 -100 69 67 164 49 -45 290 -111 -305 164 1 -62 7
6848 7 48 -12 129 -256 202 -54 -37 188 -159 -81 -77 -47 29 254 -77 138 -137 -143 -104 116 284 -66 21 162 27
6873 27 256 -4 -31 -42 -152 -32 -38 -133 81 266 226 -122 133 19 -90 273 -38 150 18 -71 -164 103 -16
6896 -16 162 -7 -280 -7 29 284 135 141 159 -85 -112 -11 -29 5 2 -175 268 -159 -96 -294 489 100 -242 -72
6920 -72 39 220 74 88 -86 -5 23 79 128 -16 -50 34 -34 66 -289 -11 23 242 -9 -246 129 30 137 19
6944 19 -25 58 210 259 -95 44 -98 84 -43 155 124 -27 -146 92 267 60 32 301 146 -23 59 -203
6966 -203 48 -79 -54 -95 -167 56 249 16 227 211 -131 194 -9 2 -194 106 -200 -161 80 172 138 -55 70
6989 70 -29 -11 -250 26 153 -92 -477 6 32 -256 77 -81 117 -107 85 -118 18 151 -124 -18 -390
7010 -390 182 -14 -93 67 -42 -236 -148 -4 410 -90 -293 246 -143 97 99 154 -34 420 -102 -88 -262 -211
7032 -211 5 -303 78 -330 150 -457 123 135 75 -17 46 -4 -59 31 -29 -20 151 288 -98 -99 148 282 -38 304
7056 304 -216 -202 64 -8 -26 -29 -30 -31 105 -100 -32 -223 59 -7 184 250 38 236 -69 -80 -114 -115 232 99 266
7081 266 -3 -66 118 -208 -156 -32 -221 254 13 134 145 -84 -47 -36 174 34 421 -30 -75 369 169 53
7103 53 78 46 -180 386 -155 178 308 145 78 -40 85 -44 -136 27 -57 -51 27 23 -155 -114 -58 -45 150 55 103
7128 103 -195 134 317 116 -31 -192 160 27 219 84 -102 282 -175 115 -98 -214 169 64 -166 -134
7148 -134 86 -12 38 -219 -77 32 -36 -68 -56 21 -181 -313 -142 222 70 105 166 157 -86 14 -34 -227 -66 -73
7172 -73 361 -105 111 -11 161 -60 -268 -256 205 32 117 75 -27 215 -184 113 -284 -63 -159 -272 -180 -240
7194 -240 -61 122 240 48 19 50 247 -122 207 -211 -99 126 -59 35 -306 -13 -257 -97 -69 -260 398
7215 398 -31 119 -6 -125 46 347 -86 40 33 -124 -102 -45 -71 -339 134 97 -102 -45 -294 -56 -22 188 46
7238 46 -24 46 -37 -118 203 267 -126 46 -81 -67 119 171 80 -36 -22 42 67 212 100 60 105 -397 266 69 44
7263 44 -27 -116 242 -175 -293 -33 -189 -164 -46 138 162 -203 35 110 17 182 132 -162 33 -141 -132 197 -105
7286 -105 -33 -97 56 -319 -188 -259 139 -5 -51 236 -227 21 135 45 -77 -130 118 -122 82 88 55 114 12
7309 12 -183 -142 -62 133 89 8 84 21 -165 -236 68 27 367 -143 91 -30 -127 56 242 84 -110 -58 215 -16
7333 -16 -200 178 28 63 75 89 -150 83 -45 -128 -113 51 134 137 102 -93 -6 255 167 172 -109 232 -165 126 1
7358 1 -357 12 -29 -171 -36 164 -96 -84 218 36 -113 -47 -40 4 97 -68 119 -92 -93 109 -93 44 303 317
7382 317 128 127 166 52 113 250 -83 -200 -83 56 14 -149 11 37 -400 11 -17 -112 -4 130 -97 -46 112
7405 112 -47 152 64 5 5 54 107 -227 224 107 -110 -48 31 67 -101 -98 151 20 -132 124 34 -114 27 146
7429 146 88 63 195 -45 33 -229 -181 -69 76 26 45 252 210 109 -151 -95 -188 -54 148 -34 -43 8 -110 -64
7453 -64 93 -43 3 -124 -102 106 -35 159 159 232 -49 276 33 205 -5 -60 42 50 225 62 -7 14 43 271
7477 271 220 153 61 139 80 45 -144 -25 50 -190 272 226 185 26 80 15 152 -189 -345 -137 45 211 -173 140
7501 140 99 -11 132 -86 -104 195 -229 -37 -211 31 -80 -62 -74 27 -73 -372 140 -155 87 195 -86
7522 -86 -81 132 77 -55 -143 -114 226 -274 -18 -143 -226 140 -190 -73 -101 -8 26 119 -238 -9 161 115 -101 210
7546 210 -117 -119 -151 0 -55 -105 -11 -339 76 -34 57 45 -10 126 437 -205 -28 -321 23 108 -266 -140 -88 -38
7570 -38 -34 74 -27 176 -103 40 -94 -93 19 -39 -205 -2 44 -126 255 25 -23 -152 38 47 262 28 -96
7593 -96 -251 4 195 209 43 55 23 102 -62 250 151 187 -76 -49 -34 -231 18 181 -37 -189 -83 -5 19 -216
7617 -216 188 103 -248 367 77 279 -113 270 -130 153 -124 114 95 190 -334 44 195 171 -55 37 -236 87
7639 87 -4 -59 298 27 75 23 214 -149 51 -174 260 217 -49 -95 -92 47 -288 -34 216 179 128 -62 279 5
7663 5 -217 142 42 -6 330 -12 156 124 -34 -214 -87 -164 11 -227 -147 -226 112 19 241 -219 102 163 52
7686 52 -231 24 -92 -212 185 160 -102 -109 14 -23 205 39 340 -134 -26 -113 -61 -21 116 -4 73 -143 -26
7709 -26 12 -188 -26 102 -36 35 -12 -96 120 -91 -31 -135 -257 475 82 166 -13 -37 -361 -269 -190 45 264
7732 264 -51 345 -118 -13 -176 -165 0 24 77 -65 103 11 -113 71 -138 -102 -142 22 176 26 -102 -167
7754 -167 192 87 -38 -106 -233 407 -91 -276 4 -389 132 -119 138 -16 -108 -185 -21 -29 231 46 -326 355
7776 355 11 -85 169 -88 131 135 -204 281 274 -413 -71 136 -328 -120 87 192 161 -31 191 -1 -126 -89
7798 -89 77 -164 -291 -30 146 -145 48 -93 -19 193 -93 14 141 79 78 16 98 42 -162 -55 53 -103 -219
7821 -219 15 -257 -176 301 -217 -219 -41 -310 4 -169 56 26 -128 -103 79 -213 33 98 -13 -103 -46 -220 108
7844 108 263 90 -22 55 -28 -207 293 71 -82 -117 -93 7 51 81 -67 -107 153 22 -208 -231 -153 -141 27
7867 27 24 -169 -212 -72 120 62 -17 5 109 -261 -35 80 238 145 30 40 -136 -163 92 -223 -111 -194 134 -188
7891 -188 146 85 42 136 -143 -147 -320 46 -114 118 93 -132 218 -10 -160 246 -123 -252 -27 -25 26 -71 52
7914 52 143 -13 -133 -113 -289 117 -113 125 197 -150 -39 -51 -48 18 9 -359 -174 59 -44 190 125 -163 105 -85
7938 -85 -206 -116 114 -28 38 -182 -1 -195 -13 -58 47 -65 137 -247 31 11 -106 -48 23 10 -77 59 -60
7961 -60 129 85 -172 1 199 -32 -38 77 -120 239 -126 25 140 -17 225 158 -177 -5 -27 -107 78 -336
7983 -336 34 -9 239 -45 -7 98 136 203 12 -25 -270 158 144 125 142 122 -127 -65 -103 -97 -24 -204 61 78 111
8008 111 -3 -46 115 -11 -92 146 174 278 -70 -117 107 -85 142 95 -85 121 -127 30 63 -72 -164 49
8030 49 79 53 -83 5 184 -350 -85 -172 -203 64 -240 -28 32 -250 -188 -60 48 -48 -69 255 102 98 136 47 -121
8055 -121 -224 -22 111 80 -77 77 -143 -159 -127 -38 -35 -103 -27 -92 315 97 113 -264 -333 -69 7 258 -120 -276
8079 -276 183 -207 110 96 22 -112 -40 -79 96 193 169 -63 -220 -59 -110 56 47 -18 125 227 -210 52 -70
8102 -70 -52 145 -148 140 -138 67 1 -285 -159 5 117 11 103 -45 62 238 -37 -307 21 -55 -216 145
8124 145 -98 55 -315 -104 28 76 -90 186 -111 -87 110 -174 -143 -32 -112 -7 74 97 -192 -17 -103 17
8146 17 -109 -156 -71 258 22 -44 72 -225 -15 276 68 38 90 222 73 -73 324 -111 -179 -227 122 -370 33
8169 33 211 298 -137 -230 -64 -66 31 40 211 53 226 -218 -195 166 -34 200 -136 21 93 54 75 39
8191C9
##END NTUPLES=NMR FID
##END=
