##TITLE=1H_Ser 4559
 CDCl3, 8 sc, 
 7.2.2020
##JCAMPDX= 6.0         $$ Bruker NMR JCAMP-DX V2.0
##DATA TYPE= NMR FID
##DATA CLASS= NTUPLES
##ORIGIN= UXNMR, Bruker Analytische Messtechnik GmbH
##OWNER= root
$$ XWIN-NMR		Version 3.5
$$ Fri Feb  7 15:30:09 2020 Russian Standard Time (UT+4h)  she@DPX200
##.OBSERVE FREQUENCY= 200.1315
##.OBSERVE NUCLEUS= ^1H
##.DELAY= (6, 6)
##.ACQUISITION MODE= SIMULTANEOUS
##.ACQUISITION SCHEME= undefined
##.AVERAGES= 8
##.DIGITISER RES= 18
##SPECTROMETER/DATA SYSTEM= spect
##.PULSE SEQUENCE= zg30
##.SOLVENT NAME= MeOD
##.SHIFT REFERENCE= (INTERNAL, MeOD, 0, 15.7039)
##AUDIT TRAIL= $$ (NUMBER, WHEN, WHO, WHERE, WHAT)
$$ ##TITLE= Audit trail, XWIN-NMR		Version 3.5
$$ ##JCAMPDX= 5.01
$$ ##ORIGIN= Bruker BioSpin GmbH
$$ ##OWNER= she
$$ F:/spectra/data/she/nmr/H-F/1/audita.txt
$$ ##AUDIT TRAIL=  $$ (NUMBER, WHEN, WHO, WHERE, WHAT)
(   1,<2020-02-07 15:28:59.78 +0400>,<she>,<DPX200>,
      <created by zg, POWCHK disabled, PULCHK disabled
       configuration hash MD5:
       00 E9 B6 7A A2 85 ED C7 34 08 36 98 17 FE 4E 26
       data hash MD5: 16K
       37 EE 74 83 38 7D 6E 21 C6 C2 6E C5 89 69 8F 11>)
$$ ##END=
$$ 
$$ hash MD5
$$ 6C FD 45 70 46 DD 4A A2 FE 84 69 1F 69 F5 67 4F
##$RELAX= 
##$RELAX= 
##$RELAX= 
##$RELAX= 
##$RELAX= 
##$RELAX= 
$$ Bruker specific parameters
$$ --------------------------
##$DU= <F:/spectra>
##$EXPNO= 1
##$NAME= <H-F>
##$PROCNO= 1
##$TYPE= <nmr>
##$USER= <she>
##$AMP= (0..31)
100 100 100 100 100 100 100 100 100 100 100 100 100 100 100 100 100 100 
100 100 100 100 100 100 100 100 100 100 100 100 100 100 
##$AQSEQ= 0
##$AQ_mod= 1
##$AUNM= <au_zg>
##$AUTOPOS= <>
##$BF1= 200.13
##$BF2= 200.13
##$BF3= 200.13
##$BF4= 200.13
##$BF5= 200.13
##$BF6= 200.13
##$BF7= 200.13
##$BF8= 200.13
##$BYTORDA= 1
##$CFDGTYP= 0
##$CFRGTYP= 5
##$CHEMSTR= <none>
##$CNST= (0..31)
1 1 145 1 1 1 1 1 1 1 1 1 1 1 1 1 1 1 1 1 1 1 1 1 1 1 1 1 1 1 1 1 
##$CPDPRG= <>
##$CPDPRG1= <>
##$CPDPRG2= <>
##$CPDPRG3= <>
##$CPDPRG4= <mlev>
##$CPDPRG5= <mlev>
##$CPDPRG6= <mlev>
##$CPDPRG7= <mlev>
##$CPDPRG8= <mlev>
##$CPDPRGB= <>
##$CPDPRGT= <>
##$D= (0..31)
0 1.2 0 0 0 0 0 0 0 0.06 0 0.03 0 0 0 0 0.0002 0 0 0 0 0 0 0 0 0 0 0 0 
0 0 0 
##$DATE= 1581074939
##$DBL= (0..7)
120 120 120 120 120 120 120 120 
##$DBP= (0..7)
150 150 150 150 150 150 150 150 
##$DBP07= 0
##$DBPNAM0= <>
##$DBPNAM1= <>
##$DBPNAM2= <>
##$DBPNAM3= <>
##$DBPNAM4= <>
##$DBPNAM5= <>
##$DBPNAM6= <>
##$DBPNAM7= <>
##$DBPOAL= (0..7)
0.5 0.5 0.5 0.5 0.5 0.5 0.5 0.5 
##$DBPOFFS= (0..7)
0 0 0 0 0 0 0 0 
##$DE= 6
##$DECBNUC= <off>
##$DECIM= 24
##$DECNUC= <off>
##$DECSTAT= 4
##$DIGMOD= 1
##$DIGTYP= 9
##$DL= (0..7)
0 120 120 120 120 120 120 120 
##$DP= (0..7)
150 150 150 150 150 150 150 150 
##$DP07= 0
##$DPNAME0= <>
##$DPNAME1= <>
##$DPNAME2= <>
##$DPNAME3= <>
##$DPNAME4= <>
##$DPNAME5= <>
##$DPNAME6= <>
##$DPNAME7= <>
##$DPOAL= (0..7)
0.5 0.5 0.5 0.5 0.5 0.5 0.5 0.5 
##$DPOFFS= (0..7)
0 0 0 0 0 0 0 0 
##$DQDMODE= 0
##$DR= 18
##$DS= 0
##$DSLIST= <SSSSSSSSSSSSSSS>
$$ [...]
##$SUBNAM2= <"">
##$SUBNAM3= <"">
##$SUBNAM4= <"">
##$SUBNAM5= <"">
##$SUBNAM6= <"">
##$SUBNAM7= <"">
##$SUBNAM8= <"">
##$SUBNAM9= <"">
##$SW= 24.9337058887773
##$SWIBOX= (0..15)
0 0 2 0 0 0 0 0 0 0 0 0 0 0 0 0 
##$SW_h= 4990.01996007984
##$TD= 16384
##$TD0= 1
##$TE= 0
##$TE2= 300
##$TE3= 300
##$TEG= 300
##$TL= (0..7)
0 120 120 120 120 120 120 120 
##$TP= (0..7)
150 150 150 150 150 150 150 150 
##$TP07= 0
##$TPNAME0= <>
##$TPNAME1= <>
##$TPNAME2= <>
##$TPNAME3= <>
##$TPNAME4= <>
##$TPNAME5= <>
##$TPNAME6= <>
##$TPNAME7= <>
##$TPOAL= (0..7)
0.5 0.5 0.5 0.5 0.5 0.5 0.5 0.5 
##$TPOFFS= (0..7)
0 0 0 0 0 0 0 0 
##$TUNHIN= 0
##$TUNHOUT= 0
##$TUNXOUT= 0
##$USERA1= <user>
##$USERA2= <user>
##$USERA3= <user>
##$USERA4= <user>
##$USERA5= <user>
##$V9= 5
##$VALIST= <valist>
##$VCLIST= <CCCCCCCCCCCCCCC>
##$VD= 0
##$VDLIST= <DDDDDDDDDDDDDDD>
##$VPLIST= <PPPPPPPPPPPPPPP>
##$VTLIST= <TTTTTTTTTTTTTTT>
##$WBST= 1024
##$WBSW= 4
##$XGAIN= (0..3)
0 0 0 0 
##$XL= 0
##$YL= 0
##$YMAX_a= 581905
##$YMIN_a= -467817
##$ZGOPTNS= <>
##$ZL1= 120
##$ZL2= 120
##$ZL3= 120
##$ZL4= 120
##$ABSF1= 10
##$ABSF2= 0
##$ABSG= 5
##$ABSL= 3
##$ALPHA= 0
##$AQORDER= 0
##$ASSFAC= 0
##$ASSFACI= 0
##$ASSFACX= 0
##$ASSWID= 0
##$AUNMP= <proc_1d>
##$AZFE= 0.1
##$AZFW= 0.1
##$BCFW= 1
##$BC_mod= 2
##$BYTORDP= 1
##$COROFFS= 0
##$CY= 11.3945322036743
##$DATMOD= 1
##$DC= 2
##$DFILT= <>
##$DTYPP= 0
##$F1P= 16.9975609425685
##$F2P= -3.02152046262296
##$FCOR= 0.5
##$FTSIZE= 0
##$FT_mod= 4
##$GAMMA= 1
##$GB= 0.15
##$INTBC= 1
##$INTSCL= 1
##$ISEN= 128
##$LB= 0.24
##$LEV0= 0
##$LPBIN= 0
##$MAXI= 10000
##$MC2= 0
##$MEAN= 0
##$ME_mod= 0
##$MI= 1.114404
##$NCOEF= 0
##$NC_proc= 0
##$NLEV= 6
##$NOISF1= 3.799351
##$NOISF2= 2.8
##$NSP= 1
##$NTH_PI= 0
##$NZP= 0
##$OFFSET= 15.70392
##$PC= 1
##$PHC0= -9789.907
##$PHC1= 18.00082
##$PH_mod= 1
##$PKNL= yes
##$PPARMOD= 0
##$PSCAL= 0
##$PSIGN= 0
##$REVERSE= no
##$SF= 200.130013532006
##$SI= 16384
##$SIGF1= 3
##$SIGF2= 2
##$SINO= 400
##$SIOLD= 16384
##$SREGLST= <1H.CDCl3>
##$SSB= 0
##$STSI= 0
##$STSR= 0
##$SW_p= 3612.71676300578
##$SYMM= 0
##$S_DEV= 0
##$TDeff= 0
##$TDoff= 0
##$TI= <>
##$TILT= no
##$TM1= 0
##$TM2= 0
##$TOPLEV= 0
##$USERP1= <user>
##$USERP2= <user>
##$USERP3= <user>
##$USERP4= <user>
##$USERP5= <user>
##$WDW= 1
##$XDIM= 8192
##$YMAX_p= 0
##$YMIN_p= 0
$$ End of Bruker specific parameters
$$ ---------------------------------
##NTUPLES= NMR FID
##VAR_NAME=  TIME,          FID/REAL,        FID/IMAG
##SYMBOL=    X,             R,               I
##VAR_TYPE=  INDEPENDENT,   DEPENDENT,       DEPENDENT
##VAR_FORM=  AFFN,          ASDF,            ASDF
##VAR_DIM=   8192,          8192,            8192
##UNITS=     SECONDS,       ARBITRARY UNITS, ARBITRARY UNITS
##FACTOR=    0.0002004,     1,               1
##FIRST=     0,             0,               0
##LAST=      1.6414764,     0,               0
##MIN=       0,             -467817,         0
##MAX=       1.6414764,     581905,          0
$$ Real data points
##PAGE= N=1
##DATA TABLE= (X++(R..R)), XYDATA
0@%%%%jRrRj7J7k4L9m7N6p2Q7j04J22j45J74k05K38k76L20l67M22m85N52o27P10
30C76p98Q98j012J133j264J412j572J747j941K153k387K643k926L240l588L976
46B090m413M910n475O124o886P788q877J0231j1958J4246j7465K2355l0761M9218
60C1127j62684J16496K33160l14223l33572l8121K96929J99192n5549k13820r2640
71c33705N5549J29647Q6175L7508n1946j09510p4541J03111K23006J15450j65748
82A4996k61345j9869K94441K56174r5759l26865j43583J98174K78849K0148k30278
93a4917j91381M2293J64191Q0903n8342j03840p0907j9193L7840Q6732O1031o4144
105d9734j69046q8773J30181K20823L2263k19034k02539P9412K72938J33031j54617
$$ y = [0, 0, 0, 0, 0, -1, 8, -1, 8, -9, 8, -16, 23, -24, 32, -40, 47, -57, 65, -80, 94, -111, 127, -149, 171, -196, 226, -259, 293, -334, 376, -422, 476, -536, 597, -667, 745, -827, 920, -1021, 1132, -1255, 1388, -1538, 1702, -1886, 2090, -2323, 2587, -2888, 3236, -3650, 4138, -4739, 5492, -6466, 7780, -9685, 12670, -18091, 31127, -131557, -15061, 218099, -96124, -429696, -467817, -170888, 28304, -27245, -241065, -333705, -278156, -148509, -62334, -24826, -76772, -186282, -260823, -157712, 65294, 180744, 14996, -246349, -266218, 28223, 284397, 188638, -138227, -281810, -83636, 195213, 215361, -14917, -206298, -164005, 186, 81089, 22747, -81093, -152000, -171193, -133353, -46621, 14410, -49734, -218780, -307553, -177372, 43451, 75714, -143320, -345859, -266447, 6491, 139522, -15095]
116a5095k23553n828K01027J54347m0290j33060n5046N8423Q5059M2649o53k6804
128D1176n1616m2594L3809J11189O5055q6886j58550l1415J49676J46772n2365
139A24251j94204r2745J14135J58795J353j38448r7838M1121R8081L2976m5560
150A917m8279o226J1742R220K2733L4137l029n9794m9307M2176R9921L2019q7755
163e25r8151K4823J18302N7480p4895j01194Q99Q6910N2778m0472o5786q458L9865
176h424K2571j6800j6933O795P011j6161j5289J9228L5369k742m6674k5980L7884
189b0145N3520n458n6309k6324L9458M7076j0331m6647j5428L1600K7107j6802
201A317l3999k846K7039J0905k5482k7564P013K7481K779k9410k1690J3252K4150
$$ y = [-15095, -238648, -244476, -43449, 110898, 70608, -62452, -117498, -59075, 25984, 68633, 67980, 41176, -10440, -53034, -19225, 91964, 157019, 70133, -88417, -119832, 29844, 176616, 124251, -69953, -162698, -48563, 110232, 111585, -26863, -124701, -83580, 14501, 47477, 1917, -46362, -52588, -40846, -31626, -8893, 25244, 22215, -37579, -86886, -44710, 55211, 87230, -525, -98676, -73853, 44449, 101929, 27034, -74160, -73261, 13649, 66427, 25955, -39831, -48289, -8424, 14147, -2653, -19586, -12791, -5780, -21941, -37230, -18002, 17367, 14625, -32049, -58029, -20145, 33375, 27917, -28392, -54716, -15258, 31818, 21487, -25160, -40588, -8988, 18119, 1317, -32682, -35528, -8489, 2416, -23066, -50630, -43617, -16136, -13357, -42767, -64457, -51205, -27055]
214b7055k837k3639o895J7751J0594j1094j0215J4227K1436k555k0993k406K9593
227a4088K8403o369k8877o576K9731L4426L2k8684j8148J7141L0894P143j9676
240B5352j8185o07Q683O418J487n480j4849j7222k484J6936J4381j2550l2742
253c0862j6344J7176K8734M628k5921k8925K633L2525K5140j0249k7242q914J9366
266a8255K6919J0941q689j3594k109J3416K0708J3341n247j8752q366J5535K4038
279D9886O455j6731k2123n009J7809K0164l732k6116k0859L653J8605J0345j2711
292A9636k4050j2293Q353J3964L925j0410j6808r309R069J7653M612j2651j4831
305b3140k93J4290J5218J528j2472r859N022J5213J1731k677j2660o065R275J3536
$$ y = [-27055, -29892, -53531, -60426, -42675, -32081, -43175, -53390, -39163, -17727, -20282, -41275, -43681, -14088, 14315, 7946, -20931, -27507, 2224, 36650, 36682, 7998, -10150, 6991, 37885, 45028, 25352, 7167, 6560, 15243, 21661, 23148, 17668, 2819, -14403, -16887, 49, 14430, 1880, -30862, -47206, -30030, -1296, 3332, -22589, -51514, -48881, -16356, 8784, -1465, -28707, -37621, -18255, 8664, 19605, 10916, -2678, -4787, 8629, 29337, 42678, 37431, 18679, 10313, 25848, 49886, 56341, 39610, 17487, 12478, 30287, 50451, 46719, 20603, -256, 3397, 22002, 32347, 19636, -4414, -16707, -8354, 5610, 9535, -875, -17683, -26992, -17923, -270, 4342, -8309, -23140, -23433, -9143, 6075, 7603, -4869, -14728, -9706, 5507, 17238, 14561, 1901, -4164, 5111, 18647]
319A8647K793p362p310j659N010P763K134p793q178k99N228M054j844o908m855
334e79J112L232J488j592l905m529J20N705J567m326l289K67K229J400R16j702
350a886j744j32K263J726N6k079j370J918K843o85k480M74J274N63N74L04j820
367b01o78L072J996r57k791o55K479L355L87l765j960K136K647R75p11k445k737
384A47J725M827q4m651k821R39K807J181j768l192j659J141K024N50j623l478
400c935j482K992K903j627l205j80J497P21O55j38j607j479J684J647j7j884j697
417e152M92J839K52j665j244J29M19Q8J378q68k321K50K202J820r37j344p6J503
435c235K345K188J9j451k89K461M586K189k577k957J219M719K696j333l334k770
$$ y = [18647, 21440, 14078, 6768, 5109, 10119, 17882, 20016, 12223, 4045, 3746, 8974, 13028, 11184, 4276, -579, 533, 3765, 5253, 3661, -244, -4773, -4653, 1052, 2619, -1707, -4996, -4729, -2500, -1100, -184, -1886, -3630, -3762, -1499, 227, 283, -1796, -3166, -1248, 1595, 910, -1570, -1096, 178, 741, 1315, 1619, -201, -879, 2193, 4189, 3232, 441, -214, 2265, 5620, 6007, 2242, 282, 2418, 5065, 6040, 5329, 2884, 147, 1872, 6699, 6615, 1964, -857, 82, 2889, 4070, 2302, -890, -2549, -1408, 616, 1166, -457, -3935, -5417, -2425, 478, -1149, -4354, -4534, -3037, -2316, -1661, -1799, -3406, -4885, -3201, -1554, -1571, -3455, -5152, -4660, -2821, -2569, -4234, -5478, -5349, -4930, -4842, -3464, -4332, -6653, -6403, -4201, -2381, -3318, -4662, -4738, -3235, -890, 1298, 1317, -134, -423, 2038, 6624, 8813, 6236, 3279, 4498, 9217, 11913, 10580, 7246, 4476]
451D476L93L784K074l599o877l329K743L634j300o613o218q18K779K294j975o220
467a4772m150J305N403K964k922l964O78M335M719L425J013o27L02M271P605N407
483A4992R8k869J094N802O305J769l137k977M43K651K001k002n071m684j643j833
499A0939l127j687k609o306q422l005K669J354n363j0335m390N330O200r37n105
514b4794k837L072O598N352K157J572K862K687K781O722J0972O450n016o584M919
529A6913J7064J1806p555j6726l907J5063J3889m297j7239j2110J119R017L668
542B6705q458j3477j0446m259L089P053J691j4337k1509o400J8673K3114k808
555a369l0684k1641J7619L8793J3433k3430k7917L147L2018K7168k686k1250j1084
$$ y = [4476, 4869, 8653, 10727, 7128, 251, -3078, -335, 3299, 1999, -4614, -10832, -11650, -8871, -6577, -8552, -14772, -18922, -17617, -12214, -9250, -12172, -16136, -15458, -11123, -6404, -2979, -1966, -2593, -2291, 1980, 9585, 14992, 15090, 12221, 13315, 19117, 25422, 27191, 24054, 21077, 21520, 24171, 26172, 24170, 19099, 14415, 12772, 10939, 7812, 6125, 3516, -2790, -11212, -14217, -11548, -10194, -15557, -25892, -30282, -24952, -18752, -19689, -24794, -27631, -24559, -17961, -12609, -10452, -8880, -6018, -3331, -550, 6172, 17144, 23594, 18578, 11994, 16913, 33977, 45783, 38228, 21502, 17595, 32658, 46547, 42250, 25011, 12901, 14020, 23037, 26705, 18247, 4770, -5676, -9935, -6846, 207, 1898, -12439, -33948, -40348, -21675, 1439, -1369, -32053, -53694, -36075, 2718, 16151, -7279, -35196, -32049, -31, 27137, 24451, 3201, -7883]
568g883R367J9499J5617L902j1180j9831p576J7862L0880Q783l3326m3606p47
581a8239M6759L5584k5672o0404k7058L4044M9259K550m7518m2350M302L5384
593a3359K3818q452k7584k4129k546K1053L0406J2368k4575m4707j2583M5847
605b4443N9368n16o5048n1570K8696P8146L4575m8221p0829p879N8274N1231r233
618C2551m9955l3879R140L3372K4566j042k4698l4372j6955K6274N2486J7864
630C5352n0756o8969k863P5200O5165k7210r0691m4234N6433Q4965J2262o7084
642b2430o1222R297N9121L9092j3608m0586k7120L05K5103L5555J7313k9274n8356
655f6810k2650N2018P5110N708q2084p4235K9139J00702M8868o0864r1083j1181
$$ y = [-7883, 1484, 20983, 36600, 40502, 29322, 9491, 1915, 19777, 50657, 59440, 26114, -17492, -18239, 28520, 64104, 38432, -21972, -49030, -14986, 34273, 36823, -10695, -53045, -48743, -13359, 10459, 2007, -25577, -49706, -52252, -31199, -793, 11575, -13000, -57707, -70290, -24443, 34925, 34409, -30639, -82209, -53513, 24633, 59208, 10987, -59842, -67721, -9447, 41784, 32551, -17404, -51283, -42143, -8771, 15795, 14753, -9945, -44317, -61272, -34998, 17488, 35352, -15404, -84373, -87236, -12036, 53129, 25919, -64772, -109006, -52573, 32392, 44654, -22430, -83652, -74355, -15234, 23858, 10250, -30336, -57456, -57151, -32048, 3507, 20820, -8454, -66810, -89460, -37442, 37668, 43376, -38708, -112943, -83804, 16898, 65766, 4902, -86181, -97362]
667i7362P5833O8501j2029o2972l5103K2008M3668K4148k113j9804k7924j4553
679c7702K4016N3747K6971m3478p3291j0614P5620P3255k4475r6127n0167N4743
691b7502Q7090J0924p3383o4433J3214N9983K9416k3915l8124j5284N931J5465
703b0618J9960J5968j1866m1856k5855L5410O7417J7150o1274o4305K0404Q6816
715C7351M7988m7722p6109o711O8131N4740j8283n4349k0563K6830K9874J718
727D2895j3069q379q650j4813k182K5402K3296k1688n5120k1805M3307N2525j2708
740B9011o8672l9394L6980O1438L946n4219l8875K1244M5493J0333k6081j7845
752c6641J1009J6156M6l319J2077J3517j0757k2464N856L7240K1700k5692l9512
$$ y = [-97362, -21529, 46972, 34943, -28029, -63132, -41124, 2544, 26692, 24579, 4775, -23149, -37702, -13686, 40061, 67032, 23554, -49737, -60351, 15269, 88524, 64049, -32078, -82245, -27502, 59588, 70512, -2871, -67304, -54090, 5893, 35309, 11394, -26730, -42014, -36083, -20618, -658, 15310, 3444, -38412, -64267, -28857, 38560, 55710, -5564, -69869, -49465, 37351, 85339, 37617, -38492, -45203, 22928, 77668, 59385, 5036, -15527, 11303, 41177, 42895, 29826, 21447, 12797, -2016, -4198, 21204, 44500, 22812, -32308, -54113, -10806, 41719, 29011, -39661, -79055, -42075, 19363, 23309, -30910, -69785, -48541, -3048, 7285, -18796, -36641, -25632, -9476, -9430, -12749, -672, 12845, 2088, -20376, -14520, 22720, 44420, 18728, -20784]
765b0784K989M4278K6498k7605m3509j281L7483K0806k4182l3114M04K4547P546
778A4076k1216j8497R589J6123p560k1791k740K0316J0444j7383k0093Q385K5557
791d790O185k1064j3747J6813K4361k200k1018m204K2774J9531j0262k2261K074
804g808K8075J5534j7706k3918N364K6968J1562j8124k0809L920J9376M934j3788
817A3580r456N279N167o622o948O174J0413n367j9333p191J9077K1271p561k9266
831a0783j2181K2461K8526j165k8440j7900J5127K7201O335j6944j4868K378J1932
844A1679P816J140k949n804p333r10J2043J4893k704k2279j5559J1900K7167Q254
858C7354k2360k7262J109K7048J9325j1839k6143r672J3701J8717L479j1569j3481
$$ y = [-20784, -17795, 26483, 52981, 25376, -18133, -19414, 18069, 38875, 14693, -18421, -18017, 6530, 14076, -7140, -25637, -16048, 75, -7485, -29276, -32016, -11700, -1256, -18639, -38732, -30347, -4790, 1395, -19669, -33416, -16603, 7758, 5558, -15460, -19664, 3110, 22641, 12379, -9882, -7808, 20267, 35801, 18095, -5823, -459, 26509, 38071, 19947, -862, 3058, 22434, 27368, 13580, 4124, 9403, 14570, 7948, 1000, 7174, 17587, 12220, -7113, -14304, 4773, 26044, 18483, -10783, -22964, -503, 28023, 26858, -1582, -19482, -4355, 22846, 29181, 12237, -2631, -253, 11679, 19495, 20635, 17686, 11882, 4549, 3639, 15682, 30575, 27871, 5592, -9967, 1933, 29100, 37354, 14994, -12268, -11159, 15889, 35214, 23375, -2768, -12440, 1261, 19978, 23457, 11888, -1593]
871a593l401O172J1001P722m360j5192j1531O951J9831J0280j3445k3413o832
884a7810J8894K2796j562k4349j7921P725K1878J0889j1293j9596o404J0531J4330
897H108M826q226j3256o084P785J4929O560r184j5583m909J1898J7575K263j5185
911A517j5340K391J7573J1944n695j6518q437Q552J4360L706q038j1529l344O100
925b758J0028L418p592j0662l203P032J0248J834q940j0149q06R821Q898j518
939E651j0575p639L570J1118M840n456q647k879N633P424L019n217p299j038N992
954a503O445O29n629n941J260O322M590j897n713l899K674O337K345l439n217
969b636q20L478M103L17l456l145NK921K668o02l119k239L99K980J386j679k824
$$ y = [-1593, -4994, 1178, 12179, 19901, 15541, 349, -11182, -4231, 15600, 25880, 12435, -10978, -17810, 1084, 23880, 22318, -2031, -19952, -12227, 9651, 20540, 9247, -10349, -16753, -6222, 8108, 12934, 4708, -8548, -14632, -6847, 8082, 14642, 5458, -10125, -15034, -3136, 14439, 16702, 1517, -13823, -11432, 6141, 18085, 12390, -4128, -12565, -4013, 10347, 14053, 6015, -5514, -8858, -2758, 7270, 10688, 3096, -7566, -10769, -3737, 6511, 8345, -595, -10744, -11550, -1729, 7169, 5651, -4924, -12563, -8993, 2125, 6965, 1509, -7138, -10017, -4384, 3040, 6059, 842, -6457, -7495, -1503, 4942, 5571, -58, -5999, -4739, 1583, 6173, 4276, -1437, -5336, -2662, 3675, 6020, 2581, -2636, -3456, 22, 4125, 4442, 986, -2159, -2154, 767, 3435, 2833, -286, -2525, -2126, 854, 2240, 561, -2263]
986b263j111R47J705L27j512k003m43Q98J741m85j981m79J18J264J209k05r90
1003c263n93Q49K052J029l65j341J79K418J444l28p80Q6J388R89N52n27p44J94
1021C239J235N27q78r15p31N53K02l11j390j150m5J90m63J5j426q39K2P35J05
1040a325j481m86P15P59N75l38n00M71J655R03j68j59K68J153J650P52p09m9R58
1059D644Q36J57J51k88K1k65O18M52l39p52j271j43Q21L34j017j606l12j67P71
1078B645O7j180j558PQ35O39j80o51j078k30J313J256j82r03j579J42K150J688
1096C201j019k152l94J011K043N71r26j931j044K265K100l93j232j794L6J834
1112B176J445j17j651p08n99J876J749N32k102j504M78J475J575L95j908k652
$$ y = [-2263, -3374, -2427, -722, -395, -1907, -3910, -4353, -3455, -1714, -2199, -4180, -4659, -4541, -3277, -2068, -2273, -3263, -3856, -3007, -955, 74, -291, -1632, -1453, 965, 2409, 2081, 1301, 1387, 2775, 3764, 4316, 3789, 3045, 3239, 4474, 5001, 4123, 3208, 2477, 3030, 3232, 2921, 1531, 381, 336, 526, 63, 78, -1348, -2187, -2165, -1430, -1325, -2806, -3292, -2577, -1818, -1243, -1581, -2081, -1610, 45, 948, 780, 621, 889, 2042, 3692, 4444, 3735, 3686, 4644, 5480, 5637, 5788, 5500, 5521, 5256, 5874, 6326, 5987, 5235, 3964, 3821, 4642, 4976, 3959, 2353, 2041, 1874, 2645, 2712, 1532, -26, -19, 816, 1455, 1275, 624, -454, -684, 629, 1885, 1703, 800, -779, -637, 1513, 3201, 2182, 30, -364, 647, 2690, 3261, 2335, 404, -640, 1625, 3725, 3332, 2100, 306, 342, 2176, 3621, 3504, 1853, 1145, 546, 2422, 4171, 4703, 2601, 1097, 1575, 3050, 4625, 5020, 3112, 460]
1128D60K25J711K337o24l065l237J87L411J826j546m282k741O82L327K584k417
1144a162n002j779J398M218J712k262m076j759K882N149K631k602m824k095N558
1159b013P316Q93m503n325N22O654O156q39o363m538K159N813M060k049o547n111
1175c715M85N774M430k061r275p724J731R948N800p171j2883n270Q306J1629J331
1190A335j0627j1128J658J1093Q867j405r692o442L229J0143Q364j73p912q502
1204a1192K032J2906J2415k755j4931j0100P917J8293P787j2125j8017l249J4496
1217C477J4053k145j5174j1914J778J1431P774l421j0525j0036j749R304J2696
1230E549Q75j4758j6192J791J9682J6275p534k3033j1188J5951K4469N016j7575
$$ y = [460, 685, 2396, 4733, 4109, 1044, -2193, -2006, 1405, 3231, 1685, -2597, -5338, -4656, -1329, 1255, -1162, -6164, -7943, -6545, -2327, -615, -2877, -6953, -8712, -5830, -681, 1950, -652, -5476, -7571, -2013, 5303, 6196, 1693, -3632, -3110, 3544, 9700, 8861, 2498, -2040, 119, 5932, 9992, 7943, 1396, -3715, -3230, 2544, 6974, 4913, -4362, -12086, -10355, -407, 5393, -1778, -14661, -19931, -11625, 4, 1335, -9292, -20420, -18762, -7669, 1198, -207, -9899, -16341, -13112, -2969, 5395, 5222, -2690, -11192, -9160, 3746, 16161, 13406, -1525, -11625, -3708, 14585, 22372, 10247, -7770, -11019, 3477, 17530, 15385, 211, -11703, -9925, 1506, 9280, 5859, -4666, -14702, -16451, -7147, 5549, 6424, -8334, -24526, -22735, -3053, 13222, 5688, -17345, -28533, -12582, 11887, 16903, -672]
1243f72j7883K472J9424J4489l679j3543q316K971J1313J0945J333j0448j4307
1256e901l031J5023J9077j331k3115j9406P791K6805J2806j8376k7354n379K1215
1269a176K0265m221k1237j3121O314J4583P350l988q810q485k316Q742J4152N935
1283A3987j2715j9952j973K2713K1804o130k8034j4739J7655K7986N026k2243
1295C385k0322M315K1288J0816q243j3834m506M435N836M578K276m281j1959p814
1309a4030Q952J8254M930j9109k1041M592K5492J4409j5715k5552l711K1269J7955
1322A6695o890j9640o320J0717J0510j078n478j142M86k991j777P088R879k743
1336G316j6589p830J3715J9463j256k1282j3128J2210K1894K722j8690j3079Q308
$$ y = [-672, -18555, -16083, 3341, 17830, 14151, 608, -7708, -4737, 6576, 17521, 18854, 8406, -5901, -8932, 6091, 25168, 23837, 722, -18684, -10893, 15912, 28718, 10342, -17012, -22391, -1176, 19089, 14868, -6369, -19490, -13176, 1407, 8757, 4769, -4041, -12526, -14842, -6100, 8052, 13987, 1272, -18680, -20653, 2060, 23864, 17734, -10300, -25039, -7384, 20602, 25628, 3385, -16937, -12622, 8666, 19482, 11239, -2595, -7101, -2666, 3170, 7748, 10024, 5743, -6216, -14030, -5078, 13176, 18106, -1003, -22044, -17452, 8040, 22449, 6734, -18818, -22529, -1260, 16695, 9805, -9835, -16155, -5438, 5072, 3994, -1484, -2626, -2140, -5131, -6908, 180, 10059, 7316, -9273, -17103, -3388, 16075, 14819, -6463, -19591, -7381, 14513, 17235, -1455, -14534, -6226]
1349f226J6242K042j1187o396N746O628k650n698L186P845j920j1111k654J1778
1363E625J0377p382j5130k359J4240J1128q549j5512p41J4197P247r334j1541
1376g734L251J2258J846j1271p038Q607J1112k987j3305l108J2039R741n832j2483
1390d904n04J1638O661p216q173L422R325p29q111j860Q850O429p499j1724K153
1405b242J4725O517j2798j4592L201J6568P132j2526j4265J141J3358N574p408
1418D385q479Q58M356K92k522J851L815l205q361j944J1588J0243n995j7134n145
1433a5397J4992J7054l539j8821j0274J1767J7267J788j3580r878L580R487M453
1446H899k846m411k465k066N38N782O663k413j2528p748P562J6033L443j4966
$$ y = [-6226, 10016, 12058, 871, -5525, 221, 6849, 4199, -1499, 1687, 9532, 7612, -3499, -6153, 5625, 16002, 8620, -6510, -8869, 5371, 16499, 7950, -7562, -8303, 5894, 13141, 3807, -7734, -4483, 7775, 9621, -1650, -8688, -81, 11031, 8044, -5261, -8369, 3670, 13411, 7579, -4904, -5408, 6230, 12891, 5675, -2498, 924, 10249, 9520, 1409, -451, 8399, 14828, 7329, -4395, -2242, 12483, 19000, 6202, -8390, -5189, 11379, 18511, 5985, -8280, -7139, 6219, 11793, 4385, -4094, -3236, 1120, 1412, -1110, 741, 4556, 1351, -7010, -8954, 2634, 12877, 6882, -10252, -15397, -405, 16649, 13110, -5711, -15985, -4218, 13049, 14837, 1257, -8621, -5041, 4446, 8899, 6053, 1642, -823, -2889, -2351, 3431, 10094, 7681, -4847, -12595, -5033, 11000, 14443, -523]
1460e23j6015K832J8651J0474j0265j6961l467J1779J1836p94r718o923J144N680
1474b270N276K407k692p581n518N205J2123N707q842j4527k432J4480J4418l584
1488A2170j6900r489Q604J5536L959j0298j1739n77R137P997l02o492o510j049
1502e953M504P610K737n676j0084k455Q238J1191N10j1775r993L555J2781O927
1516A2117o487j2045l380Q199R374M91p313o399K8N873N109Q40m252o270j568
1531e683M997P223J499o931p611L32Q287P098l322r475m583N315Q559J872o096
1546A481o495m63N239N458k90n146m086k3M275M276k02m341m352P74M712M089
1562D906j915n273l398L049N462J417l828m725J65L357L943p59l484k394L66K759
$$ y = [-523, -16538, -13706, 4945, 15419, 5154, -11807, -15274, -3495, 8341, 7547, -2171, -9094, -7950, -2270, 3006, 5413, 2721, -4860, -10378, -5173, 6950, 12657, 3815, -10712, -13144, 1336, 15754, 12170, -4730, -14219, -5615, 9921, 13880, 3582, -8157, -8734, 403, 8400, 8098, 1606, -4904, -5953, -1449, 6161, 8898, 3222, -6862, -9317, -1079, 10112, 10622, -1153, -11146, -7591, 5190, 12117, 5630, -6415, -9795, -1596, 7778, 8269, 956, -5443, -5415, 458, 5567, 6407, 2155, -4115, -5683, -686, 6537, 8036, 1105, -6506, -6174, 2113, 9211, 5889, -3586, -8169, -2854, 5705, 7577, 1481, -5014, -5477, -238, 5220, 4930, -216, -4302, -4325, -50, 4226, 4024, -317, -4669, -3895, 817, 4906, 2991, -2282, -5680, -2631, 2831, 4248, 420, -4305, -4140, -783, 3160, 2401, -1083, -3477, -3111, -352]
1578c52K410m07k839k006O92K493J940j036k973j681J808K724J608k322k709k09
1594b859K595K082m54k550j189J342J428J299p48j727p28R36J691P79j107j864
1610a074m08J742J686n2j728j332P06J823O83j069j723l32J619P20k95j193m93
1627g20M17Q11N06m27n44l15J80K68J010m56o58j26M30P52M97m75j428L08J273
1646A303O29k04r06n45L90J157j88j24k89n17K73O47R0j89o46n11P1P51L37n24
1666A005p90m64Q57N65j94o14l79O3N52J94m00q19K79M79j38m16K54J47l59P8
1686a00J63k20N38j01m27K38j29K99K6m2k00O4N0L05J72k33P0k94n21M52Q17j24
1708H03p68n58R8N03P22n79j029J24N55M78l79k21m47R4J25K85k38l1n2o37K95
$$ y = [-352, 2058, 1651, -1188, -3194, -2502, -9, 1931, 895, -2078, -3759, -1951, 773, 2381, 59, -2650, -2859, -264, 1818, 1364, -1186, -2375, -1033, 395, 1694, 946, -781, -1509, -573, 1118, 1897, 790, -1074, -1482, 260, 1946, 1894, 166, -1166, -460, 1363, 2046, 977, -746, -1078, 541, 1261, 966, -227, -720, -303, 508, 1014, 587, 43, -272, -92, 176, 1186, 730, 72, -54, 376, 1128, 1625, 1150, -278, 30, 1303, 1932, 1728, 822, 277, 667, 1824, 1636, 1512, 1223, 706, 979, 1626, 1716, 1527, 881, 370, 441, 1192, 1529, 1005, 215, -249, 608, 1173, 979, 365, -14, 49, 601, 795, 395, -424, -145, 334, 196, -220, 34, 181, -178, -100, 63, -157, 381, 280, -147, 91, -38, 261, 287, 245, 45, 109, 159, 464, 636, 403, 473, 179, -342, 110, 927, 803, 35, -523, -425, 78, 800, 221, -808, -684, -129, 349, -30, -251, -698, -604, -479, -194, -432, -463, -515, -1152, -857]
1729h57L92J80n22n33K2O44M02J62p73n67O53P61R9K24m25k35J01L27N78j48l63
1750A22k19n2P19O57j94q58j28K36L45N32n99m80J24R5J02j10m95L59n37j34j6
1771e31l5M75k28k93m02Q2O05M60n68o43k86N53J331j33n20n33j72P99R50J75
1791A086o07r87J29J256P70M2j130j394K76J597J304o80j822j228P51J492J213
1808B068j415k104r32J350J792L99j604k058o04J556K315L27j816k347j5J971
1824a117K489O2k240k261L44K832K457k69l114k708J462L835K082j742l993j944
1840c825K562L945J061k980l710k75K846K920m2l130k828J93K818K704m1k986
1856g68l429L12L732L877j056m648l283J900N443K501l056m792j051M137M254
$$ y = [-857, -465, -285, -807, -1340, -1318, -674, -272, -110, -883, -1450, -797, -36, 63, 287, -138, -373, -272, 55, 633, 485, 122, -97, -149, 570, 1227, 1033, 175, 47, 283, 628, 1160, 561, 81, 205, 300, 402, 292, -203, 156, -381, -515, -531, -566, -91, -319, -612, -1014, -932, -327, 133, -435, -1078, -1364, -811, 520, 387, -133, -666, -838, -39, 911, 1086, 479, -508, -379, 877, 1647, 1689, 559, -835, -559, 1038, 2342, 1662, -160, -1388, -637, 855, 2068, 653, -1451, -2383, -1033, 759, 1158, -446, -2504, -3108, -1552, 763, 1090, -726, -3073, -3088, -1117, 1372, 1434, -806, -3067, -2723, 109, 2566, 2297, -817, -3525, -2063, 1772, 3854, 2112, -1881, -3825, -1263, 2682, 3743, 763, -2947, -3222, -376, 2544, 2502, -628, -3456, -3263, -445, 2259, 2218, -768, -4197, -3885, -153, 3724, 2668, -1980, -5263, -3363, 2080, 4581, 1525, -3267, -4318, -181, 4073]
1871D073n1l334l624M37L560K562k02k324l029j011K918L839Q37l847m971J13
1887d054N102M849j965o503l548L514O640J290m984m769K51M745L580j367l179
1902c98j848N74K220J686J077j615l154j696L101M867R82m841n161R99O313L504
1918F610l478o329j488M616M547j222m387k156J808K059L53j002m30m32j460j038
1934c429K678L493j369m347k814L738N762K03n550l992K467O524O37m123l758
1949c880J634M360N9k483j082J585Q95j928j618J818L222j317m372j627L747M344
1965C357k068n361j874M311L943j649m757p74L302K225j964k484J178L501o66
1980B20l598j492M877L903k308n909n66N431M552k241o243r02N322L689k599l981
$$ y = [4073, 4022, 688, -2936, -2499, 1061, 3623, 3421, 1097, -1932, -2943, -25, 3814, 4651, 804, -4167, -4054, 1048, 5897, 3932, -2571, -6119, -2605, 4035, 5325, 341, -4428, -4177, 568, 4148, 2781, -398, -2246, -1672, 548, 2234, 3311, 1696, -1458, -3154, -53, 4814, 5796, 955, -4206, -3207, 3106, 6610, 3132, -3197, -4685, -69, 4478, 3256, -1131, -3287, -1479, 580, 933, -69, -499, -931, -2391, -3429, -751, 2742, 1373, -2974, -5788, -2050, 3712, 3915, -1635, -5627, -3160, 3364, 4001, -122, -3880, -2246, 2114, 2173, -310, -1392, 193, 1088, -840, -2458, -640, 2582, 1265, -3107, -4734, -987, 3357, 1289, -4072, -5946, -1635, 2308, 659, -4098, -4872, -1570, 655, -1309, -3793, -2615, 886, 220, -3378, -4870, 7, 3910, 1602, -4307, -4873, 558, 5110, 2869, -3374, -4276, 1046, 4735, 2136, -1845]
1996a845J48L014P45k174r18K523J348l018l967J910O280J538o641n572K549Q201
2012D121K779o669o552J457P557L302m303m634k3L585J609o31l56R65j331k522
2028a646L82M724L635l753p132j029P447O876l353r546l635O897Q284r65p716
2043e30n053L056O597J254l577l115J37L94L84K149K289j342n184k960M222P884
2059F605P58q112p098L022J0097M243o743r015J33P578N745k451o472k829K966
2074a573L483R94k62j859k914j819K064N254K133m834p372l11P928O660l492r346
2090e266l742O275Q802J32p613n603J915O577K893k294l992j358Q20K322K326
2105B194J398k433m898j166M395N620J86o757n772K897Q395K888n152p649N3O032
$$ y = [-1845, -1697, 1317, 2062, -112, -1030, 1493, 2841, -177, -4144, -2234, 4046, 5584, -1057, -6629, -4080, 4121, 6900, 231, -6321, -4864, 2693, 5995, 1692, -2942, -2965, 620, 2229, 1598, 1242, 2207, 876, -1646, -1264, 3460, 7095, 3342, -3790, -4819, 2628, 9504, 6151, -3395, -7030, -133, 8151, 7186, -530, -5583, -2527, 4070, 5324, 1747, -1368, -1231, -837, -453, 1696, 3985, 2643, -2541, -5501, -1279, 6605, 7363, -749, -7847, -4825, 5272, 9515, 2772, -6243, -6110, 1468, 7213, 4762, -1710, -4539, -1573, 1910, 2904, 2642, 783, -2131, -3950, -1886, 3368, 5501, 667, -6705, -7016, 912, 7572, 4080, -5266, -9008, -2733, 6069, 6201, -1412, -7015, -5100, 1477, 4370, 2076, -1916, -3274, -2454, -132, 2194, 3592, 1159, -3739, -4905, -510, 5110, 5296, -1461, -7233, -4336, 4059, 6947, 1795, -5854, -5801, 231]
2121B31N146j693n949k221K134L489J246p36k223k189k29K456L365P86l718m162
2137d267J06N558M615k778o696k155M828N357L50n240l931J653M864J678j690
2152B252l284j112J330J914J149j83j867k026R0K294L132q80m199k184K176M081
2168B683J102l583l287L14L837K180j670k841r87J637J437Q35j232j446l57Q5
2184a293J758Q14r5k344j210P08K923Q12j865k496m05K922J719p37k619p67J398
2201g77J878K49j596j322O85Q89N44j87n00p87j04M36J120K5j203q12m37J471
2219d28J289l39j727q30J350J259l8j110j075L96J367L35l59o90q5J27M92P18
2237F52l15l05o74jJ339K46K17j799j42J195Q91Nj119o81L35J104K89m11r64o0
$$ y = [231, 5377, 3684, -2265, -4486, -2352, 1137, 2383, 1647, -576, -2765, -2994, -538, 2827, 3613, -105, -4267, -4161, 1397, 6012, 3234, -3462, -5617, -789, 4568, 4918, -322, -4253, -2600, 2264, 3942, 2252, -1032, -2144, -814, 1100, 2249, 2066, 199, -1827, -1737, 557, 3689, 2809, -1390, -3574, -1398, 2683, 3785, 202, -3085, -2771, 1066, 3246, 1576, -1265, -2252, -615, 822, 1657, 425, -1021, -1378, -1293, 465, 1279, 1184, -1160, -2370, -1662, 1261, 2073, 208, -2288, -2693, 229, 1948, 1211, -1408, -2175, -777, 1101, 1350, -246, -1568, -883, 6, 550, 363, -137, -924, -1028, -592, 528, 553, -650, -1462, -1899, -428, 861, 522, -1205, -2035, -685, 574, 536, -574, -1649, -1253, 114, 449, 90, -600, -685, -558, -66, 652, 337, 32, -642, -643, 696, 942, 1159, -640, -782, 413, 1304, 1309, 190, -491, -156, 948, 1237, 826, -138, -198]
2257a98P77J81L5j67n49o76N55O28N9m5j028j59M74J232j82q11m61o9J219K53
2277A068l82m57l49L52O57k12k52j74k03R9J40K03L9m89n94m0R05O1n00m90j71
2298g89J26Q13K5n33r93Q30L16k92L69l52j4j27K56K75M46m11l67m33N40P88R6
2319E69o57m23p8P05L23m71m08J4j45J32J12l06l32j63l08J70L11J57k98k49l27
2340a672O49Q50l38p07k32M33P26O31o55m85L51N93O91J35k33j2k62N69M86Q0
2360A598m38n43M48M65J84Q1r01p20k6J021J81m95r11m03P23P56p94j91k80o8
2380c13K70L26J34Rl54l1M66O22L39m24o4j51R92Q19k48n35j38O74O57n4o36n6
2402B304j16K14K86l75m49k96Q5r2N64n91l04j082J03M87K13q30p11P5N64L91
$$ y = [-198, 579, 760, 795, 628, 79, -597, -42, 586, 645, 600, -428, -587, -113, 1119, 937, 126, -335, -404, 815, 1068, 686, 229, -120, 232, 889, 677, 425, 251, 48, 147, 287, 490, 529, 40, -554, -594, 311, 372, -128, -618, -789, -663, 150, 175, -358, -1351, -521, -205, -497, -128, -480, -494, -621, -365, -90, 356, -55, -422, -855, -315, 473, 569, -88, -511, -589, 116, 439, -32, -440, -426, -571, -439, -327, -633, -965, -1128, -1436, -1266, -955, -798, -1096, -1345, -1672, -1023, -173, -511, -1218, -1450, -1017, -291, 340, -315, -800, -449, 144, 835, 970, 737, 725, 463, 1032, 1518, 1598, 1160, 617, 1065, 1530, 1714, 1795, 894, 174, 148, 1169, 1350, 855, -56, -459, 264, 1020, 226, 35, -245, -313, -43, 283, 417, 426, 72, 41, 507, 1129, 1468, 1044, 980, 829, 1821, 2640, 2392, 1857, 1719, 2393, 3050, 2996, 2360, 2304, 2188, 2402, 2688, 2313, 1864, 1568, 1653, 1561, 2125, 1534, 1230, 148, 251, 738, 951, 121, -590, -515, 49, 440]
2422D40j10p41n86Q79N20j09n34l42M68P41K31M5o98L63R9K64L66R2l34m20N8
2443F92L00L19l29n94n48M65P04k85p56r53N30L51K5m05j284j79Q86O71r5r87
2463a472l86k9N08Q04M2n55m19RM41R97M39j193o93J61J309R98p19j354j11Q73
2483c50J073o2p97j337K20R55Q87j40j279n82M08N48M29J63j229n39R3J491M62
2502D14o84q58p04N84J484P46q55j446l8J220R85K98r99j458K82J329Q20l13n66
2521B41r57K4J022L88j81r59n88M1J164R18n60r07j097K55J375O93n17j723J58
2540a210J039J246Mr93q88N61J091N14r0j113p2L85J49P29m1k99n82n59N01Q83
2560A255K26j093j461K00R28J422o07j843n54J239O52L9r46n77O9O17Q6L65M0
$$ y = [440, 330, -411, -997, -118, 402, 293, -241, -583, -115, 626, 857, 902, 204, 567, 666, 930, 1296, 1388, 1054, 634, 692, 992, 1311, 982, 388, -160, 305, 1009, 724, -32, -985, -455, -104, -79, -484, -1768, -1947, -1061, -390, -485, -1472, -1858, -1887, -1379, -575, -533, -1088, -1507, -1498, -1057, -60, 379, -814, -1507, -1346, -37, 961, 242, -1112, -1223, -350, 723, 661, -136, -1473, -1253, -298, 589, 449, -830, -1412, -1004, -456, -27, 136, -1093, -1632, -1539, -48, 414, -270, -1128, -1832, -1248, 236, 982, 127, -1319, -1357, -137, 848, 1146, 147, -1311, -1029, 300, 1120, 807, 241, -716, -692, 330, 718, 537, -422, -1010, -969, 195, 1113, 553, -354, -1451, -1196, 179, 872, 355, -1368, -1210, -171, 1075, 1079, 86, -802, -241, 850, 1364, 1274, 161, 89, 474, 623, 1352, 1311, 1012, 430, -129, 372, 1255, 1481, 388, -1073, -873, 55, 1477, 870, -973, -1527, -288, 364, 403, -543, -1120, -1051, -434, -348, 17, 57]
2579E7j06m74p56J187J288O2j426r28Q18J495R35j158j516J38J516R67p18j224
2597A57l16N72M40n0j77k56j86r15n52J082J274k81k204j181J327K295K0k313
2615a264j432Q53K024R09j531j355K87J471M86j39l65r8m72m6Q22J531K85j701
2633B65j737M57K614J505j254l504l39K525K555j105l010r77J406J701M10j496
2649A6j157q4M82K38P22L17p71j538n60J844K386j99k744k254J626L694J003k908
2667A13k734N87L331J538j304k356l33J413J318M4m89l54r10p88R95K034L66k252
2685B19k285L58K815K460j902l776p10K736L109p29k988k045J584K279O79j111
2701F93j385j07M39K49J076N50j231j246o32K029K485o28k769j923J356L300J239
$$ y = [57, -49, -523, -1279, -92, 1196, 1258, -168, -1096, -278, 1217, 2152, 994, -522, -384, 1132, 2099, 1381, 157, -159, 413, 853, 803, 626, 370, 184, -731, -1283, -201, 1073, 792, -1412, -2593, -1266, 1029, 1049, -1264, -2696, -1843, 181, 1090, -441, -1796, -1509, -38, 448, 309, -56, -154, -626, -672, 150, 1681, 1966, 265, -1472, -1015, 1599, 3104, 1850, -1654, -1993, 532, 3087, 1982, -1028, -2005, -599, 1102, 1512, 16, -1141, -1225, -743, -505, 217, 534, -237, -1775, -2335, -491, 1895, 1696, -1048, -3302, -1676, 2018, 3021, 113, -2621, -2034, 1297, 2835, 1531, -825, -1158, 255, 1573, 1617, 1128, 774, -136, -924, 71, 2105, 2471, 219, -2066, -1708, 1107, 3567, 1665, -2111, -2821, -85, 3024, 2295, -693, -2738, -1154, 1125, 1804, 693, -692, -799, -360, -111, 965, 1515, 284, -962, -1594, 435, 2920, 2292, -477, -2400, -1044, 2256, 3495]
2718C495k763k882L53K347K148r07k621q76J425J339k5n32n79p58n2O24J444K38
2736A418j230k283K14K476J782j303k989p32K366J843K10k411j448J192K031k04
2752I32o70j107j71R44k1N83Om07o51n83J071J089J41j966j419Q98K684K77j667
2771c7j929M59K217N71r26j239l80J259N77k7r20mL4r0J51O40M81p90p66J71J005
2792D57J033r73j397l07J721R95o52j377l81J179R39l39o57m43L17N97O6n90J79
2811C67j18m59K55K57L52l53n41k10K76J099k19r73n38N98J162m23o17m49K92
2830b42J013k13m97j52J77O35m48K90m87K73j67j27M9N33kn76l94J67R78J71p46
2851B35q74N98K03K57n01n46J5P42O3m72l68k78M59J47l50pK79k14l05n1M49J80
$$ y = [3495, 732, -2150, -1797, 550, 2698, 1791, -830, -1706, -281, 1058, 1033, 501, -78, -836, -888, -264, 1180, 1418, 188, -2095, -1881, 595, 2377, 1074, -1915, -2647, -281, 1562, 1772, -639, -2087, -895, 1136, 932, 262, -845, -1016, -72, -93, 490, 496, 89, -562, -1145, -74, 1015, 1156, -810, -2229, -1331, 1353, 1630, -37, -1966, -1507, 710, 1281, 355, -884, -1264, -5, 572, 545, -375, -379, -345, -435, -284, 356, 837, 47, -719, -548, 457, 1490, 517, -880, -1187, 534, 1529, 877, -500, -881, 298, 1237, 898, 241, -202, 115, 712, 778, 188, 367, 249, -210, 45, 302, 654, 301, -240, -450, -174, 925, 706, -267, -805, -207, 955, 532, -85, -534, -242, 771, 558, 61, -91, 86, 721, 273, 563, 76, 349, 182, 55, 104, 637, 635, 59, -335, -168, 810, 981, 235, -639, -41, 162, 419, -82, -628, -613, 129, 192, -280, -648, -926, -467, -320, -670, -677, -398, -612, -917, -968, -519, -339]
2873c39P3o27o0O54N56k72n92J26J55O51j81k48k06K91M79k60j53j13J76j30Q4
2894F4K51K32q2l70o63O03M92j90l12l57M5O64Nm04n07J86N25K17l50K99l71K43
2916B20L54k90J41L37k68M4L19j49O38k51l42K44J79L93m2r2l79m8N63l37N1j78
2938A107j24L86k87n8N19k55o71M8M03L14K5p55k5K45M76J78Rr04K31n5J81K59
2960A247k14j66l12J64K87J22r5k72m17L39K60l08n7k35j82L02K56P4o51l43N45
2981C44rQ2J2n49J03o4L30J24j84m03M3r4N62N4j14l60n19M71K99L26m95o81J80
3004e42J23L70j30m26o96M86J92M13n02j53k96L2N66j8j66n59J51o6M64j5k91
3025a063l98K54L18M10j16l03M1N46N81m10l59K58m4J54M0N16k18n04o1K79M0
$$ y = [-339, -266, -893, -953, -299, 257, -15, -607, -481, -326, 325, 144, -104, -310, -19, 460, 200, 47, -66, 110, -20, 64, 315, 547, 465, 95, -568, 35, 527, 337, 25, -332, -287, 377, 382, -22, -529, -343, 182, 399, 49, 348, -23, 220, 574, 284, 425, 762, 494, 538, 857, 708, 1346, 1095, 753, 997, 1176, 1569, 1527, 1435, 1056, 1008, 1571, 1234, 1285, 1107, 983, 1369, 1082, 1024, 1543, 1288, 617, 665, 1068, 1382, 1407, 652, 627, 872, 1348, 1526, 1535, 631, 862, 807, 988, 1247, 1033, 867, 555, 719, 1006, 1128, 1033, 761, 344, 683, 943, 635, 578, 343, 161, 463, 719, 793, 142, -201, 344, 335, 417, 429, -120, -17, -81, 249, 373, 189, -214, -171, -265, 297, 351, 237, -123, -642, -171, 128, 454, -41, -722, -542, -419, -49, -179, -605, -1301, -815, -623, -210, -712, -865, -1161, -1129, -563, -581, -747, -1306, -1155, -1221, -757, -772, -1063, -1461, -1207, -889, -479, -595, -898, -857, -311, 270, -140, -499, -241, -285, -131, -91, 425, 207, -297, -358, -79, -39]
3046c9K81m10q57O04K42Q9Rm14k96J35N01l09j56k01j3N27P2J44l35q5r3L64M45
3069B05r2q5k65K76M29N16n26n19J26N01O63m74p8l46J43K61K31n62k91l35O66
3090D44J7l83l7K9k26k76J78Q4K09q39j03L00O13k24m10n67O29L32J13p7j91l76
3112g61N74L14J17l53l19K65J51K38L0j97j74k29L12L59J43m37o04j8M27J98j08
3133g2l35o33L76K40J80n14j87l6N8N05m08l8l50J26J35M16K88m26j18k19L18
3154f94K66K70m79o7n7N96L93l74k68k94K66O94j28m03J0j88L54k1p7L0k18q9
3176d78n3l8O55k17j57k62J06N3L97k57k92J51L76j28K27j73m34L21M0L40j22
3197E5k08m5K10R2J93k98J53k02J5J21L58Mm12o73M11M64K55k95o28l4J55O22
$$ y = [-39, 242, -168, -1025, -421, -179, -90, -81, -495, -791, -656, -155, -464, -620, -821, -834, -307, -235, -91, -426, -511, -604, -240, 205, 113, 28, -237, 39, 468, 984, 458, -61, 65, 566, 1229, 755, 677, 331, 474, 735, 966, 404, 113, -222, 444, 461, 78, 41, 70, -156, -432, -254, -170, 39, -800, -903, -603, 10, -214, -624, -1191, -562, -230, -117, -194, -385, -761, -187, 127, 244, -109, -428, -163, -12, 226, 256, 59, -115, -344, -32, 327, 470, 33, -571, -589, -162, 36, -72, -407, -1040, -664, -424, -244, -758, -945, -981, -923, -418, -826, -864, -1214, -1088, -953, -537, -249, -675, -793, -1012, -694, -428, -158, -637, -704, -761, -165, 228, -146, -414, -708, -442, 252, 124, -279, -269, -457, -103, -124, -201, -171, -389, -478, -531, -569, 86, -131, -288, -550, -444, -391, 6, -251, -543, -392, -16, -144, 83, -90, -524, -203, -163, 177, 55, -153, -198, 12, 104, 297, -1, 152, -50, -35, 86, 444, 448, 36, -637, -226, 238, 493, 198, -430, -464, -309, 313]
3219C13J01j72m10J08J93P6o4k28K6j37O7K22M40j29m73l00L27O06j55o17j44
3240c50J16L72N43k22n11l93L88P16n90q5m02M73j01L5K90o0k37n13L11N7O20
3261D57k31q34m7P91M84j62m97m95J53P88M63m99n00j59K68O74j41l79O5k45j52
3282a98L27K15L20p18n62K7R15P12o90j111J96Q01N82m59n98l64M73N26l85Kl96
3303c85K53K29j24K31L48l46n30k67P52Q27n02p74l89O14Q99n2q79m45K95P19
3323D74J30m36n68J6O66Qq5j51p8j21m59O18K03J67o64j38mL19P82n01r84J42
3345f64P03N03j29o98k85L15N58j30k74j68K10N1J07j51M30j51m39k19J83P77
3365E29q0o72o57P81M73L75q27j050Q10O80J39p89k03j7M99M14m72k05J12O0Q7
$$ y = [313, 414, 242, -168, -60, 133, 209, 145, -83, -57, -194, -127, 95, 535, 406, -67, -367, -40, 566, 411, -206, -350, -234, 138, 681, 459, -52, -445, -57, 659, 69, -16, -418, 55, -46, -11, 279, 219, -18, -531, -220, -163, 457, 226, -608, -655, 136, 620, 458, -39, -534, -381, 407, 870, 371, -129, -288, -20, 654, 513, 134, 199, -46, -198, 129, 344, 664, -54, -616, -589, 326, 1038, 348, -763, -567, 234, 816, 357, -241, -605, -132, 394, 9, 11, -385, -132, 97, -27, 204, 552, 206, -324, -591, 161, 988, 486, -288, -677, -63, 836, 784, -95, -540, -245, 474, 604, 168, -400, -384, 282, 290, 205, 54, -24, -145, -604, 14, 217, 384, -280, -418, -422, -103, 679, 178, -806, -664, 39, 542, 413, -285, -570, -255, 303, 173, -101, -269, -59, -8, 99, -52, 378, 227, -212, -431, -248, 529, 449, -223, -880, -99, 374, 749, -78, -1128, -318, 362, 501, -288, -491, -508, -9, 405, -67, -272, -160, -100, -13]
3386a3j23M10n6l64j04L9K59k6Q6o11L6K61O43m94k16J5J46L04n54P4N6O57k28
3409A97r7n59N65j97K80l80r0R0L20k97k43K09K64r3j95M5Q1M34r8k94J6j40O69
3432D87l14m91K44K86k0r4o1q5K69J48l32k0J79j55ll10L47K25Oo7n58K67M01
3455C49O3l68l17K40K78M33o48k71o0M51j2l19K13L4kK19m89M0M61rl27j18M16
3478B57J92j96k56J44Q2K58q9l57oO0M27j07l55L65k93P6k0k47M5K03K7Kj30J40
3502B22L11l23k82J76L05l03K4j50J0K49j74Q5M0k45L70k3l29M07m8n15M39k65
3524a9Q8M28r5k19l87L72K04l45o4K8J18J43k24L32n12L47R0Nl09J91k3j60p4
3547h5j78K88Q4q5l04L16l7j72K3J2k4J66j01k3M9o6K74K8l5l40J76j56L69j97
$$ y = [-13, -136, 274, 218, -146, -250, -211, 48, 22, 108, -503, -467, -206, 437, -57, -273, -258, -112, 192, -362, -288, -232, 425, 197, 100, -459, 106, -91, 189, -191, -281, -191, 129, -168, -411, -202, 62, -31, -226, -181, -100, 334, 236, -58, -42, -182, 487, 173, -318, -74, 212, 192, 98, 37, -48, 221, 369, 37, 17, 196, 41, 38, -272, 75, 300, 306, 239, -319, -52, 349, 412, 44, -273, -33, 245, 678, 30, -241, -301, 150, 138, -181, 32, 66, 64, 283, -206, -166, 295, 286, -41, -159, 257, 449, 253, -3, 141, 223, 481, 392, 35, 29, 89, 516, 409, 54, 419, 126, 202, 182, -65, -20, 183, 210, 212, 82, 222, 533, 210, -72, 104, 409, 106, 130, -20, -10, 239, 65, 150, 190, -55, 315, 292, -37, 370, 322, -193, 246, -19, 69, 497, 402, 183, -204, 168, 372, 27, -37, -9, 109, 252, 28, 360, -152, 195, 285, 290, -19, 172, 149, -11, -85, -263, 25, 109, 24, -280, 36, -1, -173, -150, -138, -162, 4, -97, -120, -71, -137, 137, 165, 130, -210, -34, -190, 179, -18]
3571a8l2K08m95P7K75n2P6q1n1o9m39L02O1J31p5j23N6j04J14K26l28k98L59N4
3595b26o2K18j74l3J05m4j75J78m49N59J6M3m7j26j04K51m21J23K7J41O8J76k08
3618a64o0P6r9J79P0K3J3k13l05K31J48N2p6j94m8R3J7N83m82j53N2K81j83L61
3642B02m24k2K56P7m39K69K3k50K88r3k00M03k69j07Q9M65k92J9k83J3K90J37
3664A52r8l40J33J57j5L01m04j61K07j21L49p2j18m6k30K11J48J16k08m69N13
3685El69K32n4k9n5M4R1k7p3j31rJ34Ml16K94j50k32K44K94j90R6j97J51K6J0
3710b07j05k79L04k07M71j3l24k3J1k2K98j74p4%L5J59k50L46J64o17M16j62J44
3733a09j73k10K28J36K31m13o1K60l92K51L25m49J59j34m6K67K85l01P1k03K36
$$ y = [-18, -50, 158, -337, -260, 15, -37, 39, -42, -93, -162, -601, -299, -238, -107, -182, -305, -249, -353, -239, -13, -341, -639, -280, -226, -288, -70, -244, -277, -172, -216, -391, -213, -662, -103, -87, -44, -91, -217, -321, -70, -491, -368, -341, -200, -132, 44, -164, -224, -148, -247, -68, 2, 25, 38, -175, -480, -249, -101, -49, -125, -319, -367, -274, -257, 326, -156, -309, -257, 24, -159, 202, -222, -244, 12, 89, -350, -81, -58, -308, -20, -113, -313, 90, -179, -286, -197, 268, -24, -5, -288, -275, 15, 152, 54, -286, -153, 4, -11, 290, -114, -275, -68, -189, 160, 88, -30, -76, -306, -95, 53, 169, -39, -508, 5, -364, -132, -186, -215, -270, -226, -135, -162, -235, -366, -375, -241, -237, -553, -259, -409, -641, -397, -103, -293, -197, -394, -243, -217, -207, -312, -591, -287, -494, -23, -36, -360, -383, -372, -394, -96, -270, -344, -344, -309, -150, -400, -54, 110, -507, -91, -253, -109, -282, -492, -264, -128, 103, -310, -371, -111, -503, -252, 73, -376, -217, -351, -397, -130, 155, -146, -75, -278, -42]
3754d2o2J84j48P0j61K11j29j98M39m43M12J10m9P1k36J72j31j38j16o%J43P2
3777B5j16L55l15j8J50l28L7K76M3j89J44L2l28J20J01L3L38j90j60P9K9q9J00
3800A29J28k06J78j51q6o6L70k45R4K65j30k97k2J06j14R9j19K29k87K81l8j58
3822d0K6k18J48m8K16j53KK52j14J9n3J43k63Q2K82m4Q2m79K51r3j64L72r7r6
3846A3O6l3K20j80P1l99M40j76L10j71j14m08L43m2K10j4k75K50k09J91J43k15
3868B1O1l01K98L69n17O2N7k40J13K82j55Jr6k43K71J53Ll0k79O7K34KKO4l74
3893a75j10K06o7J77J17q2n8k44K55J11J4m10R1ML12L82l15m78M98P8k46K97p33
3916c76M50K52r7j9j76j67J13J50j9k67K41oP7k93L95l32k26P6M26j57J56J85
$$ y = [-42, -104, 80, -68, 2, -159, 52, -77, -275, 164, -279, 133, 243, 194, 265, 29, 201, 70, -68, -184, -190, -190, -47, 25, -91, 264, -51, -69, 81, -247, -210, 66, 109, -80, 64, 96, -232, -112, -11, 22, 360, 170, 10, 89, 118, 29, 129, 257, 51, 229, 78, -8, -74, 296, 51, 145, 410, 280, -17, -39, 67, -47, 52, -67, 162, -125, 156, 118, -40, -14, -232, -84, -132, 84, -69, -67, 185, 71, 90, 37, 180, -83, -1, 281, 237, 319, -160, 91, -2, -166, 206, 109, 13, 79, 46, 266, 86, 157, -242, 198, 22, 332, 161, 47, -361, -18, -60, 150, 136, -139, 111, -98, 93, 236, 21, 82, -219, 79, 448, -69, -7, 50, -190, -77, 205, 50, 51, -45, -288, -17, 136, 139, 109, -170, -103, 131, 133, 135, 199, -175, -285, -79, -146, 31, 148, 66, 8, -236, 19, 130, 144, -266, -175, -171, 141, 523, 208, -270, 228, 306, 60, 357, -376, 74, 326, 229, 210, 34, -133, -20, 130, 111, -156, 85, 79, 156, -137, 258, -74, -300, -224, 202, 45, 201, 386]
3938C86k59k39k20L17k2M3l44L53J40l7l96r6J82K49N9P6J2l08K60k85p4K54L9
3961I0j42k86J14L88j7m52L53n4J19N8l23j27L1K22K1r4L44l48L01j82j91Qj3
3984a80J35J30m59NN93q3k01P2j23K62P8m7l65k9M65j49k08nP3J78j12k00O9J3
4008h8J10m7j65L08P2n3l08P6K19J22k30p8P0q6p4J71j49p1Q3J80l6R2mj1j30
4033b7j5O2p3L11j52k0j76R3j62K2j77K71J88j97mj53K89j45J38j43k1jM18j69
4057A57n67L45K20M7k15K73j98P9l0J03j95k76L30K04m21QK62o3L1q5o2L89p6
4080B60j15l48L48j42R6N2m20L20j79L60k12k71k0M41l35M4J11j83L81J69m08
4101e1R5p5j88L13j11J87J83l89m26M55NM3oJ69n20J28M23l7m07K7N6K32O0l64
$$ y = [386, 127, -112, -332, -15, -37, 6, -338, 15, 155, 118, -278, -374, -192, 57, 116, 192, 204, -104, 156, -129, -203, 51, 90, -52, -338, -224, 164, 147, -305, 48, -6, 113, 171, -152, -279, -248, -26, -5, -99, 245, -103, 198, 16, -175, -167, -180, -45, 85, -374, -369, 224, 141, -60, 12, -111, 151, 229, 182, -183, -212, 253, 104, -104, -109, -36, 142, 30, -170, -101, -88, 22, -25, -190, 118, 190, 137, -171, -95, 124, 246, 16, -62, 8, -78, -152, 19, -130, -201, -118, 62, 26, 118, 114, 103, -27, -42, 20, -53, 258, 106, 86, -90, 3, -159, -137, -314, -43, 145, -52, -56, -209, 80, -65, 73, -70, -91, -92, 326, 157, -410, -65, 155, 202, -13, 260, 62, 141, 111, 214, 19, -257, 73, 277, -144, -136, 126, 63, 94, 9, -53, 336, 260, 145, -203, 145, 3, 99, 151, -269, 51, -128, 232, 20, -251, -271, 170, -165, -121, -10, -193, 188, 357, -51, 44, -31, -219, 94, -17, 170, 353, -36, -462, -7, -2, 41, 35, 204, -316, -188, 235, 198, -209, -182, -126, 106, 166, -198]
4125a98O5K43J01m69K13K42l3l45P1m2L53k41l18N0M43j90J23J05k17j11K32J9
4147I6m54M04pl61J9J35j33L76O5m78M30l68K95L03m60J46K8L60m85p2j42M30
4169A27l8k91L02m44M03R8l06M9o4J38j50J37j00j1K28Q9j38p0K96j00l24K32
4191F3r7L00m86J27J82o6k27k04M62j74L99k82k03J76j73J96k3k84L30j52J53
4212A7m0k23ll1K25k1M7j67J88j48J40k7R2K68j00l27J73M3kj03J58l32J65K15
4236B07m95K56J78k98m5J26L72l55r3N6j01OP5l6K1k33L6L13k3K4l42L50k48M59
4260B10j66l73K19jj22Q2P9n9k9R7j01J06nl60L77R9m35J26Q0J62q2o2O3j98K60
4285c3k0P4l12M45m60P5J73K22k70K25l15k9R9n5p5L14m5K6l28K07O1k4K5k58
$$ y = [-198, -133, 110, 211, -258, -45, 197, 164, -181, -110, -152, 201, -40, -358, -308, 135, -55, 68, 173, -44, -155, 77, 96, -358, 46, 39, -322, -303, -168, -301, 75, 140, -338, 92, -276, 19, 322, -138, 8, 36, 396, -89, -161, -303, 127, 89, -202, 100, -344, 59, 157, -149, -100, -164, -26, -176, -39, -139, -150, 78, 167, 29, -41, 255, 155, -169, 63, -34, 266, -220, -93, 89, 23, -204, -408, 54, -120, 279, -3, -206, -30, -203, -7, -30, -314, 16, -136, 17, -23, -246, -249, -280, -55, -76, -29, -196, -8, -156, -16, -43, 49, 317, 217, -110, 63, 106, 104, 1, 159, -173, -8, 207, -288, -32, 146, -152, -197, -71, 301, -54, -147, -91, -192, -186, -111, -147, -126, -359, -323, -10, -33, -9, -351, -1, -249, 210, 44, -329, -110, -111, -233, -151, -72, -131, -160, -63, -164, -58, -63, -423, -46, 53, -382, -256, -176, -14, -96, -158, -95, -293, -33, -53, 21, -291, 154, -306, -231, -58, 164, -106, 119, -196, -225, -126, -181, -256, 58, 13, 39, -289, -82, -21, -45, -20, -278]
4309b78L61J46l83O6k85K05q8M93l42j82L64k16N10l02j2K81k24J0j67m5N2K44
4331B08j54l22J55j6K25q4R0pj6K17o27L63m42N46K6Q2k53M4j0q5J60j04J59K15
4355C70n68Np7L66J39j07k17L28k63J87l77L46j73J69l3L4q3k49j6K88N8Rr6l
4379C7P1k45K21m55K54K30j66J18J12l65M96k06j57j19J97N4O7L1k04J8N6k69
4401b24J37j85K33o7m8q2J36J32o3J71k01J45L7J8k43n7Q3L00j86J4K77j75K8
4424A80l87L96l49L12l84K19o5J55j16N1R1j05K1L20n58L43K8r8R5N1r9j19mK00
4448A78j49K28l39J5qK10j20J5K43j71M4j21nq3J42L6j27J86N6%k32j78L37R3
4472B50J21j68n7R6j81r4Lq8J60m5J9p4R0J20j05k4j72J99O9l61M97m99M56K2
$$ y = [-278, 83, 229, -154, -88, -373, -168, -256, 237, -105, -287, 77, -139, 371, 69, 57, 338, 114, 124, -43, -88, -36, 208, 54, -268, -113, -129, 96, 12, 102, 95, 79, 296, -331, 32, -410, 136, 162, 244, -9, 35, 25, -60, 100, -4, 155, 370, -198, -193, -270, 96, 235, 128, -89, 239, -24, 163, -214, 132, -41, 128, 95, 129, 46, -203, -219, 69, 127, 136, 40, 37, 108, -137, 84, -371, -117, 113, -53, 65, 177, -188, 308, 102, -55, -174, 23, 77, 144, 175, -29, -11, 45, -224, -87, -272, -39, -106, -154, -236, -100, 32, -31, 140, -61, 84, 121, 139, -104, -161, -78, 222, 36, 50, 327, 152, 180, -207, 189, -160, 152, -232, -13, -78, 77, -39, 12, 103, -2, 19, 339, -219, 124, 152, 54, 149, 200, 101, -18, -22, 178, 29, 257, -82, -67, -75, 135, 15, 30, 273, 102, 146, 25, 20, -63, 79, 115, -12, 174, 230, 230, -2, -180, 157, 250, 371, 203, 146, 242, 61, -33, -30, -118, 42, -3, 16, -58, 32, 152, 47, 23, -149, 50, 119, -242, 255, -244, 212, 234]
4496B34j1J4l80J07J40j62J94j41j13j65K67j33J11J15l06j45O15k82k98K32J70
4517F3r7N8J05j5j37j97R9L37k52j4J23J4o3q0q9L17l35O4K13K5K1J7l47k2K49
4542E7J33q9k16L4op2M03j23j16k3j52J3L8K29rk45K8K91j53J65j73j33K97j62
4566A6Q5kl92K22J10J17j82m2K14lp2M7M4l30L44l78K55R0R8l27j87K49J77k74
4590a21J75p5m1K21Pl64L43j03n0J27j50KJ15L9L9l14P7K23k89J0J95n0J01j64
4614d7J07q3j96O16j31p7m98K07N07m15M09l94k0J32j01Q5k16R1K2P1k3r9L22
4637B69j56j47k71L86j21P5j20k7n4L41j85p2J8K9K66j59j18k26N47k1n13K48
4659a1JK54j45k15K07k5k20O1K9M5l10M43k34m9L21j57L25l12l01N2L86n4m3k64
$$ y = [234, 223, 237, -143, -36, 104, -58, 136, -5, -118, -283, -16, -149, -38, 77, -229, -374, 241, -41, -339, -107, 63, -34, 24, 129, 114, -23, -220, -121, 216, -36, -50, 73, 87, 24, -56, -145, 172, -163, -99, 114, 139, 160, 177, -170, -192, 57, 190, 101, -115, -81, -87, -159, 244, 121, 5, -18, -170, -157, -119, 110, 101, -144, -116, 175, 22, 187, 14, -119, 178, 16, 101, 99, -293, -71, 39, 156, -26, -68, 146, 143, 71, 118, 162, -168, 176, -202, 53, 143, 241, -86, -273, -24, 153, -121, 54, -21, -62, 159, 166, -198, 145, 42, -8, 119, -31, -29, 86, 125, 164, -150, -73, 150, -139, -129, 66, 16, 117, -47, 60, -23, -219, 397, 266, 189, -309, -102, 405, -10, 399, 5, -15, 117, 16, 101, -115, -24, -2, 69, 46, -53, 269, 113, -34, -305, 81, -40, 35, -85, -112, -166, 175, -10, -82, -64, -35, 231, 72, -46, -272, 275, 254, -259, -11, -10, 244, 99, -116, 91, 66, -154, -93, -64, -19, -329, 114, -120, -169, 152, -5, 320, 8, -293, -241, 145, 91, 48, -216]
4683b16R7K45P2k48M0P0pn6R9k90J81J81N4m09L1L97k63j7J0j48q0K63j17k2j5
4708a48K25L5l80J82Q5K34O5n78L28m2K28j00n3J2R6j85K66k15K45n68N75k69
4730C8k09J45K39l2l70K61L1K43l57m05L29J62o8k06l2J88R7N3j54m5j48N32k29
4753F3l92K84J45k71K8L7J05K7j41L2p6K35q3J44j02n7J7R0O9l19Q4l30M16j01
4777i6K79l00j0J07J93k42J2k39J65j07O4J89M32n04k41J16R1K06n16K46N4m5
4799a46k11L52k37J68j63L08l76P8J94N3J06k31J62L98n65j60J58K5J58q2J94
4820A83lpj56j21l1P8J91L08l75l82J64L88n0k09k77M92j71Kj57R7k46N86j54
4843A50j98K01j75MK16k61Nk40K6L80k94K56J3J54j80K01k53j33R7N0o1J20P8
$$ y = [-216, -119, 126, 198, -50, -10, 60, 53, -3, 96, -194, -13, 168, 222, -187, -156, 241, -22, -39, -29, -177, -257, 6, -111, -133, -148, 77, 112, -268, -86, -1, 233, 298, -280, 48, 6, 234, 134, 81, 93, 189, 4, 270, 55, 300, -268, 307, 38, -171, -26, 213, 181, -189, 72, 103, 346, -11, -416, -87, 75, 7, -199, -231, -43, 54, 107, -47, -92, -240, 292, 63, -329, -45, 100, -171, -143, -106, -1, 26, -115, -83, -159, 76, -7, 137, 35, -22, -5, 85, 154, -165, -81, -411, 5, -96, 183, -117, -127, -20, 173, -69, -57, -296, -131, -238, -174, 15, 447, -57, -298, -182, -91, 115, -401, -155, -101, -146, -357, -5, -242, -74, -237, 71, -305, -227, -33, 20, 126, -105, 57, 455, -110, -270, -112, -87, 71, -11, 183, 180, 173, 17, -104, -135, -57, 134, 442, 67, -315, -151, 237, 187, -22, -299, 193, 22, 24, -133, -36, -282, 304, 150, -48, 153, -22, -18, 198, -63, -58, -298, -272, 108, -186, 70, 83, 237, 57, 258, 5, -128, -31, 19, -42, 78, 156]
4866A56J5j46m60M1M52Q8j64L56m17J51L5k61M95k94o8q4k2J44j2j27L60j96p1
4889b9k19J74l01K69l07L28p9j7K53K42k72j26j9k38M63o8j43J44j76K19k05j41
4911b48M05j69L3l48N17j56J94l86J73j99M13k69n2K65l27j3K11j5k40N4J10P
4933d0Pj23R0J78l99L27L7j94K21L8j70L00m52K00QK5R7k36k2J5j44K55K08k14
4957A2l5j9K77j95o9o1q6L68j48N1k49K98k02L59k31O1L4j71l1p8K48m5nq1M6
4982D8n5K05J0k84J10Q5j52p6K52n2m6Q7K54n95J78k46N98l22l1M3J83J48k68
5005G4L78k08k13n5R7j34r7J97j88k9l2N86p83L97N7l9L6L6k35j14L65l25L56
5028A27n9n9l37K07l22L12J44j56J82j57K58k65j00K87J65m88p7L01J14m9M6r8
$$ y = [156, 171, 25, -435, -394, 58, 146, -18, 338, -79, 72, 107, -154, 341, 47, -21, -105, -127, 17, 5, -122, 238, 42, -29, -248, -74, -375, -106, -413, -85, -164, -181, 72, 314, 42, -84, -103, -341, 122, 54, -89, 55, -121, 98, -107, -248, 157, -12, 21, -327, 190, 34, 228, -158, 15, -184, 229, -40, -92, 173, -154, -167, 44, 29, -211, -157, -47, -40, -33, -156, -66, 112, -287, 40, 77, -117, 104, 142, -28, 272, -180, 20, 28, 53, 150, -86, -108, -93, -237, 18, 226, 12, -23, -42, 235, 40, -29, -90, -176, 192, 44, 95, -154, 144, -58, 301, 70, 131, 165, -6, -37, -115, 133, 88, 83, 2, 48, -7, 198, 208, -76, 34, 119, -33, -109, 143, 91, 45, 132, 386, -209, -31, -277, 321, -1, -32, 11, 194, 342, 74, 452, 244, 31, -24, 73, -61, -158, 39, -149, -178, -210, 376, -407, -10, 47, 8, 44, 80, -155, -269, 96, -229, 127, 68, 9, -328, -121, -443, -131, 13, -143, 39, -118, 140, -125, -225, 62, 227, -261, -338, -37, 77, 28, 74, -24]
5050b4k1J23q0J01j52j05L6J64l77K73j33M07l1k39K32j95j76o9J25r2K13j6J65
5073A29j69j9L50k62k51p2M13Q8k65pk40L71P0P0m37J02K65j03j48J08j96M28
5095B25j46L60m41n5J07P4j74rK27O9l19Ok02M18PJ02k06N6j39K11l77J78N6Q
5119C6k7j61J24J33j27K34j18k99M04l50n9p0L02j43O5J15p5k20K26L48n09L3
5141a38J25m1J20K51l05N5p3j66J77J24r5k03R0q1L15l67K66nj35J87k01k1o7
5164a88m5K39J57l31N2L1P4n2K59lj92K03k19j8j44L94l74J19J59j13j50K55l01
5187a88j38J60L28l61J21K67l25J34M1K09o83P39l62J72o4k80K19N6rj03J97o5
5209F5j49k76N87j87M6k31L80l57J58J53o9l28M25l14J91j6J12l77J82n6R3P8
$$ y = [-24, -45, 78, -2, 99, -53, -158, -122, 42, -335, -62, -195, 212, 181, -58, 174, -21, -197, -266, -141, -233, -20, -36, 129, -40, -59, 291, 29, -222, -294, 119, 207, -58, -65, -305, 66, 136, 206, -231, -129, 136, 33, -115, -7, -203, 225, 79, 439, -2, -57, 50, 124, -50, -59, 168, 237, -82, -76, -278, 140, 147, 249, 43, 99, -40, 171, -206, -28, 28, 36, 9, -152, -28, 105, -22, 212, 94, -205, 199, -151, -210, -280, 22, -121, -56, 59, -16, -236, -10, 338, -171, -138, -13, -54, 66, 317, 12, 67, -6, -172, 5, 129, 34, -169, -79, -160, 155, -212, 54, 49, -86, 101, -100, -121, -188, -233, 6, 163, -168, -116, -85, -11, -63, 196, 193, 1, 204, -15, -33, -177, 217, -157, -38, 121, 8, -142, 113, -188, -326, -166, 162, -199, -78, 189, -136, -2, 39, 248, -435, 304, -58, 114, 50, -230, -11, 45, 36, -67, 130, 65, -84, -360, 227, 40, 86, -145, 235, -122, 36, 189, 120, -208, 217, -97, 94, 78, 190, -187, -5, -61, 32, 110]
5231A10j18j45L99j13j54qK33k43K9l1J02j75k15N63j55k39L76l87Mj73M12p4
5253bl9m1J15n4Nk14q3L72J33k22J75j90J95q5k41K64l46K84Ro6J31K24j41j05
5277G8O1k03K02j76k01K39j85K73Q3j94n8J96k78K22j92J48k5k52L12M7p8n12
5299d93N42O4j65L6N56o23J83j42j73K65j35J8J38l49M76k97K55j66N9k40J63
5320b8k65K20K58k40QQ8j70Q0J35k2K09l36J03j83ON0K46k6l3J94k80l05K06J26
5344D1m4p9K02J58J4l81K27J62k03k81K50o4L3K58k97L9J48m4O4j81J96K40l49
5367A09N8J3j44q1J14p6J4O0J79n17N26j21k11K54o0J05m2j77l5j24K61ok21J9
5391a03K51l59K05l02M91j53n3K16j70K81n08N3j16N94l42O2m2K23j50o89O06
$$ y = [110, -8, -153, 246, 133, -21, -29, 204, -39, -10, -41, 61, -114, -329, 234, 79, -160, 216, -171, -167, -340, 72, -2, -41, -82, 33, -21, -16, -230, -313, 59, 192, -30, 145, -45, 150, 65, -176, 88, -258, 26, 35, -31, 100, 324, 183, 78, 139, -64, 138, -38, -239, 0, -185, 88, 171, -23, -81, 115, -163, 59, -133, 15, -10, -262, 50, 97, 19, -493, 49, 113, -52, -16, 540, -83, 100, -42, -215, 50, -85, -67, 71, -278, 198, -99, 156, -10, 49, -191, -28, -293, -73, 185, -55, -47, 41, -129, -49, 86, 64, 273, -63, 40, -143, -137, -87, 159, 133, 100, 294, 14, -291, -85, 41, -3, -82, 120, 278, 292, -89, 138, 300, 97, -184, 66, 2, 35, 293, -4, 35, 183, 139, 203, 22, 218, 458, 109, 167, 180, 36, -45, 69, -7, 7, 67, 246, -271, 255, 134, -77, 177, 117, 222, 180, 3, -32, -156, 105, 99, -122, -103, 148, -211, -6, -308, 183, 30, -23, 193, 23, 304, -204, -151, -267, 327, -15, 47, 5, 228, 78, -611, -5]
5412eP1n9k93M90j3j63K15n5j64n1P8k68N54n09O5jj25N4q2J61J7J24k62J29J62
5437G0J60j29K4k99J58J13l91L25K0j58O4J15p8J05j00k64L29j28O7MK60k89n6
5460g8R4K18j80K41j63K9k26N9o7j79L17n9r2J42q1M8R1k43r2L56k37K48M4k88
5484i8j51M12j55J88j48j14P3R2j17j05K45K2o3m43L56K73j66r1M96l00n5p0l11
5507b30M09k51J16q0j55K27j39K88k2j93j46N22l06K0k9K00l83j1K93r1P4J21
5529B34l11J58j59LK09J18k94p0Q5N4o2q9R3JQ5L7j93m3J42k11K51Q6k21L3Qj64
5555b20M37j71r5J0l89L96Q5MQ2r1K5j97K47j98j54L9O9k51M22k73L61Kn1j94
5579a05R6Nj10J33K77l09L99l40k28L92j93L6m0o6J28k81Q3j52M64m78J12Rm8
$$ y = [-5, 66, 7, -286, 204, 191, 28, 243, 188, 24, -27, 51, -217, 337, -172, -107, -108, -233, -179, -261, -100, -83, 41, -221, -92, 70, 230, 101, 125, -174, -16, 97, -294, 31, 51, -107, -43, 72, -6, 99, -1, -265, 64, -64, 3, 7, 267, -22, -78, 16, 234, 54, 295, 132, 161, -65, -6, -73, -252, 65, 6, -86, 56, -25, 23, 114, -129, -221, 135, -102, 146, 190, -98, -249, 163, 8, 196, 48, -66, 7, 99, -18, -123, 122, 144, 81, -362, -6, 267, 101, 10, 506, 206, 151, 81, -230, 179, -72, 44, -36, -191, 36, -103, 185, 163, -30, -176, 346, 40, 60, 31, 231, -152, -163, 130, 39, 113, 234, -77, 81, -78, -75, 134, 252, -42, -112, -27, 27, -35, -124, -31, -30, 55, 92, -101, -144, -2, -213, 38, 124, -97, -64, -56, -220, 217, 46, -49, -39, -428, -32, 53, 57, 139, 48, 73, -124, 123, -75, -229, -190, -121, -372, 50, -223, 138, 140, 89, -105, -9, -4, -114, 19, 296, -13, 386, 46, -182, 210, 17, 53, 13, -53, 75, -206, -123, -275, 189, -289, -177, -168, -216]
5602b16Q0J05j97K60J04m3M33n57n1PL60k04L5o6Ro7O0j19N2k12K04J51l10P2
5626a10J20J04j80L5Q3j8J04Jm66J74J79Q8m77N42j80R4m55L45R6p7l5MK15m53
5650b67M53q8q5R3k50K30K2o7j12J70j21J49r4jj21p6J22QJ2k71M48J45m54J31
5674b4N6j35J91J8k71J43lk6k2K67l72J64J87j92J27m6j40K19k32L4M1P2l08L82
5698A30Rm8Lp8pl26N07k11j7k46N40l62p0O6j38J33m7R2K00j24q4M32m00J64j89
5723g1O9J15k07l21M77r7KmL3k13K85k01j55K83k98K72k21p6N56j5j27j74Q5r3
5747i6k76J18L66J07k55Q5K48l30K89l05j41K5K92j78J18m9j4k24J64n5J24j97
5769a84K39j50J00j9j97K07Pj02L96j6n1J00j78J3k08j05J87M8j38J1p4J75J77
$$ y = [-216, -136, -31, -228, 32, 136, 93, 526, -31, -82, -75, 285, 81, 116, 50, 59, -8, 52, -67, -15, -227, -23, 128, -182, -110, 10, 114, -66, -31, 52, 34, 138, 139, -327, -153, 26, 114, -363, 179, -1, 93, -362, -17, 79, 2, -33, -29, 186, -267, 186, 98, 13, 106, -144, 86, 108, 41, -71, 99, -22, 127, 33, 32, -89, -165, -43, -35, -23, -294, 154, 299, -155, -24, 32, -103, 88, 106, -165, -22, -25, -51, -73, 194, -178, -14, 173, -19, 108, 62, -78, 141, -91, -57, -16, 56, -252, 130, 139, 91, 94, 16, 9, -317, 190, -21, -38, -284, 256, -106, -176, -110, -248, -115, -162, -70, 130, 6, -78, 354, -46, 118, -71, -2, 113, -94, -415, 62, -35, -33, -37, -4, -217, 68, -133, -288, -5, -303, -31, -252, -328, 228, 213, 86, -88, -3, -96, -372, -254, 112, 219, -36, 49, 297, -33, 256, -49, -190, -165, 127, -51, 67, 18, 4, -220, -56, -111, 13, -184, 55, -95, 5, -14, -211, -4, 3, -99, 297, 281, 230, 330, 152, 165, -43, -148, 39, 87, -51, -40, -114, 61, 238]
5792B38m73P0L18j83j0j26N3L83p4l45N5J3j3K63n1k08J50R5k06J32j26J88j00
5815D3P9j58pn4k12L54j35K23k85J60O7j74Q0K14j26j21M4k07J02K83m73J77Q5
5838d1r4n6J39R0J97o1j21j36K21J92o48J4M07l49J14J14j42M37k39k34L32k02
5860f6K84m05m5O41l96J07J2j80K64l5j19Pk84J23nJ97J2J35p8l20N2o1K15J89
5884B44j70O7n2r2j88j89O91k74L4l9J14k07k9J17n1Q8M2k75J30K21k7k04J35
5907H6j08J03j02j94J34NR9K6R7J95k96m0J73o5K0j76J84k52J94Mj48j36jJ49
5931d9J05o9j78l5q0M32Rk80l78M53M1M5p9j90L00L0J05j65k67K23K8O2J0O4k29
5956i2J56J05n6l2k37J98k92O0K35r5O0l43J67L29k19q1L37m14l1j03J64L70k69
$$ y = [238, -235, -165, 153, -30, -40, -166, -113, 270, 196, -149, -94, -81, -94, 169, 118, -90, 60, 155, -51, 81, -45, 143, 43, 122, -36, -43, -97, -309, 45, -90, 133, -152, 8, 75, -99, -19, 195, 69, -52, -8, -215, -113, 170, -303, -126, -41, -135, -191, -52, 38, 235, 174, 53, -83, 138, 330, -318, -304, 103, -246, -132, -18, -160, 277, 38, -196, 136, -66, 218, -187, -232, 409, 13, 120, 132, -48, 216, 181, 62, 69, -215, -92, -97, 100, 112, 247, 169, -151, -99, -160, 55, 244, 74, 141, 89, -3, -191, -380, 311, 37, 71, 32, 146, -61, -90, 27, -24, 64, 106, -169, -39, 182, 155, -49, 86, -22, 81, -21, -215, -81, -76, 23, 49, 146, 341, 45, 5, 178, 113, 133, -43, 141, -111, 83, 87, -61, -197, -198, -49, 56, -13, -191, -226, -306, 126, 135, -145, -523, -70, -29, 16, -63, -253, 47, 77, 182, 17, -250, -27, 1, 63, 73, 137, -92, 64, 169, 113, 81, -156, 42, -250, -190, 45, -50, 10, -333, -166, 163, -56, -137, 200, -214, -245, -348, -184, 186, -83]
5979h3j18O04j15k29r4L77l97K18l75L02k34K02k4m7LJ51J65k01l22J07J08J7
6001A5j86J77j5J5m6M2q7J25j84j81K96QJ44l1j75p8L02l31M59n96J81K42J21
6024B17l53N4kP7J63m45M26j5N3M0l18J41J5j49J01j05M6j24J70J19K69n28M6
6047a02J16Q7o6j76J38J03j59jJ39l08K52J84l89j6L9J03P1J19J83k82j24J39
6069E0j78k7M49j65o5j35j71N04k22k7k40L80k07K17k55%o8j90M59j97j59K30
6091a7K02k22L96j61k96K27k79L27j78k36K64pr7jK97l63j65K39j20J61N3Q4J01
6114B09m71K82J31l72J28j05J73K1p0l7O7Ko7j77L42j1m0k11M03l00k36N02j30
6137C3R8k54K90k01K20l96K70l11K4K25m0o9Q3m7j99L30j13K50J37l62j13Q4k48
$$ y = [-83, -201, 403, 288, 59, -35, 342, -55, 163, -212, 90, -144, 58, 34, -13, -10, 141, 306, 105, -217, -110, -2, 15, -171, 6, -9, 6, -40, 2, -85, 40, -144, -325, -29, -21, 123, 92, -83, -161, 141, -190, 269, -327, -146, 96, 217, -136, -82, -84, -7, 156, -289, 137, 122, 175, 215, -103, 38, 53, -96, 5, -100, -54, -178, -8, 111, 380, -148, -102, 14, 101, 35, -141, -3, 100, -59, -60, 79, -229, 23, 207, -182, -198, -159, -56, 15, 134, 317, 35, -89, 50, -128, -155, 294, 129, 64, -71, -242, 262, 40, 13, -227, 153, -54, 163, -92, -92, -160, -350, 109, -88, -247, -17, 185, -37, 359, 198, -98, 129, -150, 177, -1, -237, 27, 20, -77, -78, 219, -144, -309, -70, -190, -29, 24, 108, 209, -262, 20, 151, -221, -93, -198, -25, -4, -74, -111, -44, -42, -109, -286, 56, 45, 5, -206, 197, -103, -339, 163, 33, 131, -123, 167, -34, 186, -210, 60, -251, -227, -2, -42, -111, -28, -75, -274, 56, -57, 193, 330, -32, -145, -61, -309]
6160c09J79k1Q5j52L47o9P9J56j71q6l6J24k64J01J85j91J54q7p2j48K07o2n0
6183a01l6O2J02L7K4l37K97J95p48J11O35j87L7j80o4K02r0j03J27j88K33p0p8
6206a20m3J64k8J69k08P0k70M92l9o4j63K02m3M2k61r5L89j3l63L1m9J98J58q1
6230G5m1j14M9J59j05j95OJ96J13j71j92M13k83l03O43k70k51K37L41k58J21k07
6252c7k0l9J74k44J89o2j28J87O5L22l21p1q9j9j58L26K6k1J07m6k35P8R9Q2l24
6277a59K13J18O4j93j70K47Mj49K0j41K33j03k12L32j83J18k9l39O03k38K47l05
6299b2L7L6j36L01j01k06J49j61r3J77j0O9m3K56l53j64M57k38l4j7L5r2J28p7
6323a02L2K20l79L06j52J52P7j39j03j88N30k37N5j55j63J36j1J13j1K00k7k89
$$ y = [-309, -130, -151, -66, -218, 129, 60, 139, 295, 124, 38, 2, 126, -138, -37, 148, -43, 111, 24, -48, -196, 11, -51, -101, -137, -75, 27, 64, 88, -249, 48, 243, -505, -394, 241, 54, 91, -89, -153, 49, -41, -144, -17, -205, 28, -42, -120, -163, 1, -27, 142, -66, 4, -266, 226, 187, 123, -40, 162, 119, 161, -100, -195, 194, 181, -182, -151, -200, -2, 156, 75, 34, -80, -31, 128, 23, -172, -166, 30, 143, -28, -220, 193, -90, -393, 250, -20, -271, -34, 307, 49, 170, -37, -57, -96, 78, -166, 23, -39, -167, 20, 85, 407, 86, 15, -74, -93, -251, 75, 101, 80, 187, 141, -94, -16, 83, 165, -159, 54, 172, 236, 43, -127, 120, 124, -25, -5, -146, 87, -16, -228, 104, -79, 39, 10, -329, 274, 36, 283, -22, 15, 51, -85, 216, 115, -91, 58, -103, -196, -19, -29, 40, -3, 253, -100, -264, 193, -45, -79, -96, -61, -153, -25, -102, -70, 150, -229, 77, -75, 77, 154, 15, -88, -276, 254, 17, 72, -83, -246, -110, -121, -8, -19, 181, 154, -135]
6345a35N75m68j31K30K5k83J97m4J83p8j14L8j08M42n60K23K46j05j17K8Q4l3
6367I5j51n4n1O2o8L89j78J71l42MK22j86L86m71j6M74k98M8k66K28J1l51K85
6390e7k5j28K21j62K76o0j20j41L62j74J19l18J28K63j10R0n6k06J93J82l68J70
6412G9j89K11l52L48M1o8j42J91j16J7m9k81M03J50o50K01jK49Qq1K8r3K76l91
6436b11M9K02Jq8J62k63J05k91M45J14K2j56k42P7K6m3K42j01r2KJ79k49j19L97
6460A68k68J3J49j62J49J19j17M4N0l51L02J18r0l5k88K88O4j05l41J74M42m31
6482a08N2K1j15K7K7Q7p1n9M7k8K0J21J13p5N3J51Ok18j01J72j15J52k28K51j14
6507F8p5j39L00l70K11Q1kL9Nk5j00J44m66L30l4j37K67k66o7J82k3J32J79P8
$$ y = [-135, 440, -28, -159, 71, 96, -187, 10, -34, 149, 71, -43, -5, -113, 329, -231, -8, 238, 133, 16, 44, 128, 95, -56, -110, -161, -99, -167, 222, 44, 215, -127, -123, 99, -87, 299, -172, -188, 286, -12, 36, -230, -2, 9, -342, -57, -82, -210, 11, -151, 125, 65, -55, -196, 166, -8, 111, -207, -79, 184, 74, 164, 108, -98, 95, 277, -91, 79, -110, 101, -251, 97, 138, 70, -72, 119, 3, 20, -29, -310, 93, 243, -407, -206, -207, 42, 50, -31, -3, -96, 180, -211, -162, 40, 41, -47, 115, -148, -43, -334, 111, 225, 247, 91, -151, -74, -48, -91, 151, 50, -42, -40, 139, -110, -229, 168, -100, -87, 62, -100, 49, 168, 51, 95, 145, -206, 96, 214, 124, 89, -199, 89, 153, 48, -293, -119, 323, -108, -56, -35, -150, -123, -96, -9, -80, -139, -92, -120, -100, 21, 134, 59, 112, 263, 269, 51, -50, 122, 7, 159, -69, 182, 68, -7, -146, 154, -216, -5, 76, 74, 113, 118, 93, -7, 137, -329, 1, -33, -170, 97, -169, -236, -54, -77, 55, 234, 312]
6531C12j83o8k17n1J68J44L73m24r4L4l9J07j3p0Nk16K28K6J15j74o7J86n0k53
6555b21L29j03J59K6m4k05j75n4K76K27m82J39M0K7M25o18J30K49k67K03J55J29
6577C45k44k00K43j74j54J30L33j55m4P7j26k24K0K47o5k58Q3J04Q9L37m95N5
6599g6J54O2k14Q1k69K4M57l35J92r1K21k98N9K42j59n1R1k09L31m12J42Q6J00
6622A28j74M1K5l42K80j26J78k09Q2J57R1m1RM2j89R1m2mJ70l50K00p8J31j42
6646g2J65O9j26Q1J5J1L0j0j43k78J85L3K10j24j35L08J25n24L05j51J50m39j38
6669d53N50j36r8J37K57m37J33oK21k18J5j27L03k04M2Qn0K22l10L11J06l42k7
6692a03r7L25j68j64K7M09l17l1J68j64K78j70J35k23K20l24M39m41K70m9k23
$$ y = [312, 129, 61, -156, -207, -39, 105, 478, 54, -40, -6, -45, 62, 49, -21, -16, -232, -4, 22, 137, -37, -104, 82, 32, -221, 108, 5, 164, 190, 146, -59, -234, -288, -12, 215, -267, -128, -88, -61, 364, -254, -124, 125, -142, 61, 216, 345, 101, -99, 144, -30, -184, -54, 279, 124, 80, 157, 31, -193, -173, 74, 9, -249, -166, -62, 27, 364, -131, -76, 78, 140, -74, 7, -262, -238, 219, -116, 76, -15, 206, -92, -33, 209, 50, -1, 90, -119, 212, -200, -58, 28, 128, -46, -5, 20, -322, -42, -168, 10, -199, -117, 40, 131, 90, 99, 141, -48, 43, 1, -3, 167, -183, 17, -61, 70, -72, 93, 162, 36, 117, 132, 143, 173, 163, 20, -258, -73, -40, 170, 46, -89, 219, 344, -180, 125, -26, 124, -315, -453, 97, -39, -137, 0, 257, -180, -47, -53, 168, -50, -35, -162, 141, -63, -21, -13, -63, 159, -151, 160, 266, -76, -103, -200, 125, -43, -207, -180, 229, -88, -119, 49, -115, 163, -7, 128, -95, 125, -199, 240, -201, 69, 20, -203]
6713b03J74j89N34l56k33J64K46J00o6k30M9K35l93j07J56Q9J02l35J62J61r3
6734c3l4K63j14r8q3J84q3j30J64K18l06K8L0k7K46j87k6Q4k63K0K60m80N15k
6758A46o6j47j6J17J68k41O9Q7j04j2r6M0j54L77j14r6j56J74j53L15j17N2r2
6781a9J26p7K94j87l79O02k07j01Q8r2K89m19k11K58K40l1r2j62o3K05J01q2P
6804H8k70J25L55n08L35l27K35j28p8K72l36J74m2K38p3L0lJ6K78k72j90J55R4
6827A68j73P8J96l38l99N12R5pl96Q7K29O1O8N3m55K40k60K47j5r9o3J64P1k69
6851b05J10j11K85l25L51j81L53l18P9ok03L8K48o9j86Q8K99m11L09j98K65m89
6873b77M25k82K03j16K8p4j57M41k14o8j56L71j0m4l9N4k27K66n2n4j34l4K62
$$ y = [-203, -29, -218, 316, -40, -273, -109, 137, 237, 171, -59, -10, 225, -168, -275, -119, -30, 72, -263, -101, 60, -33, -67, 196, 82, -16, -99, 85, 2, -128, 36, 254, -52, -24, 6, -21, 225, 38, 12, 96, -167, -147, 113, -367, 148, 146, 80, -67, -83, 34, 202, -39, 30, 117, 13, 1, -95, -55, -209, 168, 54, -42, -198, -24, -177, 138, 21, 73, -19, 107, 30, 324, 137, -242, 360, 153, 52, 140, 48, 337, -82, -293, -35, 205, 174, 82, -80, -143, 62, 163, 81, 88, -182, -57, 298, -210, 125, -202, 33, -95, -173, 99, -237, -63, -105, 133, 60, 90, 87, 103, 381, 109, -81, 74, 168, -5, 73, 269, -69, -468, 44, 139, 132, -264, -177, 52, 113, 181, 234, -221, 19, -241, 6, -9, -108, -171, -7, 64, -205, -95, -206, 79, -246, 105, -76, 277, -41, 38, 32, -171, -133, 115, 46, -140, -52, 247, -164, 145, -53, 212, -277, 148, -134, 69, -47, -19, -93, -250, 191, -23, -91, -247, 124, 114, 70, 31, 85, -142, 124, 72, 18, -116, -150, 112]
6896A12k24p5K14k10K9K50J55j24L8J30m78P3LQ6K20j58K03n05J70k10K63j22
6918a60K65j58Q1o9m48M92j03o1J53Rj0k46J60K10l05L86J50l00k97L50l15K44
6940B8m2Ro5L8J24J04k77Q4l0J46j76j63K72J55j62r5K9L0j05kK14m6n9J45k01
6965d5j78K87o2j06K63l15J99L3J48j23j55J79k39M2L43m06K76J25r7k30L15k34
6987B0j90M6L3P4p0k02M50k57J13R7j61j47L07k06J46j94Q7p7J99j70k9N2q0K41
7011H2k2r8L6J40j54Q0k3n9j86R4J35J18m96K22J76k99L3K57l06K54J88j13R3
7034A52j75M5j05%N21l19j5j60N7j03J29p1j58M35p7k44J24K49l66J08n4J34k0
7057H7l7M5O1n1k64q4L65k44j05N31k53l2j6n5j7M08k83J36m0k30l9q4K34J3L1
$$ y = [112, -112, -187, 27, -183, -154, 96, 251, 127, 165, 295, -183, -110, -107, -21, 199, 41, 244, -261, -91, -301, -38, -160, 105, -53, 28, -41, -489, 3, -100, -161, -8, 1, -9, -255, -95, 115, -190, 196, 346, 46, -251, 99, -216, 28, -14, -5, -70, -32, 92, 196, -81, 3, -27, 119, -57, -220, 52, 207, 45, -50, -21, 9, -96, -98, 116, 70, 11, 156, -45, -223, 64, 2, -104, 159, -156, 43, 76, 224, 101, -54, 125, -114, -72, 271, -135, 141, 266, 169, -61, 254, 20, -170, -124, -91, -17, -87, -289, 161, -96, 17, 114, -47, -194, 113, -93, 53, -141, -54, -131, 68, -102, -131, -79, -159, 82, 60, -38, -2, 138, -16, 64, 41, -18, -204, -110, 25, 143, -353, -131, 45, -254, -221, 36, -270, -16, 172, 59, 152, -23, 22, -83, -83, 438, 119, 104, -56, 1, -102, 27, -44, -202, 233, 156, -88, 36, 285, -81, 27, -27, 107, 87, 50, 95, 156, 105, -159, -243, 122, -122, -227, 304, 51, 19, 3, -52, -69, 339, 56, 192, 152, -78, -117, -201, 33, 46, 77]
7082G7K40o11L43j75K36l06M22n9K0n06j26M15l5j35L57l02L39j3l8k55J0j39
7104b41K67n2J70j27l45K55K93l03q0K92j68R5j45K63k20p2K62j86l8k67N41j22
7126G2k57L68k90L37j55j93J86k30J47l24N43j91O3K08m79J90j39M16n89K34j92
7147b75kK47K02l42K50N4J5l50L39N4k43J50k42J9R3J98l5r6O5j93OM3k43L34
7171D8J94l68L43J21m57K23J87j23j36n5P9O6k49L23l71n3J61n1K17k21L4J9J21
7194E2J8K90m06O3k88O9L74k93O4K5j6J6m7oK34k19Q9k31K17P1P9l06N3M31l61
7219b8N0R6k68LO9p1j18M37k52M02n57N32j10k43P7p7r5k4K27J18l90J98m7K44
7243A73j23K1j36J50k07L06J1l12J69J14k48K1p5K20mR3N5m87J68j01K41q5K93
$$ y = [77, 317, -294, 49, -126, 110, -196, 226, 167, 187, -319, -445, -30, -65, -200, 157, -145, 194, 181, 143, -112, -102, -241, 26, -26, 144, 17, -328, -73, 220, -83, -163, 129, -39, 56, -89, 174, -46, -118, 144, -42, -80, -347, 194, 72, -185, 183, -107, 230, 75, -118, 68, -162, -15, -339, 204, 13, 76, 284, -195, -5, -144, 272, -317, -83, -275, -277, -30, 172, -170, 80, 134, 149, -201, 138, 192, -51, 99, -143, -124, -31, 167, 132, 36, 101, -92, -86, -43, -286, 48, 242, -126, 217, 338, -119, 104, 291, 168, 32, -23, 56, 122, -127, 196, -175, -228, -67, -118, 99, -122, -88, -69, 52, 70, 360, -46, 17, -271, -202, 172, -121, -57, -32, -48, -32, -79, -85, 149, -70, 19, -212, 5, 76, 155, -151, -98, 333, -28, 22, 118, -150, -147, -78, -149, -267, 170, -82, 320, -237, 295, 185, -58, 19, -58, -153, -177, 50, 168, -222, -24, -71, 173, 50, 71, -65, 85, -122, 184, 195, -117, 52, 166, -82, -61, -136, 84, 80, 173, 228, -259, -91, -192, 49, -36, 257]
7266B57j25k46K17J07J6j3k84j39J98K8J75m12L24J31j51k1R5o8m0j21K02m4j36
7289e0J56k20J68P1o5j96P0J59j99K45j22N7q7K31n7j0m42J70J11J71r9Q3J38
7312B83l37J41N1j08q9J58k9j7j63L98l54j7j62K81P7k45k7J84O5j70J99j70J7
7335c4J30J24k67n0J79n1k45K0K02j20l3p2J53J5K3j2j52KJ36J14q3j71K08K74
7359B90k45J10k57M5K07k73J03j48N5l2J84K7k23J57O5j66j07R1J75j25J19Ko
7382D8k52p4M89k45p2j52K09M7mj32J74l87L84J7J9r7j0L5l8M7n3JJ8j3l7K88
7408B10k42m8Q3J36j28m8J0L32l44j74K50p0L59l31j09P7l1R6j52J96r2j3J37
7431A04J14r3O6j60j9k12J64J70k24L5k15K15J33J69n24J6N79n55L15k34M5n5
$$ y = [257, 132, -114, 103, 210, 226, 213, -71, -210, -12, 16, 191, -221, 103, 234, 83, 62, 157, 89, 49, -72, 130, 86, -50, 106, -114, 54, 125, 60, -136, -66, 93, -106, 139, 17, 74, -13, 218, 161, 151, -291, -121, -10, 161, 62, 145, 283, -54, 87, 138, 30, -59, 99, 70, 53, -110, 288, -66, -83, -245, 36, 113, -132, -159, 25, 90, -80, 119, -51, -34, 96, 220, -47, -97, 82, 31, -214, -194, 8, -112, -145, -217, -64, -49, -26, -38, -190, -188, -52, 62, -21, -192, 16, 290, 45, 155, -102, -57, 150, -123, -20, -168, -113, -145, 39, 66, -157, 0, 65, -101, -208, -117, 58, -67, 52, 54, 48, -204, -278, 211, -34, -106, -258, -49, -2, -6, -138, 36, -351, 33, 50, 69, -28, -38, -3, -41, 6, -47, -46, -28, -41, -78, 210, -32, -80, 3, 139, 11, -37, -27, 305, -39, -213, 37, -33, 326, -5, -114, -37, -68, 28, -124, 72, -20, -33, 104, 218, 125, 191, 31, 12, -200, -36, 134, -90, -55, -270, -55, 78, 247, -277, -261, 318, -237, 78, -156, -111, -166]
7453a66K97k9jr0J51j69K32j05P8l07L88j15j33Ql1K86n00j0K74p6K89n27J99
7476e7J90n6j36L2q0K64m5J42l41n8p8M29n2k67N0K32O5k78R2m40K29r6m8J84
7500a23J77j23O8K48J4l06J39k72L31j63J12j71k11R4l7M30j16O5k14J72K05n28
7522b09K34k19K39j8j4J22l69J81J6K66m34K85O9j87J69j84K19k40k60L80j63
7543a17K41P0m4P5k39k0J87j76L0j7p3K29k47J37%j19Q6J18j09n7m8n8J56j68
7567a63N9K06n2J1j85j7K16j82K3O7L40j30j49p6K47k95J11k22J84n1J61o3k0
7590B0K46k33j35K94n22M77J53j72j12L9l44M10j8o0K41n44Q3K63o5j90R2j50
7612b27K89J06l01n2J21P3j35J3L34p4l00K48J24J4l60M7L8O1K38l4Kk45J88k89
$$ y = [-166, 131, 102, 101, 11, 162, -7, 225, 120, 198, -109, 279, 164, 31, 39, 8, 294, -206, -216, 58, -18, 271, -256, -57, 133, 77, -59, -27, -107, 157, 112, 254, -87, -145, -223, 206, 154, -113, -63, 169, 234, -44, 48, -392, -163, -259, -307, -123, 54, -69, -1, 247, 261, -45, 94, -178, 153, -10, 102, -69, -280, -186, -223, 207, 91, 156, -58, 114, 319, -209, 25, -194, 45, 27, 13, 135, -234, -53, -37, 229, -205, 80, 149, -38, 131, -53, 166, -74, -334, 46, -117, 124, 194, 150, 225, -14, -34, 153, -23, 7, -10, -83, 146, -101, 36, 36, -83, 3, 121, 12, -45, -93, -151, 5, -163, -104, 102, 50, 61, -124, -141, 75, -107, -84, -17, 323, 193, 44, -32, 215, -80, 31, -191, -7, -58, 103, 40, 20, 266, 33, -102, 192, -330, 147, 300, 128, 16, 55, -289, 121, 103, 43, 284, -260, -177, 86, 21, -169, -77, -227, 62, 168, -133, -185, -64, 9, -126, -113, 221, 147, -153, 95, 219, 233, -127, -80, -42, 19, 257, 223, 225, -20, 168, -121]
7636a21r9P8J5K83j77J55j1k15J44M2n0L8p8K75l53K9K6M0J79k31J80j65m5J44
7660H3K2j50K34O9m12K80m48J89O0QJ47j15J11K31k95J0o5o9N4J04j85J56j45
7683a26K79K1l44K16J74p1l01L81l11k73O19j76k25J15K74l61p8K15j78J53k12
7704b09p9M58r7L8k00R6j71J73L41m36R6k60L77Ml89K28m9K54k41J41J3j85l2
7727a29N74o09L18k20J31o0j56L69q1l19L4mM75n41PK28J03l19K90j04J20m09
7749c02K54N0j35J57J01J93j84K03k47j48j41J88k53J25K99n6n3k53J82J8J35
7770A33j22r8k33L69L6O1j05R3j71k20J53mJ47p7J43q6n0N2K13j40J55j28j74
7793e3R7lo8P5j37K09J45j98j10j05lJ42L9K99l85l6K73r0J19l10J29K33j77j15
$$ y = [-121, -220, -142, -127, 156, -21, 134, 123, -92, 52, 94, 44, 82, 4, 279, -74, -45, -19, 21, 200, -31, 149, -16, -61, 83, 105, -45, 189, 258, -154, 126, -322, -133, -73, -65, 82, -33, 78, 309, 14, 24, -41, -110, -56, 48, -137, 19, -126, 153, 174, -170, 46, 220, 149, -152, 229, -82, -355, 264, 88, -137, -22, 252, -109, -187, 28, -150, 3, -209, -288, 170, 73, 111, -89, 7, -164, 9, 350, -86, 10, -250, 127, 131, -258, -30, -79, 175, -66, 75, 88, -97, -129, 445, -164, 154, -66, 65, 5, -151, 218, 137, -182, -148, -152, 323, -218, -211, 17, 120, -199, 91, -13, 107, -302, -48, 2, -133, 24, 125, 318, 134, 337, 90, -58, -199, -11, -264, -139, 160, 104, 51, -202, -20, -2, 133, 11, -87, -320, 49, 85, 146, 41, 134, -37, -257, -104, -108, 39, -38, 105, 19, -31, 21, 234, 94, 249, 121, -53, 44, 41, -27, 48, -89, 120, 265, 67, -43, -148, -151, -9, 30, 329, -56, -92, 181, 91, 210, -100, 29, 262, 85, -30]
7817c0j26L26k85L07r2k18o2K7K60k26K50j86J2j08M59j54l16M45%j98j18J53
7839A20r9j00r0L65m64K55N6k24J72N1P1r7j7J41k98L92k11K49m20J11N5J65j52
7862C1k91L75k16K7J92p7k49K72J38n24J39R6o9L1J1J56j33P8J13J29l18k4J49
7885C6N2j70m4P2j5k10L04J44m47r1M95l9J1l14Q5J23j03J06j27j10L60J03m9
7908A72M8l13j55L09k11L18l93K07L2j01K67r7J6j1Mj62K11j75L26l25R3K5K5
7931A10p0k33K88J86j32k15k04K52q1J4J54k4l9KJ17L0j96J89j21pr8M2j99L53
7955A18k2j4q7P3o4mR4j43j6j33K10j89N5L7J24k55J90J44j30K39l02L78k68L9
7979G4k55Nr5K16M36n02r8L71j67M4q0j1j04J52K49l31J57k5L03k08j22P8j4J65
$$ y = [-30, -156, 170, -115, 192, 100, -118, -180, -153, 107, -119, 131, -55, -43, -151, 308, 154, -162, 283, 283, 85, -33, 120, 21, -79, -169, 196, -268, -13, 43, -181, -9, 42, 113, 16, -1, 140, -158, 234, 23, 272, -148, -37, 18, 183, 31, -260, 115, -101, -74, 118, 41, -208, 64, 202, -322, -183, -87, -156, -125, -114, 42, -91, -13, 100, 229, -89, -113, 36, 88, -82, -126, -54, -69, -279, 25, 169, -278, -369, 126, 87, 98, -216, -131, -8, -111, -5, -132, -242, 118, 221, 172, 220, -93, -248, 61, -150, 168, -225, -18, 14, -87, 180, 83, 99, 88, 92, -70, 141, -34, 292, -33, 60, 85, 110, 40, -193, 95, 281, 149, -66, -270, -18, -99, -85, 69, 45, 6, 8, 125, 155, -41, 148, 27, 20, -78, -36, -235, 118, 96, 82, -5, 68, 4, 0, 94, -49, -65, -198, 12, -177, -122, -85, 39, -216, -26, 118, -12, 227, -75, 303, 35, 74, -181, -176, -271, -55, 381, -121, -219, 152, -15, 29, -51, -62, -166, -14, 235, -96, 61, 36, 339, 131, 9, 87, 73, 238]
8003B38j64k00K33j67J45K5j93o5L5K25k09M1M4K9J95k79K0R8O3j41j0k40K30
8026d7K36j00q3k66K79J23p7r3n4K94n6j53J39k37K09o1j9P4l88J85P9n3J40j32
8050f1m2J58j40j1K84k53J45m5J50Kj08l7k00M43k31k67J98j23K66oN8k19L8O4
8074F3P0N3l03J35n0N9l50O07k42k81Q6J85l23J34K70m25L01O8k63j8M26j85J98
8097B15l46J91Q3k74M5p7J41r4K67o6nn2j9p8j07J46j18pK08j75J63K67j82k06
8121h0J36m64M81k73K51j60J09l3j48K35j3J58j44k02L1J75L1j94L23k67R3j44
8143i9K83j58l9k11R4M14m67N31k60l54K72j78L54q7j78NM2J5p7J13J73j43J08
8166A53l53J72K04m31K71J51J46k27j35N7J28j84m8N9J08m9j6r3m9M3l6Q4J58
$$ y = [238, 74, -126, 107, -60, 85, 110, -83, -148, -113, 112, -97, -56, -12, 17, 212, -67, -47, 51, 114, -27, -37, -277, -47, 189, 89, 6, -260, 19, 142, 65, -28, -82, 212, 156, 3, 142, -95, 114, 53, 34, 108, -280, -95, -16, -69, 71, -61, -103, 55, -85, -96, 188, -65, 80, 35, 185, 187, 79, 42, -158, 285, 54, -213, -15, -138, 128, 122, 180, -39, -1, 63, 133, 186, -117, 18, -32, 27, -323, 284, 42, -239, -153, 32, -291, -157, 113, -312, -11, 57, -206, -224, 202, 17, 215, -131, 60, 143, -131, -86, -163, -22, -116, 151, 85, 80, 28, 9, -69, -176, -30, -148, -155, 53, -122, 41, 308, 126, -80, 56, -408, 73, -200, 51, -109, 0, -33, -181, 54, 41, 199, 55, -147, -116, 59, 90, -104, 219, -48, 45, -99, 184, 26, -13, -224, -130, 284, -183, 348, 88, -266, 6, -172, 182, 95, -83, -78, -36, -21, -98, 15, 188, 45, 153, -200, -28, 176, -255, 16, 167, 313, 86, -49, 8, 136, -48, -96, -37, 71, 22, 6, -87, -136, -93, -129, -45, 113]
8189A13J76J4
$$ y = [113, 289, 303]
8191C03
$$ Imaginary data points
##PAGE= N=2
##DATA TABLE= (X++(I..I)), XYDATA
0@%%%qJ6qQk0K8l2M0n6P2q8J04j22J47j78K11k50K92l38L94m56N23o02O87p79
28d15Q86j001J126j271J428j593J782j989K210k457K730l025L350l711M109m548
44b389N038n587O206o908P710q641R732j1035J2626j4614J7184k0658K5643l3447
58a9140M7536q0994L01387L33116m65441k70056P9901L50683R4956j87243k71184
69h6479m3120J11058J26369L660o0809j09211q9566j6118J29804J56244P48k19297
81i6717j92051R2005L16690J54779k00453l07497j3224K95368K47613q0974k66052
92e0513j15746J49517K03531L7924j16225j10166k0406M5497O5361N6435m091
103A41118j03369j37509j6320J55665J51341p3996k53644j37570J52020K47155
$$ y = [0, 0, 0, 0, -8, 8, 0, 8, -12, 16, -16, 24, -32, 40, -48, 56, -66, 81, -97, 114, -136, 156, -182, 212, -244, 279, -323, 364, -415, 471, -530, 596, -675, 753, -840, 942, -1047, 1163, -1294, 1436, -1589, 1761, -1950, 2159, -2389, 2649, -2938, 3268, -3640, 4070, -4571, 5161, -5874, 6752, -7862, 9322, -11336, 14307, -19140, 28396, -52598, 248789, 581905, 116464, -153592, -73691, 276992, 371948, 184705, -86479, -129599, -18541, 107828, 111488, 50679, -58532, -148098, -164216, -34412, 121832, 122580, -96717, -288768, -196763, 119927, 274706, 74253, -233244, -246468, 48900, 296513, 215539, -50513, -166259, -16742, 186789, 224713, 108488, -1678, -22084, 23413, 88774, 145209, 141118, 37749, -99760, -116080, 39585, 190926, 116930, -136714, -274284, -122264, 124891]
113A24891J9504k40153k03371O9772K25669R2067j26290j59965j5230J05166Q8596
124a9344N922m1224l9862k4506N619O3925R2701J8139j04067j11792M1661J74275
136F1447R9834j06559j81980k0346J67321J38660n7546j61790o0164R0674J05815
147G5366p28p8851n2129J2023L0317J2220P559P627k0739n2501k1209N8860P9755
160E7570p459j01180o6785O3585J19090K0424j00309q3817M0627J03300L2082
171G7128o4001o2977J4216N5666J9772k6728k1939Q702R905j1683j0123J8815
183F753K3588j4874m3771j1166M4647M1736k2943n7305j0374N1494M0702k3869
195B4618m6614j866M2484K4834k2294k9432Q342L2116P870k6247j9580J6618K7169
$$ y = [124891, 144395, -95758, -299129, -229357, -3688, 88379, -37911, -197876, -213106, -107940, -19344, -13422, -54646, -94508, -119014, -113395, -49470, 43231, 61370, -42697, -154489, -112828, 61447, 161281, 54722, -127258, -147604, 19717, 158377, 100831, -60959, -121123, -30449, 75366, 74638, -4213, -56342, -44319, -14002, -1782, 5777, 13404, -7335, -59836, -81045, -22185, 57570, 50111, -51069, -117854, -54269, 64821, 85245, -15064, -98881, -58254, 45046, 77128, 13127, -49850, -35634, 20032, 39804, 13076, -8863, -161, 9744, -1939, -12062, 6753, 30341, 15467, -28304, -39470, 5177, 46913, 23970, -33335, -43709, 7785, 48487, 24618, -21996, -23862, 18622, 43456, 21162, -8270, 72, 32188, 40058, 13811, -5769, 10849, 38018]
208C8018m329l1631j5834J8547K0263j1867k9282p467J5562M186j8892j5149Q458
221b9417J0308j3116k4641j962K4378J4206k0555l0721J358L3069K3982j3276
233b6387l0922o717K9512L1465L9k2533j0448J3974J9878R610l39n204p518m368
247i958R339J9100P784j8082k7291m040K4429K0763j1198l4458k2871J1141K9250
260f092Q084k7438l2918l308K2532J8301n778k0925j4862L361J7171J5381J665
273b4826j2013j4214K521K3712K2914o00j7936j1161J1260K7264J8435p938k2171
286d753o723J8455K4775N352j6894j9377J50J6791J4097l870j5620j4591k145
299d353J2471J2519n263k0099j3459M758J4195O882q534j7089p542R467J3986
$$ y = [38018, 33689, 2058, -13776, 4771, 25034, 13167, -16115, -23582, -8020, -3834, -22726, -37875, -29417, -19109, -32225, -56866, -58828, -34450, -20244, -40799, -71520, -70162, -37093, -13111, -26387, -57309, -64026, -34514, -3049, -3010, -25543, -35991, -22017, -2139, 7471, 7132, 1928, -5590, -9958, -619, 18481, 26265, 8183, -19108, -23148, 1281, 22044, 10846, -23612, -46483, -35342, -6092, 1992, -25446, -58364, -61672, -39140, -20839, -26617, -47542, -62404, -59043, -41872, -26491, -24826, -36839, -51053, -48532, -24820, -1906, -2506, -20442, -31603, -20343, 6921, 25356, 17418, -4753, -11476, 6979, 31754, 37106, 20212, 835, 985, 17776, 31873, 28003, 12383, -2208, -4353, 8118, 20637, 15374, -4725, -18184, -13426, 769, 7651, -883, -17972, -25514, -16047, -2061]
312b061L824r240j2589j218J3348J2867j835r658m215M634R073P094k00o612m194
327i82M455Q702L519k820o377j654M654M702J32l516l576k187J797M801o2n965
343E623l564J552K225k82r78k348k381Q12J676L31j683k325j108J919J926k001
359f06l281J151J639l13m11r42j313m91K441J070k077k884L06K767J995j014m083
376f046m61L289K727m41j435j611n05K862M113q25m023j383L062L424J13k182
392F78k498L07K255K090l67k294k132OK930J928k671l209J56K181R29m03p50j750
410b614l47J906J886r36j662p32J380J881J95j750m86N55K60K63L85j254k041
427c111l6J837O75k548k359j85J716O37L8k048j824L91K291L017M68l107j838
$$ y = [-2061, 1763, -7477, -20066, -21284, -7936, 4931, 3096, -6562, -10777, -6143, 2930, 10024, 9824, 3212, -982, 3473, 12175, 15694, 12874, 6497, 4843, 9497, 14199, 14331, 10815, 7239, 5052, 6849, 11650, 11588, 5623, 2059, 3611, 5836, 5554, 4576, 2228, -153, 659, 2335, 2666, 983, -1342, -2450, -531, 1395, -606, -3887, -2736, -1097, -1410, -1821, -2763, -4076, -4567, -2126, -1056, -3133, -6017, -5711, -2944, -949, -1963, -6046, -6507, -3218, -491, -932, -2367, -3978, -4483, -1621, 2492, 1667, -2356, -3739, -677, 2747, 2860, 678, -1820, -1513, 742, 2832, 2465, 171, -1961, -1955, 975, 2903, 232, -2977, -2821, -640, 289, -114, -864, -2614, -2961, -1055, 831, -105, -1767, -2499, -1119, 762, 957, -793, -1279, -724, -464, -201, 184, -1070, -3111, -3147, -1310, -635, -3183, -5542, -5727, -4011, -3374, -3336, -5384, -7208, -6817, -4526, -1509, -1041, -4148, -5986]
444e986L418N534K373j976j970J239M026N469J964k541l628J430O305M424k127
459A7954n741l068K904M203N51m470o961l196K162K764j896p311o669q08K339
474g243r2k571m051m253j756K506L849P89l749l033K168O980N525L89j752J172
490e122M783O841N179J027q71J956M727L393K369J084P85k891l200J351M167L03
506B5881p861r687l160M348J359p362j1447o021k31J227k618n871n588k718p88
521c0537r75J945M814j37p192m254Q934J6191P337q703j1007P040K3105J4772
535B1333n496j2735l42J4432J6144M409p050q418r08O233P705N271l663j5179
549B1736j5537K169J8415J1163j7098l3685j3957K2662K8479n914l7075k5651
$$ y = [-5986, -2568, 2966, 5339, 3363, 1393, 2632, 6658, 12127, 14091, 11550, 7922, 9352, 15657, 20081, 17954, 12213, 9145, 12049, 16252, 16803, 12333, 5372, 2176, 4338, 7102, 5206, -2105, -8774, -9582, -7243, -7335, -9906, -13957, -18210, -19966, -17460, -13611, -12822, -16571, -19604, -17436, -10456, -4931, -4542, -6294, -5122, -339, 6502, 11681, 12708, 11837, 13793, 18520, 21913, 24282, 25366, 26151, 23260, 20060, 21411, 25578, 25881, 18020, 8333, 5173, 9521, 10880, 3518, -7929, -13950, -14181, -12954, -15572, -21443, -27031, -29749, -30537, -31512, -29567, -24753, -24890, -32082, -36336, -27402, -11211, -3874, -12577, -23584, -16544, 6561, 21333, 15837, 3102, 2760, 17192, 33336, 37745, 30695, 22277, 21369, 27602, 35307, 40578, 36915, 21736, 6199, 8368, 26783, 37946, 20848, -12837, -26794, -4132, 24347, 18433, -18642, -44293]
561d4293J2120L1772J3221j9152k6580m424J8374K1267P188n997j2506q851P576
574a0285K6651K5645k849l1419k3571K2807N3072K2088l7626n0533P93N2895M2427
587I0095j7162n4377k6610K5754M1716J0439k6775l3260j2866J1493K4026J6036
599D8509r710l5082l3573P337M8961L6650k8251o9149k6885N1847P1276L914o8945
612c101n7132K2556P2000L5227l4725n5389j4517L2733M0365J1648j9441l0196
624B8k0203O235L6699L6700q634n9288m7599K7188P8116L4459n8140q6838j0163
637g1440P9587O9608k4186q4168m3384L9827O7031J8392l9637m6202j0785K2831
649b2526L2274K0483p210l9950m1926O498O1222N1065k9215q7869m3522O0221
$$ y = [-44293, -32173, -401, 12820, -6332, -32912, -37336, -18962, 2305, 9493, 3496, -9010, -17861, -10285, 16366, 42011, 39162, 7743, -15828, 6979, 60051, 82139, 44513, -6020, -5227, 47668, 90095, 72933, 18556, -8054, 17700, 59416, 69855, 43080, 9820, -3046, 8447, 32473, 48509, 38799, 3717, -29856, -22519, 26442, 63092, 34841, -34308, -61193, -9346, 61930, 65844, -3101, -60233, -37677, 34323, 69550, 34825, -20564, -35081, -2348, 38017, 49665, 30224, 28, -20175, -13940, 22759, 59459, 50825, -8463, -56062, -28874, 49242, 83701, 25561, -61277, -71440, 8147, 77755, 53569, -30599, -73983, -34156, 32875, 51267, 11630, -34572, -45357, -22526, 9748, 30231, 23021, -16929, -58855, -52357, 8865, 59930, 30715, -57154, -100676, -40455]
661d0455R3532Q682r0153p8502K3903Q9699M3992m7485p4055j6913M4999M6002
673C246M430k4756k7656j4999P004L3655L9873N59n2798n1043K3593Q4931M7100
686G3139n3496q9069j1472Q3291P7332k1504q6403m2715M5563O8348J0990m5668
698H336m0927q83K2208J8177P055m562k3765l4516p515M1953M7504j3967p2528
711e3430m3967M4907Q1345J4984p1972o5864K2759Q0481L7344m1548n6490k95
723e1746M6745L3530o466j9634m571L572J441R887K4801J3160k6396m0857K290
736a4244N3136L8275l2568o7327j6803N3853N1024k0959o5480k8325L5074M1749
748B7405p173m0992k0153J4389J5916n660j0177M749N810j3183j6538J1148L3000
$$ y = [-40455, 53077, 61759, -28394, -106896, -82993, 6706, 50698, 3213, -70842, -87755, -42756, 3246, 7676, -17080, -44736, -59735, -52731, -19076, 20797, 21356, -31442, -82485, -58892, 26039, 73139, 19643, -69426, -80898, 2393, 79725, 58221, -28182, -70897, -25334, 43014, 54004, 8336, -32591, -33474, -11266, 6911, 13966, 9404, -14361, -48877, -56392, -14439, 33065, 19098, -53430, -97397, -52490, 28855, 43839, -28133, -93997, -71238, 9243, 46587, 5039, -51451, -51746, -5001, 28529, 22063, 2429, -2142, 1430, 2871, 12758, 37559, 50719, 24323, -16534, -14244, 38892, 77167, 44599, -22728, -39531, 14322, 65346, 44387, -21093, -49418, -14344, 27405, 20232, -20760, -40913, -26524, -10608, -16268, -26445, -21696, -15886, -29069, -45607, -34459, -1459]
761a459R090l2092k9267J8792M7609J5158l5443l4117J6057M5411J4482k9773
773D448k7008J2852L0652M865k3071j3844J4253J5548j0349k1363M20J8965L635
786A0003k2498j8422J0272K0716l589k7167j2733J7752J7679j0770k4660j398
798d4815K2118J2465j6477k1235P745K7837Q687k1893j9180J4411K9127O172k1663
811a6701j5278J2866K2936L462j5327o761R699Q493m602n219O842P409o685j4948
825a3814j074J9978J3391j5507k7620k513K7199K0793j3328l1195j0086K2998
837a0778K4658l752k3497j2105J0293J5628M881m834o033m129j091N030J1796
850F067Q873q055j9633n040J9683K3685k247k6341j8698J2678L0184J0441k1056
$$ y = [-1459, 7631, -24461, -53728, -34936, 12673, 27831, -7612, -41729, -25672, 19739, 34221, 4448, -22560, -9708, 20944, 25809, 2738, -11106, 3147, 18695, 8346, -13017, -12597, 6368, 10003, -12495, -30917, -20645, 71, -3518, -30685, -43418, -25666, -7987, -18757, -43417, -44815, -22697, -10232, -26709, -47944, -40199, -12362, -3675, -25568, -44748, -30337, -1210, 4962, -16701, -31979, -19113, 3823, 7285, -8042, -14803, -5104, 3389, -1213, -6432, 410, 7819, 1134, -13814, -14888, 5090, 18481, 2974, -24646, -27159, 40, 20833, 7505, -23690, -33776, -10778, 13880, 10128, -13369, -25474, -15181, 447, 5328, 494, -5539, -9668, -10759, -5729, 6067, 14940, 6885, -12748, -17788, 1895, 25580, 23333, -3008, -21706, -9028, 21156, 31597, 10541]
863A0541k5118K11K1908J6414n507j6930j0173L889J1597R196L15r255j2706l728
877i346J3110J7709J087j8758j8497L994K3815J6211j1336k6213r801J7837K2202
890B2014J321j8524j7693K012J6083J1903l783j3491j0930Q39J1551J1412j550
903A1164j3978j2764K443J5839J1668n358j8219r724R816J8528N874j2728j5814
916a3253j259J4255J3090j905j2252q341K802J0131P995j383r777p854J966J0531
930D746P135k930j0900p347M766J0819N270o664j1254m189Q362R894R09r610p920
945h913J507P404O133j391p647n792K773P285M434k601p104l580M012P075K162
960E757m167n216j790N275M941O10m949m397J300N371K976k024l726j731J838
$$ y = [10541, -14577, -14366, 7542, 23956, 18449, 1519, -8654, -4765, 6832, 16028, 16343, 7088, -5618, -9346, 3764, 21473, 22560, 3802, -14695, -10701, 13114, 29325, 17989, -8224, -18025, -188, 22014, 23335, 4811, -12882, -10870, 5213, 17116, 13333, -158, -11088, -10249, 1302, 12714, 11164, -2814, -15578, -13135, 2704, 14372, 9014, -9205, -18929, -9113, 9415, 15289, 2561, -13253, -14512, -257, 12833, 10928, -1324, -9665, -6863, 3268, 11263, 9880, 103, -7751, -5785, 4746, 11881, 8951, -1949, -9296, -4530, 6289, 11559, 4895, -6359, -10548, -2186, 7708, 8617, -993, -8913, -7406, -2, 6131, 4740, -2907, -8699, -5926, 1359, 5793, 3192, -3912, -7492, -3480, 3595, 5757, 1590, -3626, -5416, -141, 4800, 5410, 461, -3936, -2636, 2735, 5711, 3687, -39, -1770, 68]
975F8L909J633j874k839j181K510K969L77k515k395Q18J933J397o40j963j454
991G53Q6J418O94j156k069j243N50J276o78j222j305j356N11Q41J45j835j609
1008f199Q0K071P53j615j392K29J501J021J07o47n82J215J817O99q52m28P14J293
1026b15J230n33n65j09P67K74L2o41p67p23M91Q75r62j702j033O6M03k95j652
1045e059q95o6O34J35j410o33K55N11P51p5r23M66J227J220k49N77m4K93R24J076
1065a285J009K12o4M14P18J686L45q72o52N82Q60J288j09j367j240P52J363J44
1083C784j133r12r83O53Q63L96p45j491p96O82J962J097k012k168J84K055J378
1100B814j10j469j724O85K198J234r56k150p26J083K089P79j157j644n62L27J712
$$ y = [68, 3977, 5610, 3736, 897, -284, 2226, 5195, 5572, 3057, 662, 1480, 3413, 4810, 4170, 2207, 753, 839, 2257, 2951, 1795, -274, -1517, -967, 309, -369, -1591, -2896, -4252, -3741, -2900, -2755, -4590, -6199, -6119, -4048, -3295, -4910, -6302, -6073, -4572, -3551, -3444, -4091, -4673, -3458, -1641, -942, -1794, -2222, -1508, -215, 1015, 482, -83, -192, 575, 849, 881, 240, -527, -1250, -759, 116, -846, -2548, -3581, -3515, -3112, -3407, -5059, -5954, -6020, -5386, -5251, -6661, -7294, -7039, -6528, -5777, -5852, -6775, -6309, -5082, -3862, -4111, -3534, -3578, -3285, -2361, -1285, -276, -64, -128, 286, 1004, 2690, 3035, 2163, 1511, 2093, 2953, 4241, 4132, 2765, 1525, 2277, 3640, 3784, 2651, 1739, 756, 1409, 2272, 2668, 1923, 432, -364, 318, 2280, 3377, 1365, -803, -619, 1436, 2814, 2704, 1235, -489, 196, 2394, 3628, 2672, 522, -204, 879, 2968, 3747, 2590, 946, 384, 711, 2423]
1117B423J501p11k320r83J740K064O69o58j499j565J392L030J803j243k507j421
1133A715J743L954J021k953l000r94K666K903O87l762m366m29L124K378n79l937
1149A71m555o20L471L176j119m459m851Q1N577M503k249o761l513L642P269L308
1165C071l357o482q86N545O969K272l495n187q84M754P401K372m057p938k584
1180b486O670J0048J118j0368j0778P46J0783Q430n186j3487q358N672J0981L537
1194G322q062j1589m058O561Q757K794o348r991m420O119J2690O524q650j4549
1208a6900k690J4337J6897O35j6104j2701O482J9146J0872q147j5832m971J0015
1221A039J3447M458q337j1517m432N213J0724O878o397j6508j0164Q687J8316
$$ y = [2423, 3924, 3213, 893, -90, 1650, 3714, 4383, 3725, 2226, 661, 2053, 5083, 6886, 5643, 3136, 1715, 3458, 7412, 8433, 5480, 2480, 1486, 4152, 7055, 7742, 3980, -386, -815, 2309, 4687, 4108, 171, -4384, -5004, -1533, 1643, 524, -3935, -8786, -8705, -3128, 1375, -874, -7635, -11148, -7506, -237, 3071, -286, -6768, -7654, -2109, 4860, 7132, 3637, -1550, -2434, 2320, 9721, 12093, 8036, 98, -2486, 4184, 14232, 15350, 4982, -5796, -5050, 5733, 14163, 8977, -4510, -12868, -7196, 3785, 7322, -740, -12329, -16387, -9826, -1069, 1725, -4623, -14614, -19034, -12915, -225, 6299, -2351, -16900, -19590, -5253, 11644, 12279, -3825, -16526, -10044, 9102, 19974, 11827, -4005, -8976, 1039, 14486, 18944, 10607, -910, -5342, -129, 10595, 17473, 11076, -5432, -15596, -6909, 11407]
1234A1407O391j6886k2386k397K0360J8345o473k3673j3399J0949K0834P029j2057
1247a956j6114l000J0525J2854M986m841j1549p873O358J7783J2363q678k2288
1260a1430r319J8323K5900K588k4137k1949O724K6806J3792j3684k3539o399J4063
1273b261J5370P49j0835j1131l345L327R353Q569k973j6520j3942O938K2847J2096
1287A8242j5905k7155m539K4950K3724o033k7389j3365J4145K3699M978j5122
1299B30j4168J408J0272P281J269k230n604p873l79J1839J4059l179k0956j3656
1313b1687J3052K5376M808k2617k1911N896K5273J1744j4850k0659q68J5658R877
1326I092n377r140j436K589n68j38N684N065n708j3838j982J6123J4267q230k2084
$$ y = [11407, 17798, 912, -21474, -23871, -3511, 14834, 8361, -15312, -28711, -17762, 3072, 10101, -1956, -18070, -21070, -10545, 2309, 7295, 2454, -9095, -16968, -10610, 7173, 19536, 10858, -11430, -20749, -2426, 23474, 26062, 1925, -20024, -13300, 13506, 27298, 13614, -9925, -16324, -2261, 13109, 13858, 3023, -8108, -11453, -8126, 1227, 9796, 6823, -9697, -23639, -16701, 6146, 18242, 2337, -24818, -29357, -4407, 19317, 13284, -14105, -27470, -13325, 10374, 15352, 230, -13938, -12530, -2258, 5023, 6292, 4062, -1542, -9415, -9794, 2045, 16104, 12925, -8031, -21687, -8635, 16741, 21549, -1068, -22979, -17083, 8190, 19934, 5084, -15575, -16443, -785, 9092, 3715, -5425, -6861, -4272, -4840, -4978, 706, 5771, 63, -13775, -15757, 366, 14633, 6403, -15681]
1341a5681o403J8362J8579n130k1066r391J4054J6208k750j4329m951Q609P201
1354C312l701o053L522O683l244q803K99J2223O467r898j3193L003J5827P312
1368A3756j1916j3920M394J5121M656j2243r730O327J1357q76j1781m958R723
1381i0R239o442j3227P4J2749O679r376j1687K657J2308L872r378p496N308Q738
1396C928k289p589m50R105M344q029q649N510J4208K415j4501j0458R174J6976
1410A3695K089j4952j1544O937J4790K752j0803p780L447O602j03k808n6J869
1424D135k910o800J450J0118N733j0203j4859Q98J7361J1265j0587j8956l593
1437a6948J6628J4928n081j6268o488R179J1148J423o261n265j26J579L239M465
$$ y = [-15681, -22084, -3722, 14857, 9727, -11339, -20730, -6676, 9532, 6782, -7547, -12498, -3889, 3312, -389, -6442, -2920, 3763, 519, -8284, -7985, 4238, 10705, 807, -12386, -9383, 6444, 13756, 1840, -12080, -7686, 7435, 12091, -152, -9882, -3555, 7802, 6926, -4855, -9813, -90, 9149, 2707, -10520, -10446, 2303, 8982, -394, -12081, -9424, 2884, 6756, -2622, -10118, -4810, 3928, 1639, -5950, -6400, 2705, 7049, -980, -9629, -4119, 10089, 12504, -1997, -12455, -3281, 13695, 15784, 832, -10712, -3775, 11015, 13767, 2964, -4816, -1369, 5233, 5130, 2322, 2266, 4135, 1225, -5575, -4125, 5993, 11726, 1523, -13336, -12438, 4923, 16188, 5601, -13355, -16948, -320, 14608, 9527, -6741, -13229, -4050, 7098, 8521, 2260, -3005, -3131, -1552, 1687, 6152]
1451F152K932m686j0464k150J1678J2938k879j6993j0780J0072J8663L964j5998
1464B449j5247K870J5946Q597o782j1974m463N228P692K554k057n272o296n70
1478g325P292R477j0j1785j1091L988J5995R302r914j6789l233J4208J3653j862
1492A1906j4262q936N346J2006M934n164q134l520K621O814N195j514p967o621
1506g296J672J0127P857m989j2882n743Q336J2817J926j0941j0779J610J1194
1519B909P223m242r375m109M057O669L300k426o190l900J831O539M807k127q081
1534c115m954M319Q977L433o458q884j142Q143P134j256q179n088L031O801K762
1549E524k860n151k851L001M711K358k556m801j992K673M906J991l799n364o03
$$ y = [6152, 9084, 4398, -6066, -8216, 3462, 16400, 13521, -3472, -14252, -4180, 14483, 18447, 2449, -12798, -9928, 6018, 14615, 7833, -4141, -8604, -3376, 4316, 6870, 4813, -459, -6755, -7325, -33, 9444, 9434, -2351, -13442, -9454, 6541, 15843, 5929, -10860, -14093, 115, 13768, 11906, -2356, -11292, -5946, 6060, 10994, 5830, -2304, -5824, -3203, 3611, 8806, 7292, -675, -7296, -5624, 4503, 12360, 7371, -5511, -11254, -2918, 9899, 11825, 884, -9895, -8285, 2909, 10132, 5890, -3485, -7594, -3537, 3132, 6432, 4006, -2184, -6084, -4253, 2286, 7093, 4966, -3115, -8069, -3750, 5227, 8660, 2202, -6682, -7824, 319, 7453, 6197, -1982, -7070, -4039, 2762, 5524, 2664, -2487, -5338, -2337, 2374, 4732, 2176, -2625, -4617, -1944, 2962, 4953, 1154, -4210, -4813]
1564d813M669M530p19m950l590J889M955K044k504l933j127K394K919Q97j551
1579A110k991q73J764K556J105k444k608n59K692K793m21l056j663O17K900J245
1595B167j468k687p1J925J467M7j258j772j76J968J384j7j547j027J81J834J098
1612B048p41j688m53J072J673K18j484j380K51K138N07r10j256l98J020O93R2
1629A402p16o80PO45K37J99o65j117J5J138N53n13n72q81J27J462K90p35p13J2
1649e05L98Q32k21n19l46O5N06K58J78o4n79l22Q49M49k0m06n70l35Q56M92k52
1670G44q53j87P42J92J92p60l69L61J85j51o29L13L5k86J84n20K53J75NL6l73
1691g11j01Q98m25k00N2L53k53P2K71J64o4m80k03Q80M17n3j053K95M35P61l8
$$ y = [-4813, -144, 4386, 3667, -1283, -4873, -2984, 1971, 4015, 1511, -2422, -3549, -1155, 1764, 2661, 1110, -1881, -2754, -990, 1566, 2671, 227, -2381, -2940, -248, 2545, 2124, -932, -2595, -1978, 922, 2167, 699, -1988, -2059, -134, 1333, 1380, 122, -1650, -1826, 142, 1526, 1509, -38, -1065, -884, 950, 2048, 1307, -381, -834, 238, 1911, 2129, 645, -735, -484, 1654, 2161, 1251, -5, -403, 617, 1310, 1402, 686, 6, 13, 658, 895, 1094, 429, -688, -673, 465, 1018, 505, -67, -948, -821, 641, 931, 196, -517, -505, -107, 725, 504, -15, -361, -296, 210, 468, 646, 582, 3, -319, 530, 979, 959, 553, -17, -352, 504, 996, 744, -109, -296, 446, 638, 830, 70, -299, 62, 247, 96, -533, -220, -185, -471, -287, -807, -554, -379, -374, -338, -711, -812, 86, -339, -539, -487, -134, -387, -315, -44, 120, 56, -424, -627, 253, 670, 617, -436, -141, 294, 1055, 1017]
1712A017m54o43L86P39J60l33k82r2R4L85N05l21l95l87J13R8P83n8o68p07OR23
1734H69L01j03j138m68R10O97m88j78k74r0j19O85K89p47j79m9K88O20N82m58
1754I50o60KP03Q64j44p25j41J57J004j59o29q5M7L00k60K61j05j06Qn82m65M94
1776G29L72k71l40j088l31Q92N30l11j272l56L70J032J31k30j053l07L65J106
1794c2Q41j52j883l52O47J835O83j087j390o01J687J603L77j690j717J07J714
1811E90J576j78k337j455L13J605J940r13k127j922Q32K474R44j035k844j054
1827c591J251L200J075j862l032j342K294M075N04l202l314M40L750L124j72m455
1843a257k670J764L889J970j551l500j563J862L116J935k031l424k102K131L681
$$ y = [1017, 563, -80, 306, 1045, 1205, 872, 590, 498, 592, 977, 1482, 1161, 766, 379, 492, 590, 1373, 1315, 647, -60, -54, 869, 1170, 1067, -71, -539, 371, 1068, 580, 402, 128, 38, -81, 604, 893, 146, -33, -82, 206, 826, 1408, 950, 290, 292, 995, 1859, 1715, 990, 849, 1006, 2010, 1851, 1222, 1137, 1184, 1484, 1224, 1485, 1380, 1274, 1282, 700, 235, 729, 1101, 830, 490, -598, -929, -37, 493, 182, -1090, -1446, -1076, -44, 87, -143, -1196, -1503, -1138, -32, 809, 657, -1226, -1578, -931, 904, 1587, 500, -890, -1491, 196, 1799, 2176, 486, -1231, -1124, 590, 2166, 1988, -349, -1804, -1491, 114, 2054, 1141, -986, -2908, -2076, 398, 1342, 307, -2537, -3591, -2340, 860, 1935, 73, -2959, -4301, -2007, 2068, 2572, -630, -3944, -3504, 246, 3370, 3198, -1257, -3927, -2163, 1726, 3696, 2145, -1355, -2918, -1056, 2060, 3995, 1964, -1460, -3562, -1431, 2250]
1858B250J952l227m249j457L753M505M39m728m305J213M642L619k205m397j974
1873d169K401L820J773k224k941j811J559L502K725j023n017k807K532N487K293
1888F100l827n907j272N831N304j631o303l298K449N205J688l051m005l28K081
1903i64K303Q31n01k288k425L22L400L377p76n013l634L368O647J548n432n113
1919d350R77N913L263k911m648r46L327K132m96j763m31l36o09k0K047J783j958
1936I74m428j098M454M335j859o396k087M299N356l57n834k674L334M328o64l200
1952a517o69J876J495j758j098K415K471j888l744l11M748K743l019m842m97N218
1968A623K932k823m871O1L862J629k705k725J753K423r77l630m25M488K587l913
$$ y = [2250, 4202, 975, -3274, -4731, -978, 3527, 3966, -762, -5067, -3854, 788, 4407, 2202, -2195, -4169, -1768, 2052, 3825, 1601, -1340, -3151, -1592, 1910, 4635, 3612, -1405, -4212, -1680, 3807, 6100, 2273, -3634, -4906, 925, 6229, 4598, -1705, -5003, -2554, 2651, 4339, 1288, -2717, -3045, -964, 1339, 2170, 1669, -619, -3044, -2722, 678, 4055, 3279, -1734, -5368, -2000, 4647, 6195, 763, -4350, -3373, 2540, 5803, 2892, -1756, -2702, 625, 2757, 2261, 498, 67, -269, -878, -898, 1149, 2932, 974, -3454, -4552, -98, 4237, 2378, -4018, -6105, -1806, 3550, 3193, -2641, -5315, -1981, 2347, 1683, -1517, -2186, -310, 1185, -573, -1671, 744, 3215, 1327, -2417, -2728, 2020, 4763, 1744, -3098, -3595, 1623, 4555, 1732, -3139, -3078, 784, 2413, -292, -3017, -1264, 1159, 182, -3448, -3873, 615, 3202, -711]
1984g11n023P31O570K705m430n701J027O138K591l592m302J351L473Q78k263o34
2000a192K173J003k769k449K916M792m72o672l598N128P145l82q064m992M198
2015c235P299R57n648m941K302M073R66k123j282Q01n86j156R04M053J353m767
2031a030n297J711Q610L954n908r038K07Q855O631m082q867k404N830O365j053
2046D484m775k807J238K069Q08P41M39k240l945m83N568N316k295q377m498O168
2062b589R276P92r044p204L692R020L585n517o843j92N154L312l47k226k255r39
2078b325R6L173L801j76o096n352K990Q527L662o424q779l48Q472P054l044r383
2094d152l388M910P315K90m691m310N06K654K444R49r38k746k721O09M879M287
$$ y = [-711, -5734, -5003, 1567, 4272, -158, -5859, -4832, 1306, 3897, 305, -3997, -2646, 827, 1705, -558, -1192, 981, 1984, -785, -3234, -318, 4474, 4002, -2670, -6268, -1140, 6005, 5623, -2441, -7433, -3235, 4064, 5021, -627, -5568, -3266, 807, 1773, -350, -1632, -831, -1417, -2573, -1669, 2384, 3737, -1030, -6327, -4616, 3994, 7948, 2040, -6998, -6791, 2064, 8695, 4613, -4254, -6658, -828, 5537, 4484, -291, -3098, -1860, 209, 1017, 1758, 2197, -43, -3988, -4471, 1097, 6413, 4118, -4259, -8757, -2589, 6687, 7479, -1565, -8769, -5077, 3943, 7528, 2011, -4832, -5024, 130, 3442, 3095, 869, -1386, -2325, -2229, 944, 4745, 4569, -1527, -6879, -3889, 4638, 8300, 1876, -6903, -7251, 1221, 8275, 5231, -4152, -7540, -2630, 4685, 4975, 284, -4026, -3520, -866, 1578, 2527, 1589, -1157, -3878, -3269, 1610, 5897]
2110E897k565p129k582N249P694r9p180n762K681P335L138m169o121m39L890L680
2126C518j85k192k596r52J344K383K162r58m244k800K350N576J966m675n788L20
2142d771N934M483k690n461k384L959M484K39l474k880P13K144J813J24j186j987
2158i40o73Q42K897J237k035l519r44L526L588p05m442k471K229L988R12k788
2174G02k843p0K699J437m33j676j263L47J038J125J10p15k070p41K205J974j55
2191A671k523j913J087K585J071j780k536l65K710J278p01j665r64Q69J540K41
2207F05m05p92q55N48P32O21k24j088o64N47J607M28r40j749J7J608R08p39j233
2226a068q60J174J202k97n69n53p6M29L09K42jr73j94M57R06K02p79p86J2Q96
$$ y = [5897, 3332, -3797, -6379, -1130, 6564, 6465, -715, -6477, -3796, 3539, 6677, 2508, -3613, -4052, -162, 3518, 3333, 1141, -1455, -2407, -1063, 1320, 3482, 2524, -1720, -4520, -2170, 3406, 5372, 697, -5091, -4771, 1163, 5646, 2956, -2505, -4889, -930, 3554, 3793, 319, -2561, -1848, 296, 2109, 2233, 1047, -940, -1613, -771, 2126, 3363, 1328, -2191, -3135, 391, 3979, 3274, -1168, -3639, -1410, 2578, 3490, 702, -2141, -2211, 488, 1925, 1492, -184, -1447, -1100, -62, 1063, 1173, 458, -1612, -2353, -148, 1826, 1671, -852, -2765, -1678, 907, 1978, 198, -2338, -2703, 7, 1285, 584, -1081, -2045, -1176, 364, 605, 200, -592, -1447, -899, -167, 454, 230, -858, -1522, -975, 632, 1060, 120, -1629, -1612, -4, 904, 165, -1068, -1928, -754, 448, 151, -418, -971, -1047, -618, -309, -67, -68, -1041, -1235, -778, 128, 330, -449, -1235, -1223, -327]
$$ [...]
8191A82
##END NTUPLES=NMR FID
##END=
