##TITLE=1H_Ser 4174-N
 DMSO
 8 sc, 
 10.10.2024
##JCAMPDX= 6.0         $$ Bruker NMR JCAMP-DX V2.0
##DATA TYPE= NMR FID
##DATA CLASS= NTUPLES
##ORIGIN= UXNMR, Bruker Analytische Messtechnik GmbH
##OWNER= root
$$ XWIN-NMR		Version 3.5
$$ Thu Oct 10 15:39:54 2024 Russian Standard Time (UT+4h)  she@DPX200
##.OBSERVE FREQUENCY= 200.1318
##.OBSERVE NUCLEUS= ^1H
##.DELAY= (6, 6)
##.ACQUISITION MODE= SIMULTANEOUS
##.ACQUISITION SCHEME= undefined
##.AVERAGES= 8
##.DIGITISER RES= 18
##SPECTROMETER/DATA SYSTEM= spect
##.PULSE SEQUENCE= zg30
##.SOLVENT NAME= D2O
##.SHIFT REFERENCE= (INTERNAL, D2O, 0, 15.7039)
##AUDIT TRAIL= $$ (NUMBER, WHEN, WHO, WHERE, WHAT)
$$ ##TITLE= Audit trail, XWIN-NMR		Version 3.5
$$ ##JCAMPDX= 5.01
$$ ##ORIGIN= Bruker BioSpin GmbH
$$ ##OWNER= she
$$ F:/spectra/data/she/nmr/H-F/1/audita.txt
$$ ##AUDIT TRAIL=  $$ (NUMBER, WHEN, WHO, WHERE, WHAT)
(   1,<2024-10-10 15:38:15.81 +0400>,<she>,<DPX200>,
      <created by zg, POWCHK disabled, PULCHK disabled
       configuration hash MD5:
       00 E9 B6 7A A2 85 ED C7 34 08 36 98 17 FE 4E 26
       data hash MD5: 16K
       09 2B 58 1B 01 63 A8 11 70 73 6E 28 EF D3 3E FB>)
$$ ##END=
$$ 
$$ hash MD5
$$ EA AA 15 F8 19 6A 13 B3 10 F2 30 C9 80 5C F4 A1
##$RELAX= 
##$RELAX= 
##$RELAX= 
##$RELAX= 
##$RELAX= 
##$RELAX= 
$$ Bruker specific parameters
$$ --------------------------
##$DU= <F:/spectra>
##$EXPNO= 1
##$NAME= <H-F>
##$PROCNO= 1
##$TYPE= <nmr>
##$USER= <she>
##$AMP= (0..31)
100 100 100 100 100 100 100 100 100 100 100 100 100 100 100 100 100 100 
100 100 100 100 100 100 100 100 100 100 100 100 100 100 
##$AQSEQ= 0
##$AQ_mod= 1
##$AUNM= <au_zg>
##$AUTOPOS= <>
##$BF1= 200.13
##$BF2= 200.13
##$BF3= 200.13
##$BF4= 200.13
##$BF5= 200.13
##$BF6= 200.13
##$BF7= 200.13
##$BF8= 200.13
##$BYTORDA= 1
##$CFDGTYP= 0
##$CFRGTYP= 5
##$CHEMSTR= <none>
##$CNST= (0..31)
1 1 145 1 1 1 1 1 1 1 1 1 1 1 1 1 1 1 1 1 1 1 1 1 1 1 1 1 1 1 1 1 
##$CPDPRG= <>
##$CPDPRG1= <>
##$CPDPRG2= <>
##$CPDPRG3= <>
##$CPDPRG4= <mlev>
##$CPDPRG5= <mlev>
##$CPDPRG6= <mlev>
##$CPDPRG7= <mlev>
##$CPDPRG8= <mlev>
##$CPDPRGB= <>
##$CPDPRGT= <>
##$D= (0..31)
0 1.2 0 0 0 0 0 0 0 0.06 0 0.03 0 0 0 0 0.0002 0 0 0 0 0 0 0 0 0 0 0 0 
0 0 0 
##$DATE= 1728560295
##$DBL= (0..7)
120 120 120 120 120 120 120 120 
##$DBP= (0..7)
150 150 150 150 150 150 150 150 
##$DBP07= 0
##$DBPNAM0= <>
##$DBPNAM1= <>
##$DBPNAM2= <>
##$DBPNAM3= <>
##$DBPNAM4= <>
##$DBPNAM5= <>
##$DBPNAM6= <>
##$DBPNAM7= <>
##$DBPOAL= (0..7)
0.5 0.5 0.5 0.5 0.5 0.5 0.5 0.5 
##$DBPOFFS= (0..7)
0 0 0 0 0 0 0 0 
##$DE= 6
##$DECBNUC= <off>
##$DECIM= 24
##$DECNUC= <off>
##$DECSTAT= 4
##$DIGMOD= 1
##$DIGTYP= 9
##$DL= (0..7)
0 120 120 120 120 120 120 120 
##$DP= (0..7)
150 150 150 150 150 150 150 150 
##$DP07= 0
##$DPNAME0= <>
##$DPNAME1= <>
##$DPNAME2= <>
##$DPNAME3= <>
##$DPNAME4= <>
##$DPNAME5= <>
##$DPNAME6= <>
##$DPNAME7= <>
##$DPOAL= (0..7)
0.5 0.5 0.5 0.5 0.5 0.5 0.5 0.5 
##$DPOFFS= (0..7)
0 0 0 0 0 0 0 0 
##$DQDMODE= 0
##$DR= 18
##$DS= 0
##$DSLIST= <SSSSSSSSSSSSSSS>
$$ [...]
##$SUBNAM2= <"">
##$SUBNAM3= <"">
##$SUBNAM4= <"">
##$SUBNAM5= <"">
##$SUBNAM6= <"">
##$SUBNAM7= <"">
##$SUBNAM8= <"">
##$SUBNAM9= <"">
##$SW= 24.0689170037331
##$SWIBOX= (0..15)
0 0 2 0 0 0 0 0 0 0 0 0 0 0 0 0 
##$SW_h= 4816.95568400771
##$TD= 16384
##$TD0= 1
##$TE= 0
##$TE2= 300
##$TE3= 300
##$TEG= 300
##$TL= (0..7)
0 120 120 120 120 120 120 120 
##$TP= (0..7)
150 150 150 150 150 150 150 150 
##$TP07= 0
##$TPNAME0= <>
##$TPNAME1= <>
##$TPNAME2= <>
##$TPNAME3= <>
##$TPNAME4= <>
##$TPNAME5= <>
##$TPNAME6= <>
##$TPNAME7= <>
##$TPOAL= (0..7)
0.5 0.5 0.5 0.5 0.5 0.5 0.5 0.5 
##$TPOFFS= (0..7)
0 0 0 0 0 0 0 0 
##$TUNHIN= 0
##$TUNHOUT= 0
##$TUNXOUT= 0
##$USERA1= <user>
##$USERA2= <user>
##$USERA3= <user>
##$USERA4= <user>
##$USERA5= <user>
##$V9= 5
##$VALIST= <valist>
##$VCLIST= <CCCCCCCCCCCCCCC>
##$VD= 0
##$VDLIST= <DDDDDDDDDDDDDDD>
##$VPLIST= <PPPPPPPPPPPPPPP>
##$VTLIST= <TTTTTTTTTTTTTTT>
##$WBST= 1024
##$WBSW= 4
##$XGAIN= (0..3)
0 0 0 0 
##$XL= 0
##$YL= 0
##$YMAX_a= 287549
##$YMIN_a= -214647
##$ZGOPTNS= <>
##$ZL1= 120
##$ZL2= 120
##$ZL3= 120
##$ZL4= 120
##$ABSF1= 10
##$ABSF2= 0
##$ABSG= 5
##$ABSL= 3
##$ALPHA= 0
##$AQORDER= 0
##$ASSFAC= 0
##$ASSFACI= 0
##$ASSFACX= 0
##$ASSWID= 0
##$AUNMP= <proc_1d>
##$AZFE= 0.1
##$AZFW= 0.1
##$BCFW= 1
##$BC_mod= 2
##$BYTORDP= 1
##$COROFFS= 0
##$CY= 11.3945322036743
##$DATMOD= 1
##$DC= 2
##$DFILT= <>
##$DTYPP= 0
##$F1P= 15.6554695791079
##$F2P= 12.8336369535428
##$FCOR= 0.5
##$FTSIZE= 0
##$FT_mod= 4
##$GAMMA= 1
##$GB= 0.15
##$INTBC= 1
##$INTSCL= 1
##$ISEN= 128
##$LB= 0.24
##$LEV0= 0
##$LPBIN= 0
##$MAXI= 10000
##$MC2= 0
##$MEAN= 0
##$ME_mod= 0
##$MI= 1.114404
##$NCOEF= 0
##$NC_proc= 0
##$NLEV= 6
##$NOISF1= 3.799351
##$NOISF2= 2.8
##$NSP= 1
##$NTH_PI= 0
##$NZP= 0
##$OFFSET= 15.70392
##$PC= 1
##$PHC0= -26350.1
##$PHC1= 20.18743
##$PH_mod= 1
##$PKNL= yes
##$PPARMOD= 0
##$PSCAL= 0
##$PSIGN= 0
##$REVERSE= no
##$SF= 200.130013532006
##$SI= 16384
##$SIGF1= 3
##$SIGF2= 2
##$SINO= 400
##$SIOLD= 16384
##$SREGLST= <1H.CDCl3>
##$SSB= 0
##$STSI= 0
##$STSR= 0
##$SW_p= 3612.71676300578
##$SYMM= 0
##$S_DEV= 0
##$TDeff= 0
##$TDoff= 0
##$TI= <>
##$TILT= no
##$TM1= 0
##$TM2= 0
##$TOPLEV= 0
##$USERP1= <user>
##$USERP2= <user>
##$USERP3= <user>
##$USERP4= <user>
##$USERP5= <user>
##$WDW= 1
##$XDIM= 8192
##$YMAX_p= 0
##$YMIN_p= 0
$$ End of Bruker specific parameters
$$ ---------------------------------
##NTUPLES= NMR FID
##VAR_NAME=  TIME,          FID/REAL,        FID/IMAG
##SYMBOL=    X,             R,               I
##VAR_TYPE=  INDEPENDENT,   DEPENDENT,       DEPENDENT
##VAR_FORM=  AFFN,          ASDF,            ASDF
##VAR_DIM=   8192,          8192,            8192
##UNITS=     SECONDS,       ARBITRARY UNITS, ARBITRARY UNITS
##FACTOR=    0.0002076,     1,               1
##FIRST=     0,             0,               0
##LAST=      1.7004516,     0,               0
##MIN=       0,             -214647,         0
##MAX=       1.7004516,     287549,          0
$$ Real data points
##PAGE= N=1
##DATA TABLE= (X++(R..R)), XYDATA
0 0 0 0 0 0 0 0 0 8 -8 8 -8 16 -16 16 -24 32 -32 40 -50 58 -68 82 -94 108 -125 144 -163 185 -213 239 -269
31 -269 303 -340 380 -427 476 -528 586 -652 723 -799 887 -982 1085 -1203 1335 -1482 1647
48 1647 -1839 2060 -2317 2625 -2998 3460 -4056 4853 -5977 7692 -10664 17222 -63757 149309
62 149309 254487 -75661 -212496 -65409 170468 192276 -11425 -189973 -62995 154070
72 154070 156572 -56749 -191269 -62008 177126 149978 -97905 -172465 17396 169038 106305
83 106305 -93788 -168143 26831 215553 78777 -161298 -139056 79600 179394 26895 -184256
94 -184256 -130022 127344 178066 -31540 -148776 -50959 94075 133493 2570 -164955 -109418
105 -109418 106485 145174 -50753 -186588 -66509 137732 119521 -92155 -159234 -53
115 -53 126463 78035 -58284 -124732 -4067 158739 82309 -126141 -120641 61516 124551 11529
127 11529 -109143 -86155 62045 127962 7498 -117421 -71988 69768 122513 2241 -139600
138 -139600 -70639 119779 127176 -47624 -128757 -21797 110782 92963 -54979 -120168 -4211
149 -4211 111845 67599 -56599 -103140 -9000 110478 59384 -100088 -103151 44936 97895
160 97895 6917 -75733 -59296 34181 89289 12085 -93048 -61067 60930 93196 -11392
171 -11392 -101805 -33850 94460 76087 -51409 -85898 -2774 68837 52869 -36595 -89903 -11550
183 -11550 88235 48277 -65757 -81031 11739 81771 34211 -64317 -61847 39488 79932 14005
195 14005 -52576 -44881 26084 70449 9108 -76694 -44536 53970 61604 -23366 -70853 -17052
207 -17052 58611 44526 -36200 -57934 2065 52259 37270 -26243 -63508 -4518 71986 33030
219 33030 -61341 -56102 28517 63008 13703 -47103 -39896 28711 59375 6438 -53138 -39721
231 -39721 27058 55773 -3626 -66959 -28139 49757 41372 -26646 -47870 -5514 41071 35933
243 35933 -17422 -43394 1575 49904 29211 -30987 -48320 5308 53127 14856 -51903 -37837
255 -37837 27560 43048 697 -38597 -28957 21771 46700 1103 -48569 -24530 35659 44072
267 44072 -11399 -49244 -11969 42080 29565 -22830 -35187 -1807 31571 28496 -14965 -41108
279 -41108 -2178 42955 18728 -35664 -37160 11932 38062 5865 -36346 -23550 21950 32673
291 32673 660 -29082 -19694 21233 38908 -1100 -39520 -12731 33973 27658 -17120 -35117
303 -35117 -6919 27444 20261 -17599 -30947 -2643 28507 21405 -17899 -34415 3295 37730
315 37730 11658 -30535 -21925 16906 28180 2781 -23618 -17217 14512 26140 543 -26209
327 -26209 -15048 19371 27466 -7107 -32196 -7337 25672 15337 -16544 -23573 -2095 20748
339 20748 16415 -11775 -24367 1702 27989 14322 -19341 -22771 10144 28025 4247 -23686
351 -23686 -13695 12831 17672 -1570 -19782 -14831 10845 21209 -1920 -23550 -8512 19586 17956
364 17956 -9393 -21451 -1124 19193 10688 -11120 -15899 959 17991 12118 -12355 -19457 4860
377 4860 22481 4583 -19602 -13179 11307 16978 -1923 -18058 -9374 9924 13337 -2330 -16168
390 -16168 -8065 13696 17706 -5185 -18454 -1129 18277 10212 -10663 -14184 2193 14087 5918
403 5918 -11111 -14066 2311 14583 4919 -15035 -13774 8477 17351 -766 -15444 -5724 11956
416 11956 12005 -3113 -13233 -5062 10678 12052 -4184 -15011 -2857 15003 10326 -9900 -14526
429 -14526 2544 14173 4200 -11252 -10505 3336 12499 3862 -11144 -11182 6016 15107 1239 -14140
443 -14140 -7004 11525 12766 -3533 -12496 -2565 10271 8837 -5058 -12384 -3064 11155 8996 -7644
457 -7644 -13836 401 13579 4877 -11195 -10474 4474 12181 3032 -9543 -8284 5413 13143 2356
471 2356 -11779 -7842 8641 12581 -2479 -13223 -3822 10314 7973 -5669 -11018 -2662 9015
484 9015 7862 -4932 -11368 -399 12451 7105 -8302 -10920 3405 12157 2680 -10028 -7892 4816
498 4816 9875 1456 -9208 -7557 6064 11334 -429 -11788 -5048 8647 8992 -3838 -11270 -3019
512 -3019 8203 6425 -5218 -9409 -1401 9663 7729 -5331 -9578 2026 12013 4184 -8594 -7993
526 -7993 3562 8948 927 -9072 -7142 4069 8274 22 -8571 -5547 6579 10165 -1139 -9673
540 -9673 -1854 8784 6741 -3926 -8668 -1900 7045 5621 -4829 -8879 163 8961 5142 -5881
554 -5881 -8428 2555 9581 2070 -7619 -5625 3449 6960 856 -7415 -5996 4206 8044 -97 -7948
569 -7948 -3284 6663 8294 -1746 -7917 -961 7145 4764 -4326 -7450 -1575 6026 4648 -4924 -7796
584 -7796 931 7743 2949 -5459 -5870 2892 7582 2071 -5837 -4414 3624 6302 437 -6179 -4892
599 -4892 4257 6746 -1636 -6992 -1360 5320 5320 -2283 -6443 -1041 5627 3677 -3745 -5411 -134 5629
615 5629 3557 -4480 -5988 1780 6695 1508 -4975 -3884 2672 5928 999 -5635 -3628 3584 4917
630 4917 -633 -5826 -3412 3819 4983 -2078 -5702 -682 4710 3277 -1769 -4782 -702 5210 3506
645 3506 -3330 -4739 1122 5141 1794 -4161 -4203 2170 5161 231 -4556 -2429 2168 4259 178 -4681
661 -4681 -2705 3564 4350 -1063 -4405 -1397 3847 3726 -2223 -5210 -457 4196 2386 -2516 -3934 78
677 78 4237 2158 -3255 -3957 1451 3834 728 -3664 -3174 1873 4107 -16 -3610 -2024 2526 3476
693 3476 -209 -4278 -1589 4042 3854 -1959 -3864 92 3930 2350 -2432 -4477 -114 3773 1991
708 1991 -2875 -3040 990 4075 1743 -3174 -2930 1950 3944 615 -3496 -2206 1784 3504 0 -3962
724 -3962 -1450 2818 2908 -1272 -3444 -748 3352 2775 -2062 -3401 233 3191 1707 -2150 -3223 47
740 47 3999 1623 -3091 -2902 1366 3996 973 -3217 -2521 2077 3674 -221 -3212 -1842 1712 3341
756 3341 -175 -3711 -1585 3229 2580 -942 -3081 -897 2824 2796 -1257 -3326 215 3340 1836 -2278
772 -2278 -2812 270 3411 1082 -2832 -2425 1566 2970 630 -2763 -2357 1620 2888 142 -3103 -1588
788 -1588 1710 2987 -199 -3300 -1650 2719 2725 -1121 -2829 -713 2573 2422 -1151 -3229 -64 2398
804 2398 1267 -1613 -2524 502 2410 1053 -1899 -2259 977 2580 769 -1918 -2087 1033 2699 -173
820 -173 -2629 -1327 1575 2320 -183 -2604 -1163 2209 2234 -905 -2521 -295 1907 1717 -996 -2403
836 -2403 -240 2447 1341 -1554 -2332 299 2294 1015 -1558 -1972 831 2289 304 -1712 -1339 1002
852 1002 1976 -23 -1945 -976 1520 1073 -305 -1937 -430 1428 1220 -415 -1939 -241 1674 1152
868 1152 -925 -1862 -71 1549 1017 -1047 -1365 65 1362 570 -1171 -1076 556 1603 386 -1137 -1055
885 -1055 339 1868 144 -1221 -645 950 1305 -594 -1172 -253 759 975 -771 -1186 409 1325 277
902 277 -728 -1270 -9 1536 207 -1049 -789 428 1059 359 -1049 -858 599 1033 36 -1277 -437
919 -437 703 1342 58 -929 -60 779 814 -584 -962 53 466 584 -752 -705 263 1258 283 -650 -525
938 -525 570 861 83 -886 -516 1084 847 -84 -970 -485 688 955 -623 -982 -69 746 443 -457 -910
957 -910 7 1325 492 -603 -990 246 941 172 -1069 -759 448 763 -275 -858 -161 749 629 -90
975 -90 -887 -511 875 364 -405 -637 -48 708 700 -188 -912 173 1031 166 -871 -485 363 1055 409 -1122
995 -1122 -824 571 812 -322 -952 -449 434 615 -219 -690 -18 435 582 -356 -487 130 467 290 -819
1014 -819 -740 51 703 257 -840 -735 283 925 -89 -373 -463 437 627 -87 -1086 -311 647 754 -318
1033 -318 -881 -246 546 569 9 -851 -85 624 161 -476 -694 177 661 288 -817 -515 196 520 76 -882
1053 -882 -512 402 1073 -423 -467 -22 906 158 -428 -525 94 764 315 -856 -1023 362 831 443 -273 -741
1073 -741 258 1146 294 -519 -495 393 1201 -155 -1163 -173 441 363 -417 -675 -106 629 558 -507 -710 364
1093 364 963 237 -616 -503 48 685 -129 -566 -821 416 935 -350 -1168 -671 780 903 -378 -1120 -24
1112 -24 771 795 -708 -1114 -142 876 580 -891 -984 416 813 371 -734 -806 462 1262 -107 -837 -532
1131 -532 454 936 96 -1252 -804 710 903 -386 -1464 -113 974 1124 -695 -877 -204 1515 831
1148 831 -923 -868 97 1218 848 -1040 -1439 283 1229 424 -1365 -861 626 1380 528 -1148 -658 899
1166 899 1239 12 -1182 -505 785 1092 -273 -1492 -671 1291 931 -599 -1191 93 1303 882 -713
1183 -713 -1424 -18 1581 632 -1014 -1233 113 1579 383 -1241 -1407 1007 1402 406 -1391 -1099 1118
1200 1118 1379 112 -1041 -886 1323 1399 -376 -1637 -463 1216 1214 -730 -1434 65 1286 1089 -734
1217 -734 -1558 124 1423 1182 -763 -1429 117 1333 754 -1145 -1284 506 1486 352 -1403 -881 1005
1234 1005 1765 196 -1218 -597 921 1432 -390 -1237 -569 1027 1292 -874 -1538 -170 1487 1165 -690
1251 -690 -1056 230 1624 816 -872 -1251 187 1101 441 -1511 -1178 404 1308 352 -1351 -996 857
1268 857 1496 113 -1419 -518 1210 1473 -292 -1485 -615 843 1477 -489 -1696 -82 1236 1051 -401
1285 -401 -1562 83 1738 666 -929 -1063 174 1418 468 -852 -1327 14 1298 -107 -1163 -852
1301 -852 839 1445 110 -980 -593 1160 1334 -305 -1595 -389 1292 1241 -893 -1543 -315 1418 661
1318 661 -639 -1414 280 1184 719 -583 -1200 259 1256 446 -1195 -1088 602 1314 -189 -1383 -722
1335 -722 762 925 -78 -1018 -550 1130 1217 -306 -1297 -433 917 954 -429 -1259 -387 1228 465 -667
1353 -667 -1250 450 1057 504 -849 -1018 329 1425 10 -1412 -899 718 712 277 -1199 -854 996 1031
1371 1031 81 -805 -382 662 1170 -414 -1166 -87 992 677 -642 -1025 -435 1187 542 -1105 -1093 21
1389 21 1017 421 -737 -1130 269 1133 -75 -934 -989 649 921 -47 -767 -614 1085 1143 -322 -806 -397
1408 -397 794 1241 -328 -1407 -465 783 425 -354 -1104 115 819 444 -662 -824 128 1173 301 -714
1426 -714 -830 193 1292 -46 -882 -474 463 777 -97 -920 -745 581 802 -454 -1012 -405 485 660
1444 660 -218 -987 -291 880 775 -427 -765 101 580 617 -574 -1036 175 911 487 -735 -704 228 761
1463 761 308 -838 -613 399 911 26 -638 -652 555 707 -6 -1267 -154 813 467 118 -520 68 896
1482 896 959 -547 -850 -316 530 511 -446 -758 115 993 134 -750 -728 302 811 93 -563 -431 138 381
1502 381 -56 -941 -133 684 866 -70 -763 71 649 284 -199 -828 -14 754 491 -644 -914 -122 695 586
1522 586 -272 -679 95 877 181 -456 -665 282 506 444 -516 -472 82 825 -130 -651 -153 463 715 -79 -727
1543 -727 -443 255 249 -397 -390 -153 543 624 -154 -622 143 350 309 -509 -627 107 778 282 -558 -338 321 521
1565 521 268 -351 -413 636 775 207 -781 -326 311 320 -412 -528 -254 683 362 -290 -143 -79 664 433 93
1586 93 -447 66 739 134 -491 -744 250 468 113 -734 -174 169 469 115 -378 -309 228 463 -137 -391 -153
1607 -153 285 98 -119 -744 -178 425 167 -265 -252 -13 605 410 -132 -586 -148 444 -15 -363 -509 -25
1627 -25 461 193 -532 -296 302 557 -1 -756 -176 492 124 -225 -681 -360 619 270 -438 -389 -175 432 232
1648 232 -306 -441 685 214 157 -495 -100 414 265 133 -520 -252 27 315 -81 -542 -332 303 621 -250
1668 -250 -644 -265 391 535 -459 -440 -357 550 109 -2 -444 -234 357 81 -200 -378 -82 709 19 -431 -577
1689 -577 177 573 149 -279 -306 126 397 15 -321 -91 499 541 -107 -483 -86 345 413 -208 -758 -92 387
1710 387 276 -554 -403 -155 786 319 -285 -427 393 232 -66 -275 -423 72 303 132 -529 -191 260 491
1730 491 -247 -483 -295 347 339 -121 -511 -167 398 195 -400 -442 -148 562 340 -437 -473 346 313 155 -444 -456
1752 -456 312 615 128 -550 -69 234 397 336 -563 49 383 274 -16 -637 -169 284 268 28 -241 -215 517
1773 517 140 -262 -536 203 480 145 -44 -77 -9 317 284 -217 15 55 303 -284 -324 -314 152 538 -48 -425
1795 -425 -184 229 534 -283 -487 -79 209 33 -301 -191 -2 650 150 -43 -203 148 677 213 -504 -456
1815 -456 17 672 3 -267 -445 275 549 -360 -386 -277 508 489 -62 -442 94 565 123 -80 -665 165 594
1836 594 203 -160 -360 15 670 278 -398 -71 308 629 329 -308 -252 291 445 162 -694 -415 352 443 -2
1857 -2 -470 7 413 268 -54 -368 -102 314 226 20 -201 1 379 359 -39 -348 463 534 288 -302 -639 -138
1879 -138 731 377 -362 -110 -15 452 -39 -603 -284 557 361 36 -560 -640 493 483 -150 -349 182 339 210
1900 210 -225 -444 23 275 436 -312 -258 93 241 286 -356 -673 213 405 101 -239 -373 303 365 -54 -429
1921 -429 -712 436 467 -144 -506 -90 512 392 -277 -477 -339 258 331 -23 -477 -42 568 270 -230 -579
1941 -579 -179 198 355 -406 -225 141 232 185 -267 -478 111 779 5 -748 -732 244 224 73 -495 -202 244
1962 244 203 66 -533 -54 377 368 -223 -608 -133 265 416 -600 -425 278 601 295 -529 -705 102 677 15
1983 15 -529 -365 317 414 -72 -593 -50 419 458 221 -381 -156 117 191 -152 -869 86 818 223 -383 -356 80
2005 80 393 360 -624 -577 -74 754 272 -239 -515 35 444 -4 -315 -616 -101 667 231 -315 -288 219 541
2026 541 -33 -423 -422 462 379 -51 -405 -15 510 680 -84 -840 -26 229 47 -197 -747 -195 695 272 -281
2047 -281 -608 -55 518 282 -641 -188 550 687 -55 -517 -357 218 533 -41 -708 -255 423 674 -345 -488
2067 -488 -347 603 639 -197 -754 -352 488 234 -383 -497 -212 574 321 -338 -484 85 591 532 -378 -290 251
2088 251 557 108 -533 -631 401 580 -93 -521 -300 241 340 -293 -249 -218 539 227 -375 -715 79 820 487
2109 487 -241 -578 -194 586 295 -562 -533 -27 488 304 -709 -561 399 638 29 -651 -573 369 507 -265
2129 -265 -518 -335 315 609 -26 -515 -221 390 481 -133 -425 -99 544 460 -393 -460 53 637 332 -443 -434 -198
2151 -198 673 260 -600 -479 353 594 436 -953 -315 426 367 -26 -623 3 124 576 122 -524 -538 319
2171 319 613 -130 -592 -87 445 349 -273 -637 -103 659 322 -423 -489 -218 302 239 -478 -287 178 641 166
2192 166 -404 -464 515 853 32 -417 -216 355 710 140 -313 -375 353 341 -243 -750 -24 405 493 -275 -391
2213 -391 -216 311 639 -277 -351 -259 524 253 -305 -215 252 437 49 -604 -324 98 555 85 -386 -517 289
2234 289 601 -78 -503 -468 300 190 240 -484 -124 560 280 -138 -517 -220 779 506 -414 -316 -229 390 81
2255 81 -602 -572 132 430 348 -312 -535 339 627 306 -394 -141 597 480 85 -405 -303 366 509 105 -797
2276 -797 6 229 450 -172 -341 -4 622 310 154 -479 -93 480 -134 -521 -517 220 319 93 -393 -250 425
2297 425 338 106 -354 -258 318 404 158 -459 -330 356 314 -248 -421 -54 310 508 102 -479 171 742 112
2318 112 -487 -392 218 398 367 -501 -241 2 457 118 -150 -197 353 806 -24 -405 -401 163 346 -230 -470 89
2340 89 587 691 -588 -660 99 470 253 -188 -388 210 320 292 -425 -427 123 358 559 -472 -238 461 644
2361 644 412 -71 -211 282 625 -249 -260 -24 200 814 -228 -284 -137 478 318 -238 -190 -109 252 573 -51
2382 -51 -302 324 521 396 -412 -558 249 310 248 -422 -284 194 644 225 -340 -325 230 196 -55 -536 -456 384
2404 384 159 -343 -504 -199 401 80 -210 -385 95 592 288 -177 -441 30 289 251 -339 -616 -87 380
2424 380 85 -461 -376 230 309 -56 -352 -67 233 169 91 -322 -328 482 198 125 -775 187 215 -75 -216 -278 184
2447 184 190 418 -71 -150 -87 96 217 -517 -360 201 260 76 -242 -298 229 313 5 -286 -89 225 535 -96
2469 -96 -195 -12 305 588 -1 -400 -369 235 77 -23 -354 -122 576 163 -236 -361 92 -10 22 -337 -181
2490 -181 181 416 156 -135 -179 -35 260 157 -442 33 56 408 6 -558 -20 387 -95 179 -314 25 436
2511 436 400 -31 -53 -240 15 -223 -237 -300 -97 -63 -537 -514 -114 40 149 -27 -151 -325 151 364 -152 -209
2533 -209 37 140 75 157 -294 -13 212 118 -215 -84 204 258 -43 136 55 76 115 5 -231 56 324 135
2555 135 -169 -168 -23 164 343 176 -309 -121 265 54 164 -444 -456 137 -70 -202 -288 -364 186 66 -159 -202
2577 -202 84 38 -144 -327 -1 112 141 -105 -343 143 343 -30 -105 -54 55 -65 425 -101 111 343 55
2598 55 297 -208 -22 -250 110 -149 -189 -124 -216 527 126 -35 -414 -17 210 93 -163 -382 192 137 -264 -167
2620 -167 -114 274 167 80 -189 -46 73 161 -120 -328 -160 215 68 -284 -131 -199 214 149 164 -222 92 134
2642 134 417 -56 -226 354 258 -283 -304 -152 278 60 -3 -208 -153 -82 222 27 -9 297 174 -97 -256 -265 -184
2665 -184 169 128 -140 -41 -82 104 -112 -149 -55 39 -142 -95 -387 -156 133 199 57 -31 147 32 30 -210 -363 -15
2689 -15 199 436 1 -288 32 96 22 -104 -69 -175 181 239 -82 -188 -128 -51 8 -219 164 -11 219 -87 -157
2712 -157 -132 0 279 -133 -197 -284 -114 3 -230 -110 1 8 217 43 -353 40 80 -83 -84 -46 -115 -92 57 68
2736 68 159 67 95 115 -53 -17 161 123 -10 -435 -75 73 146 -287 -41 -111 -104 333 27 -214 20 -82 109 59
2760 59 -29 337 27 -21 -274 -259 -78 -13 74 -160 -232 -1 630 138 -4 159 225 -97 -69 -154 116 -6 223
2783 223 -359 -135 -107 -24 148 320 -219 -210 -36 183 -184 20 -73 340 148 -249 97 205 50 49 -128 -373
2805 -373 421 -47 -74 -26 19 442 34 -9 -91 -88 300 14 26 -95 89 14 -76 -33 -115 -204 196 -12 -124 2
2829 2 -131 261 -88 -31 -97 -123 -62 -214 220 -201 -76 30 -143 -207 108 144 348 -259 71 -178 -100 149 78
2852 78 -269 127 174 -408 -298 -680 -104 283 -138 -281 -136 -164 250 134 -200 5 49 127 -57 -67 246 129
2874 129 -126 -362 -134 -193 63 133 -22 -106 -52 243 -101 -233 -322 141 376 109 -169 -114 36 365 5 -150
2896 -150 -136 34 250 -71 -437 -67 -166 262 -271 -257 -188 -6 113 121 -201 -326 92 140 76 -46 -278 156 168
2919 168 -15 -111 22 141 24 -349 -69 473 200 241 -97 -11 34 301 106 -60 -45 -89 243 -175 -219 -70
2941 -70 -193 481 -154 -484 117 114 62 13 169 80 -220 278 -270 -134 30 13 143 -34 -80 -355 -25 -36 -89
2964 -89 -78 141 89 155 -141 -225 97 81 78 -177 -52 -41 -42 -11 -204 72 69 294 268 -316 -30 290 134 -84 47
2989 47 -212 220 139 37 -115 19 219 55 16 64 323 194 88 -55 -119 55 -28 136 -65 -514 -30 -95
3011 -95 236 -419 -190 -205 246 51 -260 -320 277 -77 40 -72 -92 272 177 -163 -341 -3 19 41 -24 -26 28 -33
3035 -33 -353 -101 -386 125 455 53 44 -319 40 81 -115 -120 -188 71 -20 77 285 130 364 52 -37 275 -273
3058 -273 -39 97 -180 -216 -60 -34 87 -292 -281 75 332 -22 -333 -256 429 157 -470 -243 -261 -105 -12 -288
3080 -288 -128 -8 -42 92 -319 -144 -35 22 32 -86 -154 201 -64 167 -80 -151 151 140 -279 -10 -96 359
3102 359 -143 11 -9 103 43 409 153 -89 136 81 -62 -79 51 -207 10 91 -91 244 433 -9 20 -187
3124 -187 -428 -188 292 -272 -348 6 205 202 39 -135 135 4 171 -154 -45 26 235 126 -150 79 131 109
3146 109 51 -195 -317 438 69 68 -35 -167 53 58 -113 -206 -304 -92 -49 593 -241 -140 -30 -134 3 20 101
3169 101 53 -96 -144 -332 -214 69 370 60 -160 -202 -158 105 -19 -377 -395 -77 176 -26 -91 -214 230 205
3191 205 89 34 262 109 29 240 -172 268 318 -301 77 -78 -153 232 -235 105 -331 258 -10 -50 -109 144
3213 144 276 117 45 -161 -161 274 83 -11 -166 -248 62 110 -110 -382 -143 188 208 -196 -166 136 172 -151 -75
3236 -75 -9 141 -174 305 -189 163 -305 12 -56 43 7 359 -179 -164 -231 74 72 -171 85 -75 -235 -157 38
3259 38 -360 106 -2 62 -133 386 -24 -100 130 145 -92 -144 228 -44 -4 -46 358 22 -139 -447 -184 -279 161
3282 161 -2 -210 -148 -68 143 -89 -218 -340 -10 -7 -234 -154 397 -16 -2 -153 274 -160 58 128 8 41 -68
3305 -68 -36 -90 -133 44 -37 181 152 -351 349 318 -36 264 -311 118 23 38 -102 -297 -328 -226 -31 -380 -41
3328 -41 -170 176 -40 -137 -383 -171 170 195 -101 99 -84 35 -7 -455 -286 120 178 319 65 -149 550 261
3350 261 162 -54 -55 38 -71 -101 15 71 184 181 -112 -69 -89 68 61 112 -328 -423 22 -152 167 -269 225 -66 99
3375 99 -167 -120 185 12 145 -102 17 234 213 -233 -142 -528 193 459 101 -555 -106 -96 32 -321 96 20
3397 20 43 218 -284 -201 172 317 39 -45 -86 -99 231 -44 -232 95 0 -136 -118 -368 281 -12 -156 88 -207
3420 -207 133 148 -139 337 -96 -262 210 -201 -276 75 252 -223 57 55 30 47 -113 218 -19 -94 -18 467 52
3443 52 -150 -41 -1 -206 -144 -310 -262 -73 3 -176 -58 -96 103 250 93 -166 3 45 32 -150 -117 -143 157
3466 157 -72 53 154 -90 -21 -195 -212 -19 62 116 -120 -65 -297 -56 292 -30 -34 54 116 -227 -177 -96 56 271
3490 271 -23 -150 180 223 -33 -117 -338 -141 13 66 -28 -278 -34 5 12 14 92 -25 -69 5 -179 -141 -218 114 -91
3515 -91 -321 -207 -177 424 80 -245 -142 -321 271 -139 -57 -343 373 237 -140 -167 -302 109 108 -86 -39 150
3537 150 272 90 347 -54 -91 220 -177 -110 96 -235 21 186 -135 99 200 246 150 55 -98 -356 -105 122
3559 122 -54 63 35 421 -77 -137 -266 444 248 43 -109 -24 144 -9 -187 -289 -238 -71 12 -210 -410 198
3581 198 213 186 108 -120 -257 169 117 -255 143 -124 113 105 -276 -24 -65 247 -8 -235 51 188 374 41
3603 41 124 -278 -25 245 49 -45 210 101 298 71 -254 -14 124 46 206 -118 -316 350 128 -496 -357
3624 -357 99 127 130 -128 -201 -35 -318 222 -182 59 -210 158 -145 -13 -94 230 254 -30 -166 27 43 164
3646 164 55 -161 151 50 105 -10 -139 129 240 133 22 -14 -27 58 -191 -46 -123 160 293 148 -104 -348
3668 -348 240 -144 7 -274 -227 305 426 -43 -33 23 155 -47 -39 33 47 2 -76 7 -398 -121 51 115 -183 -395
3692 -395 92 21 -1 -171 47 -14 196 -266 -143 109 19 353 -131 -245 93 131 56 -80 -123 -281 82 252
3714 252 -84 -225 45 -87 188 -30 -258 5 315 -50 -110 -132 147 154 -186 -127 80 -174 94 169 16 -137
3736 -137 239 162 -344 254 -166 150 187 -65 -394 -64 -18 128 -79 278 163 -263 -178 -177 158 -97 59 -45
3758 -45 -46 -175 85 -55 66 -105 -352 242 210 104 137 34 68 85 -204 -430 27 400 -34 -62 80 77 -140
3781 -140 -59 -18 -399 -74 267 253 -3 -120 117 289 63 -200 -112 -171 210 -8 -288 -83 -122 69 -302 -378
3803 -378 -33 251 -36 -274 -197 110 -30 105 -102 -131 -227 42 -21 -97 -125 77 28 217 -319 -196 8 201
3825 201 -57 52 -322 17 185 -20 -392 191 -61 129 105 -179 67 205 72 56 -457 -30 387 -7 -35
3846 -35 233 57 45 113 91 -104 43 -102 2 -52 -167 163 190 -111 -118 -168 -228 -50 -2 77 -42 -209 -121 -137 -151
3871 -151 164 -359 297 -54 -263 -18 173 104 329 -194 -126 251 183 -236 -134 -97 -31 -90 -106 161 -47 361
3893 361 -196 -118 -223 122 101 -222 -76 -88 -78 79 -87 47 -99 50 188 161 -120 -252 8 121 -188 38
3915 38 -81 93 49 112 -265 78 0 124 -313 -139 37 478 49 -144 -75 102 -66 -83 8 -40 266 8 24
3938 24 -241 21 157 198 8 -268 -76 139 135 47 -219 207 106 -2 -182 -225 126 -78 -134 -69 -177 11 -50
3961 -50 -79 -218 -96 157 43 9 -166 145 -5 -79 127 -344 21 582 25 -19 -153 31 -69 -145 -193 -357
3983 -357 -76 148 192 -142 -280 7 241 72 -227 17 141 132 -58 -125 -110 38 -28 -41 -300 -31 366 -70
4005 -70 -107 -64 93 334 62 -370 -89 142 228 210 22 41 95 156 -11 -408 -444 152 67 32 -94 48 -75 119
4029 119 72 -93 -227 314 152 -225 -190 -26 -18 211 -9 -299 -156 16 157 28 42 -78 159 53 7 -247
4051 -247 -41 -132 119 -151 109 -30 122 207 -145 100 -84 352 -81 -155 -18 96 38 -183 -333 100 375
4072 375 -28 -229 -375 -130 -29 385 -2 22 -29 166 147 -32 -181 -138 -71 -527 -75 -1 51 81 -68 -192 57
4095 57 -301 342 288 -57 -101 271 18 40 -184 36 -101 62 -182 -176 51 -58 226 -35 168 199 -57 48
4117 48 -412 -136 -89 103 264 -279 -89 89 177 180 -192 -67 214 -28 -273 -5 223 43 -135 114 187 -31
4139 -31 161 -133 -205 -376 287 -7 219 123 -234 208 203 178 -59 -97 -174 67 -81 -129 -300 -20 31 219 -311
4162 -311 -90 213 369 205 -50 -199 -16 255 -296 -236 9 237 15 -79 -158 -256 -194 -81 134 -247 33 212
4184 212 -108 -80 355 5 164 -46 -7 -115 301 45 268 -155 155 153 42 -200 -165 131 -70 147 -64 -124
4206 -124 -53 -9 210 -301 213 114 30 7 -200 -202 179 356 44 -479 98 206 33 -96 129 183 361 225 -169
4229 -169 -244 123 81 59 68 11 265 283 -63 37 -154 -78 92 -106 109 -249 72 21 -415 -298 -187 281 -5
4252 -5 234 19 55 253 -63 124 -82 3 13 -215 5 -68 7 223 35 4 -286 -35 324 -139 -104 -97 139 200
4276 200 -8 -119 17 238 14 -116 27 19 -59 109 -1 -87 -61 319 53 129 -207 109 -178 59 36 -46 -109
4299 -109 51 -22 -14 -18 -20 160 -59 -225 226 174 100 -140 -396 174 159 87 -33 27 -39 -131 270 110 -266 -295 182
4324 182 371 -35 110 73 -110 172 52 46 237 -29 142 -200 100 118 -1 326 -142 -125 -51 170 262 -57
4346 -57 -111 26 53 73 -102 45 -120 244 145 54 80 171 -159 -113 -48 431 -15 119 -466 -383 186 319 93 -188
4370 -188 -36 -175 142 68 -147 5 -93 180 32 -33 -33 266 241 30 -5 -3 -141 -10 99 -75 -348 32 215
4393 215 3 -161 233 21 63 -30 241 248 -17 271 -29 78 47 145 -171 -75 252 114 -207 71 92 22 151
4416 151 -65 -174 -133 54 -237 -94 -210 537 212 99 -9 107 -82 -148 25 -300 -36 -360 -30 109 -141
4437 -141 -135 -131 -114 137 -39 -27 -207 41 48 119 -175 -168 391 -19 63 96 -176 61 -93 -169 -45 -94 21 186 44
4462 44 -89 119 -145 98 -145 45 237 265 -84 -15 -91 36 48 -81 190 -134 -220 -317 -75 -150 -104 11 390
4485 390 139 119 -119 5 -44 -274 8 8 -121 -210 -89 62 -163 223 0 -147 -33 71 -69 -116 -120 -73 -469
4508 -469 42 32 165 228 154 -39 57 225 -46 203 128 33 -226 -64 40 205 -210 -267 8 89 131 -130 81
4531 81 -16 138 -234 -101 141 142 192 -69 12 -125 -305 71 90 7 -221 152 -80 11 16 80 26 -4 -132 -87 -64
4556 -64 -80 108 -13 -50 -58 271 -3 252 270 -47 274 293 -83 -127 -156 65 164 88 -356 21 -234 -194 7 -32
4580 -32 290 -207 -191 -50 36 -62 113 -211 -46 37 -46 39 359 28 36 300 -127 47 -31 -87 158 311 54 -321
4604 -321 -104 179 -73 -130 -210 123 59 125 183 201 -121 69 201 -73 -20 199 279 -39 -78 -137 331 33 -128
4627 -128 -42 263 -15 162 58 -239 202 21 -134 -174 -175 28 108 -128 -79 -366 128 98 -258 -20 -270 -31
4649 -31 59 -52 86 -159 -165 -134 -253 170 18 -27 -133 58 -215 -380 239 -40 41 -252 -86 -208 -214 49 -37
4672 -37 88 68 -72 -217 93 194 -49 76 207 150 134 38 91 -141 -2 -59 171 -273 -40 49 -83 -146 29
4695 29 -292 250 370 177 -251 -343 -203 -202 14 275 71 139 290 -321 90 135 34 -46 11 156 283 91 -57
4718 -57 247 192 159 -21 76 -135 -23 116 102 325 18 -6 -202 41 -7 75 -349 -390 -23 44 -232 -143 214 35
4742 35 70 -188 -204 34 270 95 -115 -122 77 74 -175 -84 -49 -115 -175 -310 -32 -134 -24 104 -63 20 350 67
4766 67 -170 -290 93 -60 49 -65 -26 52 455 -303 -38 -41 102 -165 -87 85 -373 297 -3 -40 -106 255 244
4789 244 -35 -234 -302 -125 -120 224 255 -168 -56 85 -52 -133 91 -108 -321 192 -98 61 302 -150 -175 -244
4811 -244 -75 314 92 128 -100 -43 -10 71 85 -155 164 -241 -37 -90 317 -54 74 -255 42 -55 112 160 -249
4834 -249 -155 183 185 -280 -151 -41 -274 -183 165 40 -244 3 177 181 66 -229 340 -99 -275 -70 -219 147
4856 147 16 -319 -59 138 -108 168 195 0 28 231 216 -9 -121 -243 -240 -47 299 -158 208 -197 27 155
4878 155 -141 -6 -65 116 -236 -76 87 253 -61 -236 85 -152 79 -79 137 -22 192 34 -71 -142 -94
4899 -94 -101 -197 -182 85 -107 314 -171 -25 13 193 139 -24 -307 -98 22 -98 197 -1 148 -7 -224 311
4921 311 -10 201 290 245 -284 186 380 -317 67 112 -227 26 87 189 224 36 170 11 -116 -48 -83 198
4943 198 -7 116 88 -96 162 260 -107 41 -111 -55 62 -168 -41 196 -128 137 114 8 175 171 -71 -142
4965 -142 -95 -26 -102 -159 96 2 -43 46 -2 -88 12 67 37 2 16 182 -81 -7 4 313 -65 56 -229 -85 66
4990 66 -271 -208 -223 159 -122 235 95 -111 -348 -15 133 -204 176 48 -8 -368 87 244 31 -14 76 78 -7
5013 -7 -63 239 -149 -150 -2 81 124 -125 9 -164 -5 -34 44 327 -69 20 -27 186 163 244 89 156 24 -23 -128
5038 -128 134 -68 -102 34 -189 209 -88 88 83 -265 -81 -164 34 -142 77 -99 291 -60 231 -71 -180
5059 -180 297 45 64 15 -34 112 -120 -187 152 133 212 -157 205 -27 -249 8 142 303 -43 42 -22 376 -181
5082 -181 -111 -59 -148 275 -154 6 278 72 15 -65 -18 114 185 2 -58 95 -37 131 1 -112 -133 23 -157
5105 -157 -246 -78 313 231 -53 113 -70 2 -3 -254 -111 -215 -127 469 265 127 88 49 153 167 44 -127 -152
5128 -152 209 7 -15 -14 176 204 161 -148 462 -166 96 -30 -18 20 268 283 -142 155 -179 -78 -203 126 262
5151 262 13 -112 91 -134 208 132 111 12 247 -350 80 4 6 158 -109 212 -13 40 233 -37 208 23
5173 23 205 -162 -17 148 -188 -39 40 -88 224 -125 -193 20 -131 68 5 53 358 -49 3 -113 283 50
5195 50 81 -189 75 109 31 324 -202 -243 192 -175 42 223 -30 -70 90 118 92 39 52 55 -26 -93 -208 -7 -43
5220 -43 118 103 -56 -273 -365 -32 -190 -178 24 -124 -60 -129 -92 -224 -291 253 107 33 -18 -280 125 64 183 113
5244 113 29 -33 -207 146 442 -79 328 -38 -63 -46 -45 246 -50 -28 -170 111 115 194 156 9 7 -319 -192 111
5268 111 91 -299 -73 -31 -42 89 67 -65 -225 31 18 -323 -186 -93 -215 72 240 112 74 183 55 222
5290 222 -33 181 280 39 -22 24 85 293 16 128 -140 252 -46 109 0 148 -35 34 -342 -222 -320 -238
5312 -238 -87 150 45 -86 3 -60 52 -88 -211 -224 346 -79 41 -264 1 -9 -75 -153 -23 213 -93 166
5334 166 -142 32 -16 -49 46 -312 -77 148 108 188 -109 144 -90 203 11 104 152 32 -107 204 143 99 -184
5357 -184 205 119 -167 250 161 -237 -64 40 -125 140 -42 131 321 -110 -33 -199 -299 22 -297 99 180
5378 180 92 122 -199 -56 167 273 -325 264 107 -89 -77 290 67 70 91 -163 -1 229 -261 -198 -23 -185
5400 -185 102 6 -51 -33 261 234 -162 135 164 75 -108 94 247 -302 -232 101 88 -291 -115 -30 -96 135 -243
5423 -243 -16 -49 113 -87 112 61 240 -48 -150 -382 231 82 27 73 51 -68 143 197 64 196 -31 201
5445 201 104 274 116 49 77 81 0 -112 -386 238 205 -103 136 -112 -335 43 27 -62 205 -85 -152 93 209
5468 209 -12 8 -44 55 -166 -122 -37 -9 94 -220 -240 97 -118 71 -4 234 -24 -237 49 74 472 33 162
5491 162 -48 156 5 -224 -223 -153 11 229 3 -180 96 198 -245 -73 76 -4 100 -207 -146 -77 263 -62
5513 -62 171 -160 105 21 -78 -235 -256 -64 95 348 85 167 -100 -151 42 51 -260 150 105 -155 -8 -2 -27 -123
5537 -123 32 81 -72 177 -88 35 315 -15 -171 -108 27 154 -90 -169 54 -189 -228 78 8 -92 -157 -179
5559 -179 102 -345 -172 97 -130 36 239 -34 -63 -30 5 -103 -43 -164 7 -168 59 14 -135 -98 -120 -143 241
5582 241 379 -60 96 79 212 -282 -296 -152 -63 -212 -314 -63 1 44 -80 61 -290 160 -218 -51 105 11
5604 11 166 1 246 80 233 109 35 -115 -53 141 111 -275 -72 125 233 178 8 -162 -266 285 -69 172
5626 172 110 396 74 23 221 64 204 191 5 -333 -352 -88 -292 -426 244 144 11 93 215 16 -190 -15
5648 -15 -38 240 67 156 309 62 -103 -41 -306 -33 63 -127 40 194 95 22 -67 240 346 -30 214 -58 -11
5671 -11 -311 24 -51 247 -33 64 20 33 -45 42 299 -82 -363 -65 23 179 -251 -202 -4 -19 -66 165 -66 -64
5695 -64 60 5 274 188 -106 -42 239 118 -102 22 17 177 -24 -8 -231 -58 128 -42 -225 47 85 87 272
5718 272 -98 -177 -212 158 32 1 30 175 71 51 367 74 141 -217 -175 81 150 66 -149 42 219 -33 19
5741 19 -51 12 200 -21 -259 -83 87 5 -78 -188 -45 -94 157 165 -248 -158 -90 210 -249 353 -198 -8 2 -140
5765 -140 97 -234 165 36 -47 -360 -252 161 -91 -233 54 -81 70 88 85 -136 358 112 -144 -190 -199 189
5787 189 92 360 22 -74 -404 -80 65 28 -186 106 -76 -52 -171 -117 -52 -160 119 -180 -298 -162 277 -6
5809 -6 96 -33 92 -69 -197 45 162 244 95 -268 22 147 -53 228 81 -279 -151 269 68 131 100 25
5831 25 20 225 -197 -139 -91 301 193 37 -86 314 -68 136 70 -30 157 81 262 22 -94 -177 -198 -119 -435
5854 -435 206 -14 -142 -291 -208 -215 -62 -32 20 -101 53 -191 -197 -121 -94 270 -42 -43 50 -65 -182 488 345 -83
5878 -83 -280 -139 -52 -64 66 23 72 12 115 17 -194 38 150 81 133 -571 271 86 308 -71 152 -233 45
5901 45 246 113 64 -325 -74 108 174 66 26 -13 156 -41 -26 -158 169 -96 -215 -60 53 107 -208 14
5923 14 -169 -3 318 24 261 -80 -122 -132 202 0 115 -46 13 -179 -282 229 27 -385 -215 79 -214
5944 -214 184 77 -117 273 -286 51 21 309 231 104 -42 -268 -128 -86 199 -87 -74 -90 301 120 21 -244
5966 -244 -132 68 -45 -175 64 223 403 81 -82 78 192 253 150 -157 87 -6 -135 38 132 7 -45
5987 -45 -267 -232 117 -125 -211 -3 -86 82 7 -121 -149 -210 -16 146 35 -68 -191 38 -197 101 136 -165 145
6010 145 120 86 129 -213 154 10 -11 24 -178 -64 -76 -226 206 -37 43 3 39 224 -164 203 62 13 90 -117
6034 -117 -21 -230 186 95 63 143 -28 -154 90 239 -58 237 100 -15 -337 154 26 -42 -43 -67 155 -226 -191
6057 -191 -82 -147 -2 94 349 239 -50 -21 254 323 174 150 94 87 -134 -246 -76 157 132 -207 131 -264 184
6080 184 25 180 -94 26 -417 -235 83 -342 -229 -137 -24 64 133 186 59 47 -254 50 -274 -241 -248 218 98
6103 98 -152 -189 -141 98 -43 -23 -170 -21 -307 28 9 15 84 -85 -210 202 78 180 -244 -5 -231 -194 50
6126 50 50 -158 144 -95 -254 -139 -43 321 175 -130 82 -174 -106 -46 -25 -13 3 -289 -377 45 92 170 -1 -16
6150 -16 59 483 119 -189 -14 -289 211 101 360 -124 -584 141 -57 -239 -204 0 19 -53 -131 -137 102 97 -295
6173 -295 18 -198 138 276 105 110 52 -41 48 112 -54 32 -161 376 -231 -225 183 -5 179 121 169 61 158 -120
6197 -120 -11 -309 102 -35 210 -251 -283 -292 -44 -145 104 -305 -339 -96 91 190 -253 -79 55 -168 -347 142
6219 142 74 161 -67 -1 -116 -181 86 -192 -18 -140 108 12 222 -134 -23 51 -143 166 79 53 -58 54 101
6242 101 -8 52 118 -149 224 245 154 -142 176 27 -160 -209 -118 -61 -145 -83 186 207 -56 145 188 233 -8 -45
6266 -45 -67 93 59 -3 74 60 33 -146 -116 133 -181 55 -153 -120 32 78 63 220 15 204 -27 -288 -266 145
6290 145 -100 -48 -119 -1 -223 -74 174 -265 -224 25 -32 82 79 57 85 276 270 118 39 103 161 167 13 -200 418
6315 418 -167 -144 -246 -43 100 49 4 -305 -315 -91 -49 -8 217 -247 -66 48 233 15 -207 41 -183 9
6337 9 -63 42 -141 109 -64 25 -214 -39 -270 -279 32 51 -207 132 -36 -99 -166 -57 -33 -76 -102 -155 12 -24 100
6362 100 121 211 85 -211 73 -102 -97 180 156 67 147 118 -51 127 133 -79 67 -91 172 -56 -31 289 -29 260
6386 260 176 -107 199 -145 -59 61 36 -166 242 159 -213 19 118 -39 84 31 261 88 168 -157 -231 -51 137
6409 137 -5 -64 -230 90 95 138 -40 339 -264 27 8 -197 84 18 -48 -92 -131 -4 127 118 -125 -84 -344 205
6433 205 38 183 396 -20 39 186 -277 27 -20 -168 -318 -271 -132 -119 103 -32 216 -33 24 78 116 172 -181
6456 -181 22 -176 23 -221 -4 -337 183 73 -178 -5 193 303 45 -228 -118 -197 175 298 -66 -35 83
6477 83 -68 356 2 129 162 169 -309 -186 -220 -65 -64 -105 -78 -96 77 -45 -171 -136 77 -80 -444 211 111 -327
6501 -327 -77 77 -332 85 225 -108 -24 92 97 -234 -35 -78 60 125 122 -105 -20 121 -89 272 75 -145 193
6524 193 343 -27 44 36 145 -343 46 131 -52 135 38 -395 -92 -191 -466 160 1 245 -293 95 -52 277
6546 277 267 -107 -30 -255 -130 153 108 46 -86 -103 49 16 59 36 -90 -63 -294 229 289 -6 19 46 -6 53 204
6571 204 -242 22 -36 -20 262 195 -115 149 -75 273 -202 -259 153 19 179 -22 -125 -157 283 -89 73 -137
6593 -137 -140 -24 67 54 52 49 69 198 9 -36 -148 -230 -118 -137 57 -121 366 -67 -26 -105 -49 75 424 109 56
6618 56 144 120 101 -245 -134 133 88 191 148 -190 11 95 24 130 -44 -94 152 -40 114 -188 201 -162 242
6641 242 162 -191 -145 -37 380 254 202 -81 20 155 -105 8 178 185 -323 -204 -97 -66 119 219 170 59
6663 59 -185 4 238 284 -306 44 -244 129 -113 21 64 83 -27 132 -30 -131 -327 173 74 -165 -37 127
6685 127 -21 60 -8 33 -185 -105 36 111 -182 -100 -132 -69 41 -111 119 27 130 -112 75 -72 133 2 22
6708 22 -92 191 59 83 52 -207 25 -303 -67 57 -68 104 -57 185 -114 -236 36 -170 219 31 71
6729 71 273 88 -54 -155 -169 72 50 -78 7 15 185 20 120 -32 -151 299 -6 -75 38 -268 138 208 129
6752 129 106 174 -162 -103 -25 -143 -174 -360 109 -154 264 48 -36 35 133 331 -212 -220 148 135 -194 -17 -223 -229
6776 -229 121 -34 -58 -70 90 5 208 -431 -84 -179 -20 -183 -8 85 114 -68 -183 -241 -56 49 -446 317
6798 317 -225 -104 276 -154 -83 65 10 154 -50 15 27 -117 184 32 83 5 128 -304 413 225 240 220 374
6821 374 332 112 136 -398 182 -368 106 -444 40 187 271 -76 -202 103 -83 -168 94 -48 -314 -136 80
6842 80 13 -47 -93 252 360 236 103 3 -258 -142 -55 132 149 433 -47 4 75 45 60 -6 174 -87 158 2
6866 2 135 135 89 70 -185 25 113 -172 89 -76 149 58 116 1 99 -107 29 -105 -213 174 -259 -73 -5 -394
6890 -394 54 -196 139 106 131 -215 -56 260 101 103 -51 -92 -151 25 303 -66 112 -125 -195 14 154 274
6912 274 -118 -49 -298 139 277 -130 213 142 -21 -57 125 -171 292 135 13 -100 -24 97 -267 -70 -35 -136
6934 -136 192 203 -103 -131 -121 -40 -77 145 162 -195 -157 21 173 238 48 -241 -164 214 72 -128 170 78 -291
6957 -291 -33 -63 142 -309 108 71 -99 -74 -147 423 54 -98 -99 -320 188 -68 -67 68 -339 391 32 36 -20 -34
6981 -34 185 141 -157 -364 -139 -164 -94 -218 -261 -130 -190 -211 4 37 167 -5 297 -92 -316 99 155 125 40 -211
7005 -211 43 354 -84 87 54 100 6 206 58 -93 171 310 113 -100 -67 -166 -172 20 206 -16 -160 256
7027 256 153 23 211 200 -334 -310 -141 149 -68 -6 118 142 -77 -110 -208 -21 -417 -5 -259 -123 51 -169
7049 -169 -228 63 346 -69 -113 -91 33 234 76 253 254 51 -62 -47 -10 124 -202 -133 -202 244 73 125 -47
7072 -47 374 132 -97 166 -70 -48 61 87 -348 -77 74 31 229 -199 -24 -109 4 -168 -355 -100 -293 -20
7094 -20 -162 327 239 -55 -332 165 -8 27 187 -126 -61 242 113 48 -300 0 -101 -150 -98 151 -373 -130
7116 -130 371 136 106 -3 -91 268 72 34 -55 82 141 -15 31 -191 -129 36 81 -65 -18 10 -1 31 -46 -328
7140 -328 -96 14 -149 -266 190 -129 -124 39 143 -73 150 -86 -312 -55 -29 23 -269 90 5 209 229 222 -44
7163 -44 262 105 35 -42 -30 147 239 -103 190 123 -103 -71 99 190 153 183 -20 158 170 -346 -18 -146 -106 -135
7187 -135 -161 23 140 148 2 -156 69 155 -44 -46 -221 109 -424 98 49 -63 25 62 126 358 144 -85 61
7210 61 137 142 99 86 -36 -299 262 -98 0 66 -176 158 -131 22 34 -18 18 225 -114 -10 222 4 294 7
7234 7 -269 111 186 144 15 -114 27 220 -42 -46 -23 53 81 268 109 -159 -95 53 -153 223 -16 7 348 206
7258 206 -375 126 216 149 143 158 -229 -110 2 -347 123 -1 35 66 -299 -87 -201 90 312 -5 6 57 -35
7281 -35 -319 82 13 -4 -5 49 130 -42 -5 28 -196 291 -5 139 189 -10 -139 99 -18 143 -201 -36 165
7304 165 -3 208 -15 -22 285 -208 128 -54 -67 -176 -288 282 -76 99 34 245 -35 279 -25 -134 -337
7325 -337 -136 -136 353 -223 278 -123 -34 196 85 -100 -170 -63 87 -100 88 23 -114 60 -60 16 23 106 75
7348 75 -122 -39 -47 90 89 -137 -184 -163 76 -63 143 27 127 -52 -436 72 -29 110 -123 61 34 76 -22 324
7372 324 -37 5 10 163 238 -337 -51 -69 -216 -262 -128 66 320 30 124 87 93 -170 4 -20 -91 0 199 96
7396 96 -129 -100 -141 -6 7 -9 83 134 277 82 -121 -87 -51 -51 -374 36 205 60 81 81 -63 342 -46 84 -140
7421 -140 -53 118 442 -138 -60 -211 116 183 -49 164 51 174 -20 153 123 -41 141 199 129 96 -300 -62
7443 -62 -49 -169 -282 -51 281 48 55 141 -17 -60 209 7 56 20 -257 -139 80 211 149 -87 -75 87 -15
7466 -15 -87 -31 28 -25 88 168 1 -23 -69 114 -159 -130 -4 -49 -1 52 51 268 2 -57 -159 -309 112 42 -245
7491 -245 -185 13 0 -244 -73 35 248 161 -65 -15 176 195 -116 -142 -28 -159 193 136 -60 8 274 14 33
7514 33 81 114 -139 -73 350 -54 -244 143 8 67 36 -138 -154 133 -98 -12 12 -32 46 136 -52 -209 -102 -407
7538 -407 94 32 -184 -190 -290 316 68 -230 145 174 -148 -11 -51 -54 -103 35 -70 347 -253 282 -28 -208 158
7561 158 299 -9 -33 -38 111 -70 -268 180 -150 9 177 184 28 141 -356 58 -181 245 210 73 -73 15
7583 15 -166 -53 -84 0 -89 27 -125 -90 310 -132 191 -256 292 77 140 -37 -247 -471 47 140 370 -151
7605 -151 183 -93 -67 45 -203 -42 154 149 130 74 -288 254 -70 90 -336 154 23 86 -390 440 68 169
7627 169 -223 2 -62 -197 -138 139 136 -122 17 71 -253 -35 -135 295 -190 124 -45 50 338 19 -37 58 -78
7650 -78 101 -105 311 161 94 -172 -235 193 110 115 150 -376 -191 129 235 -227 -156 76 -33 -91 36 113 -40
7673 -40 -137 -1 92 92 257 45 342 99 113 -34 -183 170 10 -334 92 -129 -29 -21 -91 198 136 -120 -25 146
7697 146 220 236 175 109 -164 77 51 7 40 -202 -70 -217 -105 -49 202 35 117 -64 158 109 -215 23 -74 48
7721 48 176 184 -201 -119 35 -143 6 132 3 -108 -59 79 57 172 9 -148 126 456 -62 -233 -266 -513
7743 -513 -21 164 -16 -144 -386 18 -56 81 55 96 -142 269 106 -50 76 154 -13 -252 118 -89 30
7764 30 -207 -204 -23 275 -373 40 28 -1 107 78 48 -157 18 60 -60 106 -156 -50 -217 331 277 -202 -35
7787 -35 -65 208 -93 -65 -26 -124 -74 209 30 -126 350 -8 -39 6 195 -11 23 -53 320 -140 231 -14 136
7810 136 67 -73 87 235 -153 -111 16 -164 -126 134 -228 -400 -164 -34 46 -47 279 72 67 -27 -34 -77 -225 -293
7834 -293 69 136 246 148 37 -131 -51 141 72 -5 -105 -13 -75 -144 -83 187 95 -74 236 -16 71 357 -41 -124
7858 -124 -84 -64 74 56 200 -14 12 341 171 48 211 27 40 2 -239 176 -90 -274 238 -109 -260 436
7880 436 -233 -195 -116 -95 -1 148 172 33 97 -93 -187 -87 -170 -303 53 -80 -357 -241 -168 66 371 -309 11
7903 11 157 -38 -176 -28 -196 127 -57 -453 73 139 146 -358 -17 49 88 188 -65 -199 293 -5 -84 -186
7925 -186 -16 -74 -231 -14 -37 -152 -300 10 -186 -42 47 -62 -276 220 147 -184 103 15 426 -315 -190 121
7947 121 98 124 187 66 96 150 374 -72 98 60 77 312 267 -61 16 -98 282 -29 192 40 -219 -32 -104
7970 -104 -46 45 4 56 227 -91 -142 151 -306 180 -111 70 219 323 92 -101 127 -115 265 -277 245 -147
7992 -147 280 20 -145 -52 194 -311 -137 18 -110 264 -37 -131 -104 -154 445 -2 45 -170 10 254 44 -285
8014 -285 72 -221 -77 22 24 -3 19 142 -99 55 -151 156 -55 202 303 263 -7 210 51 15 10 -42 25 87
8038 87 231 -19 206 306 284 -126 -78 91 142 308 163 137 231 171 185 -151 195 -246 -43 -76 -23 145 -123
8061 -123 218 30 89 89 -97 -159 -89 124 -226 381 -357 -124 -305 -200 66 54 -8 12 -148 72 -111 -25 -17 -118
8085 -118 -117 -58 30 -142 231 -302 109 10 223 8 19 93 86 194 -67 171 -44 -71 151 148 -115 182 238 192 -24
8110 -24 102 35 25 -182 116 -25 -284 184 -166 69 107 -212 297 -75 -256 29 59 117 108 53 -308 -126 -5
8133 -5 -58 -248 125 -215 184 126 66 -128 191 240 -104 258 185 -88 -46 -93 -56 34 -41 35 108 -129 4 143 218
8158 218 -83 181 221 7 37 -20 61 -152 -150 -41 144 -136 -217 -14 96 -155 -42 89 178 -37 8 51 8 -170
8182 -170 -37 -173 -173 146 -196 -85 30 -82 -438
8191d38
$$ Imaginary data points
##PAGE= N=2
##DATA TABLE= (X++(I..I)), XYDATA
0 0 0 0 0 0 6 0 8 -8 8 -8 16 -16 24 -30 32 -40 48 -59 71 -80 96 -112 128 -148 171 -195 220 -252 284 -322
30 -322 362 -409 457 -509 570 -633 703 -782 869 -959 1063 -1181 1305 -1445 1601 -1777 1973
47 1973 -2202 2463 -2765 3126 -3559 4092 -4770 5666 -6898 8721 -11691 17363 -32051 144991
61 144991 287549 -121671 -214647 3448 212841 138450 -77350 -194509 -13792 186187
71 186187 121917 -112837 -182918 -12411 186682 107294 -138694 -161742 72449 186926 55062
82 55062 -133105 -144445 52374 188703 14317 -206037 -118423 124153 164446 -25244 -188095
93 -188095 -85610 154864 153108 -91921 -179093 -16694 122895 94519 -49854 -161732 -65638
104 -65638 132916 120993 -92836 -178829 -10759 170815 106146 -106591 -133569 57837 156221
115 156221 45107 -93759 -105294 27178 148517 48399 -143401 -100861 100920 127430
125 127430 -27242 -123516 -55369 85882 112484 -25413 -123473 -34172 104141 104716 -33514
136 -33514 -137340 -40834 132427 101141 -87055 -130504 16692 127498 62330 -86263 -115874
147 -115874 20019 114485 30885 -92618 -91748 23434 111214 36710 -109246 -86553 72250
158 72250 101285 -22693 -90896 -34144 59340 82103 -6767 -91180 -35252 80274 78132 -38963
170 -38963 -102177 -12668 102434 59535 -73781 -82924 25736 78575 25647 -59052 -78942 9742
182 9742 92555 32733 -76554 -62181 44293 87994 15010 -74755 -50490 53786 74356 -12270
194 -12270 -68043 -29623 40701 58682 -10890 -80350 -32359 64108 52113 -40904 -67261 5183
206 5183 69495 35197 -47662 -53412 19350 56090 16647 -41495 -51971 12828 72575 21390
218 21390 -68122 -45517 46436 60739 -8627 -58240 -28608 39523 52173 -11509 -59567 -25885
230 -25885 39353 46384 -18335 -65448 -13454 61519 39363 -35486 -42196 14255 48129 22618
242 22618 -30771 -42483 8835 47303 13288 -42393 -40586 17726 51060 3042 -56730 -29273
254 -29273 39900 41831 -12984 -40425 -13257 33488 41343 -10208 -49811 -14105 42308 34419 -24275
267 -24275 -47213 266 48553 23235 -32875 -33680 9531 33332 14642 -25429 -36953 5945
279 5945 43723 10867 -40794 -29490 23952 38472 -3572 -38580 -14266 31963 31691 -8575 -30176
292 -30176 -9403 26454 29903 -13009 -41984 -7281 37050 20453 -26742 -33022 4620 32118
304 32118 13530 -24709 -27519 7966 31512 13330 -23042 -27382 12312 38081 4822 -35411
316 -35411 -17936 23770 25727 -6901 -26093 -9698 20579 22593 -7535 -28019 -9339 22483
328 22483 20556 -14412 -30798 22 30378 12445 -21463 -20149 7563 23374 10363 -16425
340 -16425 -20707 8741 28485 7334 -23931 -19212 14310 25376 -4615 -28551 -10640 18271
352 18271 16358 -7009 -19445 -7026 15794 18575 -6872 -23253 -2591 23187 14547 -14120 -19803
365 -19803 4728 21364 6103 -16460 -14611 6045 17244 5518 -15699 -16072 9161 21335 -575
378 -575 -22706 -10159 15298 15312 -7236 -18202 -3221 14859 12324 -5891 -15137 -2910 15844
391 15844 13913 -9216 -17912 2510 19092 5758 -15425 -13447 5510 13712 1141 -13840 -11092
404 -11092 6947 15641 2001 -14841 -9339 12268 16087 -4751 -16836 -2642 14216 9388 -7441
417 -7441 -12444 -894 12558 8706 -8260 -14781 420 15230 6683 -12607 -12732 6437 14438 547
431 547 -13365 -7987 7374 11756 394 -11598 -6718 9539 13786 -2181 -15009 -4140 13223
444 13223 9963 -7994 -13051 2 11829 5737 -8080 -11582 271 11496 5984 -10179 -11948
457 -11948 4398 14160 2742 -12397 -7546 7993 11736 -644 -10858 -5577 8237 11129 -1469
470 -1469 -12296 -5480 10023 9758 -6334 -14088 -1182 11745 6053 -7862 -9854 1843 10408 5431
484 5431 -7070 -9964 2458 12526 4126 -10776 -9276 5977 11447 -529 -11790 -5715 7599
497 7599 9153 -1724 -9907 -4559 7842 9691 -3618 -12286 -2707 10219 6806 -6961 -10848 575
511 575 10622 5320 -6663 -7905 2281 9934 4933 -7364 -8799 3552 11414 857 -11053 -6378
525 -6378 5622 8124 -2208 -9763 -4309 7244 8580 -1534 -8264 -2568 8715 8476 -4114 -10189
539 -10189 -654 9354 4511 -6778 -8359 553 8056 3921 -6466 -7509 2673 9693 2870 -7536
553 -7536 -7006 4420 9200 -421 -9337 -4306 5286 6429 -1583 -7082 -2842 6679 7693 -2313 -7795
568 -7795 -1125 7886 5787 -4626 -8313 -28 7760 2911 -6283 -6942 981 6712 3059 -5950 -6109
583 -6109 3702 8599 1501 -6912 -4279 4102 6709 -690 -7781 -3405 4560 5460 -1660 -6585 -2542
598 -2542 5368 5833 -3128 -7074 120 6843 3650 -3984 -5990 420 6284 2193 -5169 -5362 1792 5743
614 5743 2012 -4832 -4814 3344 6769 35 -6171 -2955 4112 4977 -844 -6004 -2061 4535 4604 -2168
630 -2168 -5619 -1203 4880 4246 -3231 -5383 815 5992 2126 -3351 -4092 593 5143 2121 -4405 -4333
646 -4333 2257 4998 287 -4927 -3206 3102 4898 -1252 -5117 -1643 3847 3851 -1240 -4394 -1321 4537
662 4537 3580 -2878 -4677 -290 4546 2965 -2856 -4639 873 4608 1166 -3365 -3254 1202 4214 1253
678 1253 -3886 -3532 2475 3986 -604 -3985 -2143 2690 3490 -827 -4181 -817 3544 3162 -1235 -3504
694 -3504 -482 4347 2422 -3082 -4413 879 3839 1039 -3045 -3757 1147 4030 730 -3546 -2485
709 -2485 2133 4126 680 -3672 -2299 2912 3500 -956 -3928 -1516 2490 3131 -1301 -4138 -480 3409
725 3409 2247 -1979 -3132 204 3916 1927 -2869 -3305 1153 3768 744 -3057 -2725 819 3982 1173
741 1173 -3317 -2004 2385 3534 9 -3550 -2038 2728 3090 -1280 -3818 -932 2700 2654 -1074 -3512
757 -3512 -596 3436 2263 -2023 -3038 168 3396 2056 -2444 -3143 1019 3215 403 -2637 -2379 1319
773 1319 3240 697 -3150 -1993 2076 2696 -271 -3347 -1529 2398 3019 -1021 -3345 -668 2254 2137
789 2137 -982 -3504 -637 3130 2030 -2011 -2706 59 3070 1571 -2147 -2874 711 2888 650 -2386
805 -2386 -2221 1184 2714 397 -2594 -1613 1501 2223 -395 -2473 -1393 1563 2348 -941 -2827 -836
821 -836 2120 1845 -1096 -2418 -495 2263 1953 -1501 -2391 443 2398 1187 -1676 -2282 417 2404
837 2404 674 -2082 -2001 1006 2181 631 -2081 -1776 1074 1954 64 -1793 -1062 1262 2039 -332 -2425
854 -2425 -616 1585 1295 -913 -1534 -366 1585 1337 -1259 -1819 365 2094 767 -1344 -1662 442
870 442 1749 121 -1594 -1192 886 1572 152 -1204 -1126 986 1574 -298 -1516 -557 1016 1043 -473
887 -473 -1621 -576 865 1091 -341 -987 136 1137 566 -928 -1253 202 1320 162 -1056 -633 322
904 322 1405 408 -1224 -608 886 1123 -205 -1077 -327 1096 1087 -592 -1212 -294 876 747 -232 -1056 78
923 78 1306 459 -1044 -931 493 830 269 -763 -649 523 850 -157 -1027 -562 732 619 -85 -659
941 -659 -89 885 487 -805 -774 -218 776 447 -456 -1039 344 939 172 -632 -698 226 595 496 -818 -240
961 -240 519 632 -19 -555 -471 711 722 -112 -885 -176 833 585 -535 -900 -49 881 681 -547 -816 433
981 433 963 583 -637 -677 386 820 -70 -652 -270 642 1062 86 -1227 -468 813 702 -315 -742 -349
1000 -349 392 642 -440 -753 -142 512 461 -564 -932 -163 707 521 -602 -626 396 550 -19 -635 -675 528
1020 528 691 44 -386 14 550 453 -186 -868 -333 973 545 -402 -838 152 1029 293 -529 -636 175 864
1040 864 -38 -427 -375 154 413 -4 -630 -491 449 601 -363 -351 37 723 873 -499 -478 196 570 186 -1001
1061 -1001 -589 24 447 258 -825 -589 192 557 325 -754 -217 605 769 147 -800 -339 313 640 -357
1080 -357 -1074 -237 661 406 -668 -857 127 696 290 -606 -520 371 711 312 -522 -673 615 562 -359 -805
1100 -805 -72 692 825 -367 -950 126 1014 565 -273 -783 205 924 673 -776 -1006 26 949 311 -1008
1119 -1008 -900 578 1340 205 -912 -738 781 1248 16 -1160 -383 650 733 -459 -1007 -314 897
1136 897 730 -214 -1213 -66 1211 857 -553 -965 539 1124 362 -1070 -1321 148 1173 484 -1261
1153 -1261 -839 665 1553 110 -1403 -674 745 1366 -232 -1325 -376 606 1075 -561 -1406 -726 1017
1170 1017 727 -787 -1410 171 1432 894 -561 -1106 340 1788 498 -1320 -1259 323 1728 197
1186 197 -1435 -1091 807 1408 174 -1597 -782 1107 1405 -122 -1173 -630 1016 1304 -505 -1499 -542
1203 -542 1223 1054 -774 -1601 -242 1105 1002 -670 -1469 128 1557 541 -1076 -1208 346 1569
1219 1569 535 -1490 -1165 823 1496 165 -1323 -997 815 1482 -16 -1333 -747 1299 1408 -455
1235 -455 -1507 -629 1551 975 -663 -1521 -441 1327 802 -926 -1454 195 1614 459 -1104 -1250 272
1252 272 1368 305 -1431 -881 583 1352 6 -1379 -1003 1089 1303 -194 -1302 -545 1092 1235 -61
1269 -61 -1170 -361 1478 1156 -684 -1427 -335 1295 1046 -854 -1386 -177 1644 629 -1169 -1585 606
1286 606 1414 188 -1087 -1034 382 1430 -348 -985 -879 782 1071 78 -1569 -431 1021 1022 -76 -1431
1304 -1431 -329 1199 893 -795 -1161 -128 932 680 -1047 -1077 201 1489 891 -1002 -931 516 1178
1321 1178 284 -776 -904 934 977 17 -1096 -785 678 1011 -504 -1061 -351 919 1021 -518 -1098 -20
1339 -20 1102 992 -615 -1307 -168 1122 726 -1281 -1024 467 1189 682 -917 -737 405 1241 258 -1260
1357 -1260 -848 432 1428 -61 -1347 -745 909 893 -510 -1287 -518 1037 810 -597 -909 -258 798
1374 798 1037 -340 -1418 43 1188 560 -783 -879 119 1236 198 -1136 -803 496 961 78 -760
1391 -760 -856 442 1229 -247 -1155 -563 872 1051 -317 -1089 -103 1338 729 -434 -1094 128 1059 567
1409 567 -447 -1043 95 915 421 -709 -954 173 874 192 -899 -762 838 1081 18 -1112 -345
1426 -345 511 876 -556 -1042 -375 877 736 -151 -780 -49 583 643 -379 -1227 -37 813 505 -486 -975
1445 -975 86 1364 492 -512 -951 -250 818 492 -610 -589 465 929 -37 -989 -592 590 654 -158
1463 -158 -1322 -160 972 795 -366 -837 -47 739 697 -490 -936 -92 979 525 -312 -755 52 628
1481 628 482 -696 -824 372 638 214 -640 -719 318 687 186 -652 -375 574 672 -167 -701 12 517 554
1501 554 -230 -519 -273 707 519 -259 -633 -327 897 540 -558 -579 -80 672 242 -837 -813 238 525
1520 525 466 -180 -713 343 782 423 -841 -190 549 677 -175 -711 -485 361 606 -532 -519 -204 357 209
1540 209 -328 -587 12 701 276 -204 -640 10 721 280 -464 -588 -34 499 66 -615 -418 117 621 190
1560 190 -819 -215 253 324 294 -519 -185 436 495 -73 -662 112 628 272 -172 -445 155 649 56 -667 -849
1581 -849 285 498 -209 -199 -484 257 268 -208 -702 -245 494 606 -78 -637 -224 214 710 -230 -305 -211 438
1602 438 389 -269 -591 -409 122 338 -311 -230 67 332 212 -320 -479 -123 511 458 -328 -394 393 476 63 -630
1624 -630 -124 388 569 242 -380 -142 608 591 -191 -331 -30 587 243 -615 -765 -69 309 127 -262 -279 78
1645 78 760 302 -427 -206 247 598 -20 -294 -598 -52 527 179 -739 -120 135 315 -20 -351 -8 685
1665 685 391 -89 -783 -166 650 -62 -217 -160 77 130 320 -544 -455 128 689 721 -587 -389 79 451 159
1686 159 -311 -575 -112 443 37 -602 52 320 542 -116 -292 -58 263 105 -336 -571 109 539 110 -101
1706 -101 -380 348 555 79 -322 -497 17 476 119 -234 -190 142 618 214 -375 -293 248 563 -20 -207 21
1727 21 492 535 2 -120 -286 286 473 91 -545 -221 269 28 -313 -325 230 342 -126 -687 -376 601 288
1748 288 -67 -276 -206 50 299 -101 -548 -111 259 89 -118 -239 -422 304 655 -175 -117 -164 367 -77 72
1769 72 -615 410 372 249 -272 -496 235 593 -140 -534 26 233 374 -282 -326 -396 216 276 -267 -274 -104 443
1791 443 68 -103 -464 61 452 460 -460 -504 424 571 345 -363 -359 158 438 130 -760 -651 18 108 -61 -285
1813 -285 -259 69 337 -299 -354 -386 103 616 -32 -305 -68 400 271 -325 -626 -53 115 125 -230 -904 41
1834 41 220 28 -225 -209 72 371 27 -399 -128 350 519 -205 -555 -227 452 324 -91 -424 -285 449 431
1855 431 -405 -444 200 537 302 -187 -281 -208 707 141 -387 -368 -4 536 -31 -467 -297 402 422 287 -378 -208
1877 -208 122 709 -232 -395 -395 -92 274 31 -477 -305 720 329 -104 -507 -151 343 402 -195 -325 135 727
1898 727 182 -328 -145 -11 307 91 -359 -236 225 315 510 -601 -547 422 714 58 -408 -358 326 384 -191
1919 -191 -595 -493 479 290 -261 -603 270 413 401 -395 -299 53 386 406 -491 -689 26 308 108 -85 -293
1940 -293 -11 628 -66 -401 -271 244 196 34 -359 -327 38 438 382 -333 -421 300 396 -203 -455 16 737 193
1962 193 -114 -779 -149 224 142 -298 -494 163 581 435 -318 -467 503 557 77 -76 -425 385 470 -18 -425
1983 -425 -177 129 275 -317 -751 -125 481 517 -38 -525 257 495 386 -170 -666 -115 474 340 -16 -158
2003 -158 416 680 54 -377 -645 89 659 -150 -719 -262 96 463 79 -679 -201 227 564 -189 -633 271
2023 271 664 476 -198 -713 6 449 376 -202 -355 14 526 249 -546 -649 184 690 133 -441 -501 47 472
2044 472 467 -355 -483 378 662 164 -452 -494 426 549 -215 -796 -186 528 238 -40 -590 20 380 399 -258
2065 -258 -711 216 283 481 -118 -382 85 691 28 -470 -469 -65 742 126 -472 -397 483 568 115 -486 -316 476
2087 476 453 -139 -815 -477 201 270 -196 -769 25 450 585 -96 -420 82 505 211 -468 -359 230 567 -21
2108 -21 -397 -499 40 737 249 -524 -130 365 426 60 -314 -274 568 490 -267 -998 -345 377 750 -2 -807
2129 -807 -162 623 597 -81 -428 55 609 323 -523 -650 213 1044 149 -364 -705 321 437 275 -564 -307
2149 -307 188 567 -79 -575 -553 262 657 -189 -838 -257 501 511 -374 -685 -229 349 424 -307 -608 -338 565
2170 565 642 -443 -469 105 415 202 -146 -298 28 284 144 -454 -463 134 640 33 -743 -417 451 509 -251
2191 -251 -608 -327 170 487 -367 -578 -187 354 374 14 -497 -113 358 95 -110 -428 -256 494 457 -283 -490
2212 -490 132 683 336 -461 -602 77 665 149 -533 -531 566 535 -31 -426 -374 208 699 -272 -429 -242 459
2233 459 405 -117 -254 -117 416 413 -85 -462 -87 383 331 -324 -619 183 579 397 -455 -371 387 472 30 -316
2255 -316 -461 442 771 363 -486 -381 121 559 0 -868 -129 22 369 8 -671 213 349 199 -379 -704
2275 -704 -46 544 484 -530 -514 136 566 -127 -692 -478 245 429 -48 -407 -197 231 530 -69 -498 -29
2295 -29 403 162 -87 -710 216 462 577 -271 -598 169 549 380 -371 -423 136 802 226 -250 -145 254 295
2316 295 261 -750 -317 212 381 92 -337 -104 295 526 214 -78 -159 506 673 -738 -839 -140 287 291 -30
2337 -30 -424 -288 623 463 -316 -475 -20 416 294 -357 -621 259 270 108 -307 -420 158 439 225 -558 -204
2358 -204 444 267 -447 -435 111 472 716 -29 -727 -178 404 331 -261 -656 14 441 554 -313 -488 -42 509
2379 509 251 -532 -330 -59 484 167 -463 -191 409 393 160 -569 -114 539 209 -111 -842 -9 643 460
2399 460 -277 -401 -251 301 279 -98 -247 131 407 306 -330 -620 147 480 58 -142 -531 -58 344 222
2419 222 -515 -191 430 270 38 -494 -155 54 446 -106 -295 -375 427 467 -74 -245 -116 383 119 -81 -41
2440 -41 30 78 398 -228 -240 152 302 309 -336 -520 237 533 216 -411 -339 260 208 -224 -506 -277 191 194 -61
2463 -61 -658 -406 161 339 -57 -436 -266 204 394 -339 -323 -111 414 21 -217 -317 -17 297 311 -130 -379
2484 -379 216 90 202 -284 -5 419 291 36 -178 -54 85 351 -133 -136 -134 148 199 -479 -70 5 575 161
2506 161 -311 -531 -51 310 167 -180 -254 34 410 -12 -275 -82 406 167 -289 -331 -212 293 373 -249 -259
2527 -259 99 -13 49 -81 -336 -54 262 167 -88 -203 293 257 -191 41 -285 171 287 107 -96 -113 15
2548 15 491 -86 -363 170 94 -31 -102 -173 -20 537 141 63 -313 -15 160 -67 -109 -281 -126 295 191 -48
2570 -48 -236 -77 298 -18 189 194 15 161 -8 -250 367 329 373 -143 -349 -87 263 103 78 -142 -118 109
2592 109 -36 123 -77 -188 154 94 -298 -549 -75 -74 68 14 -287 -153 18 204 -230 -202 -32 383 -66 -404
2614 -404 -70 324 400 -168 -42 65 88 25 -269 -3 71 90 -228 -362 156 240 -35 275 -57 135 -63 265
2636 265 269 -237 -34 204 -172 -136 -167 -139 -49 -133 253 -233 -142 249 270 -88 -28 82 -84 424 -166 -313 -164
2659 -164 213 -221 162 -7 109 228 -64 -207 -58 24 115 10 -214 -176 70 160 -192 -25 171 -60 132
2680 132 115 -304 -320 -37 324 -148 122 233 101 156 103 -32 -51 117 212 -40 185 146 335 107 -10 -275
2702 -275 67 112 78 44 -268 71 274 31 -360 -102 125 315 -98 -197 -85 -233 134 -16 -13 5 59 399 -150
2725 -150 -12 54 369 185 -23 68 196 73 3 -94 -59 1 197 20 8 -276 188 185 -201 -239 -65 178 -93
2748 -93 12 -158 33 189 0 211 124 11 40 -236 -325 28 198 136 -59 -234 -49 -258 -23 140 25 -174
2770 -174 72 57 -383 -280 58 -46 48 -194 -23 252 175 159 -138 -198 -187 53 152 -184 -252 -68 154 -76 -272
2793 -272 -189 216 -170 -114 -305 144 -19 -22 76 -157 -81 -28 11 -170 35 -199 -206 167 -327 17 198 378 -120
2816 -120 -185 -51 337 275 -157 -261 -97 249 119 253 -336 107 212 226 -164 0 24 49 41 -337 -255 -4 18
2839 18 141 218 -149 239 188 -64 -217 -500 -403 49 -55 -164 -106 334 266 125 -271 184 65 249 79 -298
2861 -298 -132 70 213 69 -35 9 187 314 -154 -386 -126 79 189 174 -206 -138 221 37 -73 5 104 -31
2883 -31 -45 -240 -196 -141 225 -25 -269 -250 63 296 -240 -379 -76 52 377 122 -373 96 -106 -188 -53 -269
2905 -269 229 -269 -37 -187 -77 155 -92 398 -25 17 -7 -130 230 -42 -49 231 -237 136 -256 28 36 235
2927 235 122 -167 -112 -10 181 -40 -26 -51 -71 -50 296 -221 -25 -101 68 -314 253 -64 -157 2 114 -161
2949 -161 -191 288 308 -284 -211 208 -234 -60 -197 -179 499 205 -324 13 -90 93 346 89 -260 54 256
2970 256 81 -250 -135 -63 168 222 41 157 24 54 -3 -79 -217 -24 319 -129 -376 -303 13 411 113 -71
2992 -71 -419 -145 72 -88 13 -109 -19 -119 -186 -353 -91 143 461 -222 -419 -1 -134 -41 -336 136 180 325
3014 325 73 55 -366 -42 126 63 -108 -153 102 43 102 62 -344 -199 84 -70 -22 -81 289 -161 49 -71 -276
3037 -276 336 240 -93 -43 -175 270 56 -80 -74 11 358 137 -137 -32 -187 208 -383 -96 -105 -92 262 169 235
3060 235 -49 94 288 369 -244 116 165 184 -103 -261 300 78 224 47 -274 55 361 70 38 -150 -27
3081 -27 46 -58 -257 -145 248 -24 -83 274 62 144 -101 -28 -309 -16 139 211 -154 -30 -180 360 13 17 -245
3104 -245 -6 130 149 67 -248 -129 225 124 -9 -32 292 -89 -47 -370 -21 -36 28 235 -296 -307 -5 60 -68
3127 -68 1 -245 -42 274 -32 -27 234 -60 404 -112 -268 -53 358 -70 -356 -24 16 306 309 -251 -267 -101 270
3150 270 269 354 -368 237 354 21 -41 62 102 190 -93 -52 -107 -117 401 -62 -225 41 193 114 18 147 -242 -108
3174 -108 44 -84 -116 -494 153 -195 -187 298 -196 -60 -20 46 -112 88 297 -103 -304 -184 55 304 -17 262
3196 262 -305 -12 -17 199 6 206 317 67 -127 -539 -90 281 352 -106 -312 -141 127 -65 -184 -91 103
3217 103 120 107 144 -214 2 107 -84 -45 15 113 215 -61 84 -136 42 296 -58 53 -69 224 192 -307
3239 -307 109 -1 21 -16 -184 -93 79 209 229 45 52 61 -217 290 57 81 287 4 -35 165 -185 60 -62
3262 -62 37 -39 -32 -34 -104 -92 59 -176 321 181 -341 -96 -54 -92 -207 107 36 240 -11 -259 87 13 46 16 183
3287 183 -96 -179 150 212 67 -117 48 -68 73 119 -142 -336 213 98 118 28 -233 192 55 -90 -213 35
3309 35 41 -241 -99 234 112 16 -8 -50 -177 -154 -36 -148 111 -357 193 0 -1 -294 2 106 9 -6 -169 1
3333 1 -154 -7 -107 -156 -352 34 -156 254 79 229 163 -17 111 180 107 -59 -190 -300 -147 109 -40 -61
3355 -61 -142 194 56 -3 -265 33 67 -23 263 -176 13 -172 276 -16 -41 -174 177 -139 132 -455 56 111
3377 111 -87 -33 -127 -106 -36 99 47 31 -280 -246 -36 240 -223 -9 208 10 -11 -7 -26 -65 241 -60 -123 224
3401 224 -61 -357 -169 -5 -218 -22 -343 244 -137 235 30 -105 60 -232 499 -215 -185 -48 -190 -31
3421 -31 148 25 148 -125 92 0 -189 -140 269 267 301 -99 67 -142 522 -186 -204 220 -75 -165 78 208 54
3444 54 95 29 -113 87 241 267 -3 -88 69 -249 184 346 -270 96 377 185 -67 -199 -87 254 359 145
3466 145 -235 -208 93 16 295 -5 -129 -29 -187 -94 -149 43 409 28 -291 -125 159 71 249 -219 105 105
3488 105 120 -10 -316 81 7 62 143 -324 -107 -84 330 54 -148 36 235 232 134 -180 58 -202 -32 56 21
3511 21 -180 121 367 -60 94 254 226 143 -155 109 -57 285 -180 -460 -70 72 220 223 -342 -248 -43 48
3533 48 -316 -42 205 106 -34 169 -476 168 154 115 58 -372 -91 150 175 -3 -87 -381 31 4 -9 -127 -136 219
3557 219 -92 -133 -166 -169 187 -185 13 122 170 108 101 -420 -119 143 122 -21 -366 -117 -41 -116 -71 -212 -158 -77 47
3582 47 220 -268 109 -107 99 -235 -124 113 46 47 -104 -144 4 134 67 -150 -293 62 99 74 -383 123 -207
3605 -207 118 7 53 30 489 -14 -139 -193 55 298 -66 62 -140 232 -102 13 -339 -239 -95 474 42
3626 42 -531 -236 100 -5 -178 -345 -296 85 15 170 -293 69 161 267 -52 -54 -252 277 -247 -144 -185 -200 117
3649 117 83 6 -327 134 34 80 -8 -257 192 -46 -208 -151 -114 -131 110 -95 -106 -100 5 78 -298 159 220 356
3673 356 -36 -229 -141 105 140 279 64 -329 248 56 -157 -135 195 269 236 -190 159 -349 296 400 20 -64
3695 -64 -159 -149 -17 3 -133 -75 93 278 -337 303 148 -52 321 -299 -117 85 40 84 -186 -53 -236 244
3717 244 187 34 18 206 329 -308 -97 202 68 49 61 -155 -115 -145 287 -49 54 -76 48 27 -67 -67 -43 51
3741 51 146 -160 -37 -81 -84 90 -283 -171 23 260 -170 -108 -145 172 252 -54 -129 -9 178 118 -232 -112 282
3764 282 -280 48 -164 -14 -255 99 112 -463 45 95 115 153 130 -88 -107 395 71 -137 -291 -99 251 185
3786 185 -12 205 -142 152 -188 -17 -306 51 66 -96 -469 -378 147 -66 -31 -176 -121 162 237 72 123 -32
3808 -32 94 29 -155 -184 -168 250 148 61 -227 111 284 -29 -31 -214 461 151 -72 28 289 -9 314 45
3830 45 -164 -61 276 -107 -209 -146 -29 -217 -66 -36 -441 130 495 94 -281 -256 75 116 197 -216 -28 -140
3852 -140 231 55 -271 -246 92 252 119 -188 -110 356 468 -39 -142 118 53 32 6 -223 -207 269 232 -285
3874 -285 -168 181 265 203 -7 -169 4 425 240 34 -330 -44 -54 31 -17 -137 227 339 -76 -168 70 40
3896 40 77 -88 -52 69 -84 48 -239 -100 -186 -89 -333 53 -177 -164 179 -52 -21 -4 -139 37 151 173 -203
3919 -203 78 -62 185 305 5 243 83 179 -6 136 226 -32 222 80 -42 232 -151 77 -98 280 310
3940 310 230 39 -121 76 -54 63 -79 -242 -37 141 -60 -485 -219 87 79 -109 -197 13 210 295 48 -13
3962 -13 109 230 178 -85 -212 102 271 -25 -73 -13 173 138 -28 -125 -109 -310 41 259 43 -32 52 -15 -183
3985 -183 -59 -290 207 -68 -353 -41 -202 -298 381 330 -170 120 98 89 -34 -248 75 239 86 180 -65 12
4007 12 140 115 -289 61 -49 257 60 283 -37 -224 283 202 -36 24 -179 282 -54 27 108 312 -231 266
4029 266 -141 -172 8 -154 130 -185 236 -75 370 -257 -74 212 215 16 135 77 135 210 96 -228 135 -90
4051 -90 121 71 -456 -83 -37 260 11 -236 -203 167 88 25 -408 29 261 -61 -144 -96 47 400 -89 8 -329
4074 -329 -253 71 159 186 -168 11 197 70 -215 -53 247 -110 -27 -67 -232 242 -32 -191 -225 -13 379 -109
4096 -109 161 -220 190 -119 -89 -77 86 134 49 -11 -124 -224 -219 90 -45 -105 -61 -273 240 -258 -170 -179 -49 360
4120 360 102 8 -81 544 -129 53 -67 20 96 70 -29 -107 181 190 200 -79 92 194 401 -215 -14 -52 75 -106
4144 -106 1 -105 -188 81 338 157 40 -46 168 190 -258 -233 249 159 83 106 71 -196 38 -167 -139 5 115
4167 115 -52 84 -190 -5 -78 117 -102 -87 176 -75 113 -104 -465 -102 -135 233 -76 -61 93 252 -6
4188 -6 -238 88 -71 182 179 296 -188 -60 74 -73 -334 26 230 222 180 -23 -70 273 158 -112 -36 -120 84
4211 84 176 11 29 -10 -228 -90 117 -187 44 -148 52 7 -116 159 48 -142 55 -258 -15 -118 -77 -46
4233 -46 -143 -63 297 77 53 -21 -64 132 90 -144 -52 46 -226 -9 69 -8 -147 28 84 -205 -195 164 -109 -14 -194
4258 -194 53 15 454 192 -35 121 49 60 -119 94 -110 -15 -26 -82 11 -189 202 -14 -426 -4 -11 196 173
4281 173 -70 -69 241 275 -204 -39 31 -131 -227 47 63 -78 133 73 -230 -103 56 85 -109 18 -26 134 242
4304 242 -109 25 -160 301 57 24 -271 -198 39 323 -28 -66 -76 168 187 25 -264 92 46 -265 12 -6
4326 -6 -81 -99 402 -31 -77 -132 181 -36 -269 -25 36 51 85 141 -89 -91 116 90 -59 -137 -13 -85 3 -60 -113 -172
4352 -172 -138 -144 -60 -79 -110 -359 -65 -49 65 66 -9 47 -214 34 403 152 -261 -13 -38 -236 101 120 -28 240
4376 240 140 67 -129 -152 191 202 -200 -5 228 -214 -20 157 34 -273 124 51 -202 -151 -35 226 -460 -126
4398 -126 232 254 359 -163 298 -284 60 209 59 -3 -265 119 -265 81 -209 -35 -25 -177 59 -119 206
4419 206 -75 165 52 63 -4 -80 -32 73 48 214 355 -30 10 -100 -49 377 22 -29 172 -288 -44 75 -225
4442 -225 -176 30 -71 -47 28 240 -292 93 34 -323 161 -111 -334 -147 -65 201 184 212 -368 -27 62 342 64
4465 64 -247 99 94 175 103 83 89 318 -213 182 -276 33 225 309 -92 -102 -103 233 167 38 -278 -8 -78 -132 -128 10
4491 10 -92 105 64 203 -110 -30 5 -233 -91 -34 25 303 192 -105 -110 -120 45 143 -125 49 114 151 -148 209
4515 209 430 -80 -308 -244 -121 -5 -161 227 143 -72 -85 32 -34 -374 -249 -157 -148 -56 -72 -107 -119 -55 242 -144
4539 -144 247 15 -123 -107 -9 143 -73 -48 -273 -65 -7 29 200 -14 -207 -407 -113 -105 -59 228 -178 15 50
4562 50 -124 126 36 166 -213 220 55 102 115 22 255 -215 -211 132 -264 -298 -433 17 -62 61 39 -306 46
4585 46 260 76 -5 189 51 2 -132 13 -57 84 -273 -118 117 39 108 43 -104 -155 98 101 31 294 25 402
4609 402 -46 241 24 119 249 -60 -30 -37 -156 282 -110 -143 -153 -45 -126 33 -13 121 67 -183 -25 79 -49
4632 -49 -103 -23 -148 425 -29 202 -6 -41 114 -85 -79 95 279 -292 42 -3 -105 -14 -103 -16 -72 100 80 140
4656 140 80 8 24 -282 502 118 268 199 -127 -126 -24 -54 -132 79 -51 121 133 -20 62 -87 -124 55 -142 75
4680 75 -77 -117 -70 32 -90 -38 89 31 -219 55 -75 -6 71 25 95 107 102 -176 63 1 40 222 140 34 50
4705 50 -31 -116 -144 -237 -105 56 -65 68 -23 -161 -30 125 -163 40 149 91 56 -140 -4 -203 -10 -164 35
4728 35 -109 137 -62 28 -80 144 57 -117 -289 -115 297 -147 128 117 126 -211 141 71 -166 209 269 438 280
4751 280 -5 -176 -189 -56 87 54 117 -49 170 -271 -64 -100 4 70 280 57 -54 -243 388 -148 -183 166
4773 166 268 272 -35 -124 142 -238 134 -270 71 -40 125 63 169 -100 291 5 1 65 -60 134 102 67 256
4796 256 -98 46 -37 368 -139 -114 -10 171 -150 105 129 -174 138 137 -37 -166 14 0 -307 -253 450 174
4818 174 162 -164 80 73 -116 -143 -132 -167 -5 -290 -254 -280 -56 -184 26 -94 37 110 -286 -156 -158 -139 -185 337
4842 337 -150 3 -159 15 -163 30 -47 -10 -168 -43 -119 -143 -18 104 -240 -29 -270 -280 -97 172 -81 -180
4864 -180 264 -130 51 220 231 -63 186 -272 -437 -299 200 136 -237 122 2 40 129 89 126 -96 -149 46
4886 46 -139 3 -51 59 99 24 48 -19 9 -172 103 -109 -86 36 31 50 28 122 -242 61 19 130 10 225 -145
4911 -145 -131 129 137 -112 78 -1 90 -19 -112 -49 -201 -144 273 -33 0 -165 -144 338 -31 -131 -46 258 486 -16
4935 -16 -6 71 36 175 -201 200 -243 -197 -178 87 -89 145 51 -70 3 44 -193 91 -70 57 184 64 -270
4958 -270 88 85 38 70 23 -7 -26 -252 139 -250 -42 154 5 -13 109 -190 -122 378 -304 -329 -104 -162 0 -37
4982 -37 -139 148 90 116 -41 134 -213 96 43 164 130 -37 140 -9 -77 126 -34 -102 51 -229 288 33
5004 33 407 43 -276 -10 -273 151 56 188 -193 -104 -58 -170 -21 34 7 -97 -28 -106 -96 27 -243 -70 -54
5027 -54 -78 -31 273 -20 -17 217 55 -5 -113 -29 -32 -164 60 -191 -97 6 -124 65 -84 120 98 -32 94 123
5051 123 -47 -69 -37 228 -112 80 248 25 197 -33 -204 -199 -59 -81 -69 -1 10 31 -88 89 -23 2 -33 -82
5075 -82 -97 -95 33 21 -19 69 -22 132 -30 -275 257 188 -165 47 -70 35 -234 206 107 65 -156 64 60 124 57
5100 57 -290 434 -78 78 -185 -27 -245 -1 -41 63 429 -8 -118 -189 85 162 40 -159 392 -191 234
5121 234 237 23 71 -104 -127 75 70 -207 20 161 -68 -302 -12 78 8 -263 79 -377 -6 47 112 -34 -178
5144 -178 59 304 292 -91 16 109 -136 -95 290 56 42 130 44 -57 61 -130 28 -148 -222 -21 103 -85
5166 -85 104 123 124 -162 234 -105 -168 56 -4 127 429 -231 126 -211 -267 -53 -270 -382 -12 -147 -296 -113
5188 -113 116 -104 -207 -28 -289 301 -68 -44 108 1 172 213 238 52 96 -259 -231 122 156 192 72 -108
5210 -108 49 -137 -159 -149 -160 -273 28 121 -190 350 -7 94 150 -232 145 200 -85 26 181 303 25 -34
5232 -34 150 -222 82 -51 -113 -5 0 -61 229 -28 -211 -93 -124 244 278 201 175 379 -135 -97 182 -70 -180
5255 -180 -290 21 197 176 71 253 -84 111 -23 -84 -305 -207 -24 148 -236 123 132 173 109 -77 -279 -8
5277 -8 -234 -60 3 -77 109 100 67 -49 -152 143 358 -281 6 143 82 -82 -275 -407 -162 211 229 123 82
5300 82 -181 -190 2 -288 -102 64 106 78 -465 -74 71 -11 -133 118 220 115 -155 109 330 -41 -79 -153 -156
5323 -156 -116 -65 -111 90 -113 206 -71 210 253 -138 -17 -186 -148 -53 98 99 71 -226 273 -6 -49 42 -299 51
5347 51 95 -5 250 -125 -151 -305 96 310 79 63 -34 -89 186 -55 -64 -107 -91 -330 -155 -121 33 22 27 248 -153
5372 -153 354 108 -237 -16 -262 -38 2 61 57 -183 45 77 -25 -120 91 -360 234 291 -163 -231 -134 54 148
5395 148 151 430 43 96 196 3 -12 61 -51 69 186 -107 -117 -171 -18 44 19 -81 10 51 95 -117 188 355
5419 355 -153 -31 -41 -48 -205 333 -463 -5 236 30 34 223 -246 -136 133 -375 -128 35 78 -34 -158 -79
5441 -79 -74 -12 -235 -1 -110 121 37 -58 72 104 -142 -15 328 57 -31 141 189 -229 -29 -139 222 -135 -91
5464 -91 -47 260 -39 -247 213 -122 -58 -150 329 -68 216 -88 -37 90 29 214 -33 52 130 -154 -45 102 280
5487 280 90 -26 355 -195 -70 253 389 -96 -25 124 -13 -206 -247 136 399 105 28 -233 -137 -57 40 -12
5509 -12 211 -18 209 24 -168 434 -163 -59 53 63 47 20 146 -7 -196 74 136 11 135 -245 247 120
5531 120 55 237 -73 -217 454 24 -34 -351 -114 -65 11 11 -25 -29 -210 73 68 317 -285 19 -129 -24 89 195
5555 195 15 -161 -14 -156 393 140 -244 -132 -190 103 345 -84 40 -448 317 125 -44 -2 68 -66 84
5576 84 -83 124 -49 -131 47 5 350 -36 -112 209 90 168 329 -6 -166 118 221 55 227 63 109 118 147
5599 147 -174 -191 223 287 67 51 -296 -123 -6 -37 -88 158 49 -9 387 46 34 -105 -262 -34 -139 -233 -1
5622 -1 210 -44 70 -68 72 31 -228 -35 214 -141 -303 -394 -424 202 -112 -69 -29 -299 5 -337 297 -125
5644 -125 69 79 291 -131 -155 152 63 -173 88 -20 80 -13 -213 -95 -294 -110 -265 -51 -40 113 -90 -167
5666 -167 48 35 -36 123 36 379 -91 -127 -276 175 62 -88 -30 -213 8 122 436 364 137 285 -443 -158
5688 -158 23 -24 -143 -272 92 -100 219 -184 -33 -131 271 -341 -95 -65 32 -195 132 -114 265 -75 78
5709 78 124 280 -83 -83 -9 -131 539 65 221 106 -21 -105 -208 -4 -98 80 67 -33 322 123 -150 232 144
5732 144 20 123 -42 -101 25 -29 4 223 -197 -25 42 115 -254 122 166 354 84 -318 -263 -471 -238 -85
5754 -85 -202 -108 -179 121 169 -4 273 64 208 -44 -20 -102 106 -159 232 -142 -196 220 -204 -402 188 142 -115
5777 -115 -10 -22 -34 -279 -89 18 174 -33 -155 -116 -131 63 -87 114 225 -39 -67 -209 16 -43 34 -215
5799 -215 250 -33 -82 -280 157 23 -63 -18 83 -220 52 -21 -100 157 344 -105 172 -4 45 -163 -156 8 163
5822 163 53 -80 -145 -198 -179 -134 -27 25 60 8 -75 297 416 -140 213 53 -133 -130 -39 -86 -111 114 -15 -82 -23
5847 -23 -179 -114 140 17 -247 -123 108 83 244 226 15 -153 -23 349 -249 37 43 90 -300 -58 -559 -134
5869 -134 -12 -186 -238 -122 87 -212 -243 -157 236 134 89 6 -153 225 -238 -182 33 63 -5 92 -199 150 149 -52
5893 -52 -123 -202 -79 15 90 164 303 -151 82 383 -72 111 92 167 1 -365 93 261 -319 106 -28 87 297
5916 297 1 -54 -43 -40 9 -231 -118 179 -184 -20 133 0 73 -215 -113 -156 -80 109 7 126 104 110 -150 -263
5940 -263 -91 47 86 42 -169 -13 63 141 -139 212 116 -88 201 -42 -128 -22 162 75 -105 -241 -24 70 -113
5963 -113 122 -168 85 65 -3 397 -97 -79 -8 -364 108 68 95 -99 19 -86 -156 101 -13 47 -73 209 -39
5986 -39 -222 200 -135 -114 -145 189 238 -13 133 -38 91 95 -101 -46 217 -4 155 -75 247 233 8 -248 -4
6009 -4 -93 312 179 -24 136 8 192 88 35 -82 193 72 26 81 -69 -428 159 139 -133 43 152 -290
6031 -290 -29 15 47 89 -9 -74 63 93 -257 14 -183 146 -97 -87 410 -34 -74 -163 -105 -38 -46 -24 -101 12 70
6056 70 -184 225 -123 278 114 139 -233 58 266 28 104 -225 124 -96 -95 42 185 146 -189 -3 -17 -17 -45
6079 -45 217 -63 -24 -30 -55 -336 -177 -95 145 -60 -11 46 198 -70 104 174 -130 -481 10 103 -72 -163 1 23
6103 23 145 265 -89 114 -150 216 -9 36 88 81 -199 -68 -47 160 -159 -13 -67 59 -77 -267 17 260
6125 260 -11 -347 152 103 259 -41 -109 -163 -112 121 135 201 202 -17 39 341 142 89 -157 -39 52 -26 235 -300
6149 -300 225 255 -10 -23 238 117 -83 -211 42 190 -122 72 -143 -88 98 -54 270 77 -235 35 -43
6170 -43 96 -95 200 181 76 214 170 488 102 118 -35 222 17 -12 -109 -166 5 200 -240 -163 160 164 128 123
6194 123 -173 -161 181 -416 60 99 -163 -245 29 37 139 1 -201 366 105 85 -51 166 -12 127 -17 -239
6216 -239 -4 146 -217 -33 -21 7 432 33 56 -32 -41 -154 -238 186 -59 69 118 -47 128 -13 103 213 56
6239 56 -166 -409 -113 122 38 -19 -187 210 312 -60 -77 53 -117 -81 -232 -130 -3 -253 140 21 -92 123
6261 123 62 -230 237 -46 -375 32 -97 146 -147 31 -159 -228 -72 -45 -60 -289 275 258 -101 -117 160 -78
6283 -78 -263 -136 -102 -86 -93 -147 38 224 -67 45 90 -268 -144 -19 -234 177 83 160 213 122 17 -77 47 54 -95
6308 -95 -149 -56 6 -185 -32 110 -58 209 -1 115 -19 -95 -161 -126 -138 -111 20 3 61 121 233 183 194 -25 84
6333 84 17 178 -117 261 -83 87 258 -182 205 60 -223 97 185 21 -122 -50 50 -3 -116 145 -39 158
6355 158 2 161 39 -223 186 -4 237 -35 162 -38 105 -175 -150 162 95 38 -42 -165 -231 126 200 -10
6377 -10 -8 69 -229 51 -221 21 -333 -5 56 -23 76 -268 95 -235 308 138 -127 270 -231 106 33 162 -51
6400 -51 389 70 16 -33 -137 -311 -26 -116 264 303 46 107 -86 115 161 -357 101 164 -176 -4 -180 45 -87
6423 -87 -285 75 105 -48 -75 315 -125 -204 -40 -139 177 126 -18 133 364 -166 -211 0 148 81 -29 -6 345
6446 345 67 326 148 -343 -45 105 188 129 155 171 105 -334 -64 -130 27 41 58 -157 -39 -42 -112 38 -224 -70
6470 -70 -144 242 117 -55 -193 -3 -9 -103 247 52 -108 -75 -339 267 -69 -62 127 52 47 30 -339 40 169 -28
6494 -28 59 104 -31 -43 125 131 -113 -224 17 217 -158 34 -178 -167 61 -195 8 -57 -45 -77 44 117 -186 110
6518 110 -63 238 114 5 -25 -46 -44 123 161 -117 183 184 -211 -181 -146 50 -270 -146 92 99 -75 341 215 100
6542 100 -32 384 67 -47 173 8 -75 39 156 6 -40 85 387 -39 152 -157 7 -30 25 34 88 116 -25
6565 -25 36 -56 -17 -334 -337 -5 162 -22 26 121 26 248 -138 70 -47 85 71 -4 191 -86 436 185 126 191
6589 191 159 -19 313 -97 -98 -173 -29 70 299 47 -238 -286 -251 151 -149 229 -76 -75 152 133 -95 -67 -5 22
6613 22 -276 273 -64 177 149 90 246 50 225 -65 -3 -269 72 163 -412 22 67 -39 -125 -147 -30 48 -36
6636 -36 51 -133 44 -90 -183 -38 -30 -40 -424 -101 -99 73 -396 4 8 -142 288 237 -131 160 64 -118 -184 230
6660 230 470 -5 57 -158 38 -47 49 186 -37 -134 -94 -115 67 65 -169 -158 -198 -81 65 -40 -72 -40 125 -25
6684 -25 196 -86 -7 -66 -220 45 -26 201 -343 183 77 250 -123 -18 16 -135 -91 -135 157 97 -95 -82 -8
6707 -8 115 -52 -64 147 63 -83 -54 311 95 -284 -191 7 -70 -93 87 -195 -80 -106 -181 -77 -237 117 -72
6730 -72 -203 226 84 -32 -114 -374 114 68 -36 67 -106 244 64 67 -158 18 60 -48 125 -16 -145 221
6752 221 -18 142 95 26 49 -59 -51 -288 -432 176 75 -231 -272 -109 -51 -201 111 -200 -69 -28 125 214 179
6775 179 2 84 45 52 30 99 124 -17 -3 -173 105 -197 91 -19 111 -358 -223 176 -220 140 186 137 -85
6798 -85 -139 -38 -130 43 78 -359 -205 -4 326 -25 56 -148 -45 290 149 -247 32 -30 -168 -591 -338 295
6820 295 -353 111 123 -62 169 165 -78 -109 141 303 20 97 -51 -101 -270 52 -158 43 85 -178 291 -123
6842 -123 -97 390 140 85 -170 -126 50 282 16 26 411 -6 444 -187 -9 334 92 -63 74 1 5 111
6864 111 50 -37 -64 -5 245 -285 -235 285 192 144 -198 -5 -13 -3 20 -63 -302 -145 316 102 -72 421 227 -232
6888 -232 -59 144 128 -138 38 52 132 -192 266 -187 -236 -109 69 49 40 50 141 238 -140 -93 -12 -92 -103 332 12
6913 12 -281 41 61 -58 -400 80 26 -175 85 -80 -107 64 -77 115 -178 59 100 -67 29 -37 -25 115 277
6936 277 86 -196 -160 -154 -109 244 177 -19 8 118 148 263 72 -73 92 86 220 264 -394 272 -49 288 260 299
6960 299 -136 -90 337 -435 243 49 143 -85 114 -181 34 45 -33 -63 -117 39 -106 6 -239 -12 -110 -83 24
6983 24 272 -12 -115 -196 7 18 -42 -51 69 -231 -118 -264 -69 33 -315 -9 144 43 -18 62 173 -3 24
7006 24 -33 203 90 80 -267 -114 253 105 -21 -193 -10 28 -154 -75 265 -153 -310 -71 102 48 159 129
7028 129 120 71 -125 -311 36 -204 -103 -111 -183 -333 -124 70 -15 -220 -66 267 2 133 60 45 -50 -13 118 317
7052 317 51 83 85 -83 111 332 -161 -167 -125 -366 193 -63 12 32 -54 142 -129 -171 -50 197 41 139 253 -325
7076 -325 -167 95 -82 -30 183 -128 -212 99 129 -19 109 152 -157 78 -205 8 121 -343 -149 -149 31 10
7098 10 -64 -182 -32 279 132 357 -27 -79 -85 -258 148 25 1 -7 -89 -12 -141 -36 -2 25 -5 -94 -100 119 -249
7123 -249 -153 40 82 385 -176 -32 -80 -26 6 65 100 250 66 38 -23 176 96 32 93 62 -150 -85 -89 132 -166
7148 -166 -208 51 144 151 -58 -54 102 -123 -492 -184 -92 -539 78 45 -189 -222 43 -144 -94 -62 -20 -181 59 -143
7172 -143 49 17 -248 95 39 -399 -15 -100 173 -45 264 128 119 -140 333 12 248 66 177 -89 -108 -70
7194 -70 -3 -67 53 11 -83 279 -46 40 -32 132 -103 13 -56 -55 -93 -161 8 -170 -56 -224 41 130 101 -125 30
7219 30 42 -40 55 10 158 -161 365 -164 111 40 -267 10 -47 -115 46 -49 45 -143 -78 277 114 -111 -46 -92
7243 -92 63 -111 -325 66 -13 -416 -240 96 109 206 14 106 -11 111 45 20 124 237 14 -40 27 -126 167
7266 167 10 -268 -10 159 -75 -99 349 -25 40 -45 128 -108 -28 278 308 230 68 -157 87 -136 -46 -202
7288 -202 -27 415 172 38 -14 60 127 182 67 0 28 197 58 50 327 119 -23 -89 -11 104 100 284 -122 -126 35
7313 35 -247 -205 -34 166 -96 218 67 163 171 80 -132 -4 -69 -77 -3 -51 -275 155 60 -493 33 -288 -7 -178
7337 -178 -59 86 294 267 313 270 -96 136 -119 1 -99 -253 249 -64 60 206 -153 -170 -217 -79 161 162
7359 162 157 -255 342 384 -222 -238 -278 -109 46 -3 -167 230 14 -155 -216 409 144 -208 54 -124 -48 -104 -160
7382 -160 83 -271 94 -113 295 -111 -82 189 227 183 79 18 28 68 160 133 35 -222 -86 46 343 309 101
7405 101 123 -14 30 -56 121 15 -428 365 -163 -218 136 -159 93 -72 151 -105 50 -204 -30 -27 194 33
7427 33 -59 -243 163 20 158 -57 -6 -126 -25 107 98 -3 -6 51 -43 68 -147 -46 -170 -31 -81 -218 153
7450 153 -13 159 39 107 -83 9 32 -109 -31 -120 125 220 -373 17 186 199 85 184 -196 113 112 -97 -198
7473 -198 314 -8 142 -243 258 166 -116 176 -194 141 307 53 -149 178 -235 -83 -175 -91 -357 -213 -27
7494 -27 96 -42 -191 257 -165 -58 155 18 -141 -11 -49 -61 165 152 -52 107 -61 216 172 124 143 14
7516 14 33 6 194 -111 178 24 -80 127 143 307 -308 247 83 -19 208 -13 256 137 145 76 -147 239
7538 239 44 177 16 -102 -266 -41 -93 149 138 21 -109 21 147 1 -125 -216 -11 1 -198 -212 -81 -231
7560 -231 89 -99 -344 172 194 -18 257 -36 -216 -12 -268 -167 124 226 149 27 38 -10 -29 -135 -65 -98
7582 -98 -62 -276 227 41 121 -90 -205 -88 358 -25 -175 -99 -73 87 72 60 -283 64 278 -550 13 190
7604 190 -85 -286 182 -101 -109 -66 -135 123 -191 -57 286 -77 -235 23 -1 70 -73 113 -393 124 162 71 -27
7627 -27 9 189 225 -182 -186 160 -123 -3 224 -43 18 326 22 -108 -154 500 -115 -339 5 -9 160 -46 175
7650 175 163 133 -93 -143 -40 70 -73 -62 188 75 59 163 -13 -208 -110 113 231 -237 -38 -212 -91 315
7672 315 7 91 -46 -26 -6 150 -16 66 -41 261 -143 24 -184 32 58 142 -43 -30 1 -177 -219 -94 -89 -61
7696 -61 -210 0 187 -32 -73 -187 164 84 190 -83 73 -30 68 136 254 15 -21 -163 -40 -154 -263 120
7718 120 152 21 -277 268 -151 213 -39 -77 -56 -31 129 269 -61 48 -4 7 -305 -172 77 159 124 124 -32
7741 -32 23 48 84 -97 110 288 102 104 309 78 -148 152 -95 -139 -33 -43 -70 -323 207 48 31 -151 -129 -63
7765 -63 -58 -201 82 164 -339 -69 112 25 -170 57 -31 -164 -148 -81 50 -227 -78 115 12 142 -148 45 -30
7788 -30 324 18 -97 -131 -45 104 -71 297 -68 300 -109 -91 -143 -208 126 26 319 138 282 130 92 -65
7810 -65 -292 -11 -433 -39 127 76 -104 211 204 219 -52 139 -85 -224 88 -110 187 -66 83 -58 117 240
7832 240 181 -168 198 32 82 -177 -40 89 -56 -69 -71 -47 296 124 -161 63 254 97 195 194 -84 -431 -197
7855 -197 -169 10 26 -253 66 -100 -312 121 -150 -270 -379 -67 -103 -94 227 21 44 -171 236 138 -16 50 219
7878 219 293 19 -11 -142 261 -316 -145 27 -51 14 12 -69 347 109 -192 -87 58 216 -84 294 -107 28
7900 28 27 51 -162 24 189 -91 120 125 32 279 -21 -42 7 -105 199 69 119 -11 145 -73 -151 -166 -135 309
7924 309 36 136 -233 -107 130 118 -80 -81 -80 -100 -54 -119 -29 -260 204 316 -184 -55 132 -28 30 -106 102
7947 102 -257 -10 -84 -67 -177 -67 119 -21 165 -136 -79 43 -158 77 203 -74 -83 -158 162 -99 -154 128
7969 128 133 176 102 -16 277 -146 -135 -151 215 -54 188 -38 -13 -294 123 -44 158 4 -242 -116 75 96 74
7992 74 14 165 -137 -43 -144 158 -355 -282 81 89 46 114 34 -343 128 -115 -108 -170 -148 -65 269 64 -167 -54 28
8017 28 201 58 -38 -178 174 -123 213 166 224 -70 25 -14 41 192 -75 142 -220 -162 128 101 248 -64 62
8040 62 -31 -25 -161 8 206 -260 -148 -71 230 155 81 81 -112 64 -29 35 19 93 -81 -81 138 -35 -95 -182 91 -187
8066 -187 75 -193 -188 78 -127 -3 -131 -122 -288 -34 86 -37 -205 -4 252 23 -177 207 97 145 71 -176
8088 -176 -29 -117 -172 44 309 8 -142 20 173 -35 -373 134 123 -16 -92 -24 284 -95 228 85 -2 183
8110 183 -266 -127 124 381 -50 -104 -266 34 -196 362 169 -161 -257 200 -67 -218 197 -165 -347 -195 70
8131 70 256 254 30 50 -49 53 -270 123 82 31 -177 324 -140 -92 -140 119 -177 -37 27 -265 21 187 183 16
8155 16 -83 82 -119 46 216 -142 142 -314 7 154 -142 354 -188 18 -74 -65 -200 -97 95 -6 125 366
8177 366 2 246 -42 -49 51 52 224 221 -112 -175 -31 41 -69 -127
8191a27
##END NTUPLES=NMR FID
##END=
