##TITLE=1H_Ser 3752-V
 DMSO-d6
 8 sc, 
 8.10.2024
##JCAMPDX= 6.0         $$ Bruker NMR JCAMP-DX V2.0
##DATA TYPE= NMR FID
##DATA CLASS= NTUPLES
##ORIGIN= UXNMR, Bruker Analytische Messtechnik GmbH
##OWNER= root
$$ XWIN-NMR		Version 3.5
$$ Tue Oct  8 16:11:34 2024 Russian Standard Time (UT+4h)  she@DPX200
##.OBSERVE FREQUENCY= 200.1318
##.OBSERVE NUCLEUS= ^1H
##.DELAY= (6, 6)
##.ACQUISITION MODE= SIMULTANEOUS
##.ACQUISITION SCHEME= undefined
##.AVERAGES= 8
##.DIGITISER RES= 18
##SPECTROMETER/DATA SYSTEM= spect
##.PULSE SEQUENCE= zg30
##.SOLVENT NAME= CDCl3
##.SHIFT REFERENCE= (INTERNAL, CDCl3, 0, 15.7039)
##AUDIT TRAIL= $$ (NUMBER, WHEN, WHO, WHERE, WHAT)
$$ ##TITLE= Audit trail, XWIN-NMR		Version 3.5
$$ ##JCAMPDX= 5.01
$$ ##ORIGIN= Bruker BioSpin GmbH
$$ ##OWNER= she
$$ F:/spectra/data/she/nmr/H-F/1/audita.txt
$$ ##AUDIT TRAIL=  $$ (NUMBER, WHEN, WHO, WHERE, WHAT)
(   1,<2024-10-08 16:09:41.09 +0400>,<she>,<DPX200>,
      <created by zg, POWCHK disabled, PULCHK disabled
       configuration hash MD5:
       00 E9 B6 7A A2 85 ED C7 34 08 36 98 17 FE 4E 26
       data hash MD5: 16K
       AA AE 8B F5 48 FA 24 1E 9C 96 DB DC B9 BE E2 E0>)
$$ ##END=
$$ 
$$ hash MD5
$$ 6C A3 E2 99 CE BE 3E 90 BB 4B C6 36 46 22 C2 74
##$RELAX= 
##$RELAX= 
##$RELAX= 
##$RELAX= 
##$RELAX= 
##$RELAX= 
$$ Bruker specific parameters
$$ --------------------------
##$DU= <F:/spectra>
##$EXPNO= 1
##$NAME= <H-F>
##$PROCNO= 1
##$TYPE= <nmr>
##$USER= <she>
##$AMP= (0..31)
100 100 100 100 100 100 100 100 100 100 100 100 100 100 100 100 100 100 
100 100 100 100 100 100 100 100 100 100 100 100 100 100 
##$AQSEQ= 0
##$AQ_mod= 1
##$AUNM= <au_zg>
##$AUTOPOS= <>
##$BF1= 200.13
##$BF2= 200.13
##$BF3= 200.13
##$BF4= 200.13
##$BF5= 200.13
##$BF6= 200.13
##$BF7= 200.13
##$BF8= 200.13
##$BYTORDA= 1
##$CFDGTYP= 0
##$CFRGTYP= 5
##$CHEMSTR= <none>
##$CNST= (0..31)
1 1 145 1 1 1 1 1 1 1 1 1 1 1 1 1 1 1 1 1 1 1 1 1 1 1 1 1 1 1 1 1 
##$CPDPRG= <>
##$CPDPRG1= <>
##$CPDPRG2= <>
##$CPDPRG3= <>
##$CPDPRG4= <mlev>
##$CPDPRG5= <mlev>
##$CPDPRG6= <mlev>
##$CPDPRG7= <mlev>
##$CPDPRG8= <mlev>
##$CPDPRGB= <>
##$CPDPRGT= <>
##$D= (0..31)
0 1.2 0 0 0 0 0 0 0 0.06 0 0.03 0 0 0 0 0.0002 0 0 0 0 0 0 0 0 0 0 0 0 
0 0 0 
##$DATE= 1728389380
##$DBL= (0..7)
120 120 120 120 120 120 120 120 
##$DBP= (0..7)
150 150 150 150 150 150 150 150 
##$DBP07= 0
##$DBPNAM0= <>
##$DBPNAM1= <>
##$DBPNAM2= <>
##$DBPNAM3= <>
##$DBPNAM4= <>
##$DBPNAM5= <>
##$DBPNAM6= <>
##$DBPNAM7= <>
##$DBPOAL= (0..7)
0.5 0.5 0.5 0.5 0.5 0.5 0.5 0.5 
##$DBPOFFS= (0..7)
0 0 0 0 0 0 0 0 
##$DE= 6
##$DECBNUC= <off>
##$DECIM= 24
##$DECNUC= <off>
##$DECSTAT= 4
##$DIGMOD= 1
##$DIGTYP= 9
##$DL= (0..7)
0 120 120 120 120 120 120 120 
##$DP= (0..7)
150 150 150 150 150 150 150 150 
##$DP07= 0
##$DPNAME0= <>
##$DPNAME1= <>
##$DPNAME2= <>
##$DPNAME3= <>
##$DPNAME4= <>
##$DPNAME5= <>
##$DPNAME6= <>
##$DPNAME7= <>
##$DPOAL= (0..7)
0.5 0.5 0.5 0.5 0.5 0.5 0.5 0.5 
##$DPOFFS= (0..7)
0 0 0 0 0 0 0 0 
##$DQDMODE= 0
##$DR= 18
##$DS= 0
##$DSLIST= <SSSSSSSSSSSSSSS>
$$ [...]
##$SUBNAM2= <"">
##$SUBNAM3= <"">
##$SUBNAM4= <"">
##$SUBNAM5= <"">
##$SUBNAM6= <"">
##$SUBNAM7= <"">
##$SUBNAM8= <"">
##$SUBNAM9= <"">
##$SW= 24.0689170037331
##$SWIBOX= (0..15)
0 0 2 0 0 0 0 0 0 0 0 0 0 0 0 0 
##$SW_h= 4816.95568400771
##$TD= 16384
##$TD0= 1
##$TE= 0
##$TE2= 300
##$TE3= 300
##$TEG= 300
##$TL= (0..7)
0 120 120 120 120 120 120 120 
##$TP= (0..7)
150 150 150 150 150 150 150 150 
##$TP07= 0
##$TPNAME0= <>
##$TPNAME1= <>
##$TPNAME2= <>
##$TPNAME3= <>
##$TPNAME4= <>
##$TPNAME5= <>
##$TPNAME6= <>
##$TPNAME7= <>
##$TPOAL= (0..7)
0.5 0.5 0.5 0.5 0.5 0.5 0.5 0.5 
##$TPOFFS= (0..7)
0 0 0 0 0 0 0 0 
##$TUNHIN= 0
##$TUNHOUT= 0
##$TUNXOUT= 0
##$USERA1= <user>
##$USERA2= <user>
##$USERA3= <user>
##$USERA4= <user>
##$USERA5= <user>
##$V9= 5
##$VALIST= <valist>
##$VCLIST= <CCCCCCCCCCCCCCC>
##$VD= 0
##$VDLIST= <DDDDDDDDDDDDDDD>
##$VPLIST= <PPPPPPPPPPPPPPP>
##$VTLIST= <TTTTTTTTTTTTTTT>
##$WBST= 1024
##$WBSW= 4
##$XGAIN= (0..3)
0 0 0 0 
##$XL= 0
##$YL= 0
##$YMAX_a= 554460
##$YMIN_a= -555791
##$ZGOPTNS= <>
##$ZL1= 120
##$ZL2= 120
##$ZL3= 120
##$ZL4= 120
##$ABSF1= 10
##$ABSF2= 0
##$ABSG= 5
##$ABSL= 3
##$ALPHA= 0
##$AQORDER= 0
##$ASSFAC= 0
##$ASSFACI= 0
##$ASSFACX= 0
##$ASSWID= 0
##$AUNMP= <proc_1d>
##$AZFE= 0.1
##$AZFW= 0.1
##$BCFW= 1
##$BC_mod= 2
##$BYTORDP= 1
##$COROFFS= 0
##$CY= 11.3945322036743
##$DATMOD= 1
##$DC= 2
##$DFILT= <>
##$DTYPP= 0
##$F1P= 15.6554695791079
##$F2P= 12.8336369535428
##$FCOR= 0.5
##$FTSIZE= 0
##$FT_mod= 4
##$GAMMA= 1
##$GB= 0.15
##$INTBC= 1
##$INTSCL= 1
##$ISEN= 128
##$LB= 0.24
##$LEV0= 0
##$LPBIN= 0
##$MAXI= 10000
##$MC2= 0
##$MEAN= 0
##$ME_mod= 0
##$MI= 1.114404
##$NCOEF= 0
##$NC_proc= 0
##$NLEV= 6
##$NOISF1= 3.799351
##$NOISF2= 2.8
##$NSP= 1
##$NTH_PI= 0
##$NZP= 0
##$OFFSET= 15.70392
##$PC= 1
##$PHC0= -26267.53
##$PHC1= 19.98743
##$PH_mod= 1
##$PKNL= yes
##$PPARMOD= 0
##$PSCAL= 0
##$PSIGN= 0
##$REVERSE= no
##$SF= 200.130013532006
##$SI= 16384
##$SIGF1= 3
##$SIGF2= 2
##$SINO= 400
##$SIOLD= 16384
##$SREGLST= <1H.CDCl3>
##$SSB= 0
##$STSI= 0
##$STSR= 0
##$SW_p= 3612.71676300578
##$SYMM= 0
##$S_DEV= 0
##$TDeff= 0
##$TDoff= 0
##$TI= <>
##$TILT= no
##$TM1= 0
##$TM2= 0
##$TOPLEV= 0
##$USERP1= <user>
##$USERP2= <user>
##$USERP3= <user>
##$USERP4= <user>
##$USERP5= <user>
##$WDW= 1
##$XDIM= 8192
##$YMAX_p= 0
##$YMIN_p= 0
$$ End of Bruker specific parameters
$$ ---------------------------------
##NTUPLES= NMR FID
##VAR_NAME=  TIME,          FID/REAL,        FID/IMAG
##SYMBOL=    X,             R,               I
##VAR_TYPE=  INDEPENDENT,   DEPENDENT,       DEPENDENT
##VAR_FORM=  AFFN,          ASDF,            ASDF
##VAR_DIM=   8192,          8192,            8192
##UNITS=     SECONDS,       ARBITRARY UNITS, ARBITRARY UNITS
##FACTOR=    0.0002076,     1,               1
##FIRST=     0,             0,               0
##LAST=      1.7004516,     0,               0
##MIN=       0,             -555791,         0
##MAX=       1.7004516,     554460,          0
$$ Real data points
##PAGE= N=1
##DATA TABLE= (X++(R..R)), XYDATA
0@%%%Qj6J6j6K4m0M8m8N6q0J04j20J44j76K16k56K95l43M04m75N43o16P12q21
27d37R27j043J184j342J508j684J883k108K351k613K899l221L575l957M378m848
43b548N371n948O592p322Q154r108J0207j1499J3050j4943J7307k0362K4498l0430
57a6981L9670n6119R3887l18491l5060Q47554m66856o15579N56416N10124p22552
68a83987k93717P67041J21498q11754J11659P54530k95502o78809M78314N34984
78E04257n96325l87651O93756K01686p32099j5873P35490j80681o76616L48953
88a05103N80048m95626m39234N99552K82019o66942j09707O85119o5198o60125
98c95197K38171N88340l88019m81612N06120L45697n84886j90462O24860K6365
$$ plain form
0 0 0 0 0 8 -8 8 -8 16 -24 24 -24 32 -48 56 -64 80 -96 120 -136 159 -184 220 -255 288 -328 384 -437
27 -437 490 -553 631 -711 797 -887 996 -1112 1239 -1374 1525 -1696 1879 -2078 2300 -2548
43 -2548 2823 -3125 3467 -3855 4299 -4809 5398 -6101 6949 -7994 9313 -11049 13449 -16981
57 -16981 22689 -33430 60457 -258034 -293094 554460 87604 -527975 28441 538565 -183987
68 -183987 -477704 289337 410835 -400919 -289260 465270 169768 -509041 -30727 504257
78 504257 -92068 -479719 214037 415723 -316376 -332249 403241 222560 -454056 -105103
88 -105103 474945 -20681 -459915 139637 421656 -245286 -354993 330126 264928 -395197
98 -395197 -157026 431314 43295 -438317 67803 413500 -171386 -361848 263012 289377
108B89377o23938J33740N83808k80888n05143M05728L92521n01953k56389N62118
118A98981J08740n81198L9285N61305j79983n08489L09285M25527m17202l13403
128c57152M92303J81263n30414m3255N33653r1981n04991K18760M44825l31295
138A1716l54745M20730K41048m77523j14117M99167j4333m88366J38043M47523
148C09143k51414l78361L45320K85441m13946j76232M53588N7700m62220O1958
158a69023M40762j73620l91672K70869L18766l48433k26495M03480J20533m32682
168a87515p685M30035j04004l95700K04464L37372k87648k61687L51142J70557
178B49331l91692o6690M06080m0619l91104J41115L47713k27105k84135K94809
$$ plain form
108 289377 -334561 -200821 382987 102099 -403044 2684 395205 -106748 -363137 198981
118 198981 307721 -273477 -234192 327113 147130 -361359 -52074 373453 -43749 -357152
128 -357152 135151 316414 -214000 -257255 276398 184417 -320574 -101814 343011 11716
138 11716 -343029 77701 318749 -158774 -272891 226276 211943 -276423 -138380 309143
148 309143 57729 -320632 24688 310129 -103817 -280049 173539 231239 -230981 -169023
158 -169023 271739 98119 -293553 -22684 296082 -52351 -278846 124634 245167 -187515
168 -187515 -195200 234835 130831 -264869 -60405 276967 -10681 -272368 78774 249331
178 249331 -142361 -209051 197029 156410 -234694 -93579 254134 27029 -257106 37703
188C7703K07652l44805j19353L74028K0660l76661P9268L50881j68393l00928
198b39948K41322K35812k97723j60503L37177P4110l55434K0692L46188j12418
208H9275l11538J89854K58966k51500j93286K99181J15817l28387k9271L33960
218A73071n8723l14826J39609K74042k07696k17043K60455J47812k96398p0498
228a70195L11883j0004l05403Q8878K79125j60406k34523K18568J75529k59968
238f6516j07521K84401L4656k91549L9803K78959j11725k47525J75395K00137
248A88515k25597j39686K58958P1631k74242j107K72281o8513k52851J33907K15919
259A79215j89837j64360K29972J02370k51987l6129K57692k9422k48909R2491
$$ plain form
188 37703 245355 -99450 -218803 155225 175885 -200776 -121508 229373 60980 -239948
198 -239948 1374 237186 -60537 -221040 116137 190247 -165187 -144495 201693 89275
208 89275 -222263 -32409 226557 -24943 -218229 80952 196769 -131618 -160889 173071
218 173071 114348 -200478 -60869 213173 5477 -211566 48889 196701 -99697 -170195
228 -170195 141688 131684 -173719 -84841 194284 33878 -200645 17923 193452 -66516
238 -66516 -174037 110364 145020 -146529 -106726 172233 60508 -187017 -11622 188515
248 188515 -37082 -176768 82190 153821 -120421 -121528 150753 82240 -170611 -36704 179215
259 179215 -10622 -174982 54990 157360 -94627 -130756 126936 97514 -151395 -58904
269e8904K24615j50023j83006J96349J28712k26831o9236K41276P890k41129N3568
280g6719K25629j11668j95033J61470J51325j98672r8212K21803M0450k30012
290a09639J8663K23082p5874k01391J26848J66877j68606j22397J98819O9939
300A26321k15581j3026K16840m3050k02590R4452J75972j38316j39541J72596
310C4077R4924j95689m3384K05239j1479j99950O2923J80981j07111j51864J43995
321A2662J14838j73037o9972J91374J9284j94976L2318J83432p9043j60200J18056
332e264J28879j50135r0640J73619M5015j84315M701J80373n1928j63877R2464
343b1108J38584j25420j06037J51414O6707j68679k2364J73123k3142j64458O5040
$$ plain form
269 -58904 165711 15688 -167318 29031 157743 -69088 -138324 102952 110842 -130287 -76719
280 -76719 148910 37242 -157791 3679 155004 -43668 -141880 79923 120373 -109639
290 -109639 -90976 132106 56232 -145159 -18311 148566 -20040 -142437 56382 126321
300 126321 -89260 -102286 114554 71504 -131086 -36634 139338 1022 -138519 34077
310 34077 129001 -66688 -110072 95167 83688 -116262 -53339 127642 20531 -131333 12662
321 12662 127500 -45537 -115509 75865 95149 -99827 -67509 115923 36880 -123320 -5264
332 -5264 123615 -26520 -117160 56459 101474 -82841 -78140 102233 50305 -113572 -21108
343 -21108 117476 -7944 -113981 37433 104140 -64539 -86903 86220 63078 -101380 -36340
354c6340J45618j00979j19134J30475Q5413j51717m5499J62812K894j62123L9017
365d9563J50187p7702j28813J10186R9336j34550o3666J49634K4467j55159J5615
376f0028J50409n4188j34675Q9196J09416j16724p8161J35035M3189j44428o039
387f6998J44887l1741j35847O6895J17223r6532r0635J18588N9246j31707k5573
398g2194J36946r201j34372M3862J22732p5830j01882J01593P3858j19561m2393
409g6442J29293R746j31125K4144J24456n7128j08447Q5329Q4681j05826n6190
420g7509J18683K5212j24458O854J21761l8388j10391O6560R1977q9196o8477
431g7372J05943M1014j15829j0598J17658k0013j11079M8115R7504p2695p8654
$$ plain form
354 -36340 109278 8299 -110835 19640 105053 -46664 -92163 70649 73543 -88580 -49563
365 -49563 100624 22922 -105891 4295 103631 -30919 -94585 55049 79516 -75643 -60028
376 -60028 90381 36193 -98482 -9286 100130 -16594 -94755 40280 83469 -60959 -66998
387 -66998 77889 46148 -89699 -22804 94419 -2113 -92748 25840 85086 -46621 -72194
398 -72194 64752 55551 -78821 -34959 87773 11943 -89939 11654 85512 -34049 -76442
409 -76442 52851 62597 -68528 -44384 80072 22944 -85503 -174 84507 -21319 -77509
420 -77509 41174 66386 -58072 -51218 70543 32155 -78236 -11676 80301 -8895 -77372
431 -77372 28571 69585 -46244 -56842 60816 40803 -70276 -22161 75343 2648 -76006
442g6006R2608N4602j06364k6171J12336l895j10054L2357J00518n7018q5008
453g2095P8111O4485r4886l9530J04947J1489j06809J6617J00675m2119q8703
464f7818O3870P2236q1810n1143R5307K5813j01489J420R9412k7176r0867M9446
476a2799P7751o8556o0305Q4091L8118r4242j2837R6794j2330r1802L5560Q1613
488F1056n6186o7106P3458M7976q5612k5052R1174P17r0403K2589Q3585m3750
500A2446p1477O1751N5127p5236l5293Q3522J3525q6158Q642Q3379k9974p5209
512e4955M9117O1791o4734m4696P5431K5345q1237m367Q2251j7225p7675L7657
524a3297O7239n4660n1879O7247L3836p5482j4584P8885n644p7014K5863O9508
$$ plain form
442 -76006 16602 71204 -35160 -61331 51005 47110 -62944 -30587 69931 12913 -72095
453 -72095 6016 70501 -24385 -63915 41032 52521 -54288 -37671 63004 20885 -67818
464 -67818 -3948 68288 -13522 -64665 30642 56455 -45034 -43614 55798 28622 -62245 -12799
476 -12799 64952 -3604 -63909 20182 58300 -35942 -48779 48015 35685 -56117 -20557 61056
488 61056 4870 -62236 11222 59198 -26414 -51466 39708 40425 -49978 -27389 56196 12446
500 12446 -59031 2720 57847 -17389 -52682 30840 44365 -41793 -33151 50228 20254 -54955
512 -54955 -5838 55953 -8781 -53477 21954 47299 -33938 -38305 43946 26721 -50954 -13297
524 -13297 53942 -718 -52597 14650 48486 -26996 -41580 37305 31661 -45353 -19490 50018
536E0018m4052n7008N8089M1436o7674k3849P3266N210p4333J3865P0183l2244
548A2907o1166M7923M8116n9558l2572O7026J5517p0725K695O9904k0873o3733
560d4539L7464N3361n0844m0262O0572K4716o6623p020O8220j1372o4925K7961
572a3291N7118m1847m5761N3266L1702o1609j5024O5215k392o3563J8530N7803
584D0147l2635m9161M4802L7470n4638k3072O0431P220o1380Q686N8213k3234
596A2849n2010L6230M2891m7261l0489N5295J5511n9065M1N8177j4950n3547K8516
609g812M5938m0073l5653M9335K2496n4962p469N6118p135n3314K0333M7690l2372
622C120l9565M2554K8402m9614j5055N2965J056n2779J2388M9354k4580m2747
$$ plain form
536 50018 5966 -51042 7047 48483 -19191 -43040 30226 35436 -38897 -25032 45151 12907
548 12907 -48259 -336 47780 -11778 -44350 22676 38193 -32532 -29837 40067 19194 -44539
560 -44539 -7075 46286 -4558 -44820 15752 40468 -26155 -33175 35045 23673 -41252 -13291
572 -13291 43827 1980 -43781 9485 41187 -20422 -35446 29769 27377 -36186 -17656 40147
584 40147 7512 -41649 3153 40623 -14015 -37087 23344 30564 -30816 -22130 36083 12849
596 12849 -39161 -2931 39960 -7301 -37790 17505 33016 -26049 -26008 32169 17219 -36328 -7812
609 -7812 38126 -1947 -37600 11735 34231 -20731 -28200 27918 20783 -32531 -12198 35492 3120
622 3120 -36445 6109 34511 -15103 -30158 22807 23863 -28916 -16528 32826 8246 -34501
634c4501L5631L3096m4239k1319M9295Q485n1041M531M9664j7425m4818K9055
646c586L6625l8256k6295M4833J4836m8234k539M8440j0271m5415K2311L9326
658C1775l2377l0502L9383K0110m4013q830M6292l086m5313J4979M0914k5421
670C911l3968L3859K5134l9823j5015M3454L781m4609P969M2378j9182l6768K8489
683c90K9083l5536j9863M0497R155m2744K276M1973j3237l8024K2714L1416l0455
696c135k3265L6159J4100l9734l788M0364o855l7919J6575L3342k4661k7065L1427
709E545J9013l6388r508L8660p57l8058J0644L4799j9255k9782K6675K3015l2775
722h172j4262L6651M376l7165N285L5073j4120l1466K2057K5974k8753j8178L3193
$$ plain form
634 -34501 1130 34226 -10013 -31332 17963 26448 -24593 -20062 29602 12177 -32641 -3586
646 -3586 33039 -5217 -31512 13321 28157 -20077 -22616 25824 15553 -29862 -7551 31775
658 31775 -602 -31104 8279 28389 -15624 -24454 21838 18752 -26561 -11582 29332 3911
670 3911 -30057 3802 28936 -10887 -25902 17552 21333 -23276 -15307 27071 7889 -28879 -390
683 -390 28693 -6843 -26706 13791 22946 -19798 -17522 24451 11214 -26810 -4096 27320 -3135
696 -3135 -26400 9759 23859 -15875 -19663 20701 13846 -24073 -7498 25844 1183 -25882 5545
709 5545 24558 -11830 -21338 17322 16565 -21493 -10849 23950 4695 -25087 1588 24603 -8172
722 -8172 -22434 14217 18593 -18572 -13287 21786 7666 -23800 -1743 24231 -4522 -22700 10493
735A0493Q965l5190M03L4744q968l2086J6839K7634k3956k1256K9477J3263l2601
748a2239m791L3422l626l2220J1589K9058j8982k4023K5316J7510k9854r616L2004
761A3548J185l1925O967L0058j4621k6196K1336K0285k6684j3024K9795N383l0730
774a4623K486K9695j0163k6896J7253K2359k2821j6244K6466R318k8562k208K9196
787A5256n421k7806J2838K4124j8805j9026K3360J3020k6609o078K8353j355k7893
800a6042Q614K5188j5138k0862K0244J5540k3992r446K6345K530k6891M688K5359
813A6137j1105k2112J6547J7719k0931j2366K3984O179k5511N37K5101p154k2947
826a5922J2898J9426j7554j5001K1486R559k3953l171K4510l366k3355R376K0744
$$ plain form
735 10493 19458 -15732 -15329 19415 10447 -21639 -4800 22834 -1122 -22378 7099 20362 -12239
748 -12239 -17030 16392 12766 -19454 -7865 21193 2211 -21812 3504 21014 -8840 -18456 13548
761 13548 14733 -17192 -10225 19833 5212 -20984 352 20637 -6047 -19071 10724 16107 -14623
774 -14623 -12137 17558 7395 -19501 -2248 20111 -2710 -18954 7512 16830 -11732 -13940 15256
787 15256 9835 -17971 -5133 18991 186 -18840 4520 17540 -9069 -15147 13206 11851 -16042
800 -16042 -7428 17760 2622 -18240 2004 17544 -6448 -15894 10451 12981 -13910 -9222 16137
813 16137 5032 -17080 -533 17186 -3745 -16111 7873 14052 -11459 -10922 14179 7025 -15922
826 -15922 -3024 16402 -1152 -16153 5333 14892 -9061 -12232 12278 8912 -14443 -5067 15677
839A5677j4509j7047J8714J2127k1967o178K3591j91k3047O173K1027j1307j8144
852a5081J5890J4018j9447q715K1567K900k2051K613K0971p749j8801J2464J5744
865A4323j6538j1545J9567O229k0844p23K0810m399j9754R307J7338j4027j3489
878a3745J7526Q802j9622l543K0179j643j9600O655J7920j1211j4897J5094J0672
891A2587j7676n969J8832J260j9045L608J8063q344j5792J2262J2480j5304q321
904a1359J7366L900j8211O57J7902n230j6561R614J3910j3175j0382J5576O405
917A0412j7190j983J7725k538j6979P064J4953j0940j1931J3774Q303j5691m304
930i325J6846j61j6862M634J5314q457j2825J1527R958j3928o487J5598K389j6149
$$ plain form
839 15677 1168 -15879 2835 14962 -7005 -13183 10408 10217 -12830 -6657 14370 3063 -15081
852 -15081 809 14827 -4620 -13335 8232 11132 -10919 -8306 12665 4916 -13885 -1421 14323
865 14323 -2215 -13760 5807 12036 -8808 -9531 11279 6880 -12874 -3567 13771 -256 -13745
878 -13745 3781 12583 -7039 -10582 9597 7954 -11646 -4991 12929 1718 -13179 1915 12587
891 12587 -5089 -11058 7774 9034 -10011 -6403 11660 3316 -12476 -214 12266 -3038 -11359
904 -11359 6007 9907 -8304 -7647 10255 5025 -11536 -1922 11988 -1187 -11569 4007 10412
917 10412 -6778 -8761 8964 6426 -10553 -3489 11464 524 -11407 2367 10670 -5021 -9325
930 -9325 7521 7360 -9502 -4868 10446 1989 -10836 691 10649 -3279 -9766 5832 8221 -7928
944g928J940J5465n878j3834R208J1441j2095q416J4361M706j5611m07J5451l617
958D786j4339P213J2437j0242r787J2808O322j4444k544J4935j419j4252N036
971c490J2810q156j0804J0854Q086j2975m560J4162P49j4092K711J3251n983j1806
985i243R030R511j1581o387J3211K754j3759P95J3411l991j2368P194J0518j0104
999a009p734J2026M494j2947j155J3127k251j2540N414J1080q230q837J0608N912
1013G958j1938k795J2376k58j2264L358J1440o378r716Q814P331j0656m559J1756
1027D469J639j2112J494J1762m599j0589P397Q547r465n963J0909L042j1706q4
1041e259J1746l020j0812N876R091q117o938R762M403j0760j602J1195j334j0771
$$ plain form
944 -7928 -5988 9477 3599 -10235 -1027 10414 -1681 -10097 4264 8970 -6641 -7048 8403 4786
958 4786 -9553 -2340 10097 -145 -9932 2876 9198 -5246 -7790 7145 5726 -8526 -3490
971 -3490 9320 1164 -9640 1214 9300 -3675 -8235 5927 6676 -7416 -4705 8546 2563 -9243
985 -9243 -213 9298 -2283 -8670 4541 7295 -6464 -5669 7742 3751 -8617 -1423 9095 -1009
999 -1009 -8743 3283 7777 -5170 -6325 6802 4551 -7989 -2575 8505 275 -8562 2046 7958
1013 7958 -3980 -6775 5601 5343 -6921 -3563 7877 1499 -8217 597 7928 -2728 -7287 4469
1027 4469 6108 -6004 -4510 7252 2653 -7936 -539 8008 -1457 -7420 3489 6531 -5175 -5259
1041 -5259 6487 3467 -7345 -1469 7622 -495 -7433 2329 6732 -4028 -5630 5565 4231 -6540
1055f540M065R544o484p786Q357N730r806l244J0618M85j0716K384R991m895q566
1070f863P006O755q753m631R988K014j0502R12J0074l561r044N728P610p564n663
1085f494R113L203r916n05R837k029r203M248Q140o258o520P924M374r100j930
1100e116R527n05r140K690Q506m921p295O829N501q254l245R021Q65r221J449
1115c309Q779l678p715N633O348p389m298Q453J951q687K27Q574k351p985M347
1130a100O830o173n173P463L186q119j099Q273r34q072K986P458n005o042O554
1145A033M183p575k253Q073K62q172J886P699l946o575N585M992o829l106P588
1160B845J281p953Q16P578k764o824M519N567n877m048O817K336p421l99P489
$$ plain form
1055 -6540 -2475 7069 585 -7201 1156 6886 -2920 -6164 4454 4939 -5777 -3393 6598 1703 -6863
1070 -6863 143 6898 -1855 -6486 3502 5516 -4986 -4074 6000 2439 -6605 -877 6733 -831 -6494
1085 -6494 2619 5822 -4094 -4599 5238 3209 -5994 -1746 6394 136 -6384 1540 5914 -3186 -5116
1100 -5116 4411 3906 -5234 -2544 5962 1041 -6254 575 6076 -2178 -5423 3598 4463 -4758 -3309
1115 -3309 5470 1792 -5923 -290 6058 -1331 -5629 2824 4775 -3912 -3685 4889 2538 -5447 -1100
1130 -1100 5730 -443 -5616 1847 5033 -3086 -4185 4088 3154 -4918 -1932 5526 521 -5521 1033
1145 1033 5216 -2359 -4612 3461 3723 -4449 -2563 5136 1190 -5385 200 5192 -1637 -4743 2845
1160 2845 4126 -3827 -3011 4567 1803 -5021 -502 5065 -812 -4860 1957 4293 -3128 -3527 3962
1175C962j521p019L380O072m839m843N989L335o814j614P265l51p187K262O529
1190D606l909n425N220M141o278k502O927O29p055J301O656l010n791M292M669
1205D471n471l257O374J538o685K11O491j852n891L220N169m559l968N586K509
1220C886o297q84O414p80o036K255N546l658m702M963L310n807j684O196O5o083
1236c296J398N721k913m992M211L863n157k447N692R04n826N69N708j967n210
1251c742L259M413m491l105N132J777n542l72N647j069n398K421M750l652l702
1266c674M649K457n210j177N450j74n459J640N017k974m168M063K998m753j786
1281c101N149N43n273Q45N052k208m425L316L519m163k439M655J359n073j4N044
$$ plain form
1175 3962 2441 -4578 -1198 4874 35 -4808 1181 4516 -2298 -3912 3353 3002 -4185 -1923 4606
1190 4606 697 -4728 492 4633 -1645 -4147 2780 3409 -3646 -2345 4311 1301 -4490 -198 4471
1205 4471 -1000 -4257 2117 3655 -3030 -2819 3672 1820 -4071 -851 4318 -241 -4209 1377 3886
1220 3886 -2411 -3295 3119 2339 -3697 -1442 4104 446 -4256 707 4017 -1790 -3474 2722 2787 -3296
1236 -3296 -1898 3823 910 -4082 129 3992 -1165 -3612 2080 2984 -2842 -2273 3435 1468 -3742
1251 -3742 -483 3930 -561 -3666 1466 3243 -2299 -2671 2976 1907 -3491 -1070 3680 28 -3674
1266 -3674 975 3432 -1778 -2955 2495 2321 -3138 -1498 3519 545 -3623 440 3438 -1315 -3101
1281 -3101 2048 2591 -2682 -1837 3215 1007 -3418 -102 3417 -746 -3185 1470 2829 -2244 -2258 2786
1297B786j356m625K568L978l517l090M249K025m854o33M989o45m813J862M245
1312C169k938l454L812K494m488j245M721%m711J231M327k219l741L148K950l922
1328h66j939M385P49m538M31M373j510l976K450L402l321k543M087J441m422k60
1344b057M373q83m114J869L711k826l026L666J999m130q79M305k61m162J285L858
1360B728k246l313L135K419l726j400M012L69m052N75L900j541l521K481K877
1375B697l259j935L702R77l879j02L982r37l719J917L168k789k383L356J530l700
1391a374o12L850m22l714J421L335k255k736K938J947l372j104L609J75l665Q27
1407a152L434j728k953K412K365k969j577L377P06l578J49L578j121l212J935
$$ plain form
1297 2786 1430 -3195 -627 3351 -166 -3256 993 3018 -1836 -2469 2520 1875 -2938 -1076 3169
1312 3169 231 -3223 589 3083 -1405 -2650 2071 2071 -2640 -1409 2918 699 -3042 106 3056 -866
1328 -866 -2805 1580 2329 -2209 -1778 2595 1085 -2891 -441 2961 -360 -2903 1184 2625 -1797 -2057
1344 -2057 2316 1433 -2681 -812 2899 73 -2953 713 2712 -1418 -2297 2008 1747 -2415 -1130 2728
1360 2728 482 -2831 304 2723 -1003 -2403 1609 1978 -2074 -1499 2401 860 -2661 -180 2697
1375 2697 -562 -2497 1205 2182 -1697 -1799 2183 1246 -2473 -556 2612 -177 -2560 796 2326 -1374
1391 -1374 -1986 1864 1442 -2272 -851 2484 229 -2507 431 2378 -994 -2098 1511 1686 -1979 -1152
1407 -1152 2282 554 -2399 13 2378 -591 -2168 1209 1915 -1663 -1514 2064 943 -2269 -334
1422c34K645k589j946L025J208l391k86L470o02l295J479K849k188k283K741J608
1438B111l146p77L315r9l272R43K943j605k549K320J952k798j272L080M54l186
1454a586M04L040j126k797J835K309k441j673K871R61l125p6L078o85k910J437
1470d84K533k070j964K559J233k830n25K942k64k830R59K624j607k207K166J604
1486A839k585q60K740K21k765M14K670j114k434J805J921k294j266K576O44k753
1502a241N9K741p44k556J455K130k025j568K352R25k513l21K666l93k574J081
1518e26K173j586j761K057J227k325o17K449Nk475O18K346j225j974J680J513
1534A579k049j016K319M66k506K74K358q45k145J423J704j801j280K159O95k334
$$ plain form
1422 -334 2311 -278 -2224 801 2009 -1382 -1668 1802 1200 -2095 -616 2233 45 -2238 503 2111
1438 2111 -1035 -1812 1503 1404 -1868 -925 2018 413 -2136 184 2136 -662 -1934 1146 1600 -1586
1454 -1586 -1182 1858 732 -2065 -230 2079 -362 -2035 836 1797 -1328 -1404 1674 989 -1921 -484
1470 -484 2049 -21 -1985 574 1807 -1023 -1548 1394 1130 -1700 -741 1883 276 -1931 235 1839
1486 1839 -746 -1606 1134 1355 -1410 -996 1674 560 -1874 -69 1852 -442 -1708 868 1512 -1241
1502 -1241 -1182 1559 815 -1741 -286 1844 -181 -1749 603 1528 -985 -1306 1360 967 -1607 -526
1518 -526 1647 61 -1700 357 1584 -741 -1358 1091 1096 -1379 -761 1585 360 -1614 66 1579
1534 1579 -470 -1486 833 1299 -1207 -933 1425 580 -1565 -142 1562 -239 -1519 640 1335 -999
1550i99j30K389n39k182J105J860j503j495J916R50k108m61K241j55k150O85J981
1567A405j165j697J618J230j922p36K131J85k162L82K005q25j850J346J488j750
1583c17j003J991M82k120O8K062o22j862J078J590j454j226J811P14j944j90J883
1600I41k20j866P18J684j160j408J567R57j756n25J909M3j890L91J830r02j612
1617a299J353J157j598p21J749L09j834J42J812o22j644J078J343j429r13J628
1633E11N07j731o0J730l76j656Q27J381j153j105J393P78j578l72J689q3j654
1650i52N21J508r21j273J241R21j420o35J686J23j695L15J596p40j351J057J088
1667A069j318p42J494L47j579Q1J551n15j389Q47J174j102q60J327N18j491j62
$$ plain form
1550 -999 -1129 1260 721 -1461 -356 1504 1 -1494 422 1372 -736 -1197 1044 889 -1261 -576 1405
1567 1405 240 -1457 161 1391 -531 -1267 864 1049 -1113 -731 1274 449 -1401 -55 1433 -317
1583 -317 -1320 671 1153 -967 -899 1163 541 -1321 -243 1347 -107 -1333 478 1192 -752 -942 941
1600 941 721 -1145 -427 1257 97 -1311 256 1213 -543 -1068 841 884 -1006 -615 1215 313 -1299
1617 -1299 54 1211 -387 -1108 641 950 -884 -742 1070 448 -1196 -118 1225 -204 -1117 511
1633 511 1018 -713 -773 957 581 -1075 -248 1133 -20 -1125 268 1046 -532 -904 785 702 -952
1650 -952 -431 1077 156 -1117 124 1045 -375 -1010 676 799 -896 -581 1015 275 -1076 -19 1069
1667 1069 -249 -991 503 850 -729 -648 903 388 -1001 -154 1020 -82 -942 385 903 -588 -750
1684g50J518k07j440N83J260r13j021J128P75j350m24J495Rj463L56J346o87j197
1702i82J022R17j273n35J390K05j454J68J378n27j223Q18J011j077p16J249L86
1719G57j287q5J334k81j273O09J108q81q76J108N55j256j95J293r3j273L96J214
1737H74p42j001R67P07j146m21J272J24j314K59J193n34j069Q39Q15j033n52J187
1755D25K23j190K4J249l92j107O67Q88q71o76J025L99j092j68J214k41j077M77
1773b23R95p55p72R21N53j053k83J164n1j115K83J044n93q29P57O76j004l59J057
1792D13J39j114J77J049m38r08O48P30p95n81R89L13j126O4R80k20r56N00Q29
1811F93o94o81Q69M49j028j37J043j08r96L44Q99n81p82P74N68r10l16J028L1
$$ plain form
1684 -750 768 561 -879 -296 964 51 -970 158 933 -417 -841 654 663 -800 -444 902 215 -982
1702 -982 40 957 -316 -851 539 744 -710 -542 836 309 -914 -96 915 -162 -878 371 757
1719 757 -530 -615 719 438 -835 -226 882 1 -875 233 788 -468 -663 630 537 -736 -340 874
1737 874 132 -869 98 805 -341 -762 510 634 -680 -421 772 238 -831 8 823 -210 -762 425
1755 425 648 -542 -518 731 339 -768 -101 787 -84 -760 265 664 -428 -596 618 377 -700 -223
1773 -223 772 17 -755 166 719 -334 -617 547 496 -619 -336 708 115 -714 43 719 -285 -644 413
1792 413 552 -562 -385 664 226 -682 -34 696 -99 -680 309 622 -504 -440 540 320 -636 -136 693
1811 693 -1 -682 187 636 -392 -529 514 406 -590 -246 653 72 -710 64 632 -278 -594 434 465
1830D65j008K25R18m46p82O45O25q20m29R12J80r06M8Q86k61q48M94P15o64n66
1850f17Q23L57r03j18R34j52q80L68Q03o22o32Q11L59q16k35R26n5q59K48Q26
1870E66m82o86O61N15p48l55Q24J48q81J15Q46l50p24N44N67o69m26P63K67q42
1890c47l1Q60k07p99M14O60n95m99O93L63p76j68Q40o7p93K47P46m89n70O31L98
1911E11p17k43P75L7p65J39P31l59n97M91M99o21l19O94J23p22L8P06k03o68L91
1932g9N96n60m49O71K47p57nP15j12p24L42O04m47m97N71L37o95j39O69J1o54
1953c55J70O15l25n36M86M25o21k34O31Q1o44O1O48k45n96M12M76n01l68O12J81
1974C73o36k6O66j79o24L34N37m64l86N37K66o09j41O66p3o34K26N50l35m74M92
$$ plain form
1830 465 -543 -318 600 154 -628 17 642 -178 -607 305 485 -421 -373 513 252 -596 -102 613 -51 -617
1850 -617 206 563 -340 -458 476 324 -556 -188 615 -7 -639 172 531 -285 -520 406 351 -508 -260 566
1870 566 84 -602 59 574 -174 -529 295 443 -438 -323 523 173 -551 -7 560 -109 -535 228 495 -347
1890 -347 -378 482 275 -524 -110 550 -45 -544 149 512 -264 -432 408 341 -452 -205 541 52 -518 113 511
1911 511 -206 -449 326 363 -402 -263 468 109 -488 3 502 -119 -438 256 379 -343 -305 401 198 -470 -79
1932 -79 517 -43 -492 179 426 -331 -336 379 267 -457 -115 489 42 -455 116 453 -242 -381 288 299 -355
1953 -355 -185 430 105 -431 55 480 -141 -375 256 337 -307 -246 402 157 -439 -27 449 -52 -420 192 373
1974 373 -263 -289 377 198 -426 -92 445 -19 -405 132 398 -211 -352 314 241 -393 -167 383 48 -426 66
1995F6L07n34j62N80L1n90Q6O03l19m64L90L94m81k20N35J23o01K8N84k29n21
2016c94L82L71m24l01N02K07n80n4O15j36n48K62M78l70l64M06K81m98j20N50
2036B65k4n40J52M77k95l73L32L76m77j76M52J00n33N3N30k22m14K90L45l78k78
2057c38N01J18n13ON12j09m89K38L78k99l27M39J73m70o1M70l2m56J32M45k67
2078E1m04L74L08m27j65M55J6m41L9M85k26l65L02L24l96k40M63Q0m39MM63j25
2100A36m16K26L47l27k56L86J46l62r4M33m5m42J79L77k75k84L11K07l62j04M14
2121A95J0m10O3M38k25l39K87K83l83j64M23Q4m38L5L67j43l54K44K84l02j97
2142b42L63J17m23qM18j16l34J67K99k54k50K96K09l61r6L78l9l37J13L59k14
$$ plain form
1995 66 373 -161 -323 257 288 -302 -216 387 68 -396 -6 388 -93 -313 222 345 -256 -228 356 127 -394
2016 -394 -12 359 -65 -366 136 343 -237 -291 324 188 -360 -98 380 10 -354 52 333 -165 -285 265
2036 265 241 -299 -147 330 35 -338 -6 370 -107 -283 169 269 -264 -211 319 97 -317 -27 318 -60 -338
2057 -338 163 281 -232 -226 286 177 -312 -74 304 5 -322 117 290 -180 -241 229 197 -259 -127 318 51
2078 51 -353 21 329 -98 -263 192 208 -233 -194 291 65 -300 2 326 -70 -310 153 233 -206 -202 261 136
2100 136 -280 -54 293 -34 -290 96 242 -120 -214 219 174 -268 -89 288 13 -271 40 247 -115 -219 195
2121 195 205 -205 -142 296 71 -268 19 302 -81 -245 178 262 -176 -141 226 83 -271 -27 257 -45 -242
2142 -242 121 238 -185 -193 225 109 -225 -58 241 -13 -263 33 242 -119 -215 163 124 -213 -100 259 45
2163D5k79K22K60l15j48L69J4l30K4L74j69l01K11K69k92j43L09P3l75N0L19p6
2185A11l17J68K74k41k23L15P3k80l2L13k2l33J43K62j65k47K56K00l41r9L35
2206A50J1l28O6L42j77k92K18K17k69j50L08R5l45%L26n9l18J62K24k13j75K42
2228C5J74l40k6L04k5l11J09K81k25j62K44J36k78o3K77K0l19P1L13j82k23K31
2250D1J41k26j20K25M5k82P1L06j24k69J88J70j97j58K34J30k98l4L12o6k87J20
2272g8K42j23k06J79J67k85o8K86k3k32M3K45j12k20J97J59k32j19K73L0k27J6
2294h8K40p7k33J26K06j86j63K57J14l45L1K61o9k12Q9K00j39j93K12J37k68n6
2316a56K57j8j94J1K54j16k38K03J73k26r2K71k1k38N1K47j08k17J19K15j87j50
$$ plain form
2163 45 -234 -12 248 -67 -215 154 168 -162 -138 236 67 -234 -23 246 -46 -189 120 193 -182 -132 187 111
2185 111 -206 -38 236 -5 -228 87 160 -120 -152 161 139 -194 -51 211 46 -201 55 255 -86 -185 150
2206 150 161 -167 -101 241 64 -228 -10 207 -62 -212 96 191 -154 -154 172 113 -205 -43 181 -32 -207 35
2228 35 209 -131 -157 147 122 -189 -80 201 -24 -186 58 194 -84 -147 130 150 -169 -98 215 33 -190 41
2250 41 182 -44 -164 61 106 -176 -105 201 77 -192 -4 166 -31 -189 45 175 -123 -157 155 89 -198 -78
2272 -78 164 41 -165 14 181 -104 -172 114 91 -141 -98 147 35 -185 12 171 -61 -180 93 123 -104 -88
2294 -88 152 75 -158 -32 174 -12 -175 82 196 -149 -118 143 74 -138 -49 151 12 -181 31 168 -100 -156
2316 -156 101 83 -111 -100 154 38 -200 3 176 -50 -142 129 108 -130 -79 168 60 -157 -38 177 -10 -160
2338a60K16R0k48j1K46p1j99J02J80j38j35J59J44k46p2K66l5k12M4K34j44j38
2360a28J63R8j78q4K35qj97L6J88q9j72J59J22j63j23J81R3k44LK12l3j89R4J74
2384A50j66j59K22Q4k08k8J86j6j57M7J64r4j30J43R7j49q5J78J0k02N2J72p4
2407C7j42J13J18j63q3J83N1k22oK43p3j77Q9J72j41j48J86O4j83l3J88Mk02P6
2431d9J85j33j61J95O3j46n3J65Mj37OJ55o3j71J56J17j57r1J96L3j85j4J82m7
2455E0j64J05J49j51p6J58L9k04K3J72l6j90P1J52j01q5R9P5j22n7J49M0j92P2
2479b4J34r5j29J08J20j67o9J94j5j39J6J74p5j82J59J10j19p9J15O1j58j7J54
2502G7k4j49P4J14q1j01J25N5j29j4J52l5j44J6J67p6j27J01J10r6j06J26L2j65
$$ plain form
2338 -160 56 146 -102 -113 133 62 -137 -35 145 7 -128 31 175 -71 -143 123 88 -124 -80 154 10 -128
2360 -128 35 133 -45 -129 106 98 -99 -63 125 36 -136 23 145 -18 -141 40 133 -111 -108 104 71 -118 -24 150
2384 150 -16 -175 47 131 -77 -105 81 65 -92 -45 119 25 -105 38 135 -14 -99 79 89 -113 -61 111 37
2407 37 -105 8 126 -37 -120 63 114 -108 -114 129 56 -121 -32 140 -1 -149 37 101 -82 -115 73 77 -125 -49
2431 -49 136 3 -158 37 100 -46 -99 66 70 -67 -61 94 31 -140 16 133 -24 -115 81 114 -71 -85 97 50
2455 50 -114 -9 140 -11 -87 71 110 -94 -71 101 65 -125 -54 98 -3 -88 11 86 -36 -93 56 96 -96 -24
2479 -24 110 15 -114 -6 114 -53 -122 72 57 -82 -66 108 33 -149 10 120 1 -78 37 98 -60 -77 77
2502 77 53 -96 -22 92 11 -90 35 90 -39 -53 99 64 -80 -64 103 27 -100 1 111 15 -91 35 67 -98
2526i8L6J39p3o6N5J02j12p6J21M1j36J0J40n9p2L7Q8o5r9J32M2j34RQ6L2j76
2552i6J2J88q6j05Q5R8j16p9J54K1j64M4J23m2j61J08R2q5n3Q8P2j67L9J23l7
2577E6j04M1J04p1j24J23O7j24l7J42j7j28K9J35p0j27J43K8j15j6J06rq6N1P4
2602G1n1q9O5R2r6m6Q4J9r9JR2k2j14P1J17j07n5Q0M4j04j2J16k6o3L8O0o4q0
2630g8P6P3j13PJ19Nj32RJ10m3r3P5O8j06n8J04M4j46M1Q7Jj02M6P9q1o0R8M4
2658G4j35J3J27m4p5L7O4p5l4O5P0r8l8Q4K2j32L4J06q4l8P8P3j04n7P4P0j26
2685d9J8J13p0p7K5P2m4n7J32Oj47O5O5m5n8L3O6l6r2J09K3j08RQ1qm6j1R2n0
2714A1n6M0M4n0n4J16j2j03K4J16p5m9L0P6q6l6Q8K7n4j0O8m6p0Q6N4p7q6Q1N6
$$ plain form
2526 -98 -62 77 4 -62 -7 95 -17 -93 28 69 -67 -57 83 24 -48 -11 77 12 -87 45 87 -47 -38 48 80 -96
2552 -96 -84 104 18 -87 -2 96 -20 -99 55 76 -88 -44 79 37 -124 -16 76 -9 -62 26 98 -69 -30 93 56
2577 56 -48 -7 97 26 -98 25 92 -32 -69 73 56 -72 -43 92 22 -105 38 66 -49 -65 41 32 -54 -3 71
2602 71 20 -69 -4 88 -8 -54 30 49 -50 -49 43 21 -93 -22 95 -12 -67 13 57 -47 -59 57 31 -32 6 66 2 -78
2630 -78 -2 71 -42 -35 84 89 -43 -34 76 33 -60 15 83 -23 -81 23 67 -79 -38 49 50 -52 -6 73 -8 -68 30 74
2658 74 -61 -48 79 35 -40 -3 61 -14 -48 17 87 -11 -49 35 57 -75 -41 65 -19 -57 21 94 -10 -67 7 77 -49
2685 -49 -31 82 12 -65 -40 32 -12 -69 63 69 -78 -13 52 7 -51 -18 48 12 -80 29 52 -56 -47 34 26 -20 -31 61 11
2714 11 -45 -5 39 -11 -65 51 39 -64 -40 76 1 -48 -18 58 -28 -64 24 51 -3 -13 55 9 -61 25 79 2 -84 -3 53
2743E3n8m3R4j3p9K9Q7p4p3J00N7j07j9P8K3r4J1P3j1j22Q8N4r1k0Q5Jp6K8P9
2772F0l1n8L6O2p7k8N9kn8J4O5mn7OQ5p7n0P2L7m7m5Q4qp2oQ8l5o0N4M4n4k2O9
2805D4j5p3j6J11rq5P4K6o8n1P4Oq4N3N2m0n5N0P5n7l8J9L9r2M0Q4m2m6JO3n2
2836a2j2N0L4j00QO0J7q4PQ4o0j8O6L1n6n6P7Qr5L5O2j1o2K5O3o2k0P2l8l0j1
2867b8N2oo7O3L9p4j2L2K9l8l8P0pl1JN0rq3P4Ml1n6R4Po0K8J3j8m1L9K2k5l2
2900c9P9k4l0k5O1mo2M4J0l1l2P9J8j02M0N4no6L1L7k4l9K5N5q0QL5J6o3K9L3
2931B8j8n7K4K9m8pQ3l4j9OL3J2j3n6N7k0pK6L1n9k0N3pn7M9N3o8j8J5O0p6J6
2963iO1m4m9M6O0p9j9J9M8l2pMN2n7nM0l3l4L6N4n0j8LM1p8J1R4m6j3J0K3l5k1
$$ plain form
2743 53 -5 -48 46 33 -46 -17 70 -4 -77 23 80 -27 -46 32 55 -39 -28 45 34 -88 0 54 -37 -57 28 29 -47 -19 60
2772 60 29 -29 7 69 -8 -36 23 21 -37 -23 42 38 -19 -13 72 -5 -55 17 54 7 -38 46 38 -34 -40 48 13 -47 7 51 -3 -25 44
2805 44 29 -44 -60 51 42 -43 31 57 -11 -62 12 18 -66 -13 39 -1 -56 -6 69 12 -26 -7 32 -60 -20 64 22 -24 -23 40 -12
2836 -12 -24 26 60 -40 -32 28 45 -39 -32 52 -8 -26 40 71 15 -41 36 44 -51 -16 46 35 -27 -2 61 -1 -21 51 13 -17 -28
2867 -28 24 18 -49 14 53 -21 -33 -1 28 -10 -48 22 15 -16 -15 35 26 -57 17 21 -10 -66 28 35 -25 3 16 -2 -43 -4 18 -7 -39
2900 -39 40 16 -14 -39 22 18 -44 0 10 -21 -53 26 44 -58 -18 36 31 -35 -4 33 9 -30 -5 50 -30 -22 13 29 -34 -5 28
2931 28 10 -47 -23 6 -42 -49 34 0 -19 -13 20 32 19 -37 20 0 -7 19 50 -9 -29 24 17 -40 9 62 -6 -24 -9 51 -25 -9
2963 -9 52 8 -41 5 65 -14 -33 -14 34 2 -5 -1 51 -6 -11 29 -4 -38 -2 52 2 -16 -13 28 -50 -39 55 9 -4 6 29 -6 -27
2996b7L6%n9L1M5km0qP8j4n4L5K0l6l0N6jo5PR1l7m9M7K1p2JP2l4k3j1L6Ko4M3
3030eN5o8j5M8M8p7l0N9j3j2J5K8k9n0N5L2n2l1P2Mm9kL7m0j7M7J0Lp8Q0nj5l6
3063c1P0l2k8N6jk9l2N1J9m0l1K4J6m1KM6l0j6K0L9o4J3M4l5j4M1K4m0n4O4K1
3094C2m7j7J1M9o8K4M5k9m6L1L8p1K3P9k8q3K9N0j5k5j5P1m4k5M3j3l7J5N6k3
3124A0mm8O2j2l4O5j6o8J1O7l6j4J1K9nn2L0L2l4j8M6j5Nj5Q%k6L6J2k9j2O6j4
3157C8m0l8Q0Pm8L2j2j3k9L5Qj1j5L3K3m2k5N0j9l9M6J4l3m3O2mn3M5M2l6k1K3
3189A7Pqk8K3J5n8L9L3J2p9N5Ln0QL1Oj7m4O6j6ok0Rj7PQNrl1N2J1n8J0L9j8K
3225arL5n7K1K3J3n6LM3L9p2J4M0m9jL7j3j7mK0K4m7J8J0qj5M2j7n5K9K4mJ7j2
$$ plain form
2996 -27 9 9 -50 -19 26 24 -16 -24 54 40 -14 21 41 5 -25 31 30 -35 -28 63 26 -23 24 45 -27 -26 46 12 -11 -22 14 16 -48 -5
3030 -5 50 -18 -33 15 63 -14 -44 15 2 -10 5 33 4 -46 9 41 -11 -42 30 34 -15 -17 20 -20 -37 10 20 23 -55 25 20 5 -31
3063 -31 39 7 -21 35 34 5 -27 24 43 3 -28 -4 12 -29 -27 19 -11 -27 -7 32 -32 -19 25 -10 -24 17 41 1 -53 11 32
3094 32 -15 -32 -21 28 -40 -16 29 0 -46 -15 23 -48 -25 54 26 -57 -28 22 7 -18 -33 38 -6 -31 12 -1 -38 -23 33 10
3124 10 6 -42 20 8 -26 39 23 -45 -34 33 -3 -17 -6 23 18 -34 -4 28 -6 -24 22 7 12 -3 5 5 -21 15 27 -2 -14 52 38
3157 38 -2 -40 40 47 -1 31 19 6 -23 12 20 9 -6 27 50 8 -17 33 14 -25 21 35 2 -41 21 17 -36 9 51 15 -6 17
3189 17 24 16 -12 11 26 -32 7 40 52 -27 28 31 -19 -11 20 26 9 -35 31 15 9 -11 -2 -19 -12 -4 1 -8 -39 13 24 -34 -24 15 -3 -1
3225 -1 -10 25 -32 -11 12 25 -31 -28 15 54 -18 -4 36 -13 -14 23 10 -7 -11 9 33 -14 4 14 6 -9 33 16 -39 -10 14 10 27 15
3259A5Pm5J5J9K4n4l3N8Pk7j3J2J0l8L6pjl2P3J1p3P2on1K0KN8o9j9J5K1ql2L6
3293C%KOOk6OkQJ6j3nJ5k5pL1j0j3j5M4n8J5L8qMl0K4mk9NL5Jl7pL6n4RN1rnj5
3333a7J6K6k7L1k5Jj0K7j6j4J6m%LJ0K1p4pN6qll8P3m6l1M8Ol1J8k0J1J0m2O5
3367B5J9m4j5K3J5l8K4Rl4QQL2m9K5k3O%M2kk4j3J5J9m0j0M7pl0J6lj3l5O4j2
3401EJ6m3M0kj4J0J3Nj7L9l5j6k1L2k7K5m2K3LlK0L1m5J4QK2n5k8M2j8J4Lj4m
3435a9J6Pkl5J8L0jm1MO6n6k1O3l2LKK1K4o4K7J1k5kQJn0N0Ok3K6j4K9l1kK4Q
3471B6n9J7L5k1LL2j2j0k4NK7m0KK3Pmj2OJ4k4NL8%l8MNJ3k3J2Pl7QM5l3k7O6
3507C6j2p0P5m0MK6l9L4nk8K0L7m9j0L5j4kk9K8%K4j3K1j2k3LJ5l7L2j6J6k3J9
$$ plain form
3259 15 22 -23 -8 11 35 -19 -52 6 13 -14 -27 -15 -5 -43 -7 -14 -15 -47 26 37 -36 36 30 -21 -1 1 59 -10 -29 -14 7 -1 -33 3
3293 3 3 5 11 17 -9 -3 -5 3 19 6 1 16 -9 -16 15 5 -8 -23 21 -37 -22 16 8 12 -18 6 2 -27 -22 13 14 -23 -30 6 -48 -39 12 3 -2 -17
3333 -17 -1 25 -2 29 4 5 -5 22 6 -8 8 4 4 7 17 38 -36 -43 13 5 2 -36 37 -9 -40 8 14 -17 1 -19 -8 2 -40 25
3367 25 44 0 -15 8 23 -15 9 18 -16 -8 0 32 -17 8 -15 -9 -9 33 31 7 -6 9 28 -12 -22 25 18 -12 4 1 -12 -47 17 5
3401 5 21 -22 18 16 2 12 25 30 13 52 17 1 -20 12 -15 10 -32 -9 -6 -9 11 42 -3 11 19 41 -14 -42 0 -18 -4 -1 -15 -19
3435 -19 -3 4 2 -33 -15 15 14 -27 -23 43 -13 -34 29 -3 0 2 23 47 -17 10 21 -4 -6 2 3 -47 3 9 -14 12 -2 27 -4 -6 18 26
3471 26 -33 -16 19 -2 1 33 21 11 -13 -8 19 -21 -19 4 11 7 -5 1 15 -9 -4 34 34 -4 0 5 18 -5 7 14 -23 -15 30 -3 -30 36
3507 36 24 -46 29 -11 -7 19 -20 14 9 -19 1 38 -11 -21 14 0 -2 -31 -3 -3 21 8 29 17 -6 -3 12 -25 7 -9 7 -16 3
3540CKj2k4N2j6j3J5ljj6M2lj4kk6K3k4qK2nj3pK9Qk2K2Ol5L3lJ6l1j5K8j0nj9
3577b6K8j8oM9pk1%lkK3k5QrJ6l5L1J7k0k4J5oK2j9%j6K0K5j4j5J9Pj9PkPmkJ
3615BKj5L6k6l0M8l7K2%l6N3k3MQpK2j1JQk0m3M6k4M9j3rK7l5J7lPk5K8jl5%K2
3652Ik5oL0j8J2k4L8J8l5j3J7nJ5m3M7k0j1L8k3k4pN7j7j6OK8k3l3N3k1rJ7rL
3686Fk1L1nRj5Pj2j5L3nl5J4L4j8ol7N8Ml4J4K5k5qk0N8o7QJM3k4%LJ1k4J6oj5
3723a7LL3l5k1J4J2KJ7J6k2Koj8O4j0n1N5k8Nj4mMlPjj0%L0Kn0J2lJ5LLj0L6l4
3761b%K4j5j5RNJ1j9K9m0J8Lk6nK4j2J2kJk0K5nM8l0j6J3K2k3J6j7J5k9R%%J7
3797B5m6K2Nk1J5j6J1nK1mnKjJ5k1J5k1J0J9l2M3j4j1j5J9kqk5K0J2j0MpJ4k3
$$ plain form
3540 3 5 -7 -31 21 5 -8 7 4 3 -13 29 26 12 10 -16 7 -17 -25 -3 -8 -21 -28 1 9 -13 9 15 -20 13 10 26 -5 -20 8 -2 -7 -26
3577 -26 2 -16 -22 27 20 -1 -1 -4 -6 17 -8 0 -9 7 -28 3 20 0 -24 -9 -15 7 -12 -12 -28 -8 17 3 -12 7 14 -5 2 0 7 3 1 2
3615 2 4 -11 25 -1 -31 17 -20 2 2 -34 19 -4 0 8 1 23 12 13 21 1 -42 4 -20 29 16 7 34 -1 16 13 20 -5 23 22 -13 -13 9
3652 9 -16 -22 8 -10 2 -22 16 34 -1 -14 3 -2 13 -30 17 -3 -14 24 1 -23 -30 27 10 -6 0 28 5 -28 25 4 -5 12 3 6
3686 6 -15 16 11 20 5 12 0 -15 18 13 -22 -8 26 8 2 -35 23 27 -7 7 32 7 -1 -21 37 -30 -22 -21 22 -2 -2 1 12 -12 4 -2 -17
3723 -17 -14 19 -16 -37 -23 -11 -9 8 24 2 4 -2 -20 44 34 -17 38 10 15 1 -3 1 -2 5 4 -6 -6 24 26 -24 -12 -15 0 3 6 -4 32 -2
3761 -2 -2 22 7 -8 1 6 17 -2 27 -13 5 8 -18 -23 1 -11 1 -1 0 -20 5 0 48 18 2 15 37 14 30 13 28 -1 8 8 8 25
3797 25 -21 1 6 -15 0 -16 -5 -10 11 7 2 4 3 18 -3 12 -9 1 20 -12 31 17 6 -9 10 8 0 -25 -5 7 -3 1 -6 8 -15
3832a5K6k8QlK4Rk0PK8m8QJ8k6L2j4Lj2K2qjK6n3L0oj3QMj0KJ3Nk1J4jm1K6J3
3869Fj4kJ4N0o3M4m1j5N2j1j9k5J5PK0j5lJ4l6J1K0j2rK8j6lK8l0J4%k2J9k0N
3903iK2j4kJ2l1K9%K5j1qMj1j5J1j1J8l2N2j9L8m7j1Lk1L6qk2K2j6lJ8k4K3K8
3937B6m9M8k6JpK3k0j6J6kNmnJ3j2j5L2j6qLk7K3jJ1%l1L5J7lJJPJ8m1J5Lk7K
3975a0KK6J7%n8K5PlL2o0L0k7J9J6j0k9M0Jj5Nj3j6J4K3l2j3N5mj2j5l0O1rj4
4009CnNjNL4m1k3L4k1L0j7Qj9OJ3Qm5J6K0k4K7m0L3j9NNQNk0J1okJ4l6K0K8k5
4046fKJ7j6j1K2r%pJ3l4K9j0J6n8N1K0LqpJ4k1l7M7L5k9OpJ0j0k6K8rnL2p9M9
4082EMJ4l3oK3k0K9k9mJ2j7L9j2j4MK2k1J1kJ6l5K0Qk0J3k7j0N1m2K7j1J6nj2
$$ plain form
3832 -15 11 -17 -9 -12 12 21 1 8 36 -12 -4 14 -12 20 6 9 -3 19 11 10 36 -17 13 7 -6 2 6 -4 -2 11 16 -5 9 8 -33 -7 6
3869 6 -8 -10 4 54 -9 35 -6 -21 31 20 1 -24 -9 -2 18 3 0 14 -22 -11 9 -3 -12 16 0 -3 25 -5 9 9 -13 6 -14 -9
3903 -9 13 -1 -3 9 -22 7 7 32 21 13 17 6 -9 2 -9 9 -23 29 10 48 1 -10 -7 -28 8 0 -22 0 -16 -19 -1 -25 -2 26
3937 26 -23 25 -1 0 -7 16 -4 -20 -4 -6 -1 -5 -10 3 -9 -24 8 -8 -16 -13 -40 -17 -18 -7 -7 -38 -3 14 11 12 13 20 38 -3 12 15 -12 -10
3975 -10 -8 18 35 35 -23 2 9 6 38 -22 8 -19 0 16 6 -23 17 18 3 8 -5 -21 -7 16 -16 -29 26 22 10 -5 -35 26 17 3
4009 3 -2 3 2 7 41 0 -23 11 -10 20 3 11 -8 -2 11 19 -26 -10 10 -14 13 -27 6 -13 -8 -3 5 10 -10 1 -5 -7 7 -29 -9 19 -6
4046 -6 -4 13 -3 -14 8 -1 -1 -8 5 -29 0 -10 6 -52 -1 19 22 14 7 21 0 -37 10 45 16 22 15 25 15 -11 17 8 3 35 -44 5
4082 5 9 23 -10 -16 7 -13 16 -13 -17 -5 -22 17 5 -9 -5 17 -4 7 5 21 -14 6 14 -6 7 -20 -30 21 -21 6 -5 11 6 -6
4116fj5lJ3K5k1KK2R%K5p9M0rNj1mL6l5J3Mk2jJ3J1j7LPj0L5l1J3j0j9K2nJ9j1
4153HK2l1j2K4l1K0j7L9j1l1L3Kk0j0L3j2J2ml1Qk1L7J6j8l%J0j7nrK3K7k6k8
4187b3KM2l1K4l4kK3J3j3J4k5j8P4j5o1J1L5lkpOl%k8L8l3J3qJ1lK2kk1J5qj7
4223a4K4jJ1k3J1l0M0Rj5jok2K0Rk2L5k1j3PL4l3Qk4K3pk9M4qj6kJ4%k2JK7Nm0
4260b7M4Jk3jj0L7k1J2Jk1pL1k1qK4j3M8o4L3qjNNj8J6k4K0nrmK6ok9K1k4M9m8
4297a9K2K3l5mL4k6Pm8K3j0M3jMj2jkj8qKN2j6rK4l7J1qO1l3m6RlMJ0%OJ4k8K7
4335A2Jl3J8J1J6ojl6j2K1K3m0K0nJJ8%j7L2m0qK3MJ2J3k8nj4pL4l4K3jJ6%Lj7
4372cjK9rj5K4k6J6rPll0k2J8OK0j6MnML1J3m7OjK7k1K5%n1P5j6nl2K1porJ3m2
$$ plain form
4116 -6 -21 -24 -11 14 -7 -5 17 26 26 51 -28 12 3 8 -3 -7 29 -6 7 11 -11 -12 1 12 -5 -2 5 -5 30 -1 12 2 -17 5 0 19 8
4153 8 30 -1 -13 11 -20 0 -17 22 11 -20 13 15 -5 -15 18 6 18 14 -17 -9 -30 7 23 5 2 2 12 -5 -10 -19 4 31 5 -23
4187 -23 -21 21 -10 14 -20 -22 1 14 1 15 -10 -28 46 31 -30 -19 16 13 11 4 10 7 7 -21 17 -16 -3 -11 0 -3 19 17 -4 11 3 -14
4223 -14 10 9 20 -3 8 -22 18 27 12 11 5 -17 3 12 -10 25 4 -9 -2 32 -1 7 -17 6 -1 -30 14 6 -10 -12 2 2 -20 -19 8 13 -27
4260 -27 17 18 -5 -6 -16 21 0 12 13 -8 -15 16 -5 -13 11 -2 46 -18 15 7 6 11 16 -2 14 -10 10 5 -4 -8 18 12 -17 4 -20 29 -19
4297 -19 3 26 -9 -13 21 -5 2 -46 -23 -33 10 9 13 1 0 -2 -20 -28 -26 26 10 1 25 -12 -1 -9 52 19 -27 -18 -21 -17 -7 -7 -1 13 -15 12
4335 12 13 -20 -2 9 25 19 18 -18 -30 -9 14 -26 -6 -11 -10 8 8 -9 23 -17 -25 -2 2 14 27 -1 -6 -20 -27 7 -27 -4 -5 11 11 14 -3
4372 -3 -4 25 16 1 25 -1 15 6 13 10 -20 -42 -24 -18 2 -14 -10 -15 -11 20 33 -14 -8 -9 18 -3 22 22 -29 46 30 25 -7 14 7 1 -8 5 -37
4411c7J1K8J6Ln3O3l5QJ7mj6k2K3m4N2k1%LrmK1Rk7N8k4j4%%Lk8L5Kk3Rj7M2k3
4448BMLr%K2%l2J3qMJ4j4qk7K4J8%l3L8%j5J7JrJ0l4L3j9J8oKk8L4pk1J9K7m8
4486a5J7Nk8L6oj6L3l8J6Rk5L1J0j4kl3L2K9k7Ooj0Jk2K8k4j5L3j3K1k8N1j9k1
4520dj0PJ3Kj6K2m6J8J7k2kK9ok0J1L0k2j5K1rpj6J2J1pJ1l6K6J6J0L0n7J5On
4555GRj0Kk0j1J2j3M8kk3l9K9nK9orJ9j1K0j6%rnKj1KJL7k3jK7o1K5J2nMmk0J6
4594cJ3j3Rpj5rK3j5K0rNJ4j5jrMnK1j3J6nmJ7k6L8m2lJ3K1j4K9j5j7k6K1joJ0
4632ApjOL4p3N9l9J8j0K2mj2J5pLJj9K0K1j5l7PJ7jJ2j6K1j8k8M0k7O6m0k9K2
4667BrmlKlk3M8m4J5K2Mk0J8Ql7J5K3k0J3j5j3KRJ1J1nl1KJ1N0m0j5k5K1l7O9
$$ plain form
4411 -37 -26 2 18 21 -32 31 -4 4 21 17 1 -21 2 -42 10 -11 -11 -8 -17 -21 0 9 -18 40 16 2 2 2 5 -23 12 14 -9 0 -17 25 2
4448 2 6 9 0 0 22 22 -10 3 -5 -1 13 -1 -9 -36 -12 6 6 -27 11 11 -4 13 14 5 15 -19 14 -5 13 7 9 -19 15 8 -13 6 33 -15
4486 -15 2 7 -21 15 9 -7 26 -12 4 13 -12 19 29 15 13 -20 12 41 14 20 14 4 5 -17 11 -13 -28 5 -8 13 -15 36 17 -4
4520 -4 -14 -7 6 8 -8 14 -32 -14 3 -19 -21 8 2 -18 -7 23 1 -14 7 -2 -9 -25 -13 -2 -9 2 -34 -8 8 18 48 -9 6 12 7
4555 7 16 6 8 -12 -23 -11 -24 24 22 -1 -40 -11 -16 13 7 -2 17 6 26 10 10 1 -4 -2 -13 -11 -10 27 4 3 30 -31 -6 6 1 5 1 -19 -3
4594 -3 10 -3 6 -1 -16 -25 -2 -17 3 -6 -1 13 -2 -3 -12 -8 -13 8 -5 11 6 2 19 -7 31 -11 -14 -1 20 6 35 20 3 -23 -2 -3 -9 1
4632 1 -6 -7 -1 33 -40 19 -20 -2 -12 10 6 -6 9 2 5 6 -13 7 28 13 -24 -17 0 -1 11 -5 16 -2 -30 10 -17 49 9 -20 2
4667 2 -7 -11 -14 -12 -15 -38 10 -34 -19 3 7 -13 5 13 -24 -9 14 -6 7 -8 -21 -19 -10 1 12 7 -24 -22 -11 39 -1 -16 -41 -20 -57 12
4703A2Jj4%Nj2KlrL1ql8J5K0mn%%j5L0m4N3k2j1J5mJ2J1j8J6l4J1J8kj5Lk6L2
4740Cj4K9j7qRj4L7k4lOnJ5k0J7Rjn6J2J8oOPj8JnJ9rK3l6K8mj5J9MOMk2J0j6
4779a1j0PK3l3N4j7J5m9J7KJnK8l6K6k7L0l8J2M7k3l2J1J4pqOJ8k5J5Mk0LL1k2
4814Aj3K4l1RMjMJ9j1Ok2L1oj3k9J7j7J9l3P3k8l3N8ol3J7m2L8lK6Nk9Rj4j8K3
4850AqJ5J1l6M6k4J1l7j7L2NmkLqL7l8K3Ok0J1lm1QK3K0k6PJ8j6qj3K9j2J6J9
4886B8j3k3j1QJ3M7o6N1m7K1loK2l7j7N6pj8J9j1Kl7L8oj2L4lj9L3l9qjJ6Qj6
4921dL3k1j8J7l0M9%m9RJ1K8j4k4ORjOl1M5k6OQqJ0Kk5J6OojkMj9L4j7Mk6PJr
4961b0%M6l7J2J2l2K5j8j2J0PmK9l7OK9k3L9m1K0qj0j9%NJ0nJ1K0k1k8L2J3l0
$$ plain form
4703 12 13 -1 -1 4 -8 -6 -9 -18 13 5 -33 -18 2 -2 -7 -7 -7 -22 8 -36 17 -5 -16 -1 -5 7 18 0 16 -18 -7 11 9 -6 -3 -29 3
4740 3 -11 18 1 -7 2 -12 25 1 -2 4 -1 14 -6 11 20 19 -37 -25 -7 -13 -7 0 -18 -17 -22 -3 -12 11 -25 3 -1 -16 3 7 13 17 -5 5 -11
4779 -11 -21 -14 9 -24 30 13 28 -21 -4 -2 -1 -6 22 -14 12 -15 15 -23 -11 36 13 -19 -8 6 -1 -9 -3 15 -10 5 9 -11 -8 23 1
4814 1 -12 12 -19 -10 -6 -7 -3 16 5 11 -11 20 14 1 -28 -11 -28 -9 -42 31 3 -30 28 22 -11 6 -36 2 -1 25 30 1 10 -4 -22 1
4850 1 -7 8 19 -17 29 5 16 -21 -38 -6 -1 -5 -7 -4 -12 25 -13 10 16 -4 7 4 -37 -29 -6 14 -12 -5 13 -3 -11 -24 5 -7 9 28
4886 28 15 -8 -19 -11 2 49 -17 34 -13 8 5 -1 21 -16 -33 23 16 -2 17 6 8 -29 9 3 -9 25 22 3 36 -3 -11 -12 4 12 -4
4921 -4 29 8 -10 7 -23 26 26 -23 -14 -3 25 11 -13 -7 2 1 7 -24 21 -5 1 9 1 11 13 -12 4 10 4 3 1 5 -14 20 3 7 -19 -12 -11 -20
4961 -20 -20 26 -11 1 13 -19 6 -12 -24 -14 -7 -11 18 -19 -13 16 -7 32 -9 11 3 -7 -26 -26 -21 -11 -16 -5 15 -6 -34 -2 11 -19
4995a9K4k7K2omJ8KrK9m2K2qK%j0oK5l5K8K0j9mj6JJ8kl3J9K3j4J1K8m1M5m5k
5031eK7k3J1rJ5l6K1J5mk3K2k0jj0OJ2OrK1Kk9j3L4k2K9nnNNj9j1K9mj1pL8l4
5068bRk4j4PN5l5rj7K1L9k8rL7j9k2PoK9j2Ml5L5Rlj1rK3lj3pQoJ4k9J0OK1rl0
5107a8O4j4n0NK8j8Ql5K3J5Nk8J4nJ2kL2j4l3K1j7J0MK4l0j9lJ5M1n6L2J7Om5
5141a1JL0k8PJ8j8L4l8rQJ9Qom2L5MKk6J3j6L8j8pK0l2L2l2QJ0KLJ0ln%K5l5j4
5179a3K5j8K3l2K3NJ5m0Ok0M4k3MK0k1J3jk1RJ3nJ2k9K6km4P1l8k3L7m0M7k3l0
5213c0K7kk8M6l5K7kj5K2J5lj3j4j4QK5J2j3lj8j3L8ok0%JJ6jJ7k0RmJ7j7m3K4
5249a0j1J4KoJ4k2J3J4Rk5NK3j5mK6j9K6k6NJmJ0l4QKl5L1L9k7K2m3L3l4J5k3
$$ plain form
4995 -19 5 -22 0 -6 -10 8 10 1 30 -12 10 2 4 4 -6 -12 13 -22 6 26 7 3 -13 -12 6 4 -29 -10 13 -1 10 38 -3 42 -3 -5
5031 -5 22 -1 10 1 16 -20 1 16 12 -11 11 -9 -10 -20 -14 -2 4 -5 16 18 -11 -24 10 -12 17 12 7 12 17 -2 -13 16 12 1 -6 32 -2
5068 -2 7 -17 -31 -24 31 -4 -13 -30 -9 30 2 -7 30 11 -11 -4 -10 19 7 11 -24 11 20 17 6 -3 20 17 4 -3 5 -1 13 -16 -6 0 21 12 -18
5107 -18 46 32 -18 -13 15 -3 5 -30 -7 8 13 -15 -1 -6 6 4 36 22 -11 10 -7 3 7 31 1 -18 -21 -6 35 -21 11 28 34 -11
5141 -11 -10 20 -8 -1 17 -1 33 -5 -14 -6 13 21 15 -27 8 12 14 -12 1 -15 23 5 -2 18 -14 18 -14 -6 4 6 9 19 16 11 11 36 1 -13
5179 -13 12 -6 17 -15 8 13 28 -12 -6 -26 18 -5 -1 19 -2 11 10 -11 -2 11 6 18 -11 15 13 -31 40 2 -21 16 -24 23 0 -30
5213 -30 -3 -5 -33 13 -22 5 3 -12 10 25 22 9 -5 -19 -11 14 26 13 10 -8 -21 17 11 -9 -9 -8 8 7 24 4 13 9 26 9 -34 -10
5249 -10 -21 -7 -5 -11 3 -19 -6 8 17 -8 -3 20 5 1 27 8 34 8 13 14 10 20 -14 -6 -4 -39 -8 31 4 26 -17 16 -18 -3 -26
5284b6K1J1Ok2mL6k7J8j3pj1PK8l3KJ0N6n4K6j8J3k8J8Rj9j5K5k3j6N4k2J5m4
5317b7K9j4J6j2QK5j5Jk3M9k1Ll4K6j0JmLqLQrL3l8K0K0m2oK4Qk3PrK7lJ3j6j4
5355dK6K5m6j2J7MM1l5l6K0LoO%k7K4nPj6qj7L0J5K2k9k9pL6j4MJ1j0K6pj6j0
5391a7L0l4N7n4K5K4n1MK8l3N0j6k6NKnpL1Pk0J6K5n4J5Lj4j3PJ1K3oj9NJ7k7
5426a1mK4qJ5j6LqJ6m3Q1l8koLjJ9n9N0l3K5j3M6m3k3M9k8K1l2K5l9M0nqJ0J7
5461B4k0jKk7N7rj9l9K6RRJ9k8j6K0l0M0pj7j2K3j3Oj7N1n4M7l8k8L3K5j1Pm0
5495b8N0k1J7j7l4N8l0NPK0m7K2m0K8J3mK0K3k9j8J6j6J4Rnk7rM3k9K4k2j6K6
5528CJ2l6OK7j1lO4n9J1Jl2J4j2lrM0j5j1L0k0K0j6Jj7J8k2J3K4K0k7k8J9K4q
$$ plain form
5284 -26 -5 6 12 -10 -14 22 -5 13 0 -7 -18 -11 17 -16 -14 -4 52 -2 24 6 19 -9 9 18 -1 -16 9 -14 -30 24 2 17 -27
5317 -27 2 -12 4 -8 0 25 10 11 -12 37 16 19 -15 11 1 2 -2 1 -7 -4 4 -5 28 -10 10 30 -12 -18 6 14 -9 -2 -11 16 13 26 10 -4
5355 -4 22 47 1 -11 6 10 51 16 -20 0 3 -3 3 3 -24 0 -5 2 -14 -22 -39 -9 6 28 -1 -30 -37 -1 -15 -11 0 -10 16 9 -7 -17
5391 -17 13 -21 36 -18 7 31 -20 -16 12 -21 29 13 -13 -8 -6 -11 -18 13 20 0 16 41 -13 2 5 -9 -22 -15 -4 19 13 -6 -1 16 -11
5426 -11 -15 9 1 16 0 3 -5 11 -32 49 11 9 3 6 5 24 -35 15 -18 7 -6 40 -3 -26 23 -5 16 -16 9 -30 10 5 -3 7 24
5461 24 4 3 5 -22 35 26 7 -32 -6 3 12 31 3 -13 7 -23 17 10 -7 -19 4 -9 -3 -20 31 -23 24 -14 -42 -9 16 5 12 -28
5495 -28 22 1 18 1 -33 25 -5 0 7 27 -20 2 -38 -10 3 -1 19 42 13 -5 11 -5 9 18 13 -14 -23 20 -9 15 -7 -23 3
5528 3 15 -21 -15 12 1 -2 62 3 14 15 -17 -3 -15 -18 -27 13 -2 -13 17 -3 17 1 2 -15 3 -19 -6 18 38 11 -17 2 26 18
5562A8j9J3k9KjJ0j4OJ3QJ8j7j8J4L1l4LnL3j5n1N0j7kj2mNK6k3qqO8j9oj7k0
5598b1J9j8J5l2K4K9Mj7K5l1j8K9k2J3j5K9jj3K1j%k2j1rL4kj0K4l8K8kl4M6J
5632B4j2Ml4K0J0J4m5J7K9l4j7oM1JQj1k7K6lmK2Mm2K7k1K2m0M6lJ9m0olK8kk2
5668a0RNk0K3k2K4JK1m1J8j4L2l1QL9n2M0k5pOJ1j4J2j5pl0L5KMJ8j9l2M0j4K9
5703B4Pm2J4OK1l7j2L2k0k4M9m3K5nK1n4M2Pk5J5k9L5rLLOm2J7L4l6OkOJ4J2j
5739A8n1L9rPJ9J1j6Kl9K2ll4L1%j2j2K4L9n7J0J1L3k3mMj0J5j9mj0K1j8L2l0
5773a3J8j8JKJ8j9L5l3L0Ql6K1j0LJ5l8qK2j1L7lj2j9J2K2kk1J2k5k7Q2l8J8m7
5807b4L6k9J8K1m6L0J7Kl1NK1l9L0j5NL2n3K4lK0J8j1l4J7l9K0QnK0k4PNl4K1
$$ plain form
5562 18 -1 12 -17 -15 -16 -6 -20 -14 -1 7 25 8 -10 4 35 1 4 -1 32 17 -34 16 -1 -3 -15 -19 -14 12 -11 -19 -27 41 22 16 -1 -21
5598 -21 -2 -20 -5 -37 -13 16 20 3 28 -3 -21 8 -14 -1 -16 13 12 -1 20 19 19 -3 -14 -23 11 9 -1 23 -15 13 11 -23 23 24
5632 24 12 16 -18 2 12 26 -19 -2 27 -7 -24 -30 11 12 20 9 -18 8 5 1 23 27 -15 12 -9 13 -27 19 16 35 -5 -11 -14 14 12 -10
5668 -10 -1 4 -16 7 -15 9 10 31 -10 8 -6 26 -5 3 42 -10 30 5 -2 4 15 1 13 -2 -9 -39 -4 -2 2 20 1 -31 9 -5 24
5703 24 31 -11 3 9 30 -7 -19 13 -7 -31 18 -25 0 -5 16 -38 4 11 -14 1 -28 7 -2 1 4 10 -32 -15 19 -17 -11 -13 -7 7 19 18
5739 18 -33 6 -3 4 23 34 18 20 -19 3 0 -34 -3 -3 -15 -27 -3 36 -21 -11 0 33 10 6 10 0 15 -4 -8 -18 3 -15 17 -13
5773 -13 5 -13 -12 -10 8 -11 24 -9 21 29 -7 14 4 7 22 -16 -24 -2 -13 24 21 9 -10 2 24 22 1 13 -12 -39 43 5 23 -24
5807 -24 12 -17 1 22 -24 6 23 25 -6 -1 20 -19 11 -4 1 33 -20 4 1 21 39 28 -6 11 -28 -8 0 -5 15 -9 -2 3 -31 -10
5841a0K8j3LJ1m2L0k1L5kqlLk2J9jrJ7j4J2P%m0RnJ7rj1K2K4l0k3J4RK1j6PQk4
5879gJ4j0J1m5L9o6O2l2M1K9l6l6Qj0K9j5L8lkJ0l2J1k4M2J2l2jk2K3N4o9L4j7
5912bj7j6M5j0lK1j3k3J8K3k6J0J3j6J7m0J1NJjPj8K2NJ2j9k1pL3%l3K8j0KL0
5947B8rm4L6p%j2LK0RJ9l5J2km3jK3K3j7j9J8j1J8j1QOk3NK1J5k4oLmKJ2Mk7J5
5985EL5m9j9N7l4k8oK2L2rJ9j2k4JNK9j5j9RNk0K5k1J6pMJ0pk8J3J8k2J5j8L4
6020A6J8m4JJ7J7k4l2K5k2J8J6j8L0Lm4kK5j7K4j7K1k3qJ4l4M1kpM5l0j8J7k1
6053a5L0k3K0ml0J4K2lk8Ll7N2o2M5L6n0L6l9N2k1J1j5K8Mj7k1K3m2L7k3J9k4
6085b2M2k8NMPOOrkJ0j2lj3lK3j3J3j1nRpJ1K3l2rJ9J1j7oJ8j8jJ2p%K5k2Ok2
$$ plain form
5841 -10 18 5 8 19 -23 7 -14 21 19 11 8 11 -11 8 7 -2 15 1 13 20 20 -20 -11 -16 1 -8 -19 3 27 -3 -26 -12 -3 18 2 9 17 -7
5879 -7 7 -3 8 -37 2 -64 -2 -34 7 36 0 -36 -28 -38 -9 -24 14 11 9 19 -13 -2 -26 16 28 -4 -5 -27 -4 50 -19 15 -2
5912 -2 -19 -35 10 0 -3 18 5 -18 0 23 -3 7 20 4 21 -19 -8 -3 -2 -3 4 -14 8 13 25 6 -15 -22 11 11 -22 6 -4 -2 28
5947 28 19 -25 11 4 4 -8 -5 15 24 43 8 20 18 -25 -26 -3 20 3 -16 2 -9 9 -2 6 12 -11 -6 15 30 6 0 3 -1 1 13 17 -10 5
5985 5 40 -9 -28 29 -5 -33 -39 -17 15 6 25 13 -11 -10 -5 24 9 -10 -1 4 -16 9 -12 4 -3 1 11 4 -24 -11 7 -15 0 -18 16
6020 16 34 -10 -9 8 25 1 -31 -6 -28 -10 6 -12 18 21 -23 -25 0 -17 7 -10 11 -12 -20 -6 -40 1 -1 -8 37 7 -11 6 -15
6053 -15 15 -8 12 8 -22 -8 14 11 -17 -14 -51 1 -61 -16 20 -30 6 -33 19 -2 9 -6 22 26 9 -12 11 -31 6 -17 2 -22
6085 -22 20 -8 -3 1 8 14 20 11 9 19 7 4 -9 -12 11 -2 11 0 -5 4 -3 8 31 -1 -10 9 20 3 -3 15 -3 -4 8 1 1 26 4 10 -12
6124a2M0n3M1m7L9k4pjK0J4llk5J2pK1J3m5K1l6K2nO6l8m3J1L0J5k5J7j4L6n2
6157b2K5j1%lj0K3jK1k0Nk4K6J3k6j3L8l7RL7n0K6MOk9K9JJ1l4k7L3J1m0M0k7
6191a6QK0j0kJ1kj7L1k4J7k6K0J1k1MJ3l8M7j1j3j7R%K7j9Kj4lOOJ6m9M9l2K2
6226Eoj9j3K5nkJL0qj7M2k8nOrJ1J3j4k5LK4k1qkPM2k7k4J5j5QJ8pLK6k6J2J6
6264B6om7L1J4k1qj2J8j8p%L3LJ5rrj5mL6nl4ML5j6%J5k5K3k7kK3j0OJ9j9J6p
6301A6j2j1M8k0qm0K9K0m0M1l8K5j2Oj3%OJOj3L5m0K0J0j1Rj0J5m4L9k1jmJ2k0
6336b0K7m%j3RL2k1l8K9j8J2j6K0J9m7K9k8L3j3rM1m5K4k1K1pjlK1k1J7Pl3Om
6371a5J0M6m2kK4l0j4K4j7kOJ2j9J8pJ3mLkK2Ol2k7M2J2l5L2qNml2L6l3J4mqj9
$$ plain form
6124 -12 28 -25 16 -31 8 -16 -23 -24 -4 10 7 4 -21 -9 -16 5 18 -27 -6 -42 -20 -25 41 3 -40 -29 1 16 -9 8 -6 30 -22
6157 -22 3 -8 -8 -11 -21 2 1 22 2 7 -17 9 22 -4 -17 21 -16 -7 30 -20 6 10 16 -13 16 17 28 -6 -33 0 11 -29 11 -16
6191 -16 -8 12 2 0 11 9 -8 23 -1 16 -10 10 21 0 4 17 -21 26 15 2 -15 -6 -6 21 2 4 -10 -13 -7 -1 15 -34 15 -17 5
6226 5 -1 -20 -33 -8 -13 -15 -14 16 8 -9 33 5 0 6 -3 8 21 7 -18 -15 9 -12 -20 -22 -15 27 0 -24 -9 -24 -16 2 -5 -2 24 -2 10 26
6264 26 20 -27 4 18 -3 -11 -23 -5 -23 -30 -30 3 6 21 12 3 -12 -16 20 15 -19 -15 20 4 4 19 -6 17 -10 -12 11 1 7 26 7 23 16
6301 16 4 -7 41 21 13 -27 2 22 -18 23 -15 10 -2 4 -9 -9 -3 -2 4 -9 26 -14 6 16 5 14 4 19 -25 14 -7 -8 -12 0 -20
6336 -20 7 3 3 -10 -1 31 10 -28 1 -17 -5 -21 -1 18 -29 0 -28 5 -8 -17 24 -21 3 -18 3 -4 -5 -8 13 -8 9 16 -17 -11 -15
6371 -15 -5 41 -1 -3 21 -9 -23 1 -16 -18 -12 0 -19 -1 -8 5 1 4 2 24 30 -2 -29 13 25 -10 22 14 19 15 -17 19 -14 0 -4 -12 -31
6408c1L0%K9l1KQK0n9j6O9J0p4M1KmK3n8M2j2%Jj5K0Lj5%j0K4Olkk5PRJ1K0k3
6445aj1LjJ4J2l6NJ9K5l4k7J3J4Q%J5K0m2j8K2K9m5k3M5qOj7K0k5J3rK3j6jj6
6480b4K2j3J8k3M1j8MRj1j7K6K3l9oMk2j8K8LJJ4j0j2L4j0J4m1koMJ9j9K1J5n
6515DJ3j9mj1j8O6l0J0J9j7J1l0k1M5l6j9K4j6K1ok9N3k5J6j4Mj3JJ8k5%J8j6
6548b6J7mpK0K6j3Kj3K8nm3j0J3K6j9LL1k7PqJ1RqJ5J0k2m9L7K6l2m8P3j9J2l1
6583a8K8pN%j3%K6j4mPj3Pk7NJ5J6l5QL2k7Mj9J9J2kJ3k6L0mk0K5j7j1kJMqk4
6621c4L8m4M0jKLNL2jn4lJ2Lj8lK1k5M8rk6oJ7L7j7rj4oK3k2J9mJ2j1K0l1l1N2
6658A5k2J9ppJlMJ0pL3nj3k1K0Oj3k3j8K8mJ6Mk2J9j1J6K0j8k6K8lLm1K3%Nqq
$$ plain form
6408 -31 -1 -1 28 -3 -1 7 27 -32 -48 21 31 -43 -2 0 -4 19 -39 3 -9 -9 -8 -23 -3 0 -15 -15 -25 -1 5 2 0 -25 -18 -9 2 22 -1
6445 -1 -12 -9 -10 4 16 -20 -15 4 29 -5 -32 -19 -5 3 3 18 38 -4 -22 0 29 -16 -39 6 -2 4 -13 7 -18 -5 -14 9 -7 -8 -24
6480 -24 -2 -15 3 -20 21 3 7 16 5 -12 14 37 -2 -8 -4 -26 -44 -16 -13 -12 2 -8 -20 14 4 18 -23 -25 -31 -27 -8 -27 -6 9 4
6515 4 17 -2 -6 -17 -35 31 1 11 30 13 24 -6 -27 18 -18 -37 -13 -29 -8 -14 -43 10 -15 1 -13 -9 -22 -21 -3 -28 -28 -10 -26
6548 -26 -9 -13 -20 0 26 13 15 2 30 25 -18 -28 -15 11 -8 -5 26 -1 6 -2 9 18 10 25 35 13 -36 1 27 -5 -53 20 1 13 -18
6583 -18 10 3 8 8 -5 -5 21 7 3 10 -3 4 -23 -18 -3 13 -22 -14 18 -9 -5 -24 -5 7 5 18 -8 22 18 -2 23 6 -5 -7 -6 -2 -10 -34
6621 -34 4 -40 0 -1 1 4 9 41 40 -14 -17 -5 -2 -20 -23 -2 -27 21 12 -14 -20 -3 34 17 8 -6 -12 11 -11 8 4 16 5 25 -6 -37 15
6658 15 -7 12 5 -2 -1 -4 0 10 3 36 31 18 -3 17 23 10 -13 -31 -3 -7 9 13 -9 10 -1 15 35 17 -9 19 16 19 -22 1 1 6 -2 -10
6696a0L8m3PkNJ6j6kL2K5p1oN0k9j0K7PQk9OKQlNj8L6k0Kl2L9j6k7OK4oj6Rk0
6734b4NK6KJ6m4J6J6oK1k8J0Lj6K8j7k1K1Oj8K7j1j6j6J4J5NLj6LL2k2ol2M0p
6769Im5L4MmJ3J2k5lj1K%L2j7lJ4K7j7k3J1J7j0j6j9K1pj1j2L7kJ5j6M%JJMk2
6806eL0k8K3qj6J3qL8l1k2NJ8qqqlJ7JK0Lm3QJ8Qqql4K9MmJ6J0j5J7k2K8k7jK7
6845B6Kl3l1L1omOL7j8Mj7J1rrjj3L3Kj5J6j7o%L1j5k0K7oJ4m1L9j2k0K7l5LL6
6882A7J9m2LqJ0qM1l6K0j3j6L3J0l7j4J8LJ7j2j9NPK0qn7M3k1JJ2j5M5J1k4J3
6916A8k6J5j4J2JRj6Qqj0K1j2JOj4K0lj9J2Rkj0j4K1K2l7lJ3qK6lk9Kk0NL6%k9
6954b0K0J5n7O7lJ2l4j9J7K2oj6RkJ3j7rmK0mQok4QK2J0l7J1L6k0k8j5L2nNpJ
$$ plain form
6696 -10 28 -15 -8 -10 -5 11 -5 -7 25 50 -21 -27 23 -6 -16 11 18 26 -3 3 5 13 10 15 -3 33 13 15 -17 22 6 -21 -15 9 3 -13 -4 -24
6734 -24 -19 7 9 25 -19 -3 13 7 28 0 10 13 -3 25 8 -13 8 14 -4 23 12 -4 -20 -6 9 14 17 1 4 36 14 8 -24 16 9
6769 9 -36 -2 2 -2 11 23 -2 -5 -16 -14 -14 18 1 -2 12 39 22 -1 10 27 17 1 -18 3 -4 -15 -27 10 8 23 7 11 11 12 13 17 -5
6806 -5 25 -3 20 12 -4 9 1 39 8 -14 -9 9 1 -7 -15 -18 -1 0 20 23 -20 -12 6 14 6 -2 -36 -7 -3 -7 9 19 4 21 -1 27 0 -1 26
6845 26 28 -5 -36 -5 -11 -15 -9 28 10 14 -3 8 -1 -10 -11 -24 9 11 -4 12 -5 -11 -11 20 5 -15 12 6 20 -21 18 6 -14 13 -22 -19 17
6882 17 36 -6 -3 -11 -1 -9 32 -4 16 3 -13 20 30 -7 -21 -3 0 17 5 -14 -9 -2 18 10 -47 -4 -25 -24 -12 -27 18 29 5 18
6916 18 -8 7 -7 5 6 15 -1 7 -1 -11 10 -2 -1 5 -9 11 8 -11 1 10 8 -2 -16 5 27 -10 -13 0 -8 18 15 -14 -12 -32 -27 9 9 -20
6954 -20 0 15 -42 25 22 34 0 -19 -2 20 14 -2 7 5 18 1 -8 -12 8 4 12 6 -18 -10 12 22 -15 -4 32 12 -16 -31 1 -4 1 -6 -5
6991eK6l7L5J9l9K6k3JL9k3j2m0K2J8l5K3lL4k1oPp%k7N1j5Qk3J6%J6k7%j4%j6
7027c2QK4j1LK3qk9M3mk2J5j5LNJ3k5J1Ql3K4J0%kj0J2rk5M6k8L7m6J6J3j5L8
7062C8l6Mj9MJ9K2k4PKl3L4J2J1j7k5OKj7ojJ9Kj3L9n9L7Qk9K7j7qPJ7m2M8m0
7098b1L1j5mnPK1%j7Jk1J7J5qJ9k3JJ3J6kl2NqNjK7k0NJ9k3LRk6K0J1L1l4oj1
7136apM7n0K1m2OlN1j3l2M8J1m4M3k5k8L8j6kNkJ8kOk5pK5k2PK8n8M9Nn2M9k7
7172aJ1J6mlj4j6J5j3K5l3jL2j0M2k9ll2L1j3Pj4Nj0J3kLMj4M2J0p6KK9j8L4j0
7208Ek3J5j8M2j5l7M8l4J1OnJj2k7K8Rjnl4O2k3QjJ5j7pL0l5L7krk7K3Kj5NN3
7245E3l9rjQLl7Rj6J1%RK4m1LN7l4j1jJ2L6l4k0K3k2J6k0j4N0l2PRK9j4j5J2J8
$$ plain form
6991 -5 21 -16 19 38 -1 25 2 3 42 19 7 -33 -11 7 -28 -5 -8 26 5 -1 6 -1 -1 -28 23 8 16 -7 9 9 25 -2 -2 -16 -16 -32
7027 -32 -24 0 -11 -8 15 7 -22 21 17 -5 10 -5 -2 3 16 -9 2 10 -23 1 11 11 9 -1 11 2 -23 23 -5 32 -14 2 15 0 38
7062 38 2 6 -13 -9 10 32 8 15 17 -16 18 30 41 24 -1 5 7 -10 -16 -17 2 4 -9 30 -29 8 16 -13 14 -3 -11 -4 13 -29 19 -21
7098 -21 10 -5 -9 -14 -7 14 14 -3 -2 -23 -6 9 1 20 -3 -2 11 27 25 -7 -2 -10 -5 -6 21 1 6 25 2 5 14 -12 8 19 50 16 10 -1
7136 -1 -8 39 -11 10 -32 -26 -29 22 9 -23 25 36 -8 35 10 -18 20 4 2 7 5 23 21 27 2 -5 20 -2 5 33 -25 24 29 -23 26 -1
7172 -1 10 26 22 19 5 -11 4 -9 16 -17 -18 14 4 46 17 14 -18 13 0 7 -7 -2 -12 1 -1 2 6 -8 34 44 -32 -30 -1 -19 15 5
7208 5 -18 -3 -21 21 6 -31 17 -17 -6 0 -5 -4 -16 -43 -15 -6 -7 -12 -46 16 -7 1 0 15 -2 -9 21 -14 23 21 12 -15 8 10 -5 0 53
7245 53 14 5 4 12 15 -22 -13 -29 -18 -18 -9 15 -26 -23 34 0 -11 -12 0 36 2 -18 5 -17 -1 -21 -35 15 -17 -10 -1 28 14 -1 11 29
7281B9o0K1j8K6J9j9JMj4L8lm3OK0j1J6k5j6N9rj6j1RlPK8j5j6OMRk0QqJk0lk0
7319c9J7N7k7j1NK0k3O1n9J8qj9L0l0k5L8j6jQk0M2mLk7K1J0k6K8j4RmJpoJ2j8
7355dnqJ4J8kk6K7Kl9L3j6j1J3k2K9j8LJ7k4K4j7QrK3J2oj8Rk8PL2JPk8j2J2J
7392aJ4j7J3K8m9J5jJ1L5k3k4rJ5k3M8J1o4L3nk1oJ3J1Mk3J4J0Pjj0k5K4k4K9
7426IJ0rl2PJ1JKNOk0L0poRolkNK3jq0M4koM3j5j7PJ6j4Lj3%K6j9J9k3J2Rk6J6
7467A2j4lRJ4%NPj4j5mPk8N1l5KMj8J4k2M0n0N1k3J6k4PMJ1jk5PK9j0j1Rr%Mj0
7506a3J2j4J5Rj4RJ1lLrLl3L0k6k2N5%k7KJ0l6KN4n0M4n2K4LL6k6l4M5J6j2jj5
7542dJ0k6L5k3L1l9J6J7Qj5OrJ0Mkj2JJ2j0j1K2k6j1j2N3oj7%rK5kj1k4K2J3k6
$$ plain form
7281 29 -31 -10 -28 -2 17 -2 -1 3 -11 27 24 -19 -13 7 -4 12 -13 -29 30 21 5 -6 3 0 7 35 20 4 10 14 23 3 11 3 4 -16 -19 -39
7319 -39 -22 35 8 -3 2 22 -1 60 1 19 11 -8 22 -8 -33 5 -11 -12 -4 -24 18 14 17 -10 11 21 -5 23 9 18 14 15 8 2 14 -4
7355 -4 -9 -17 -3 15 13 -13 14 16 -23 10 -6 -17 -4 -26 3 -15 -12 5 -19 5 -12 -4 -13 10 22 16 -2 7 -21 -14 18 19 26 -2 -14 -2 -1
7392 -1 13 -4 9 37 -12 3 2 13 48 25 1 -8 7 -16 32 43 -21 12 7 -14 -20 -7 4 8 -15 -1 9 16 15 5 -20 4 -20 9
7426 9 19 10 -22 -15 -4 -3 -1 4 10 -10 20 13 7 16 10 7 5 10 33 32 -48 -4 -6 -12 31 16 -1 6 22 8 11 -2 -2 24 5 24 1 13 22 -4 12
7467 12 -2 -5 4 18 18 23 30 16 1 -3 4 -24 27 -8 -6 -2 -20 -6 -28 12 -38 13 -10 6 -18 -11 -7 4 3 -22 -15 14 4 -7 2 -7 -7 -3 -13
7506 -13 -1 -15 0 9 -5 4 15 12 15 6 9 -24 6 -20 -42 13 13 -14 -12 -2 -38 -36 18 -32 12 -40 -16 -13 23 -3 -37 8 24 12 11 -4
7542 -4 6 -20 15 -8 23 -16 0 17 25 10 16 7 17 21 19 7 8 20 10 -1 21 -5 -16 -28 25 19 2 2 -7 18 16 5 -19 3 16 -10
7578a0J1J4qpJ1mj2LKk4NL2k5NPJ2j9qQk4QM9j1l7L5J6rlj9kJ7qK4qj7kjj1K9
7617A9rNk0J3kJ6m1N0l5J8qJ9Kn3M2Nn1K6mJ4J1Pj9JJ2J5rpoJ1k2lk7L0qnM0k7
7655@J6lJ2k1mK6l0J2k4J9Pj2J3J7l8K2JL1k4l8N4l8K0j7j5J9L1m9J2LK4k0j3
7688gPJJ6m3RqL8J2lk4nNL4k4Qk7j5J7J2k0L8k4J0%Ll2J9kPk5MK2j5J6J0k0KJ3
7726Ipk3K8MRl1J1rjK7m9K7K1jj6J8j0J0k0K0lj6jK0j3J1j5oj8O7k5n4K2J6Ll
7762BlLK4k0Nn0M8l9J7J5J0m6N6m5L0j8K7Ol7PK7J8l3K8l7Ok7M3l8J8Kj1K5l5
7796b2NJ4j1%QKk3M0J5n1LN9m6Q%Pk9J0RQl5N8k5k8M7k1l9M7oK7k2l4K0M0o2J7
7832a0J0k6NK4j1M0j0l7J1%mJ9j4L6l4Pj3KJ0QrkJ3J2ll0j0K7Nrj4mJ5Mj6j9K5
$$ plain form
7578 -10 1 15 7 0 11 7 -5 -2 0 -24 -19 13 -12 -7 0 12 -7 -15 -7 -31 -23 26 15 -22 13 29 20 17 -2 -4 13 5 29 21 4 2 1 -10 19
7617 19 10 15 -5 8 6 22 -19 31 -4 14 6 25 27 -26 16 21 -30 -4 -8 6 17 24 5 6 18 33 24 17 11 22 0 -3 -30 0 -8 -13 27 0
7655 0 16 13 25 4 0 26 -4 8 -16 3 10 -2 11 28 -10 12 13 44 20 -18 36 -2 18 1 -14 5 36 -13 -1 2 26 6 -7
7688 -7 0 1 17 -26 -17 -25 13 25 22 -2 -7 -2 32 8 16 -11 -26 -9 3 -17 21 -3 7 7 10 -22 -3 -5 2 -23 -19 3 -12 4 14 -6 -4 9
7726 9 2 -21 7 11 20 -11 0 -9 -10 17 -32 -5 16 15 -1 17 7 17 -3 17 14 -2 -3 17 4 15 0 -6 -24 43 18 -36 -14 2 5 2
7762 2 -1 2 26 6 11 -39 9 -30 -13 2 12 -34 22 -23 7 -11 16 22 -15 -8 19 37 4 32 -5 1 -26 17 -21 -3 -1 -12 13 -22
7796 -22 -17 -3 -14 -14 -6 -4 -27 13 28 -23 -20 39 -7 1 1 8 -21 -11 -2 6 -29 29 4 -24 23 2 -37 10 4 31 9 -25 -5 35 -27 -10
7832 -10 0 -26 -21 3 -8 32 22 -15 -4 -4 -8 11 -3 33 -1 6 -7 -5 5 13 4 2 15 27 24 -6 -16 11 16 7 -7 -11 4 8 -8 -27 -2
7869bk2%LM5pl1J0k0J3rM7Pj4j2j5J5J1k5j4J1JM3l5qJ3J8rl9N7l4K2Kk6Lj2J1
7905bj8L0qPj6oJ3rOL5k5Nj2lRJ6l1J1LMkqRpLNmJ3rrj4K5l2M1l0K5Lmj9LJ5P
7947B0QK2n4nJ4N0q0M5l%j5jJ8k5J2K9j8pl5K5J7j7kJ4l5K9J5l0K4k2J7J8m8J8
7981bJNJ5l8J7J3J8l7L3k4j0J0LK1J8l5Pj1Rj4QR%j7RJ0j7kJ7j1Pj5knjL6j5k4
8019a4K1j7K1l4J8J8j5J5J1ll5K0NPk3J7l3L3j0LJrK6m6K0lJJ8pm2M2pLmJ7j0
8055Ej0K5jk7j2j1K8jjL6m7J6Pmjj9J7j8N1k0j1L4o0MK2k8L1j2nK5J0n2J9Ok8
8090c2O4m1lj3K2lj0j5J2oK1rLM2k1k8L4j9jjK5j7pj0J6jJK0k4KjOj4J7J9k4j6
8127a2jK8l9N1j8j0j0OJ8ok1jJ5nqqjMNK1k4J6J9Jk8j8K1J1k5K4qRj7qL7QRk4
$$ plain form
7869 -2 -24 -24 -21 24 17 -14 -4 -24 -11 -20 27 34 20 8 -7 8 19 -6 -20 -9 -8 35 0 -8 5 23 14 -25 32 -2 20 22 -4 -1 -13 -2
7905 -2 -20 10 2 9 -7 -13 0 -9 -3 32 7 12 0 -3 6 22 -9 2 5 9 7 -1 8 1 4 9 5 18 9 0 -14 11 -21 20 -10 15 18 14 -5 -2 13 20
7947 20 28 50 -4 -9 5 55 -25 20 17 17 2 1 19 -6 6 35 17 10 -25 0 17 0 -2 12 -23 6 21 -9 15 -7 10 28 -20 -2
7981 -2 -1 4 19 -19 -2 11 29 -8 25 1 -9 1 4 25 43 8 15 4 13 -1 7 16 16 -1 8 18 1 -1 16 5 12 -3 -5 -10 -11 25 10 -14
8019 -14 7 -10 11 -23 -5 13 -2 13 24 21 -14 6 11 18 -5 12 -21 12 2 5 6 -3 23 -23 -3 -6 -5 13 6 -36 6 -1 2 -2 15 5
8055 5 -5 20 19 -8 -20 -31 -3 -4 -5 31 -16 0 7 3 2 -17 0 -18 33 13 2 36 -24 -20 2 -26 5 -7 -12 13 23 -29 -10 -4 -32
8090 -32 32 -9 -12 -25 -3 -6 -16 -31 -19 -25 -4 -13 -10 32 11 -17 17 -2 -3 -4 21 4 -3 -13 3 2 3 23 -1 1 0 6 -8 9 28 4 -12
8127 -12 -13 15 -24 27 9 -1 -11 -5 13 7 -14 -15 0 -5 -13 -21 -22 -18 -13 8 -16 0 19 20 -8 -26 -5 6 -19 5 -3 6 -11 -19 18 26 35 11
8165A1j5j4K4mNqJ0k4j1K0mL6m5L8j5J0Pk8J1j7J1J0jj2NJ7
$$ plain form
8165 11 -4 -18 6 2 7 -1 9 -15 -26 -6 -10 26 -19 19 4 14 21 -7 4 -13 -2 8 7 -5 0 17
8191A7
$$ Imaginary data points
##PAGE= N=2
##DATA TABLE= (X++(I..I)), XYDATA
0@%%%%%Qj6QqK4l2L2l9N5p2Q0q8J11j39J64j88K18k60L06l48L96m57N27n98O72
30C56p60Q64r73J084j211J359j519J685j867K075k306K555k823L123l464L839
46B017m250M715n250N862o562P379q358R553j1032J2919j5437J8964k4225L2804
60A9099n9467N02137k56021p61539N35947N49391o31325m15704P60803K01665
70D44986p89419j1790P96157k11746p17974L87442O14744n45930m60773O47290
80A52987K99638p20885j07632P38295q2065p13846K69357O32513m25489n14389
90d71516N53334L61687o38075j97541O82343K2192o78030J52968O29712l16873
100A00201n38702M51474M16848n50503k69837O09779J08706o29537N4797O08732
$$ plain form
0 0 0 0 0 0 0 8 -8 0 -8 16 -16 16 -23 32 -40 40 -48 63 -76 88 -100 118 -142 164 -184 212 -245 282 -316 356
30 356 -404 460 -513 571 -640 719 -800 885 -982 1093 -1213 1342 -1481 1642 -1822 2017
46 2017 -2233 2482 -2768 3094 -3468 3911 -4447 5106 -5926 6993 -8444 10520 -13705 19099
60 19099 -40368 461769 205748 -555791 -19844 529547 -101778 -517482 243321 444986
70 444986 -344433 -356223 439934 228188 -489786 -102344 512400 -33530 -494303 152987
80 152987 452625 -268260 -375892 362403 280338 -433508 -164151 468362 42873 -471516
90 -471516 81818 443505 -194570 -392111 290232 312424 -365606 -212638 417074 100201
100 100201 -438501 12973 429821 -120682 -390519 219260 327966 -301571 -246774 361958
110C61958k09501n49286L46577M52524m57884l26559N36960J83307n76788l4179
120b72871N75795j10790n38719K46537M70797l66804l72783M59346K48846n15901
130a76547j12327N36145k5078n23266J56835M78793k77222m03212L79573L00329
140C34023m53636j78349M92541M9520m97620P6996M71644j96593m16287L01296
150a6465L34357l83016k32424M37610J17702m61812K609M55231j19294m19481
160b84983K24435L57871l12374k74726L78904J74758m21642o4554M35559m8979
170A64269m16402J56175L69042k48352l01507L22001K18076l74513j19745M02329
180A71373J2766m02400R2247L72548j86226l17897K63222K47360l22078j65001
$$ plain form
110 361958 152457 -396829 -50252 402272 -55612 -382171 154789 338096 -238692 -272871
120 -272871 302924 192134 -346585 -100048 370749 3945 -368838 90508 339354 -176547
130 -176547 -288874 247271 222193 -301073 -144238 334555 57333 -345879 33694 334023
140 334023 -119613 -297962 194579 244099 -253521 -176525 295119 98526 -317761 -16465
150 -16465 317892 -65124 -297548 140062 257764 -204048 -201439 253792 134498 -284983
160 -284983 -60548 297323 -15051 -289777 89127 263885 -157757 -222311 213248 164269
170 164269 -252133 -95958 273084 24732 -276775 45226 263302 -111211 -230956 171373
180 171373 184139 -218261 -126014 246534 60308 -257589 5633 252993 -69085 -234086
190b34086L62416P0939l78974K9991L67256j25724l28382K06937K69750k71576
200c1453j99408L19691J18714l49459k7166L54332o7802l31580J53304K87080
210B26253k22469k27658K77282J55956l16502p3318L34269j5085l27425J00491
220h8206K96762j75418k47301K36069J83713k80726j09853L06942L0374l11278
230a58922M9949K94662j25968k59014J91537K06457k41468j42395K74244P1547
240A60629k90311K580K87801p6393k65413J44993K25651k02376j71289K44509
250F0381J06218k68818l6449K75382l4000k64814J02007K36425j63463j91731
260a78862K12109J34383k43189o9340K56707L081k55110O1374K38900j22263k05845
$$ plain form
190 -234086 128330 199269 -179705 -149714 217542 91818 -236564 -29627 240123 -31453
200 -31453 -230861 88830 207544 -141915 -169081 185251 117449 -214131 -60827 226253
210 226253 3784 -223874 53408 209364 -107138 -180456 153813 138728 -188697 -88206
220 -88206 208556 33138 -214163 21906 205619 -75107 -184960 121982 152356 -158922
230 -158922 -108973 185689 59721 -199293 -7756 198701 -42767 -185162 89082 160629
240 160629 -129682 -127102 160699 84306 -181107 -36114 189537 -12839 -184128 60381
250 60381 166599 -102219 -138668 136714 102714 -162100 -60093 176332 12869 -178862
260 -178862 33247 167630 -75559 -144899 111808 114889 -140221 -78847 160053 37790 -168055
271a68055J74959J56909k13722r9261K35939L8700k43085K3029K35298q3311k12091
282a54691J37927J74654j81786j25641K12054O9664k27782j0944K28435m7778
292G4112k14019J02352J85542j49009j45729J85238R7023k08993m1725K18265
302A03057j5336k11532O9463J90642j17449j58869J56734J18164j85714o9868
312a20708K02270J5978k04432L8001J91979q5960j67469J26435J34346j59624
322b9184r3335J83805M5094j95116O749J90920n6621j73023R9531J45433j34980
333a0727j10686J63204O8701j80779k0326J84195k8964j73455P3162J52189j09894
344F620j23207J39292Q7181j61443m4954J72650n75j70250M4747J56110q3777
$$ plain form
271 -168055 6904 163813 -49909 -149170 86769 125469 -117616 -94587 140711 57400 -154691
282 -154691 -16764 157890 -23896 -149537 62517 132181 -95601 -106545 121890 74112
292 74112 -139907 -37555 147987 -1022 -146751 38487 135510 -73483 -115208 103057
302 103057 87721 -123811 -54348 136294 18845 -140024 16710 134874 -50840 -120708
312 -120708 81562 97540 -106892 -68891 123088 37128 -130341 -3906 130440 -29184
322 -29184 -122519 61286 106380 -88736 -81987 108933 52312 -120711 -21180 124253 -10727
333 -10727 -121413 41791 110492 -70287 -90613 93582 64618 -108837 -35675 116514 6620
344 6620 -116587 22705 109886 -51557 -96511 76139 75564 -94686 -49939 106171 22394
355B2394j33255J16613J03221j42319o6006J58663K4268j63991J8306J57459n9016
366C6337j40574R4887J15015j23479q2142J43321M4340j53592m397J54171l5202
377D8685j43922P2387J23004j04050r4396J27031O0984j40832k4768J45786j2909
388E7000j41576M9831J27699q2565j04697J08621P5355j26190m2673J35303Q219
399F4327j36672K6635J29719o0399j13432Q9676Q8483j11516n8373J25439K6226
410G0113j31202P129J28964m0959j17629P2062R7346r6606p0881J13141M0911
421G2389j22516r282J24295k2882j17050N3102J01910p8615q0727R8319N5197
432G4140j11844k6032J17800m930j15347L4468J05025o0901q8713Q3322O7302
$$ plain form
355 22394 -110861 5752 108973 -33346 -99352 59311 83579 -80412 -62106 95353 36337
366 36337 -104237 -9350 105665 -17814 -99956 43365 87705 -65887 -70284 83887 48685
377 48685 -95237 -22850 100154 -3896 -98292 28739 89723 -51109 -75877 69909 57000
388 57000 -84576 -34745 92954 10389 -94308 14313 89668 -36522 -79195 56108 64327
399 64327 -72345 -45710 84009 23610 -89822 -146 88337 -23179 -81552 43887 70113
410 70113 -61089 -53960 75004 34045 -83584 -11522 85824 -10782 -81663 31478 72389
421 72389 -50127 -59409 64886 42004 -75046 -21944 79966 1351 -79376 18943 74140
432 74140 -37704 -63736 54064 49134 -66213 -31745 73280 12379 -76334 6988 74290
443G4290j00340m0864J10497J1075j12151J8481J06111m5164r3462O8001P5291
454G1765q7131n2507J00876K5732j06947K751J04674k9875r5239N3503Q1006p3257
466d649o2302Q9225L8941r9487j2218J01493j4762r5800L8749Q4786n9355o9621
478f5000P6868M9815r0038k5640R6522J34r5085K4197Q7265m6267p4908O5328
490C191N8054q0227l6939Q9254J2897r1560J1212Q7684l3533p8084N3217O3833
502E8999o9129m5550Q0066K4515q5526k428Q5439j9516p9981L9906O9052n7435
514a588n3600P0737L5257p8912j5036Q2433o433q0734K7746P3159m6653o0063
526e3687O1431M3086p1961k4267P7802M536p8621J5865P3972l5380o3765N1656
$$ plain form
443 74290 -26050 -66914 43583 54658 -57493 -39012 67099 21935 -71527 -3526 71765
454 71765 -15366 -67873 33003 58735 -48212 -45461 59213 29338 -65901 -12398 68608 -4649
466 -4649 -66951 22274 61215 -38272 -50490 51003 36241 -59559 -20810 63976 4621 -65000
478 -65000 11868 61683 -28355 -53995 42527 42661 -52424 -28227 59038 12771 -62137 3191
490 3191 61245 -18982 -55921 33333 46230 -45330 -34118 53566 20033 -58051 -4834 58999
502 58999 -10130 -55680 24386 48901 -36625 -39053 46386 26870 -53111 -13205 55847 -1588
514 -1588 -55188 15549 50806 -28106 -43142 39291 32858 -47876 -20130 53029 6376 -53687
526 -53687 7744 50830 -21131 -45398 32404 36940 -41681 -25816 48156 12776 -50989 667
538F67M9563o3433l2828P0985J4626p4396M297P2823k3246o6226M0551N5037n4313
551e893m0533O3774K4231o9351o466P0969j1931o7489K9501N8984m4598m7138
563d5940N6174L2796o4135j6087O7993k199o7181K0023O1483l5220n1760M7885
575C832L9028n7939k3600O4076O281o5015J0681O1069k5807n3849L8945M3732
587D1434n0131l0510N8150J5244o1472Q19O0204j6118n5464K9900M7853m2053
599b144l7114N1764K3162n7772p706N9167p631n6262K2003N0054l4541m1131M5061
612F910K9419n2706j5082N6102pn5180J3905N0835k6488m3999L7740L4442m6589
625a0698k1938N1846Q039n3314N803N1464j8690m6408L0320L8231m0360k7373
$$ plain form
538 667 50230 -13203 -46031 24954 39580 -34816 -30519 42304 19058 -47168 -6617 48420 -5893
551 -5893 -46426 17348 41579 -27772 -34238 36731 24800 -42689 -13188 45796 1198 -45940
563 -45940 10234 43030 -21105 -37192 30801 28602 -38579 -18556 42927 7707 -44053 3832
575 3832 42860 -15079 -38679 25397 31678 -33337 -22656 38413 12606 -41243 -2298 41434
587 41434 -8697 -39207 18943 34187 -27285 -26466 33738 17620 -37844 -7944 39909 -2144
599 -2144 -39258 12506 35668 -22104 -29810 29357 21726 -34536 -12533 37521 2980 -38151 6910
612 6910 36329 -16377 -31459 24643 24636 -30544 -16639 34196 7708 -36291 1449 35891 -10698
625 -10698 -32636 19210 27249 -26065 -20262 31202 12512 -33896 -3576 34655 -5705 -33078
637c3078M7194J4955n0538k002N0767j1025m7701K3507M1092l3963l1656M1872
649I424K0710m6963q814M8747l862m7375J6524M2724k7750l5124L6214K5462m1919
662a2002j4580M5516K941m6257R096M3513k0436l7737K9956K9691l7131k0221
674b7651M1915R509m4411K078M3972j3720l9910K4131L3132l2249k4691L8319
686A0424J4601m1959l454M2756p919m0410J8232L4969k6845k7465L3607J8831
698B5368l8241r085M0407j522l9464J1870L5846k0781l0443K8193K3242l4205
710h815j4402L7866M420l8651N786L6755j5092l2568K3117K6671k9934j8881L5093
723A1365R352l7312N53L6339r765l3479J8195K8966k5599k2320L1240J3699l4511
$$ plain form
637 -33078 14116 29071 -21467 -23469 27298 16273 -31428 -7921 33171 -792 -32448 9424
649 9424 30134 -16829 -25643 23104 19242 -28133 -11609 31115 3365 -31759 4455 29917 -12002
662 -12002 -26582 18934 21875 -24382 -15286 28227 7791 -29946 10 29701 -7430 -27651
674 -27651 14264 23773 -20638 -18560 25412 11692 -28218 -4087 29045 -3204 -27895 10424
686 10424 25025 -16934 -20388 22368 14449 -25961 -7729 27240 395 -27070 6537 25368
698 25368 -12873 -21958 18449 16927 -22537 -10667 25179 4398 -26045 2148 25390 -8815
710 -8815 -23217 14649 19069 -19582 -13796 22959 7867 -24701 -1584 25087 -4847 -23728 11365
723 11365 20717 -16595 -16042 20297 10532 -22947 -4752 24214 -1385 -23705 7535 21234 -13277
736a3277m193L5306m818l3660J2982L0076k0575k4702K6995J7425l1363r049L3282
749A4429N48l3108P735L0888j5390k6722K2310K0971k7866j3738L1279N377l2223
762a5510K961L1190j0845k8483J8190K3457k4236j6716K8512R266l0547j459L0437
775A6217o362k8548J3807K4910k0285j9480K4896J2855k7701n841K9101j568k8790
788a6789R252K6219j6044k1709K1266J6150k5194r612K7743K349k8405M991K6805
801A7022j1994k3177J7846J8340k2319j2566K5375O057k6861J137K6345q000k3894
814a6689J3901J9996j8853j5159K2635R363k4952k880K5549l862k4284J0210K1293
827A6268j5307j7298J9632J2388k2920o479K4515j52k4171O514K2216j2083j9063
$$ plain form
736 -13277 -17470 17836 13018 -20642 -7660 22416 1841 -22861 4134 21559 -9804 -18853 14429
749 14429 14977 -18131 -10396 20492 5102 -21620 690 21661 -6205 -19943 11336 16713 -15510
762 -15510 -12549 18641 7796 -20687 -2497 20960 -3276 -19992 8520 17786 -12761 -14220 16217
775 16217 9855 -18693 -4886 20024 -261 -19741 5155 18010 -9691 -15532 13569 12001 -16789
788 -16789 -7537 18682 2638 -19071 2195 18345 -6849 -16461 11282 13631 -14774 -9783 17022
801 17022 5028 -18149 -303 18037 -4282 -16848 8527 14584 -12277 -11140 15205 7205 -16689
814 -16689 -2788 17208 -1645 -16804 5831 15194 -9758 -12638 12911 9049 -15235 -5025 16268
827 16268 961 -16337 3295 15683 -7237 -13716 10799 10647 -13524 -7010 15206 3123 -15940
840a5940J6721J4738k0487r206K3039K976k3603L309K2214q861j9708J3654J6237
853A5083j7780j1513K0684N787k1924j02K1611n181k0006J0143J7418j4562j3830
866a4172J8226Q964k0399l479K0992j886k0415O886J8672j1733j5546J5947J1280
879A3337j8819o204K0138Q81k0042M230J8879q961j6586J3235J2873j6558q360
892a1957J8417L651j9080J208J8670o008j7068J0411J4260j3908j0475J6488O125
905A0734j7963j643J8197k926j7432P490J5405j1533j2227J4507Q459j6515m199
918i646J7644l01j7496M852J6083r117j3593J2500J0170j4791o428J6432K114
931H423j7042K433J6240o597j4156J0072J1478j2829q324J4929M458j6029k01
$$ plain form
840 -15940 781 15519 -4968 -14174 8865 11841 -11762 -8453 13761 4900 -14808 -1154 15083
853 15083 -2697 -14210 6474 12261 -9663 -9765 11846 6665 -13341 -3198 14220 -342 -14172
866 -14172 4054 13018 -7381 -10860 10132 8246 -12169 -5283 13389 1656 -13890 2057 13337
879 13337 -5482 -11686 8452 9333 -10709 -6479 12400 3439 -13147 88 12961 -3597 -11957
892 -11957 6460 10111 -8969 -7761 10909 4901 -12167 -1756 12504 -1404 -11879 4609 10734
905 10734 -7229 -8872 9325 6399 -11033 -3543 11862 329 -11898 2609 11068 -5447 -9646
918 -9646 7998 7697 -9799 -4947 11136 2019 -11574 926 11096 -3695 -10123 6309 8423
931 8423 -8619 -6186 10054 3457 -10699 -627 10851 -1978 -10302 4627 9085 -6944 -7145
944g145J5910l946j4793P597J2741j0711r988J3373O606j5152k575J5716j640
957E993j5016N442J3534q823j1253J1654Q125j3799m453J4830O08j4759L295J3626
971I004o655j1891R517R606j1960o451J3679K658j4282J020J3769m373j2600P545
985a414J0730j0343q068J2536M638j3628r69J3693k410j2965N543J1578q728r248
999i055J1220O156j2650k778J3142n66j2938L871J1948o894j0023R503P393j1359
1013c030m409J2257J284j2394J824J1917m941j0660P724Q551r808n998J1309L160
1027F786j2008j22J2006l026j1274O016R681q561p284J0301M513j1443j599J1875
1041E861j436j1416M534J0042p079q083Q987N736j0345l039J1041J77j1096K709
$$ plain form
944 -7145 8765 4819 -9974 -2377 10364 -347 -10335 3038 9644 -5508 -8083 7633 5993
957 5993 -9023 -3581 9953 1130 -10123 1531 9656 -4143 -8596 6234 6842 -7917 -4622 9004
971 9004 2349 -9542 -25 9581 -2379 -8830 4849 7507 -6775 -5755 8014 3641 -8959 -1414
985 -1414 9316 -1027 -9095 3441 8079 -5549 -6518 7175 4765 -8200 -2657 8921 193 -9055
999 -9055 2165 8321 -4329 -7107 6035 5469 -7469 -3598 8350 1456 -8567 936 8329 -3030
1013 -3030 -7439 4818 6102 -6292 -4468 7449 2508 -8152 -428 8123 -1685 -7683 3626 6786
1027 6786 -5222 -5344 6662 3636 -7638 -1622 8059 -502 -7786 2515 7028 -4415 -6014 5861
1041 5861 4425 -6991 -2457 7585 506 -7577 1410 7146 -3199 -6238 4803 4980 -6116 -3407
1055c407J0295n343q744P475O792r092m548J0297J878j0745R68J0453l702r346
1069f769N965P752p976n746R450L372j0337n52J0389k301r610M691Q399o632o741
1084f646Q398M488r597j928J0018q19r575L156Q722n299p387P162N511q612l136
1099e544R414O75r384J619Q860l846p918N880O461p596m436Q715K051r162K81
1114c930R045k518q315M647P137o567n381Q014L143q678q72Q715j321q320L357
1129a844P452n285o070O909M214p854k141Q226J02q244J974P860m029o844N826
1144B52N171p128l255P864J278q166Q42P996l002p179M882N786o248m096P272
1159B269K198p837k55P789j735p271L685O254n282m838O406L212p123j409P481
$$ plain form
1055 -3407 6888 1545 -7199 276 7068 -2024 -6572 3725 5603 -5142 -4174 6279 2577 -6769
1069 -6769 -804 6948 -1028 -6774 2676 6048 -4289 -4841 5548 3247 -6363 -1672 6727 95 -6646
1084 -6646 1752 6240 -3357 -5285 4733 3914 -5661 -2505 6217 918 -6469 693 6204 -2408 -5544
1099 -5544 3870 4545 -4839 -3220 5640 1794 -6124 -244 6217 -1379 -5815 2900 4951 -4211 -3930
1114 -3930 5115 2597 -5718 -1071 6066 -501 -5882 2132 5275 -3403 -4275 4440 3119 -5201 -1844
1129 -1844 5608 323 -5747 1162 5376 -2478 -4619 3607 3709 -4535 -2561 5299 1270 -5574 252
1144 252 5423 -1705 -4960 2904 4182 -3984 -3142 4854 1852 -5327 -445 5341 -907 -5003 2269
1159 2269 4467 -3370 -3625 4164 2429 -4842 -1157 5097 -185 -5023 1383 4595 -2528 -3937 3544
1174C544m72p350K427O626m157n468N439M111o463k501P095O50p290J338O863
1189D392l055o034M593M793n751l382O649J608p085L84O893k187o230L647N281
1204D516m899m042N993K424o615o09O632j062o261K574N593l933m593N065L294
1219D077o012j696O414P0o328J536N872k981n145M370M032n495k510O075R08o229
1235c042O45O005k208n390L574M515m809l187N587J653n831j36N824j324n475
1250c599K611M858l970l728M886K450n439j058N624l32n559J755N118l072m246
1265c701M211L096n013j805N387M65n473R20N254k325m626L560L614m482k346
1280c264M995J134n224J17N246j579m775K818L990l759k992M392J907m902o52
$$ plain form
1174 3544 3072 -4278 -1851 4775 618 -4850 589 4700 -1763 -4264 2831 3481 -3809 -2471 4392
1189 4392 1337 -4697 -104 4689 -1062 -4444 2205 3813 -3272 -2888 4005 1818 -4412 -765 4516
1204 4516 -383 -4425 1568 3992 -2623 -3232 3400 2338 -3923 -1349 4244 311 -4282 783 4077
1219 4077 -1935 -3631 2783 2853 -3475 -1939 3933 952 -4193 177 4209 -1286 -3796 2279 3187 -3042
1235 -3042 -2397 3608 1400 -3990 -416 4099 -710 -3897 1690 3343 -2488 -2624 3200 1876 -3599
1250 -3599 -988 3870 -100 -3828 1058 3508 -1931 -2989 2635 2303 -3256 -1501 3617 545 -3701
1265 -3701 510 3606 -1407 -3212 2175 2640 -2833 -1913 3341 1016 -3610 -50 3564 -918 -3264
1280 -3264 1731 2865 -2359 -2242 3004 1425 -3350 -532 3458 -301 -3293 1099 3006 -1896 -2548
1295b548N083o56m923K016M311l076l507L891K588m596j382M965L9m981J270M575
1311C069k408l876L407K970m174j871M619P02m771O12M513j718m047K673L322
1326C022l553k442M205J390m513j89M486r70m205K005L736k910l000L712K020
1341B794m311q30M402k66m340J396L971k378l392L260K537l937j412M230L27m263
1357b212P80L991j723l670K763K880l482j916L902Q52m015Q8L999j066l684K022
1373d91L180k860k429L498J445l827n00L897m06l852J390L531k394k830L157J989
1389B498l601j090L856O7l840R34L600j885l058K634K310l177j524L549O16l624
1405a735L00L577j243l279K120K655k677j989L166J180l526k55L588o82l389J584
$$ plain form
1295 -2548 2535 1879 -3044 -1028 3283 207 -3300 591 3179 -1417 -2799 2166 2205 -2776 -1506 3069
1311 3069 661 -3215 192 3162 -1012 -2883 1736 2438 -2333 -1721 2792 1074 -2973 -300 3022
1326 3022 -531 -2973 1232 2622 -1891 -2080 2406 1436 -2769 -764 2972 62 -2938 774 2794
1341 2794 -1517 -2347 2055 1789 -2551 -1155 2816 438 -2954 306 2843 -1094 -2506 1724 2051 -2212
1357 -2212 -1432 2559 836 -2834 -71 2809 -673 -2589 1313 2165 -1850 -1762 2237 1171 -2513 -491
1373 -491 2689 -171 -2600 898 2343 -1484 -1984 1913 1507 -2345 -955 2576 182 -2648 509 2498
1389 2498 -1103 -2193 1663 1730 -2110 -1176 2424 539 -2519 115 2425 -752 -2276 1273 1889 -1735
1405 -1735 -1435 2142 899 -2380 -260 2395 -282 -2271 895 2075 -1451 -1706 1882 1200 -2189 -605
1421f05K907k286k350K857J616l228q01L531j67l436J020L111j802k607K445J983
1437B188k909j262L230L79l314M95L155j293k751J955K298k595j636L016Q20l160
1453a384l8L139p69k871J428K568k124k056K725J322l034m80L113l48l015J066
1469g58K772j808k254K374J570k726q76K921J12k870O06K730j253k455J878J975
1485A938k438j238K666N55k745O9K757p71k588J464K211k057j643K475R67k653
1501a031l11K746l77k684J128K347j772j827K179J276k459o64K641l7k633P16
1517g62K419j340k013J859J482k191r58K405L93k521K78K436r35k186J512J749
1533A627j894j270K167P84k435r5K421n39k282J161J962j640j545J975J019k261
$$ plain form
1421 -605 2302 16 -2334 523 2139 -1089 -1890 1641 1474 -1962 -942 2169 367 -2240 205 2188
1437 2188 -721 -1983 1247 1626 -1688 -1193 1962 669 -2082 -127 2171 -424 -2060 956 1776 -1384
1453 -1384 -1422 1717 948 -1923 -495 2073 -51 -2107 618 1940 -1094 -1574 1539 1191 -1824 -758
1469 -758 2014 206 -2048 326 1896 -830 -1706 1215 1327 -1543 -937 1793 540 -1915 -37 1938
1485 1938 -500 -1738 928 1483 -1262 -1193 1564 793 -1795 -331 1880 -177 -1820 655 1622 -1031
1501 -1031 -1342 1404 1027 -1657 -529 1818 46 -1781 398 1674 -785 -1449 1192 1155 -1478 -762
1517 -762 1657 317 -1696 163 1645 -546 -1504 901 1294 -1227 -949 1487 552 -1634 -122 1627
1533 1627 -267 -1537 630 1414 -1021 -1116 1305 766 -1516 -355 1607 -33 -1578 397 1416 -845
1549h45l95K401k32k289Q05K048j313j677J727J243k080o93K214J17k221M39K066
1566A315r21j802J374J468j780r85K060M18k128N9K141o27j934J115J627j527
1582a27j293J924P20k038j74K093l86j980Q36J764j284j389J629R51j884m52J944
1599H54J7j945M74J843r59j578J371J201j669p55J860K50j863J56J837o26j740
1616a272J132J414j501r56J685N27j854m5J867m14j723Q73J487j279j143J565
1632C63P51j718k97J729j08j727N80J534j009j239J275R40j509n51J654J43j713
1649i02K94J642p31j386J081J047j324p68J555M31j684N5J636n38j457R29J193
1666A073j177r62J470N20j562j26J593k98j510P01J268r73j030J238P33j442l69
$$ plain form
1549 -845 -1240 1161 929 -1360 -555 1493 180 -1497 230 1473 -607 -1300 914 1031 -1190 -751 1315
1566 1315 394 -1408 -34 1434 -346 -1331 729 1147 -981 -922 1219 592 -1342 -227 1400 -127
1582 -127 -1420 504 1224 -814 -988 1105 719 -1261 -425 1339 55 -1334 295 1246 -638 -1090 854
1599 854 871 -1074 -600 1243 284 -1294 77 1278 -391 -1146 714 964 -899 -743 1094 468 -1272
1616 -1272 -140 1274 -227 -1183 502 1029 -825 -870 997 583 -1140 -267 1220 -59 -1202 363
1632 363 1114 -604 -901 828 720 -1007 -427 1107 98 -1141 134 1074 -435 -986 668 811 -902
1649 -902 -608 1034 303 -1083 -2 1045 -279 -1047 508 939 -745 -690 946 408 -1049 -120 1073
1666 1073 -104 -1066 404 924 -638 -764 829 531 -979 -278 990 17 -1013 225 958 -484 -853
1683h53J524j1j478L76J407p73j184J057Q91j234o17J435K19j478J96J397n87
1700B87j224Q61J018j090p85J387L10j392J3J383l35j295O64J111r71q73J218
1717B87N10j278j90J319j33j306M58J178p22j023J042P01j215l63J265J24j303
1734f49K15J232n47j100Q35Q99j116n63J220K33j260O8J279m29j124P08R33r37
1752a03o61J061L90j180r0J201j83j183N38J001q12p84R77N67j093k93J178k6
1770E05j165L20J075o03q87Q19O73j031m13J162J11j157J46J161m73r38O49P68
1788G22r09n27J041L06j095l0J092k62j026N92Q13p28o96R12M46j030j90J116
1806E47j62j019L91R14n83p74P57N95r57k97J023O1j042K33R68m93q59O73P04
$$ plain form
1683 -853 671 660 -818 -442 965 192 -992 65 956 -278 -895 540 759 -719 -523 874 287
1700 287 -937 -76 942 -148 -933 454 764 -628 -615 768 433 -862 -198 913 -58 -931 287
1717 287 797 -481 -671 648 515 -791 -333 845 123 -900 142 843 -372 -735 530 654 -649
1734 -649 -434 798 251 -849 -14 885 -231 -794 426 659 -601 -533 746 317 -807 -99 834 -103
1752 -103 -764 297 687 -493 -583 618 435 -748 -210 791 -21 -805 172 739 -354 -647 531 505
1770 505 -660 -340 735 132 -755 64 737 -294 -707 455 566 -591 -445 716 243 -695 -46 722
1788 722 -187 -714 327 633 -462 -492 600 338 -688 -96 717 -11 -707 205 651 -379 -569 547
1806 547 385 -634 -243 671 88 -686 71 666 -291 -588 435 496 -546 -313 655 162 -697 -24 680
1825F80q58m25J007Q2r71J05R49k92r06N66O99p13n18Q64K84r74k3R28j22r26
1845e64L90P94o14o57P98M11q62j86Q83Or33K79Q46m75p25O56N70q35k89Q40J00
1866D33q84J14Q74l98o91N16O20p10m33P87K36q30j0Q41j97p90L77P27o13n19
1886e50P34K89p85j10Q59o7q80L40P12n03n84O58L90p39k17Q06N1q01J53P65m05
1907A16o17M91N16o38l46P48J41p78O4P55k56o80M15N84n78m35O74K73p52j4O77
1928C60j03p43L26O45m43n61O31L38p23j09P20k9p16K34O16l83n32N21M03o44
1948a92k41P17O6p00R9O92l33n73M19N15n67l40O34J73o63nO70j57o42L46N42
1969D60m83m41O39K56o74j11O93q8o09K14N78l92n12N35L28n88j49O14j5o02J51
$$ plain form
1825 680 -178 -603 404 486 -485 -380 569 277 -629 -63 636 -77 -595 269 553 -421 -444 484 362 -564
1845 -564 -174 620 6 -651 147 558 -304 -490 393 399 -534 -255 591 116 -609 47 617 -218 -507 333 433
1866 433 -451 -337 537 139 -552 -36 584 -126 -559 228 464 -366 -376 465 268 -522 -145 582 -31 -550
1886 -550 184 473 -312 -422 437 370 -510 -170 542 39 -545 113 503 -236 -453 353 404 -397 -244 521 116
1907 116 -501 -10 506 -132 -478 270 411 -367 -303 452 196 -484 -69 515 -63 -498 176 449 -303 -317 360
1928 360 257 -486 -160 485 42 -519 112 450 -273 -382 338 309 -407 -173 443 60 -472 49 452 -192
1948 -192 -433 284 350 -350 -251 441 108 -465 -46 469 -98 -438 196 369 -294 -299 371 214 -428 -82 460
1969 460 -23 -464 175 431 -243 -354 339 251 -358 -144 434 42 -470 65 393 -195 -344 270 255 -347 -196
1990a96N98k99n08M35L54m90k38N34J08n60K2N62j85n48L77M40m40l36N39J95
2010C64n66j02O38j24n90K81M73l76m09N07K54n35j31N51Jn47J29N54k79m73M31
2031E1L00m97j76N25P8n72J18N03j95n10L40L87m12k79M89J31n04k8N43j38m74
2052c20K68L83l37l57M62K33n25n0M84o9m81K01M46k97l86L83K60m30j53N00O
2073B21m56J00M38k15l99L16L02l73k12M23R3m54NM56r6m36K30L77l20k87M01
2094A14J58m56l0M63p7m42K07L51k74l30L83J99l91p0L75Mm05J00L75j89l55L01
2116A1K60l57j59M14J2l99P3L80j34l55K15L16l20k06L93J02m19m5M44p8m14K05
2138f1L67l11k45L50J15l74m3M20q9l35J21L27k42k42L01J78l39j20L70M2m16
$$ plain form
1990 -196 402 103 -405 30 384 -106 -344 190 298 -262 -240 322 137 -411 -34 406 -34 -370 169 364
2010 364 -202 -304 334 210 -380 -99 374 -2 -411 96 350 -185 -316 235 236 -311 -182 372 93 -380 51
2031 51 351 -146 -322 203 281 -291 -173 330 135 -375 -35 352 -60 -339 150 281 -223 -251 292 154 -320
2052 -320 -52 331 -6 -363 99 332 -193 -243 241 172 -309 -108 338 41 -345 38 298 -132 -285 215 221
2073 221 -235 -135 303 88 -311 5 307 -66 -278 145 238 -216 -211 245 149 -287 -57 320 0 -287 114
2094 114 272 -184 -214 249 172 -270 -63 288 14 -316 67 266 -125 -195 180 184 -221 -121 254 65 -290 11
2116 11 271 -86 -245 169 181 -218 -145 235 101 -254 -39 277 -43 -249 144 246 -173 -218 226 148 -266 -61
2138 -61 306 -5 -250 100 215 -159 -202 218 129 -206 -85 242 0 -242 59 237 -102 -222 148 190 -226
2159b26Q6L80j70l04K27K53k76k09L45Q6l69K4L36r8l37K10K65k49k25L37J48
2180B34l70l8L79r1l25J27L59k28k84K68J77k93j05L36J6l30N5L24j28k93K18
2201HJ83k54j50L38P3l61J1L70j31l31K05K76k64j78K83J44l49k1L13r3k93J54
2223f7L02k44j97K10J75k81o1K85Ol31J01K98j54k40J88K14k75j34L00P5l42M9
2245a23L29j70k12J94J47k44j12K77O9k83j3K64l0k77J27K50j79k07K27J48k74
2266i2p1L10k9k91P2K63j09k40K28J43k45j11K63M2k93Q6K30o3l07K19J73k23
2288d5j11K27O5k44lK65j01k30J37K32j96j69K31Q8k26p6K75ok53N7K58j20k40
2311a85J72J98k63r2K54L9k49M3K19q8k20J54J84j99j43K43O1k35j3K28l9k66
$$ plain form
2159 -226 -140 240 70 -234 -7 246 -30 -239 106 192 -177 -153 183 85 -252 -42 223 -26 -251 86 234
2180 234 -136 -174 205 114 -211 -84 275 47 -237 31 208 -85 -190 146 162 -168 -113 211 83 -210 8
2201 8 191 -63 -213 125 198 -163 -152 218 87 -244 -39 237 -27 -205 78 222 -127 -148 165 72 -221 -67
2223 -67 235 -9 -206 4 179 -102 -163 122 128 -203 -102 196 42 -198 -10 204 -71 -205 95 170 -172 -123
2245 -123 206 36 -176 18 165 -79 -191 86 155 -128 -141 123 93 -184 -57 193 14 -193 34 182 -92
2266 -92 -163 147 118 -173 -101 162 53 -187 41 184 -61 -172 91 133 -160 -74 156 93 -214 5 178 -45
2288 -45 -156 71 136 -108 -111 154 53 -177 -40 192 -4 -173 58 146 -80 -156 119 113 -140 -83 175 55 -185
2311 -185 -13 185 -78 -170 84 123 -126 -83 136 48 -172 -18 166 -33 -176 67 128 -107 -120 108 69 -197
2333a97J76J95j81j76K25J03k39k3K27k3k31Q1K03j37j93K08J34j93r5J94L4j99
2355a07N5J92j07j93J48J58k09p3J77M9k18K8K35p3j58N8J71j32j43J74J15k52
2377a05m4K43j7j66L0K02j45j39J80J14k15k5J67J7j92M0K34j52j55J05J81j86
2399b8p4J64N5k07K1J73k0k35J45J43j30j43K17M1k01MJ68j9j85O1J40j06j14
2422a30J79O3j71l0J82j8j82L3K04j22j57J58J41k16m2J91L1k02J1J79m9j67J32
2445A8R0j41o9J63M5j49l4J49l4j75J20J31j09j22J48N7j67pJ60k0j35M4J25o9
2469A9j17R5J13j72n1J56N6j73j9J87m1j61R4J47j62o1J39K0j69M7J24m0j26O1
2493c4J28p9j43J77M4j60j8J74j8j42QJ43o4j23J15P2j26j7J15J3j28J1J45q9
$$ plain form
2333 -197 -21 174 -7 -183 42 145 -94 -117 110 87 -144 -63 140 3 -190 18 152 -41 -136 58 92 -107
2355 -107 -52 140 33 -160 -12 146 -63 -136 41 90 -128 -100 135 62 -96 -38 133 1 -142 32 147 -105
2377 -105 -149 94 77 -89 -59 143 -2 -141 39 153 -62 -87 80 97 -95 -55 179 27 -128 -23 158 -28
2399 -28 -102 62 117 -90 -69 104 84 -151 -6 137 7 -136 81 122 -79 -75 93 74 -111 -50 90 -16 -130
2422 -130 49 112 -59 -89 93 75 -107 -74 130 8 -149 9 150 -66 -108 83 114 -88 -77 102 53 -114 18
2445 18 108 -33 -102 61 106 -43 -77 72 38 -137 -17 114 5 -117 31 88 -79 -86 74 54 -81 -37 88 19
2469 19 -98 -3 110 -62 -113 43 99 -74 -93 94 53 -108 -14 133 -29 -90 49 69 -100 -53 71 31 -95 -34
2493 -34 94 15 -128 49 93 -67 -85 89 71 -71 -63 80 16 -107 8 80 -46 -63 52 65 -63 -52 93 4
2517Dr4J08Q9j38n8J21O0j47k1J77n2j47P6J22q4j13J02J07j63l5J83l2j83O5
2541e3J47j08q5J17O9j37l2J61m3j25L0J47q3j12J20P4r5q6J28L0j11k4J70q3
2565A6j43J20J18j27o7J02O1r3p0J53m0j14O7J09j08o0J08M0j24m1J68qj54N9
2589b8J06m3j03O0J05j35n5J53nj38L6J48o8j48J10P9j08p8J60J4j38K0J43p2
2613A5r1P0Q7m4j33J18N1j23k9J19%r9P1N5p7o4J00K5o3n8J10L9j50K4R8k6q9
2640f4O3M7q1n6J22K8j12k4J37l0r4O9R5r1j12J28M0j05l0J37rj17K3R8q3n1J09
2667C7Kn7l1O6Qj12M8O9j0j37R9R1j01JO4N6j47J8J22p2q5N0O8o7n4J02K6o9o4
2696g9J38l3q4L9P7o6n2N5N6p9k3J00Rj43M9J03n5r1L9P2q4NN5K7p7j2J08k5q9
$$ plain form
2517 4 -90 18 107 -31 -89 32 92 -55 -76 101 49 -98 -22 100 16 -97 5 112 -51 -86 97 65 -118 -53
2541 -53 94 -14 -99 18 87 -50 -82 79 36 -89 -59 88 5 -107 13 87 -8 -94 34 64 -47 -71 99 16
2565 16 -127 -7 111 -16 -83 19 80 -13 -83 70 30 -84 -17 92 -16 -76 32 72 -52 -93 75 67 -87 -28
2589 -28 78 35 -68 -8 97 -38 -93 60 55 -83 -47 101 33 -115 -5 74 -34 -112 48 62 -76 -56 87 15
2613 15 -76 -6 81 37 -96 22 73 -50 -79 40 40 -59 12 67 -10 -74 26 51 -12 -70 40 79 -71 -47 51 25 -64
2640 -64 -1 46 -35 -91 31 59 -53 -77 60 30 -64 5 100 9 -103 25 65 -40 -70 67 58 -59 -36 62 -21 -72 37
2667 37 39 -18 -49 17 25 -87 -39 30 20 -117 -18 73 -28 -27 37 93 -54 -36 86 14 -71 -21 47 -20 -74 28 54 -15 -79
2696 -79 59 26 -58 -19 58 -8 -60 -5 51 -28 -51 49 58 -85 -36 67 12 -79 -40 32 -52 -47 8 35 -42 -54 54 29 -60
2725f0P6L6p7q7J26L8j15J0J29m8l7rQ0k9j12R3M8q4k2N9j6n2M1N4o5l1N2N8q8
2754c2m1J02j2l4pO6l7m6K4O2q5k6J16j3n4l1R7l4n3L2O4q1qP3J4r2J2P1l2j1
2784Dk0M3k4m8N3Jl9lQ2Qq6K1N4k7o3N5J2m6l9J10qr1nJ19n6n6L8O9p5l5Q5nn3
2817b5%O5J7j35N3Q3l1n1J3N1l9l9P5j7p0L1N1k9m6L1N7n3n3O8L1o5RO4j6j11
2847h1N7L9j8o2O8L8p5mN2K3q9O4K3n5j7M1R1j11rL7L2r4K8Q2p3l7Q5M0q9j2N4
2878B8Rm8j1N4k2m2qP1o9L1K6L1p5J0L1j4m3K3P7q2qL6jl4j7O9k0m9N8K0n9j6
2910d4O7K7p0rM2nk8J0M2m9k0L6N6p3l6P3Po3kO9L1j24M7O7o8k4O2ro7N1L9j7
2942A8n7L3J7kn1O4J4p9NO4rq9N4Q0m3p5O8mm0J1N7j2k6oO0m7m0O8j0j9j9jL5
$$ plain form
2725 -60 16 52 -25 -112 14 52 -63 -53 76 28 -9 -18 62 33 -79 14 62 -22 -44 15 -1 -53 -12 42 -23 -54 -2 56 -32
2754 -32 -73 29 17 -17 -24 42 5 -41 -17 45 -40 -66 50 37 -17 -48 49 15 -38 -6 58 -23 -31 42 56 -36 -24 47 15 4
2784 4 -16 27 3 -45 8 9 -30 -33 49 57 -29 -8 46 19 -44 11 23 -23 -62 48 40 -51 -56 63 7 -49 -11 58 -17 -52 33 28 -25
2817 -25 -25 40 57 -78 -25 58 27 -24 -11 40 1 -38 37 20 -50 -19 32 3 -43 -12 45 -8 -61 7 38 -27 -18 46 30 -81
2847 -81 -24 15 -3 -65 3 41 -34 -38 14 37 -52 12 35 -20 -37 4 95 -16 -25 12 44 -50 -22 60 -13 -50 35 75 -14 -26 28
2878 28 37 -11 -22 32 10 -32 -40 31 -38 -7 19 50 -25 -15 16 2 -41 -18 59 -23 -31 5 4 -30 -47 22 2 -47 11 31 -28 -44
2910 -44 23 50 -20 -29 13 8 -20 -10 32 -17 -37 -1 55 -18 -54 19 26 -37 -39 30 61 -63 -16 51 -17 -41 21 12 -55 -4 35 18
2942 18 -39 -6 11 9 -42 22 36 -43 -38 26 17 -72 -18 62 19 -56 12 8 -32 -21 36 24 -2 -8 52 5 -35 33 23 4 -15 -16 19
2975A9k4l0P1j3o9J4L5Ko2Q2k7m1L3L1l1j7LK0J0q2P0L8n8M3J7n1j2J8J5qj8J1
3007a1M8j4m5N7l4l0lP5p2KoM0j3j3K4K6n6l1M7K4k6J4K6n2k1M6l1k4L0L8K7o5
3039b3kN5k0m7M8K6p0K9KK8l4j5K6J1n2K2M6m6k4O2l4j9L4J5J6n6RK3Mk7%M6k5
3072Hk6N4m1m1P2j5l7OM0lm2j2O5rOJ8k6j7o1P9J4n0j4L2K5l1m5N0j9k2J0N8l4
3105hmpL8l0l0N7J5o4K0L3j9l9L3Rj0l0N3rl0mK7%Jk7M8o9pN8j9kLK8j0l7J6R
3141gj6J6rRj5K3MK4o1M0j6K4p4N9J6k5k4L3jnj1M9k9l6J9RolN2m7jqL9m4OK2
3177FJ3m2J5j4M7n9J2N0kk0k7N6j7n2OM1j0k2L8mn5K8J4Kj4QQJ1l0J5M3q1K1K
3211a3J6J2n2O4k7k5M6k7j5J0j4J8k9L1M7j3l0qK7j8m0L2K9p4L8P1l2m2J7J0k5
$$ plain form
2975 19 -5 -35 36 23 -46 -32 3 5 -57 25 -2 -43 -10 21 -10 -27 -24 -4 6 -76 -6 32 -26 17 34 -17 -29 -11 4 -4 -22 -11
3007 -11 37 23 -22 35 1 -29 -32 43 -29 -27 -33 7 -6 -19 5 31 -25 -56 -9 15 -11 3 29 -23 -44 2 -29 -53 -23 15 42 -23
3039 -23 -25 30 10 -37 11 37 -33 -4 -2 26 -8 -23 3 14 -38 -16 30 -16 -40 22 -12 -31 3 18 34 -22 -13 10 14 -13 -13 33 8
3072 8 -18 36 -5 -46 26 11 -26 -20 20 17 -25 -37 28 19 25 43 17 0 -61 18 32 -18 -32 0 25 -6 -51 -1 -20 -42 -32 26 -8
3105 -8 -12 -19 19 -11 -41 16 31 -33 -13 20 1 -38 -5 4 -6 -36 17 8 -22 -26 1 1 2 -25 23 -46 -53 5 -14 -16 -13 15 5 -32 -16 -7
3141 -7 -23 -7 -16 -7 -22 1 5 29 -32 8 -8 16 -58 1 17 -8 -32 1 0 -5 -16 33 4 -32 -13 -4 -10 -13 39 -8 -9 -17 22 -22 -16 6
3177 6 19 -23 -8 -22 25 -34 -22 28 26 6 -21 35 18 -34 -28 13 3 -19 19 15 -40 -12 2 4 -10 -2 6 17 -13 2 45 -36 -15 -13
3211 -13 3 15 -37 27 0 -25 21 -6 -21 -11 -25 -7 -36 -5 42 29 -1 -9 18 0 -40 -8 21 -53 -15 56 24 -18 -1 9 -16
3242a6J1M7jp2K1M5l7LnK5pm6J00q9k3M2nl5NK9OPn1L4L3k4NK4j4k7k5N6kk8L1
3277A7M1n9l2K7j0Oj0N3k7o2O5pLoK7j7l3L6mql7PK5J9o0O2J4k8m4L8K3n9N3J1
3311B4l4j4nM1k1k2N6J0o4J6Qj6L6j7M0l8j7K5Ml6NL0J4m4K9J1k1j1llRpN0n5
3345b0J4OK3l6KJ7K1%n2L2Mj6jK0J9o0k1Q3q8N3J3Rm2K2l9O8m7JM0l6k4L4J8l9
3379b2K3J4Ol7MK3l3K0K4m5RK4j0kk2M3J1n7K0M3lp2K3J9M8n2J9j5l1NJ0K4l1
3412b0KL2l3J4oJ1kn5O8j6K7m3K0Pk1K0J9j2l4J4K8l4MJ8ln6K6N4l5J5k8%j2K6
3446eKJ6m5L0L6Lp0M6pj6LQK9k8l6M8Om4K7LK3m0J4j7mlJ3j5J3jL0Qm0j6K0Ok4
3483b7N6Ql6pJ8Ok8OkNm0K9OJ8Pk2J1j5j5M8k0m2M9K3m4l1O7k4%Nj6L3m2k3O8
$$ plain form
3242 -16 -5 42 41 -31 -10 35 -2 1 -4 21 14 -32 68 -21 -44 -2 -7 -42 -37 -8 -2 5 -46 -12 21 -3 2 26 12 -15 -40 16 14 -14 17
3277 17 58 -1 -33 -6 -16 -10 -20 33 6 -56 9 2 5 -1 26 9 -24 12 8 0 -37 -30 -5 14 -46 16 30 2 -42 -4 19 -40 13 24
3311 24 -10 -24 -29 12 -9 -31 25 35 -29 -13 -5 -21 15 -2 38 0 -17 8 12 -24 -19 11 25 -19 10 21 0 -11 -14 -17 -8 -15 35 -20
3345 -20 -6 0 23 -13 -11 6 27 27 -25 7 11 -5 -6 14 33 -27 -48 35 -53 0 13 22 -20 2 -37 31 -16 -15 25 -11 -35 -1 17 -22
3379 -22 1 15 21 -16 -12 11 -22 -2 22 -23 -14 10 0 -2 -24 19 30 -27 -7 36 33 -39 -16 3 51 -1 18 3 -28 -23 -13 11 -20
3412 -20 -18 14 -19 -5 -11 0 -2 -57 11 -5 22 -21 -1 6 -15 5 24 12 -22 -8 20 -14 -10 8 5 -51 -25 29 -6 9 -19 -19 -31 -5
3446 -5 -3 13 -32 -2 34 37 -33 13 6 -10 -7 1 30 2 -34 14 20 -24 3 6 29 -11 3 -14 -18 -21 -8 -23 -10 -11 19 27 -13 -29 -9 -3 -27
3483 -27 29 37 1 -6 12 18 -10 -4 -6 -1 -41 -12 -6 12 19 -3 8 -7 -22 26 6 -36 13 36 -8 -39 28 4 4 9 -7 26 -16 -39 29
3518B9m4LPJ6lk8L9m3K0j7M9l5j2K6Mj4j8M2jk0k2J4j8L6%lj6MJ7%k1L1rl3J2
3553hj0J6J6m8K5pJ3KmK2Pk1K5l4j7nL7k2l3P8l2j9qQK9rJ2J6l4m4N1k3j2K8K1
3588A6pk6K5krpPkk5L4nj4J1J8Nk4k5M2qj9M3j7nk1L2k1J8m4J9OM4o1K0Jj5L1
3624A5k6J7m1L5J4Nl1M%j7N3m2M3n9K8Qj8QK2J0l2J6ok5J4Qjl2J0K5K2j2k4J3
3658DJ4l8PPJ8j7j6M8l6j3J2%J3j9JnrM0Rn3L2J4j2jJ6m7QL2kJ2k6MPj0K1kj5
3695bmK0l4%L1j4j1PlOK3pQk8PNj4j6J6J0jJ1l4QJ8K0J2p2RO2kp3N1j4j4PK3O
3733A7k6M8j1j6m8Q7l7j2rJ7mQlRk5OJ4nl4K1J3mj4k6PLM5J1m9M9l0nJ0k6J5k2
3769b6J8J8k4NrJ8pK4l5K9rl8N3k2%Mj1K0L1m6K3k9qLK1jj7J2J7k5OLKM2l2j9
$$ plain form
3518 29 -15 -12 -5 11 8 -20 19 -24 -4 -21 28 -7 -19 7 11 -3 -21 21 20 0 -22 -8 -26 10 10 7 -9 -5 12 12 -9 22 13 -20 -8
3553 -8 -18 -2 14 -34 -9 -16 -3 -1 -5 17 24 3 28 -6 -23 -28 9 -13 -46 32 0 -19 -27 -19 10 1 13 29 -5 -49 2 -21 -33 -5 16
3588 16 9 -17 8 6 -3 -10 -3 -5 -30 4 -1 -15 -4 14 19 -5 -30 12 4 -15 28 11 6 -15 17 -4 14 -30 -11 -5 39 -22 -2 -1 -16 15
3624 15 -11 6 -35 0 14 19 -12 -8 -8 -25 28 -14 29 -30 -2 6 -12 -4 18 28 -4 12 6 -19 -5 3 2 -30 -20 5 27 15 -9 4
3658 4 18 -20 -13 -6 12 -5 -21 27 -9 -22 -10 -10 3 -16 -15 -20 -29 11 20 -33 -1 13 1 0 16 -31 -23 9 7 19 -7 -3 4 -6 15 13 -2
3695 -2 -6 14 -20 -20 11 -3 -14 -7 -10 -4 19 12 20 -8 -1 4 -10 -26 -10 0 -1 10 -24 -16 2 22 34 -38 -29 33 31 -42 9 -5 -19 -12 11 17
3733 17 -9 39 28 12 -36 51 14 2 -7 10 6 14 11 20 -5 1 15 10 -24 -3 10 6 -8 -34 -27 -24 21 32 -17 32 2 -3 7 -19 -4 -26
3769 -26 -8 10 -14 -9 -18 0 -7 17 -18 11 2 -36 17 -5 -5 -1 -12 8 39 -7 16 -13 -21 -18 3 2 -15 -3 14 -11 -5 -2 0 42 10 -9
3805iJ0ojlJ8k0j4J2L3Km0j7N9n1J2J0J7k6J1qqM8j8ll3O2l9j0L8l3L3j2j7L4
3839C1l3l3M8J2j3Qk1Kl1N4k2MLQj5K2ln5K6L2m6K1J3k1Nj6L2l7%K5J7k0jNjn
3875ej7NLK5lNmj8NK3j2l1K5Rl6L0lk0L7nK2p4O9kk9j1K5KL2m3mj5j1nJ7jk7O1
3913A9j6k0QK7m3M9l6PJ5k8J8kqknJ0J1oj8J2j3J4j3K5J7k3j4K1k1LjqK7Mnl9
3949c4L5Kk1jK2k0NNK2k2K1J9l0j5nM7k1k5K3J2j0qj6J6j1rNqL7k0k4K1lJ5j9
3984a5J7j0J3%prJ4J6j7j2j5J8J0J3n7L2j1L2l8J6MOK3k6J9m7M1pj5K4j7lK4m9
4018c3N8j9J5l5j5M5m1J9Oj8mK4k6K3Lk6J1MK2j8%j3L1kk3j4rJ8K2lk2K9k9Rj9
4053c0J5K6J2k8L6l0n5O6rk6J5K6j5j4rqK7k1J9L8n2oL0j9QqJ8k2K9j2Rk2j4L5
$$ plain form
3805 -9 1 -5 -6 -9 9 -11 -25 -13 20 22 -18 -35 24 -27 -15 -5 12 -14 -3 -11 -19 29 11 8 -25 37 -2 -12 26 -7 26 14 -3 31
3839 31 -2 -35 13 25 12 20 -1 1 -30 24 2 6 9 17 2 24 21 -34 -8 24 -22 -1 12 -9 -4 -20 12 -25 -25 0 17 -3 -4 1 0 -5
3875 -5 -22 -17 -14 11 8 13 9 -9 -4 19 7 -24 1 10 -26 4 1 -19 18 13 35 -39 30 28 -1 -12 13 15 47 4 0 -15 -26 -31 -14 -15 -42 19
3913 19 3 -17 -9 18 -25 24 -12 -5 10 -18 0 -2 -10 -12 -17 -7 4 -2 -20 -8 -21 -7 -20 5 22 -1 -15 6 -15 -12 -13 -21 6 10 5 -34
3949 -34 1 3 -18 -19 3 -17 -12 -7 15 -7 14 33 3 -12 -17 30 9 -16 7 19 9 1 -15 1 -10 -19 -14 -22 15 -5 -29 -8 -11 4 -15
3984 -15 2 -8 5 5 -2 -11 3 19 2 -10 -25 -7 3 16 -41 -9 -20 12 -26 -10 -6 0 23 -3 16 -31 10 3 -12 12 -5 -8 16 -33
4018 -33 25 6 21 -14 -29 16 -25 -6 0 -18 -22 2 -24 -1 2 -24 -13 -9 13 -5 -5 -18 13 11 -12 -26 -35 -17 5 2 -20 9 -20 -11 -30
4053 -30 -15 11 23 -5 31 1 -54 12 3 -23 -8 18 3 -11 -20 -28 -1 -22 -3 35 -17 -23 7 -12 -4 -12 6 -16 13 1 10 -12 -26 9
4087Iqj6PK8k4lNnpj8PM0l3QK2%l0J4pK3j4J7Kk4J9MMj5j5Qj1J4%k5j2M8LoK3
4126C2m9J1%j0K5l3M5j5K3k9%%KPj8j1M0jk6j6L0j8PqLRK0j9qM%J4jj2%pjqK8
4165A0jn4N9l3N9n5NONj8K4k4J0mL5ol3M5k9j0K0kK0mm1L0k6K5mlk3J7nNRpKk1
4203a7L5j7J5j4nJ8j5oK0Kj0JpJJ9j6J4Kj6onj5L2J0j2rk4L9l2NJ3Llj6K2J0P
4240B3l4OPnj7qK0k0J6Qj8K4J4j1qJ6j4k6J8KQOk8rK1mOJ0j6J1l1J8K2qlLOLm0
4279c2L1K7Oo3K2j5N0l8MJ8j8M9m4J5l2NK1K8m4K8j9M2n2l1L1KnK4l4M4n6lO3
4312B4k2qj1MK7k4J9K3k6l5N4j6j5J2j4J2l5L1j6J6Mj2oRlj0L1j4k1L0l1J1J1
4345a%Kj0K3J7j5n9L8Mj9MOPk2L1LRj9l9N1pmj1K7k7mL0j1k2OJ9jLkNRk5k1JK4
$$ plain form
4087 9 1 -15 -8 20 -4 -7 -2 -7 -14 -32 -25 15 -18 -10 12 12 -18 -4 -11 12 -2 15 17 -7 12 16 20 5 -10 -2 -13 1 1 -24 -36 12 15 9 32
4126 32 -17 -6 -6 -16 9 -24 21 6 29 0 0 0 2 9 -9 -20 20 19 -7 -23 7 -11 -4 -12 -9 0 20 1 -7 -3 -3 11 10 -2 -2 -9 -10 -18 10
4165 10 9 -45 14 -19 40 -15 -10 -4 1 -17 7 -17 -7 -11 24 18 -15 30 1 -9 11 9 29 25 -16 14 -12 13 9 6 -17 0 -5 0 9 2 4 -17
4203 -17 18 1 16 2 -3 15 0 -6 14 16 6 7 0 1 20 4 18 20 4 -2 -7 -22 10 20 8 -1 -25 14 -18 -13 0 3 0 -16 6 16 23
4240 23 -11 -5 2 -3 -20 -28 -8 -28 -12 -4 -22 2 16 5 -3 13 -1 -27 -9 -7 1 7 -21 -30 -9 -13 -7 3 -13 -2 -33 -15 7 -1 -4 -1 5 8 -32
4279 -32 -1 26 32 -31 -9 -24 26 -12 -8 10 -8 41 -3 12 -20 -15 6 34 -10 18 -1 41 -11 -42 -11 -9 -14 10 -24 20 -36 -39 24
4312 24 2 -6 -17 -13 14 -10 9 32 6 -29 25 9 -6 6 -8 4 -31 0 -16 0 4 -8 -14 -5 -8 -18 13 -1 -22 8 -23 -12 -1
4345 -1 -1 1 -9 14 31 16 -43 -5 -1 -20 -16 -10 -3 -25 6 9 18 -1 -40 11 4 0 -11 16 -11 -15 15 4 -18 -12 7 6 9 7 12 21 -4 -25 -24 0
4385@L8k6l0K1rKj4NM4k7K2l4K5k1Jn%loL4nK2l5%j8J1L2k8lJ3lpLj9M2j4k3L9
4423B4k9mRk6M3j5j4MMnK5pJ0j7KmJ1j5K4j6nlMJ3k0J3NJ0k8K1l8LK6J1k4J8J5
4460B5l3K3j9K3j9j8M7n0LPJ3k1J7LlK1k0k0M0j7j3PJ0Lnj1L7n5J7J5J6m0KkJ6
4495aK0Pj6j4J5k4J9Koj4K1j1JjL4n4pL0LQJ1l6qK4OJ3LJKl9Mk1N0j5LJ2m9N5
4533B8j1j1lj7QPk1J3MKJ5j6k1K3L8j6n0K1j1N3l3j7L1j0Rml1K9k3M1k0PkJ1j5
$$ plain form
4385 0 38 12 -18 3 -6 -4 -18 -13 31 4 26 -8 17 -4 -3 -8 -8 -11 -17 17 12 34 -1 -1 -19 -8 24 -4 -7 6 3 -4 -1 -20 22 8 -15 24
4423 24 -5 -9 0 -26 17 2 -12 -8 -4 -9 16 9 19 2 4 0 11 -4 20 4 -1 -4 0 13 -7 6 11 21 -7 14 -24 -21 5 16 -8 10 25
4460 25 -8 15 -4 19 0 -18 29 -21 -18 -11 2 -19 -2 1 -2 19 -1 -21 19 2 -11 -4 6 9 4 -7 30 -25 -8 7 23 -17 -15 -17 -1
4495 -1 19 26 10 -4 11 -13 6 8 2 -12 9 -2 -1 -2 32 -22 -29 1 4 12 23 -13 -21 3 9 22 25 26 28 -11 -7 -28 22 7 10 22 -27 28
4533 28 17 6 3 -14 -6 1 -20 -7 -3 -1 14 -2 -23 0 38 22 -28 -7 -18 35 2 -15 16 6 15 11 -20 9 -14 27 7 14 12 23 8
$$ [...]
8191a3
##END NTUPLES=NMR FID
##END=
