##TITLE=1H_Ser 3752-V-2
 DMSO
 8 sc, 
 11.10.2024
##JCAMPDX= 6.0         $$ Bruker NMR JCAMP-DX V2.0
##DATA TYPE= NMR FID
##DATA CLASS= NTUPLES
##ORIGIN= UXNMR, Bruker Analytische Messtechnik GmbH
##OWNER= root
$$ XWIN-NMR		Version 3.5
$$ Fri Oct 11 13:47:31 2024 Russian Standard Time (UT+4h)  she@DPX200
##.OBSERVE FREQUENCY= 200.1318
##.OBSERVE NUCLEUS= ^1H
##.DELAY= (6, 6)
##.ACQUISITION MODE= SIMULTANEOUS
##.ACQUISITION SCHEME= undefined
##.AVERAGES= 8
##.DIGITISER RES= 18
##SPECTROMETER/DATA SYSTEM= spect
##.PULSE SEQUENCE= zg30
##.SOLVENT NAME= DMSO
##.SHIFT REFERENCE= (INTERNAL, DMSO, 0, 15.7039)
##AUDIT TRAIL= $$ (NUMBER, WHEN, WHO, WHERE, WHAT)
$$ ##TITLE= Audit trail, XWIN-NMR		Version 3.5
$$ ##JCAMPDX= 5.01
$$ ##ORIGIN= Bruker BioSpin GmbH
$$ ##OWNER= she
$$ F:/spectra/data/she/nmr/H-F/1/audita.txt
$$ ##AUDIT TRAIL=  $$ (NUMBER, WHEN, WHO, WHERE, WHAT)
(   1,<2024-10-11 13:46:22.48 +0400>,<she>,<DPX200>,
      <created by zg, POWCHK disabled, PULCHK disabled
       configuration hash MD5:
       00 E9 B6 7A A2 85 ED C7 34 08 36 98 17 FE 4E 26
       data hash MD5: 16K
       7D 2A 22 72 C0 5C 00 41 69 A8 4B 5B D6 59 94 75>)
$$ ##END=
$$ 
$$ hash MD5
$$ 00 02 2B E3 53 90 33 F0 25 62 42 19 F9 FA 6E E5
##$RELAX= 
##$RELAX= 
##$RELAX= 
##$RELAX= 
##$RELAX= 
##$RELAX= 
$$ Bruker specific parameters
$$ --------------------------
##$DU= <F:/spectra>
##$EXPNO= 1
##$NAME= <H-F>
##$PROCNO= 1
##$TYPE= <nmr>
##$USER= <she>
##$AMP= (0..31)
100 100 100 100 100 100 100 100 100 100 100 100 100 100 100 100 100 100 
100 100 100 100 100 100 100 100 100 100 100 100 100 100 
##$AQSEQ= 0
##$AQ_mod= 1
##$AUNM= <au_zg>
##$AUTOPOS= <>
##$BF1= 200.13
##$BF2= 200.13
##$BF3= 200.13
##$BF4= 200.13
##$BF5= 200.13
##$BF6= 200.13
##$BF7= 200.13
##$BF8= 200.13
##$BYTORDA= 1
##$CFDGTYP= 0
##$CFRGTYP= 5
##$CHEMSTR= <none>
##$CNST= (0..31)
1 1 145 1 1 1 1 1 1 1 1 1 1 1 1 1 1 1 1 1 1 1 1 1 1 1 1 1 1 1 1 1 
##$CPDPRG= <>
##$CPDPRG1= <>
##$CPDPRG2= <>
##$CPDPRG3= <>
##$CPDPRG4= <mlev>
##$CPDPRG5= <mlev>
##$CPDPRG6= <mlev>
##$CPDPRG7= <mlev>
##$CPDPRG8= <mlev>
##$CPDPRGB= <>
##$CPDPRGT= <>
##$D= (0..31)
0 1.2 0 0 0 0 0 0 0 0.06 0 0.03 0 0 0 0 0.0002 0 0 0 0 0 0 0 0 0 0 0 0 
0 0 0 
##$DATE= 1728639981
##$DBL= (0..7)
120 120 120 120 120 120 120 120 
##$DBP= (0..7)
150 150 150 150 150 150 150 150 
##$DBP07= 0
##$DBPNAM0= <>
##$DBPNAM1= <>
##$DBPNAM2= <>
##$DBPNAM3= <>
##$DBPNAM4= <>
##$DBPNAM5= <>
##$DBPNAM6= <>
##$DBPNAM7= <>
##$DBPOAL= (0..7)
0.5 0.5 0.5 0.5 0.5 0.5 0.5 0.5 
##$DBPOFFS= (0..7)
0 0 0 0 0 0 0 0 
##$DE= 6
##$DECBNUC= <off>
##$DECIM= 24
##$DECNUC= <off>
##$DECSTAT= 4
##$DIGMOD= 1
##$DIGTYP= 9
##$DL= (0..7)
0 120 120 120 120 120 120 120 
##$DP= (0..7)
150 150 150 150 150 150 150 150 
##$DP07= 0
##$DPNAME0= <>
##$DPNAME1= <>
##$DPNAME2= <>
##$DPNAME3= <>
##$DPNAME4= <>
##$DPNAME5= <>
##$DPNAME6= <>
##$DPNAME7= <>
##$DPOAL= (0..7)
0.5 0.5 0.5 0.5 0.5 0.5 0.5 0.5 
##$DPOFFS= (0..7)
0 0 0 0 0 0 0 0 
##$DQDMODE= 0
##$DR= 18
##$DS= 0
##$DSLIST= <SSSSSSSSSSSSSSS>
$$ [...]
##$SUBNAM2= <"">
##$SUBNAM3= <"">
##$SUBNAM4= <"">
##$SUBNAM5= <"">
##$SUBNAM6= <"">
##$SUBNAM7= <"">
##$SUBNAM8= <"">
##$SUBNAM9= <"">
##$SW= 24.0689170037331
##$SWIBOX= (0..15)
0 0 2 0 0 0 0 0 0 0 0 0 0 0 0 0 
##$SW_h= 4816.95568400771
##$TD= 16384
##$TD0= 1
##$TE= 0
##$TE2= 300
##$TE3= 300
##$TEG= 300
##$TL= (0..7)
0 120 120 120 120 120 120 120 
##$TP= (0..7)
150 150 150 150 150 150 150 150 
##$TP07= 0
##$TPNAME0= <>
##$TPNAME1= <>
##$TPNAME2= <>
##$TPNAME3= <>
##$TPNAME4= <>
##$TPNAME5= <>
##$TPNAME6= <>
##$TPNAME7= <>
##$TPOAL= (0..7)
0.5 0.5 0.5 0.5 0.5 0.5 0.5 0.5 
##$TPOFFS= (0..7)
0 0 0 0 0 0 0 0 
##$TUNHIN= 0
##$TUNHOUT= 0
##$TUNXOUT= 0
##$USERA1= <user>
##$USERA2= <user>
##$USERA3= <user>
##$USERA4= <user>
##$USERA5= <user>
##$V9= 5
##$VALIST= <valist>
##$VCLIST= <CCCCCCCCCCCCCCC>
##$VD= 0
##$VDLIST= <DDDDDDDDDDDDDDD>
##$VPLIST= <PPPPPPPPPPPPPPP>
##$VTLIST= <TTTTTTTTTTTTTTT>
##$WBST= 1024
##$WBSW= 4
##$XGAIN= (0..3)
0 0 0 0 
##$XL= 0
##$YL= 0
##$YMAX_a= 117830
##$YMIN_a= -64178
##$ZGOPTNS= <>
##$ZL1= 120
##$ZL2= 120
##$ZL3= 120
##$ZL4= 120
##$ABSF1= 10
##$ABSF2= 0
##$ABSG= 5
##$ABSL= 3
##$ALPHA= 0
##$AQORDER= 0
##$ASSFAC= 0
##$ASSFACI= 0
##$ASSFACX= 0
##$ASSWID= 0
##$AUNMP= <proc_1d>
##$AZFE= 0.1
##$AZFW= 0.1
##$BCFW= 1
##$BC_mod= 2
##$BYTORDP= 1
##$COROFFS= 0
##$CY= 11.3945322036743
##$DATMOD= 1
##$DC= 2
##$DFILT= <>
##$DTYPP= 0
##$F1P= 15.6554695791079
##$F2P= 12.8336369535428
##$FCOR= 0.5
##$FTSIZE= 0
##$FT_mod= 4
##$GAMMA= 1
##$GB= 0.15
##$INTBC= 1
##$INTSCL= 1
##$ISEN= 128
##$LB= 0.24
##$LEV0= 0
##$LPBIN= 0
##$MAXI= 10000
##$MC2= 0
##$MEAN= 0
##$ME_mod= 0
##$MI= 1.114404
##$NCOEF= 0
##$NC_proc= 0
##$NLEV= 6
##$NOISF1= 3.799351
##$NOISF2= 2.8
##$NSP= 1
##$NTH_PI= 0
##$NZP= 0
##$OFFSET= 15.70392
##$PC= 1
##$PHC0= -26352.32
##$PHC1= 20.18743
##$PH_mod= 1
##$PKNL= yes
##$PPARMOD= 0
##$PSCAL= 0
##$PSIGN= 0
##$REVERSE= no
##$SF= 200.130013532006
##$SI= 16384
##$SIGF1= 3
##$SIGF2= 2
##$SINO= 400
##$SIOLD= 16384
##$SREGLST= <1H.CDCl3>
##$SSB= 0
##$STSI= 0
##$STSR= 0
##$SW_p= 3612.71676300578
##$SYMM= 0
##$S_DEV= 0
##$TDeff= 0
##$TDoff= 0
##$TI= <>
##$TILT= no
##$TM1= 0
##$TM2= 0
##$TOPLEV= 0
##$USERP1= <user>
##$USERP2= <user>
##$USERP3= <user>
##$USERP4= <user>
##$USERP5= <user>
##$WDW= 1
##$XDIM= 8192
##$YMAX_p= 0
##$YMIN_p= 0
$$ End of Bruker specific parameters
$$ ---------------------------------
##NTUPLES= NMR FID
##VAR_NAME=  TIME,          FID/REAL,        FID/IMAG
##SYMBOL=    X,             R,               I
##VAR_TYPE=  INDEPENDENT,   DEPENDENT,       DEPENDENT
##VAR_FORM=  AFFN,          ASDF,            ASDF
##VAR_DIM=   8192,          8192,            8192
##UNITS=     SECONDS,       ARBITRARY UNITS, ARBITRARY UNITS
##FACTOR=    0.0002076,     1,               1
##FIRST=     0,             0,               0
##LAST=      1.7004516,     0,               0
##MIN=       0,             -64178,          0
##MAX=       1.7004516,     117830,          0
$$ Real data points
##PAGE= N=1
##DATA TABLE= (X++(R..R)), XYDATA
$$ [...]
$$ plain form
1971 97 -53 57 -68 -217 -152 -97 -178 -11 -140 209 -42 333 -331 -135 192 -104 -267 372 -122 -66 -13 -88
1993 -88 63 134 -71 130 -24 -206 129 -17 -180 -231 -227 184 -137 181 204 -473 -57 146 -164 210 -221 -37
2015 -37 155 7 182 1 -7 310 -163 -11 368 -436 152 -100 -238 24 49 203 138 -449 387 421 -173 -50
2037 -50 174 -44 -76 -239 309 -57 -37 171 152 92 265 188 211 -26 118 309 -301 -420 165 151 -237 -234 -246 324
2061 324 -59 48 271 -252 200 252 -301 144 -28 136 246 -227 -74 250 -37 75 88 299 154 -194 291
2082 291 -17 -271 195 -183 -104 55 -320 138 159 -38 423 287 1 232 86 -27 -90 -190 304 87 -18
2103 -18 167 85 316 241 -190 292 -204 -258 138 -326 -364 172 -450 -165 -29 -178 362 172 -113 143 106 324
2125 324 -217 234 305 -211 -54 -50 -226 342 116 -351 116 -140 51 6 -546 -225 54 -365 -546 216 163 -258
$$ packed form
1971I7j50J10j25j49O5N5q1J67j29L49k51L75o64J96L27k96j63O39m94N6N3p5
1993h8J51P1k05K01j54j82L35j46j63n1MM11l21L18K3o77M16K03l10L74m31J84
2015c7J92j48J75j81qL17m73J52L79q04N88k52j38K62K5J54o5n87Q36L4n94J23
2037e0K24k18l2j63N48l66K0K08j9o0J73p7K3k37J44J91o10j19N85j4l88Lj2N70
2061C24l83J07K23n23M52N2n53M45j72J64J10m73J53L24k87J12J3K11j45l48M85
2082B91l08k54M66l78P9J59l75M58K1j97M61j36k86K31j46j13o3j00M94k17j05
2103a8J85q2K31p5m31M82m96n4L96m64l8N36o22K85J36j49N40j90k85K56l7K18
2125C24n41M51P1n16J57Mj76N68k26m67M67k56J91m5n52L21K79m19j81P62n3m21
$$ plain form
2147 -258 11 256 -83 154 383 -120 241 602 162 353 140 -451 466 304 -351 -57 149 -48 170 24
2167 24 -58 37 38 -210 -225 350 -278 -146 215 -338 -136 302 -158 253 484 181 163 105 -246 147 103 -149 116
2190 116 197 -11 109 338 11 -494 190 -139 -517 25 -385 -362 362 -356 -90 412 -70 -23 445 208 141
2211 141 533 484 -4 191 156 -309 249 -288 -236 -8 9 -370 299 171 -597 290 -106 -679 170 -256 -359
2232 -359 -36 -229 -88 158 224 -79 -38 476 204 516 248 -309 -32 106 -628 -198 286 -325 10 61 -165
2253 -165 244 341 -357 -260 372 -322 -415 224 -144 -99 391 22 -150 502 -191 78 314 -303 191 678 -263
2274 -263 -70 153 -214 -314 237 21 -289 302 -72 -233 389 -238 -452 616 -23 -458 430 -313 -41 265
2294 265 -27 -374 280 25 -153 -14 -160 -48 187 80 -473 -221 -27 -460 287 253 -421 376 390 -779
$$ packed form
2147b58K69K45l39K37K29n03L61L61m40J91k13n91R17j62o55K94K06j97K18j46
2167B4q2R5Jk48j5N75o28J32L61n53K02M38m60M11K31l03j8n8l51L93m4k52K65
2190A16Q1k08J20K29l27n05O84l29l78N42m10K3P24p18K66N02m82M7M68k37o7
2211A41L92m9m88J95l5m65N58n37N2K28J7l79O69j28p68Q87l96n73Q49m26j03
2232c59L23j93J41K46O6l03M1N14k72L12k68n57K77J38p34M30M84o11L35N1k26
2253a65M09R7o98R7O32o94r3O39l68M5M90l69j72O52o93K69K36o17M94M87r41
2274b63J93K23l67j00N51k16l10N91l74j61O22o27k14J068o39m35Q88p43K72L06
2294B65k92l47O54k55j78J39j46J12K35j07n53K52J94m33P47l4o74P97J4j169
$$ plain form
2314 -779 49 225 -80 318 -82 -250 138 193 -202 251 663 -31 167 330 -480 -53 228 -563 -268 357
2334 357 -455 13 177 -700 1 327 -309 -24 102 -301 -53 -90 -139 31 509 -142 -116 489 -156 -203 553
2355 553 -235 -108 240 -401 -303 514 -279 -209 372 -332 -190 85 -208 -258 240 51 -431 237 -29 -351 164
2376 164 206 -239 398 108 -232 495 -55 -527 345 26 -175 233 -161 -468 86 173 -476 101 214 -502 93
2397 93 -29 -210 239 306 -387 87 221 -376 178 -39 -230 270 315 -85 184 222 -278 183 200 -403 19 588
2419 588 -572 -194 358 -564 -330 520 -310 -72 601 -161 -136 -30 -26 289 272 -320 88 695 -147 -331 357
2440 357 20 -38 428 -367 -337 664 -313 -184 346 -306 -221 57 -136 -355 280 -105 -146 298 0 -247 115
2461 115 -97 -248 233 38 -507 226 129 -226 460 -134 -390 340 -53 -174 278 110 -424 85 -132 -306
$$ packed form
2314g79Q28J76l05L98m00j68L88N5l95M53M12o94J98J63q10M27K81p91K95O25
2334C57q12M68J64q77P01L26o36K85J26m03K48l7m9J70M78o51K6O05o45m7P56
2355E53p88J27L48o41R8Q17p93P0N81p04J42K75k93n0M98j89m82O68k66l22N15
2376A64M2m45O37k90l40P27n50m72Q72l19k01M08l94l07N54Q7o49N77J13p16N95
2397I3j22j81M49O7o93M74J34n97N54k17j91N00M5m00K69L8n00M61J7o03M22N69
2419E88j160L78N52r22K34Q50q30K38O73p62K5J06ML15j7n92M08O07q42j84O88
2440C57l37n8M66p95L0J001r77J29N30o52Q5K78j93k19O35l85m1M44k98k47L62
2461A15k12j51M81j95n45P33r7l55O86n94k56P30l93j21M52j68n34N09k17j74
$$ plain form
2481 -306 268 229 -278 327 280 -433 102 246 -211 130 187 -574 303 255 -496 163 108 -150 216 104 -419 -79
2503 -79 175 -322 -171 416 -3 11 617 -347 159 433 -322 -68 220 -315 -188 380 -335 -300 614 -108 -92
2524 -92 247 190 -141 338 -138 -228 501 -192 -496 426 -122 -366 486 -123 -407 388 -210 -106 255 -138 -40
2545 -40 137 -130 -253 368 -3 -520 101 60 -113 366 298 -96 330 -71 -443 197 44 -404 321 -263 -241
2566 -241 313 -21 -202 62 226 -364 51 430 -140 -196 126 -257 131 337 -338 -89 258 -90 209 138 -210
2587 -210 104 216 -66 -7 -70 -53 -50 119 -68 -136 560 -345 -235 353 -115 -20 222 -485 -338 136 -2 88 -19
2610 -19 -61 105 252 -174 -86 256 -110 -182 272 -105 -370 273 -197 -452 342 14 -278 322 -147 -126 257 -62
2632 -62 -138 331 -232 -171 208 317 -247 48 142 -427 148 149 -278 277 15 -537 121 -11 -364 -109 -93 -116 171
$$ packed form
2481c06N74l9n07O05m7p13N35J44m57L41N7p61Q77m8p51O59n5k58L66j12n23L40
2503g9K54m97J51N87m19J4O06r64N06K74p55K54K88n35J27N68p15L5R14p22J6
2524i2L39n7l31M79m76r0P29o93l04R22n48k44Q52o09k84P95n98J04L61l93R8
2545d0J77k67j23O21l71n17O21m1j73M79o8l94M26m01l72O40j53m48P25n84K2
2566b41N54l34j81K64J64n90M15L79n70n6L22l83L88K06o75K49L47l48K99p1l48
2587b10L14J12k82N9o3J7LJ69j87o8O96r05J10N88m68R5K42p07J47M74j38R0j07
2610a9m2J66J47m26Q8L42l66p2M54l77k65O43m70k55P94l28k92O00m69K1L83l19
2632f2p6M69n63O1L79J09n64K95R4n69N75Jm27N55k62n52O58j32l53K55J6k3K87
$$ plain form
2655 171 79 85 147 170 77 -53 83 35 59 112 -478 194 375 -243 74 340 -42 207 97 -173 245 -95 -37
2678 -37 -52 -215 -266 -12 326 -155 -165 329 -59 -25 302 -52 -55 386 -300 -49 29 -131 169 235 -215 5 467
2701 467 -3 17 150 201 -160 -54 -237 -280 39 -167 -26 130 -321 -390 64 -148 -466 383 140 -278 199
2722 199 92 95 -66 -428 151 -94 179 -157 19 289 -217 -144 376 -584 -259 -49 -437 3 103 -198 -60
2743 -60 108 80 373 -144 -192 84 55 -134 -113 304 70 -63 172 140 70 -62 3 -12 -23 -208 138 -89 -286
2766 -286 50 -33 -148 -34 -42 258 -217 -215 236 53 45 -69 -306 193 -224 -50 51 -313 -115 173 142 -37 131
2789 131 64 58 -312 -268 165 -44 -197 -82 192 -92 -65 239 -51 -199 -14 142 -42 83 -50 227 184 -277
2811 -277 48 42 -147 44 138 122 161 -159 15 168 121 44 79 -31 -127 80 -86 -46 -31 267 -45 -22 14 -58 -183
$$ packed form
2655A71r2OO2K3r3j30J36m8K4N3n90O72J81o18L17K66l82K49j10k70M18l40N8
2678c7j5j63n1K54L38m81j0M94l88L4L27l54lM41o86K51P8j60L00O6m50K20M62
2701D67m70K0J33N1l61J06j83m3L19k06J41J56m51o9M54k12l18Q49k43m18M77
2722A99j07Lj61l62N79k45K73l36J76K70n06P3N20r60L25K10l88M40J00l01J38
2743f0J68k8K93n17m8K76k9j89K1M17k34j33K35l2p0j32O5j5j1j85L46k27j97
2766b86L36q3j15J14qL00m75KM51j83qj14k37M99m17J74J01l64J98K88l1j79J68
2789A31o7ol70M4M33k09j53J15K74k84K7L04k90j48J85J56j84J25j33K77m3m61
2811b77L25oj89J91R4j6L9l20J74J53m7p7L5j10r6K07j66M0J5K98l12K3L6p2j25
$$ plain form
2836 -183 -237 -131 183 14 -138 43 -68 -151 -52 21 36 -21 -85 232 -56 -145 -98 11 -265 -333 -33 45 -250 121
2860 121 45 -12 71 355 170 280 -227 -73 -77 -90 2 38 -97 -56 121 361 -150 -480 223 -286 -164 -125 -95 246
2884 246 -30 -224 204 155 -208 232 116 -85 -177 44 -65 -98 39 382 21 -215 -410 95 92 -288 -102 374
2906 374 -267 -231 211 -259 -11 -53 -144 -110 4 -5 25 324 -1 204 360 110 -12 336 116 -125 179 20
2928 20 -143 184 -70 -5 -65 -141 42 147 175 -154 27 -156 -267 -35 121 -36 285 205 -60 106 33 -248
2950 -248 453 2 -214 151 -46 -138 267 -242 -172 249 27 -184 -6 172 -177 120 59 -207 -97 1 -515
2971 -515 158 182 -333 223 137 -120 62 157 -145 -58 67 -348 227 220 -186 238 344 -177 -68 246 -182 -219
2993 -219 50 -242 74 226 -346 -207 233 -90 -348 228 -159 127 248 65 -59 586 -1 -88 217 16
$$ packed form
2836a83n4J06L14j69j52J81j11q3R9P3J5n7o4L17k88q9M7J09k76o8L00P8k95L71
2860A21p6n7Q3K84j85J10n07J54mj3R2L6j35M1J77K40n11l30P03n09J22L9L0L41
2884B46k76j94M28m9l63M40j16k01r2K21j09l3J37L43l61k36j95N05ll80J86M76
2906C74o41L6M42m70K48m2r1L4J14rL0K99l25K05J56k50j22L48k20k41L04j59
2928B0j63L27k54O5o0p6J83J05K8l29J81j83j11K32J56j57L21q0k65J66p3k81
2950b48P01m51k16L65j97r2M05n09P0M21k22k11J78J78l49K97o1k66J10R8n16
2971e15O73K4n15N56q6k57J82R5l02Q7J25m15N75pm06M24J06n21J09L14m28l7
2993b19K69k92L16J52n72J39M40l23k58N76l87K86J21j83j24O45n87q7L05k01
$$ plain form
3013 16 69 243 -157 -267 301 -142 -213 267 -187 -291 388 -340 -235 18 5 -269 -3 172 -388 110 -64
3034 -64 -372 359 4 -94 451 191 -364 397 18 -332 216 -85 -280 257 -1 -302 417 -118 -144 19 232
3055 232 -482 77 41 -558 44 294 -319 67 80 -136 462 468 -408 224 80 -93 71 321 -273 -23 310
3076 310 -241 -184 318 -68 22 -251 -397 -64 81 -472 -238 345 -289 -147 407 -148 -4 51 -118 -7 148
3097 148 -204 45 224 -306 -62 328 -132 -249 408 -16 -119 280 -223 -274 160 -186 -201 81 -157 -30 118
3118 118 -157 -224 297 19 -149 354 116 -235 353 196 -381 314 57 -371 302 116 -187 266 -206 -511
3138 -511 -93 185 -304 -95 227 -554 -53 -7 -338 46 327 -305 -50 431 -168 119 90 -220 151 324 -528
3159 -528 108 47 -193 -125 -3 171 -12 341 -290 49 477 -229 -41 253 -523 -189 478 -111 67 396 -141
$$ packed form
3013A6N3J74m00j10N68m43p1M80m54j04O79p28J05K53j3k74K66J75n60M98j74
3034f4l08P31l55r8N45k60n55P61l79l50N48l01j95N37k58l01P19n35k6J63K13
3055B32p14N59l6n99O02K50o13L86J3k16N98Oq76O32j44j73J64K50n94K50L33
3076C10n51N7N02l86R0k73j46L33J45n53K34N83o34J42N54n55J44N5j69J11J55
3097A48l52K49J79n30K44L90m60j17O57m24j03L99n03n1M34l46j5K82k38J27J48
3118A18k75o7N21k78j68N03k38l51N88j57n77O95k57m28O73j86l03M53m72l05
3138e11M18K78m89K09L22p81N01M6l31L84K81o32K55M81n99K87k9l10L71J73q52
3159e28O36o1k40O8J22J74j83L53o31L39M28p06J88K94p76L34O67n89J78L29n37
$$ plain form
3180 -141 43 179 -262 -25 515 -326 -244 379 36 215 366 -190 -92 310 -282 -427 267 82 -417 240 -131
3201 -131 -201 142 -18 -361 418 108 -243 249 133 -93 207 -5 -326 77 -138 -280 259 359 -366 245
3221 245 66 -553 121 -6 -375 81 96 -425 68 167 -311 125 -109 -247 86 116 -174 67 253 -81 161
3242 161 214 -104 154 202 -487 -94 185 -233 90 337 -337 -97 171 -313 -319 360 -302 -181 277 -133 -228 439
3264 439 -218 9 -54 -238 225 405 -331 -127 529 -333 -331 354 -171 -390 488 13 -248 433 122 -218 55
3285 55 -21 -274 211 -171 -386 391 55 -163 218 -84 -165 139 68 -91 226 69 -15 232 70 -447 51 177
3307 177 -111 162 -105 -197 360 -90 -326 269 -62 -321 47 -105 -353 110 354 -228 -88 259 -42 244
3327 244 233 -50 280 444 -164 76 195 -215 -4 63 -291 339 98 -25 -49 206 -223 -30 80 -127 95
$$ packed form
3180a41J84J36m41K37N40q41Q2O23l43J79J51n56R8M02n92j45O94j85m99O57l71
3201a31p0L43j60l43P79l10l51M92j16k26L00k12l21M03k15j42N39J00p25O11
3221B45j79o19O74j27l69M56J5n21M93R9m78M36k34j38L33L0k90K41J86l34K42
3242A61N3l18K58M8o89L93K79m18L23K47o74K40K68m84oO79o62J21M58m10r5O67
3264D39o57K27o3j84M63J80p36K04O56q62KO85n25k19Q78m75k61O81l11l40K73
3285E5p6k53M85l82k15P77l36k18L81l02q1L04p1j59L17j57q4K47j62n17M98J26
3307A77k88K73k67r2N57m50k36N95l31k59L68j52k48M63K44n82J40L47l01K86
3327B44j1k83L30J64o08K40J19m10K11O7l54O30k41j23k4K55m29J93J10k07K22
$$ plain form
3348 95 -25 -480 73 410 -463 131 320 -51 -14 462 -232 -179 258 -132 -279 254 -225 -145 85 -77 -119 162
3370 162 31 188 92 -203 -255 68 -260 -226 438 47 -247 167 187 -197 343 -63 -157 220 178 -204 170 100
3392 100 -56 183 87 -304 35 -101 -384 75 123 -358 92 -83 -388 22 119 -135 66 -32 -34 126 -9 6
3414 6 11 402 -341 88 310 -50 40 258 -141 67 204 -233 -48 99 -20 61 2 -85 57 -44 -297 -135 257
3437 257 -9 44 342 -94 -5 471 -287 -84 342 -244 -164 135 12 59 130 -24 73 -138 -100 -25 333 78 16
3460 16 238 92 -175 265 50 -230 283 -90 -95 231 52 165 371 -47 -109 354 180 -57 -69 78 -116 85
3482 85 -121 14 -72 -57 11 214 22 -113 98 203 -152 -81 163 113 0 83 61 -26 53 -35 84 163 35 -8
3506 -8 27 -107 174 19 -281 -9 306 -16 -158 48 -256 -159 16 -5 163 159 -153 247 252 -5 226 156 -18
$$ packed form
3348I5j20m55N53L37q73N94J89l71L7M76o94N3M37l90j47N33m79Q0K30j62m2K81
3370A62j31J57r6k95n2L23l28L4O64l91k94M14K0l84N40m06r4L77m2l82L74p0
3392A00j56K39r6l91L39j36k83M59M8m81M50j75l05M10R7k54K01r8kJ60j35J5
3414FNL91p43M29K22l60R0K18l99K08J37m37J85J47j19Q1n9q7J42j01k53J62L92
3437B57k66N3K98m36Q9M76p58K03M26n86Q0K99j23M7P1j54R7k11L8P5L58k55o2
3460A6K22j46k67M40k15k80N13l73nL26j79J13K06m18o2M63j74k37j2J47j94K01
3482H5k06J35q6J5O8K03j92j35K11J05l55P1K44n0j13Q3k2q7P9q8J19P9j28m3
3506hL5j34K81j55l00K72L15l22j42K06l04R7J75k1J68ml12M00Nk57K31p0j74
$$ plain form
3529 -18 -186 319 83 -306 -39 -17 -48 -7 -109 -335 137 -286 -270 -110 93 -24 102 5 26 152 207 -13 -172
3552 -172 268 -20 37 -8 301 293 326 31 87 32 122 -76 33 -123 -196 -145 -141 -282 2 -57 35 -14 -51 -182 13
3577 13 -43 87 83 -108 165 82 104 124 50 -132 122 39 2 61 -32 -4 -220 -135 62 -14 136 45 284 -56 -170
3602 -170 144 -168 -99 41 155 12 340 -99 51 245 9 -109 -128 75 196 -3 -154 41 -196 -180 -102
3623 -102 114 43 -351 74 50 36 157 -12 -134 -173 -127 -153 15 -239 -186 36 -82 -10 129 -142 -31 270 62
3646 62 73 127 -22 -169 -124 0 2 -108 -306 -13 -63 -169 123 -107 149 -62 117 25 -10 85 132 -66 105 71
3670 71 -74 -98 -22 -29 40 -143 34 30 27 -79 174 -58 -14 169 34 -180 314 -187 -79 -72 -99 -49 -171 -152 124
3695 124 79 205 -70 -48 -111 166 76 -103 -80 207 -159 -138 -203 81 -91 100 -238 -218 307 -153 84 9 50
$$ packed form
3529a8j68N05k36l89K67K2l1M1j02k26M72m23J6J60K03j17J26r7K1J26N5k20j59
3552a72M40k88N7m5L09qL3k95N6n5R0j98J09j56p3N1Mj41K84n9R2m9l7j31J95
3577A3n6J30mj91K73q3K2K0p4j82K54q3l7N9r3K8k16Q5J97p6J50r1K39l40j14
3602a70L14l12O9J40J14j43L28m39J50J94k36j18j9K03J21j99j51J95k37J6P8
3623a02K16p1l94M25k4j4J21j69j22l9M6k6J68k54N3K22j18P2J39k71J11L01k08
3646F2J1N4j49j47M5J24Kj10j98K93n0j06K92k30K56k11J79r2l5R5M7j98J71l4
3670G1j45k4P6pO9j83J77mlj06K53k32M4J83j35k14M94n01J08Pk7N0j22J9K76
3695A24m5J26k75K2o3K77r0j79K3K87l66K1o5K84j72J91l38K0N25m60K37p5M1
$$ plain form
3718 50 106 -134 -194 -159 -27 62 -159 56 48 49 250 304 -45 172 192 105 68 -8 -182 108 -66 40 -124 218 -181
3743 -181 -13 62 -165 26 -152 32 -93 0 -197 145 81 -8 78 -98 -182 -224 -234 -229 -158 125 -225 -404 121 44
3767 44 -157 217 -47 -287 325 -212 -344 68 -50 238 -93 -113 -188 73 -174 -17 132 17 -121 -38 35 225
3789 225 35 -68 23 170 -31 -171 148 -62 -220 233 29 1 -114 -15 64 37 -18 -187 101 -2 63 -85
3811 -85 286 -261 265 327 -299 204 43 -263 150 456 -192 387 285 46 80 26 -18 -177 94 -315 -41 147
3833 147 -187 124 150 -143 89 61 -224 60 79 -102 168 207 -29 182 9 -108 153 66 47 -25 12 -47 -40 363
3857 363 -21 -113 106 -83 -168 308 -140 86 113 49 -205 267 -22 -191 119 -33 9 67 -10 -308 240 -87
3879 -87 -240 210 27 -13 263 -432 -284 -40 104 97 127 -88 -293 28 85 84 316 27 -7 145 34 -235 195
$$ packed form
3718E0N6k40o0L5J32Q9k21K15qJK01N4l49K17K0q7l7p6j74K90j74J06j64L42l99
3743a81J68P5k27J91j78J84j25R3j97L42o4q9Q6j76q4m2j0NP1K83l50j79N25p7
3767D4k01L74k64k40O12n37j32M12j18K88l31k0p5K61k47J57J49j15j38Q3P3J90
3789B25j90j03R1J47k01j40L19k10j58M53k04k8j15R9P9k7n5j69K88j03O5j48
3811h5L71n47N26O2o26N03j61l06M13L06o48N79j02k39L4n4m4j59K71m09K74J88
3833A47l34L11K6k93K32k8k85K84J9j81K70L9k36K11j73j17K61q7j9p2L7n9PM03
3857C63l84r2K19j89q5M76m48K26K7o4k54M72k89j69L10j52M2N8p7k98N48l27
3879h7j53M50j83m0K76o95J48K44J44pL0k15k05L21N7jK32k89l4J52j11k69M30
$$ plain form
3902 195 116 -169 337 155 -155 201 124 -262 57 -29 -547 17 -33 -109 -70 -46 73 -169 366 -145 -50 137 -194
3925 -194 49 216 -377 164 91 -211 317 159 -69 79 71 -405 -59 -7 -292 13 154 -34 -49 201 227 54
3947 54 -71 -17 -336 165 -346 -94 283 -196 -203 7 17 -69 8 22 -25 103 19 6 51 -121 -246 186 -187 -259
3971 -259 -28 -53 -46 182 -23 8 -3 -108 -238 124 -10 94 250 -30 35 82 291 -146 -124 95 54 297 104
3994 104 -253 -2 -42 -185 31 179 -304 -32 -3 -179 255 56 182 -116 73 -491 -96 29 -92 -2 155
4015 155 -112 -41 184 -137 257 185 -55 33 376 69 -83 175 -167 -32 48 -35 -195 17 -67 -246 44 -183
4037 -183 -70 190 -42 -304 109 -309 142 451 -181 -8 250 11 138 84 -38 58 160 -97 -144 299 -256
4058 -256 -289 55 140 -77 274 -154 -243 179 -109 -326 173 -70 2 281 -11 -180 53 140 21 105 -238 -75
$$ packed form
3902A95p9k85N06j82l10L56p7l86L19q6n18N64n0p6L9K4J19k42N35n11R5J87l31
3925a94K43J67n93N41p3l02N28j58k28J48qm76L46N2k85L05J41j88j5K50K6j73
3947E4j25N4l19N01n11K52L77m79pK10J0q6P7J4m7J28q4j3M5j72j25M32l73p2
3971b59K31k5PK28k05L1j1j05j30L62j34J04J56k80O5M7K09m37K2K19m1K43j93
3994A04l57K51m0j43K16J48m83K72K9j76M34j99J26k98J89n64L95J25j21R0J57
4015A55k67P1K25l21L94p2k40Q8L43l07j52K58l42J35Q0q3j60K12q4j79K90k27
4037a83J13K60k32k62M13m18M51L09o32J73K58k39J27n4j22R6J02k57m7M43n55
4058b56l3L44Q5k17L51m28q9M22k88k17M99k43P2K79k92j69K33Q7j19Q4l43J63
$$ plain form
4080 -75 132 56 -217 -67 257 -72 5 62 -94 344 72 -232 79 -6 -48 73 -93 3 -104 -137 -102 128 -82
4103 -82 -151 -157 26 -192 -160 -65 68 -146 247 -192 173 -21 -81 -32 73 -51 115 185 -9 -221 120 -279 -91
4126 -91 166 -357 -118 164 -279 -92 104 13 -83 69 58 72 -55 -47 -111 -94 -134 -338 -21 -135 -57 87 89 103 110
4151 110 73 53 62 157 -38 125 -81 -155 215 -63 -141 237 79 -108 151 -179 -58 172 233 -83 -28 241 -128
4174 -128 -28 -126 -117 225 80 -140 138 368 -59 332 86 -206 -107 -45 17 -37 129 120 -83 146 5 18 -149
4197 -149 93 -40 109 -136 -114 -64 -112 -173 55 -23 328 -114 -157 156 162 -214 64 64 -426 109 34 -57 76 -24
4221 -24 -15 25 -162 -226 173 -42 -214 -161 113 -222 -214 46 -120 -259 37 -144 -21 0 -88 -15 -211 27 125 62
4245 62 -186 -144 -37 42 20 145 -88 -105 95 -31 -38 -243 56 109 26 5 -116 -31 141 -108 22 91 -185 295
$$ packed form
4080g5K07p6k73J50L24l29P7N7j56M38k72l04L11q5m2J21j66R6j07l3L5K30k10
4103h2o9oJ83k18L2R5J33k14L93m39L65j94o0M9J05j24J66P0j94k12L41l99J88
4126i1K57n23K39K82m43J87J96r1r6J52j1J4j27Qo4J7m0k04L17j14P8J44KJ4P
4151A10l7k0RR5j95J63k06p4L70k78p8L78j58j87K59l30J21K30O1l16N5K69l69
4174a28J00r8RL42j45k20K78K30m27L91k46k92R9O2O2n4J66rk03K29j41J3j67
4197a49K42j33J49k45K2N0m8o1K28p8L51m42m3L13Ol76K78%m90N35p5r1J33j00
4221b4RM0j87o4L99k15j72N3K74l35QK60j66j39K96j81J23K1q8P3j96K38R8o3
4245F2k48M2J07P9k2J25k33j7K00j26pk05K99N3q3k1j21Q5J72k49J30O9k76M80
$$ plain form
4269 295 -247 -176 -11 -62 -39 -147 -57 -199 35 120 203 12 102 -194 -32 -88 62 -159 -350 -121 -32 70 -92
4292 -92 90 -33 87 117 -187 7 160 -103 -332 23 16 176 -107 -56 76 -156 -150 -180 105 -19 -66 -207 147
4315 147 145 141 54 -125 34 -104 78 -61 -9 17 23 -19 24 84 -52 95 51 -9 51 -121 -41 178 -201 197 -112
4340 -112 -65 -148 -73 152 106 22 106 176 284 87 -179 80 -37 11 -240 -118 86 -75 -161 155 -144 -75 43
4363 43 5 -49 122 176 215 -120 80 72 -91 -2 10 -197 -269 -79 39 57 75 40 -42 70 242 -25 -174 -106 -8
4388 -8 -88 139 -30 35 147 -96 228 -35 108 -131 161 68 61 -127 20 -209 -125 94 -66 170 7 -109 -28
4411 -28 -145 206 246 -49 53 -233 -143 -89 -108 -19 -92 213 -32 129 146 155 87 43 -8 -93 -54 -8 6 -238 -165 8
4437 8 -43 -231 243 -133 150 45 -163 167 95 75 -175 145 -132 -13 -177 -48 0 11 48 24 50 -45 -40 111
$$ packed form
4269B95n42P1J65n1K3j08R0j42K34Q5Q3j91R0k96J62n6J50k21j91K29Q9J02j62
4292i2J82j23J20L0l04J94J53k63k29L55pJ60k83N1J32k32Ol0K85j24m7j41L54
4315A47kmq7j79J59j38J82j39N2K6Om2M3O0j36J47m4o0O0j72Q0K19l79L98l09
4340a12M7q3P5K25m6q4Q4P0J08j97k66K59j17M8k51J22K04j61q6L16k99O9J18
4363D3l8n4J71N4L9l35K00qj63Q9J2k07p2J90J18J8J8l5q2J12J72k67j49O8R8
4388hq0K27j69O5J12k43L24k63J43k39K92r3pj88J47k29Q4K19j60K36j63j16Q1
4411b8j17L51M0k95J02k86R0N4j9Q9p3L05k45J61J7Ro8m4n1q5L9M6J4k44P3J73
4437Hn1j88M74l76K83j05k08L30p2k0k50L20k77J19j64J29M8J1L7k4K6r5NJ51
$$ plain form
4461 111 -43 117 153 129 130 109 -88 52 173 -54 -288 -45 -229 20 62 150 -66 -47 79 -123 -103 -12 1 52
4485 52 -25 -156 99 -81 -59 -196 267 -36 -155 -180 -246 215 30 84 137 4 194 164 291 94 -100 170 42
4508 42 127 334 -210 -175 202 -2 139 121 180 -118 -74 -10 -31 -15 142 26 16 -73 -49 163 -160 10 -160 124
4532 124 -2 52 91 -56 -145 209 -63 -103 -80 113 -70 37 122 -75 76 -59 -23 213 52 98 100 64 120 -16
4556 -16 104 201 212 67 101 180 6 94 42 174 -47 -201 62 -40 -24 -43 -68 -62 -133 129 135 -323 -184 376 39
4581 39 34 20 85 -133 172 87 70 46 25 -170 124 -20 -284 -49 -220 -298 -24 219 56 142 -114 -191 -59 -113
4605 -113 -57 -135 102 -48 178 122 -87 40 152 85 236 -120 -102 -56 13 -89 -85 16 -38 280 -94 19 106 48
4629 48 -329 -57 84 58 -32 -66 -93 -110 31 130 -106 133 -119 364 122 -58 -53 291 94 76 -182 -85 -6 -96
$$ packed form
4461A11j54J60L6k4Jk1j97J40J21k27k34K43j84K49M2Q8k16J9J26k02K0R1J3N1
4485E2p7j31K55j80K2j37M63l03j19k5o6M61j85N4N3j33J90l0J27j97j94K70j28
4508D2Q5K07n44L5L77k04J41j8N9k98M4O4k1J6J57j16j0q9K4K12l23J70j70K84
4532A24j26N4L9j47q9L54k72m0K3J93j83J07Q5j97J51j35L6K36j61M6Kl6N6j36
4556a6J20R7J1j45L4P9j74Q8n2J32k21j54K63j02J6j9k5Op1K62Om58J39N60l37
4581C9nj4O5k18L05q5j7k4k1j95K94j44k64K35j71p8K74K43j63Q6k56p7J32n4
4605a13N6p8K37j50K26n6k09J27J12o7J51l56J8M6O9j02MJ01n4L18l74J13Q7n8
4629D8l77K72J41k6r0l4k7j7J41R9k36K39k52M83k42j80NL44j97j8k58R7P9r0
$$ plain form
4653 -96 -153 -94 -155 -164 91 118 17 -160 46 -280 -4 202 -385 -32 -2 29 -32 5 212 7 -62 115 17 -36 -130
4678 -130 -210 -66 153 117 -27 -183 -113 134 306 -92 -93 -97 -69 -15 -123 -158 -39 161 -156 5 5 -228 107 66
4702 66 -12 150 -15 -140 97 6 -114 14 -160 24 26 40 31 -237 -4 -148 135 -135 -61 -58 -89 -31 -155 159
4726 159 84 222 64 -29 87 116 -18 124 -208 -154 -43 -17 -221 185 179 -43 23 -96 -62 -178 40 96 127 72
4750 72 144 -90 -162 -98 2 202 -1 253 206 -187 -22 -1 -409 -8 88 75 -140 14 1 -21 60 65 84 282 -51
4775 -51 14 -88 -11 0 157 173 73 -117 -29 28 171 -62 28 119 -6 187 201 75 180 18 137 33 -54 -221
4799 -221 75 63 59 -218 -91 -43 -435 379 -102 -109 -63 -97 -126 152 -127 -93 -165 -77 169 -173 -100 -234 251 -137
4823 -137 -287 -24 -75 -43 385 -31 -74 84 -5 -6 -232 75 43 -218 14 52 212 82 -292 -132 275 57 -15
$$ packed form
4653i6n7N9o1rK55K7j01j77K06l26K76K06n87L53L0L1o1L7K07k05o9J77r8n3r4
4678a30q0J44K19l6j44j56P0K47J72l98jmK8N4j08l5J19K00l17J61%k33L35m1
4702F6p8J62j65j25K37r1j20J28j74J84KJ4rk68K33j44K83k70P4Ll1N8j24L14
4726A59p5J38j58r3J16K9j34J42l32N4J11K6k04M06ok22O6j19L4j16K18N6L1n5
4750G2P2k34p2O4J00K00k03K54m7l93J65K1m08M01R6j3k15J54j3k2Q1NJ9J98l33
4775e1O5j02P7J1J57J6j00j90Q8N7J43k33R0R1j25J93J4j26J05j62J19j04q7j67
4799b21K96j2mk77J27M8l92Q14m81pM6l4k9K78k79L4p2Q8K46l42P3j34M85l88
4823a37j50K63n1L2M28m16m3J58q9jk26L07l2k61K32L8J60j30l74J60M07k18p2
$$ plain form
4846 -15 -67 -118 37 76 -196 73 -191 -94 -211 -54 26 -23 -79 156 233 48 -70 -144 50 -74 25 107 150 33
4870 33 10 -164 -262 181 90 153 39 -135 23 54 323 -27 109 59 -57 40 -13 -106 307 -113 -45 241 103 270
4894 270 188 25 12 -93 63 17 -153 -35 -241 31 122 66 62 -164 74 173 -109 -152 123 -249 228 26 -114
4917 -114 -37 388 -64 18 -152 -110 -65 -99 -150 -51 -48 13 -6 129 -110 -53 -83 -34 -210 80 -52 -143 73 -118 -21
4942 -21 -12 -5 443 70 -118 25 121 -147 -4 -141 -22 53 41 -24 -84 -127 145 -115 51 -3 0 -48 34 129 305 -261
4968 -261 130 20 -50 41 93 114 145 12 101 99 -123 73 169 227 -12 -39 -186 62 -19 -59 199 -136 -157 128 -123
4993 -123 60 -233 -114 -214 114 -103 -18 185 -87 -42 -68 5 129 62 168 -79 6 248 -137 72 -250 65
5015 65 -92 122 -179 11 116 74 -49 370 -167 30 -47 -78 25 189 -189 -6 241 -8 99 45 -50 -107
$$ packed form
4846a5n2n1J55L9k72K69k64R7j17J57Q0m9n6K35P7j85j18p4J94j24R9Q2M3j17
4870C3k3j74r8M43r1O3j14j74J58L1K69l50J36n0j16R7n3r3M13m20O8K86j38J67
4894B70q2j63j3j05J56m6j70J18k06K72R1n6mk26K38R9k82m3K75l72M77k02j40
4917a14P7M25m52Q2j70M2M5l4n1R9LO1j9J35k39N7l0M9j76K90j32r1K16j91R7
4942b1RPM48l73j88J43R6k68J43j37J19P5j2o5o0m3K72k60J66n4Lm8Q2R5J76n66
4968b61L91j10p0R1N2K1L1j33Q9kk22J96R6N8k39k7j47K48q1m0K58l35k1K85k51
4993a23J83k93J19j00L28k17Q5K03k72M5k6P3J24o7J06k47Q5K42l85K09l22L15
5015F5j57K14l01J90J05m2j23M19n37J97p7l1J03J64l78J83K47k49J07n4r5n7
$$ plain form
5037 -107 134 103 -56 -22 12 -5 146 7 -195 -28 -113 81 -123 -82 -46 11 170 86 -77 -44 174 29 -168
5060 -168 187 47 172 -21 -165 -39 -115 244 85 -57 139 -96 -20 -28 26 20 89 -55 -98 188 -93 136 173
5083 173 -21 -54 90 -118 67 -190 97 12 25 -139 -92 104 -13 42 48 -21 -40 -102 50 -81 -109 -228 49 -149
5107 -149 257 -7 3 195 -56 204 -263 19 289 -105 -115 9 -159 11 82 -149 -285 16 -14 -46 -3 187
5129 187 20 98 146 -23 -101 34 -191 -301 -134 -193 -49 -31 -142 42 -47 151 -14 -72 156 65 -207 98 154
5152 154 126 114 -35 2 174 -198 -132 -97 154 -86 79 161 159 58 -8 -299 -139 -101 106 -66 -82 -330 -142 162
5176 162 -169 299 -58 206 -13 126 107 177 66 -134 147 65 -336 -176 252 -183 -99 220 12 25 -23 -42
5198 -42 -35 84 -89 152 85 -93 120 -151 131 37 -127 -94 -63 -41 29 -206 -35 145 -89 -165 87 -240 -29
$$ packed form
5037a07K41l1j59L4L4j7J51j39k02J67q5J94k04M1L6N7J59q4j63L3K18j45j97
5060a68L55j40J25j93j44J26p6L59j59j42J96k35P6qN4oO9j44m3K86k81K29L7
5083A73j94l3J44k08J85k57K87q5J3j64M7J96j17N5Oo9j9o2J52j31k8j19K77j98
5107a49M06k64J0J92k51K60m67K82K70l94j0J24j68J70P1k31j36L01l0l2M3J90
5129A87j67P8M8j69p8J35k25j10J67n9J44J8j11J84q9J98j65n8K28r1k72L05N6
5152A54k8j2j49L7J72l72O6L5K51k40J65Q2kj01o6k91J60L8K07j72j6k48J88L04
5176A62l31M68l57K64k19J39j9P0j11k00K81q2m01J60M28m35Q4L19k08J3m8j9
5198d2PJ19j73K41o7j78K13k71K82r4j64L3L1K2P0k35J71J80k34p6K52l27K11
$$ plain form
5221 -29 -2 291 -9 40 -175 53 -132 56 2 64 -10 71 119 23 80 31 -186 -167 -18 40 253 -66 -235 250
5245 250 -98 -213 91 -29 40 230 24 47 -189 -44 180 269 -75 -77 -105 89 87 180 90 -277 217 -108 34
5268 34 -124 17 -36 78 31 98 72 -29 208 -74 -13 287 63 262 87 -89 131 117 -258 76 34 12 -80
5291 -80 -270 -34 -11 168 89 30 187 -96 262 131 -330 -175 -95 54 -23 77 -226 -44 48 -70 -24 -30 -180
5314 -180 34 54 13 6 -207 -129 32 -93 193 149 176 127 104 182 -126 5 81 -205 -108 117 -160 185 -158 -13
5338 -13 53 98 -19 223 -155 -256 62 60 20 137 137 -35 158 -30 -35 1 -201 -101 -57 4 -223 271 -27 -275
5362 -275 7 50 -151 -60 67 180 113 -83 -127 189 223 217 71 210 -278 50 130 -278 -108 70 206 71 182
5385 182 113 -65 97 92 -110 102 126 -54 -98 5 -112 78 -286 -81 27 -459 32 105 -46 139 214 152 156
$$ packed form
5221b9K7K93l00M9k15K28j85J88n4O2p4Q1M8r6N7m9k17J9J49N8K13l19j69M85
5245B50l48j15L04j20O9J90k06K3k36J45K24Q9l44kk8J94kR3r0l67M94l25J42
5268C4j58J41n3J14m7O7k6j01K37k82O1L00k24J99j75j76K20j4l75L34m2k2r2
5291h0j90K36K3J79p9n9J57k83L58j31m61J55Q0J49p7J00l03J82R2j18M6oj50
5314a80K14K0m1pk13P8J61j25K86m4K7m9k3P8l08J31P6k86R7K25k77L45l43J45
5338a3O6M5j17K42l78j01L18km0J17%j72J93j88nL6k02J00M4O1k27M94k98k48
5362b75K82M3k01R1J27J13o7j96m4L16L4oj46J39m88L28Q0m08J70J78J36j35J11
5385A82o9j78J62nk02K12K4j80m4J03j17J90l64K05J08m86M91P3j51J85P5o2M
$$ plain form
5408 156 131 238 -149 401 31 -68 267 73 67 58 -45 -75 46 -237 -335 -27 48 -51 3 -106 4 71 -121 -149
5432 -149 45 95 23 60 0 -162 39 53 -201 4 -32 -88 44 -148 -20 -96 -130 -59 -41 -249 -16 -34 119 94
5456 94 97 14 -87 148 40 2 78 200 118 23 34 -147 227 8 -104 214 4 26 -120 29 -27 150 166 -243
5480 -243 -224 -20 -143 -44 12 114 126 -164 -50 62 141 250 -1 118 32 -265 87 195 31 42 127 -111 -110
5503 -110 -167 -233 107 35 -63 6 119 18 -54 -17 -165 -4 -229 -130 11 89 -102 -73 92 -148 64 -8 -133 187
5527 187 20 -133 58 -110 -5 171 98 -433 96 -85 -158 130 -69 -296 -14 41 -4 -147 -57 -46 28 -184
5549 -184 -109 216 255 -52 36 -61 -200 -63 -90 -78 333 157 -160 40 180 -3 24 116 13 -153 105 -140 11
5572 11 226 -155 -124 47 -10 -341 249 -215 251 220 -300 91 180 74 -269 137 -14 -284 243 203 -83 197
$$ packed form
5408A56k5J07l87N50l70r9L35j94orj03l0J21k83r8L08P5r9N4j09J10O7j92k8
5432a49J94N0p2L7o0j62K01J4k54K05l6n6J32j92J28p6l4P1J8k08K33j8J53k5
5456I4Lq3j01K35j08l8P6J22q2r5J1j81L74k19j12L18k10K2j46J49n6J77J6m09
5480b43J9K04j23R9N6J02J2k90J14J12P9J09k51J19q6k97L52J08j64J1Q5k38J
5503a10n7o6L40p2r8O9J13j01p2L7j48J61k25R9J41P8j91K9J65k40K12p2j25L20
5527A87j67j53J91j68J05J76p3n31N29j81p3K88j99k27K82N5m5j43R0J1P4k12
5549a84P5L25L9l07Q8r7j39J37k7J2M11j76l17K00J40j83K7R2j03j66K58k45J51
5572A1K15l81L1J71n7l31N90m64M66l1n20L91Q9j06l43M06j51k70N27m0k86K80
$$ plain form
5594 197 -64 -463 23 -95 -201 273 -102 -57 277 -138 -201 7 179 162 112 153 -27 80 25 75 248 273 -204
5617 -204 -83 -43 -187 -33 -155 -151 -90 29 -269 101 55 131 252 179 71 83 -103 -57 137 168 -119 149 -26
5640 -26 -92 96 24 29 -6 55 -118 325 41 -141 -29 -167 48 -41 107 65 41 135 -133 85 206 15 -149 219
5664 219 -213 76 106 -213 -101 199 -124 -128 196 -122 131 58 106 -124 155 148 -286 68 21 81 201 62 54 387
5688 387 -149 -250 161 -111 107 160 -115 -42 65 -42 83 -48 135 -41 -40 -27 -181 96 172 140 16 157
5710 157 -109 -1 -33 -18 -1 126 -106 27 -138 -111 156 -17 1 38 -218 -260 183 209 -190 83 30 -233 -105
5733 -105 87 -113 -9 -51 -255 194 152 -95 64 23 -118 92 16 76 -50 16 -181 -178 -53 126 -238 250 -78
5756 -78 -88 86 -167 48 -25 -11 -139 73 -164 -120 139 -92 -124 112 -40 -179 39 -33 34 -38 48 -123 176
$$ packed form
5594A97k61l99M86j18j06M74l75M5L34m15o3K08J72j7n0M1j80J07n5N0J73K5m77
5617b04J21M0j44J54j22MO1J19k98L70m6P6J21p3j08J2j86M6J94L1k87K68j75
5640b6o6J88p2Nl5O1j73M43k84j82J12j38K15q9J48m2k4R4k68K18J21j91j64L68
5664B19m32K89L0l19J12L00l23mL24l18K53p3M8k30K79pm34L54m7O0J20j39qL33
5688C87n36j01M11k72K18N3k75P3J07j07J25j31J83j76JJ3j54K77P6l2j24J41
5710A57k66J08l2J5J7J27k32J33j65K7K67j73J8L7k56m2M43K6l99K73n3k63J28
5733a05J92k00J04m2k04M49m2k47J59m1j41K10p6O0j26O6j97LJ25J79l64M88l28
5756g8j0J74k53K15p3J4j28K12k37M4K59k31l2K36j52j39K18p2O7p2Q6j71K99
$$ plain form
5779 176 -183 -261 280 1 -26 107 -48 -185 44 -108 144 -176 -54 -117 23 -30 12 -128 -28 12 56 36 -456
5802 -456 151 7 -44 -110 80 -71 65 -20 42 -89 -333 89 -192 -51 -4 6 184 -113 -45 -50 -296 81 38
5825 38 -187 82 198 -109 23 5 -181 -127 69 -130 56 -52 -134 -12 -151 -65 -98 202 -227 8 90 -51
5847 -51 23 -36 -92 -53 197 -267 -25 7 2 101 34 37 -112 -14 -295 -100 201 -179 -41 230 56 -86 127 -58
5871 -58 -4 89 -126 -130 54 33 -34 72 -189 -316 151 -153 -237 89 -35 -10 -59 -37 -1 -9 -32 149 23 77 -83
5896 -83 -69 -97 113 99 1 -160 197 -142 47 -129 74 -89 -183 -303 -113 36 276 45 -44 2 -138 -166 186
5919 186 -18 -2 -22 -89 -86 64 -36 -57 55 -89 283 -135 -117 -56 53 -57 -4 -106 68 -148 -3 61 36 76
5943 76 -82 -3 -23 75 14 170 64 -110 266 79 116 -78 -111 -26 -109 76 -105 -66 -137 16 -35 163 9 -44
$$ packed form
5779A76l59p8N41k79k7J33j55j37K29j52K52l20J22o3J40n3M2j40J00M0M4k0m92
5802d56O07j44n1o6J90j51J36q5O2j31k44M22k81J41M7J0J78k97O8nk46L77m3
5825C8k25K69J16l07J32j8j86N4J96j99J86j08q2J22j39Q6l3L00m29K35Q2j41
5847e1P4n9n6L9K50m64K42L2nR9o7Lj49R8k81J95L01l80J38K71j74j42K13j85
5871e8N4R3k15mJ84k1o7J06k61j27M67l04q4L26j24K5m9K2L6qk3J81j26N4j60
5896h3J4k8K10j4r8j61L57l39J89j76K03j63r4j20J90J49K40k31q9M6j40k8L52
5919A86k04J6k0o7LJ50j00k1J12j44L72m18J8O1J09j10N3j02J74k16J45O4k5M0
5943G6j58P9k0R8o1J56j06j74L76j87L7j94l3Q5q3J85j81L9p1J53n1J98j54n3
$$ plain form
5967 -44 -1 -94 -39 -136 -26 -223 -16 58 -64 362 50 -191 -80 154 -151 171 63 -125 -123 18 76 -142 53
5990 53 95 -89 107 -99 62 -47 -94 -49 -215 16 -72 219 41 -117 -180 49 64 -280 15 -9 166 135 96
6013 96 142 -232 -177 167 -213 -232 344 202 -126 157 -77 -37 -251 -78 -214 -18 48 -236 -79 278 -230 -47
6035 -47 75 9 -84 -2 51 106 9 -299 140 83 -20 -266 -42 29 -31 -28 -81 131 34 -1 -178 -154 120 196 213 -238
6061 -238 57 92 219 -62 197 -111 -10 -61 106 117 28 105 -46 211 123 43 26 4 109 75 -11 -14 274 -61
6085 -61 -116 44 4 221 -263 -5 15 28 1 320 -83 -80 -54 66 -204 -88 70 248 -183 58 99 -109 148
6108 148 -209 -138 132 -32 -71 177 -91 -82 -60 147 251 227 144 55 54 55 -105 171 -171 -153 71 13 3 159 93
6133 93 -189 -39 -142 0 38 -20 110 27 -145 -279 70 108 -23 130 89 40 277 148 36 6 -191 -70 179
$$ packed form
5967d4M3r3N5r7J10j97K07P4j22M26l12k41J11K34l05L22j08j88KJ41N8k18J95
5990E3M2j84J96k06J61j09m7M5j66K31q8K91j78j58o3K29J5l44K95k4J75l1l9
6013I6M6l74N5L44l80j9N76j42l28K83k34M0k14J73j36J96O6k84J57L57n08J83
6035d7J22o6r3Q2N3N5r7l08M39n7j03k46K24P1o0Ln3K12r7l5j77K4K74P6J7m51
6061b38K95L5J27k81K59l08J01n1J67J1q9P7j51K57q8q0j7k2J05l4q6lK88l35
6085f1n5J60m0K17m84K58K0J3k7L19m03LK6J20k70J16J58J78m31K41M1k08K57
6108A48l57P1K70j64l9K48k68RK2K07J04k4q3q9jJj60K76l42J8K24n8j0J56o6
6133I3k82J50j03J42L8n8J30q3j72j34L49L8j31J53m1m9K37j29j12l0j97J21K49
$$ plain form
6156 179 159 75 -193 46 -244 50 86 60 47 -138 -211 -215 62 -175 -115 42 -312 -381 8 -148 21 73 -92 -50
6180 -50 -108 -230 196 -85 40 -2 178 4 -135 150 34 -49 77 80 10 27 -152 -126 -9 28 -71 48 -97 19
6204 19 -11 -163 -77 213 144 -229 34 147 -190 -96 -88 -162 163 -153 -167 124 -34 -117 29 21 73 19 -162 -58 -45
6229 -45 -43 -219 -85 142 -223 105 171 -76 36 141 -116 -21 303 -96 124 232 -141 231 285 -156 -322 209
6251 209 28 -195 88 53 142 -12 -84 11 103 -39 -9 230 -246 51 62 -146 77 95 -187 -297 277 51 113
6274 113 33 -254 -142 123 13 -73 68 -135 -244 105 -303 -309 132 -279 41 244 -90 -216 153 240 -89 128
6296 128 55 -41 110 23 -33 -78 -102 -119 200 145 -185 275 129 -445 -56 -44 -172 141 49 59 131 -11 -61 67
6320 67 99 91 -96 -48 -67 139 144 -267 -60 107 -334 -76 171 -51 81 83 -372 -133 -203 -64 68 269 -288 41
$$ packed form
6156A79k0q4k68K39k90K94L6k6j3j85p3mK77k37O0J57l54o9L89j56J69N2j65M2
6180e0n8j22M26k81J25m2J80j74j39K85j16q3J26Lp0J7j79K6J17L7r9J19j45J16
6204A9l0j52Q6K90o9l73K63J13l37R4Qp4L25l16j4K91j58q3J46qN2n4j81J04J3
6229d5Kj76J34K27l65L28O6k47J12J05k57R5L24l99K20J08l73L72N4m41j66N31
6251B09j81k23K83l5Q9j54p2R5R2j42L0K39m76K97J1k08K23J8k82j10N74k26O2
6274A13q0k87J12K65j10q6J41k03j09L49m08oM41m11L20K03l34j26L69Q7l29K17
6296A28p3r6J51q7n6m5k4j7L19n5l30M60j46n74L89J2j28L13r2J0P2j42n0J28
6320F7L2qj87M8j9K06Nm11K07J67m41K58K47k22J32Km55K39p0J39J32K01n57L29
$$ plain form
6344 41 -41 -73 -163 5 -50 -28 188 -97 55 227 99 294 45 -285 -237 -99 -101 -177 335 76 -68 -29 75 104
6368 104 -11 -143 88 203 123 -124 148 44 -185 59 327 -76 331 -37 -242 134 -6 -230 98 18 -110
6389 -110 116 56 -7 35 -18 -41 -58 -258 -91 175 68 93 192 -10 -166 -128 -1 26 166 -106 -309 -43 196
6412 196 -169 -152 111 -112 226 180 -66 19 35 -325 106 31 -217 58 107 13 98 261 91 -105 181 -2 -51
6435 -51 44 23 -203 155 -21 -51 138 -244 -144 59 -62 109 152 -301 267 87 -127 -153 258 -96 104 -46
6457 -46 168 -141 153 -123 143 174 -121 -97 208 -79 204 336 -7 69 193 18 4 73 -209 -138 48 93 -18
6480 -18 75 242 -218 234 -31 -162 34 -63 -83 -80 -137 -207 186 8 -88 252 -204 -191 355 -107 -130 -172 79 -106
6504 -106 -80 -23 -232 168 -65 -183 80 69 23 117 32 -196 141 179 -186 196 -21 -112 223 156 -100 -50 101
$$ packed form
6344D1q2l2r0J68n5K2K16k85J52J72j28J95k49l30M8J38kp6N12k59j44L9J04K9
6368A04j15j32K31J15q0k47K72j04k29K44K68m03M07l68k05L76j40k24L28q0j28
6389a10K26o0o3M2n3k3j7k00J67K66j07K5R9k02j56L8J27K7J40k72k03K66K39
6412A96l65J7K63k23L38m6k46Q5J6l60M31p5k48K75M9r4Q5J63j70j96K86j83m9
6435e1R5k1k26L58j76l0J89l82J00K03j21J71M3m53N68j80k14k6M11l54K00j50
6457d6K14l09K94k76K66L1k95K4L05k87K83J32l43P6J24j75j4O9k82P1J86M5j11
6480a8R3J67m60M52k65j31J96r7k0Ln7p0L93j78r6L40m56J3N46m62k3m2K51j85
6504a06K6N7k09M00k33j18K63j1m6R4q5k28L37L8l65L82k17r1L35o7k56N0J51
$$ plain form
6527 101 -173 -67 45 -20 -358 48 -97 20 10 101 -53 38 -106 142 -24 -86 38 75 -70 -45 253 60
6549 60 6 144 107 -112 96 1 -133 54 219 -237 162 2 -5 -61 34 -8 108 -108 -62 64 253 62 -135
6572 -135 31 -166 141 -1 -221 -36 106 110 -43 -118 117 -10 -25 28 -123 -156 -157 -205 17 -317 22 88 13 -11
6596 -11 -102 -174 -28 66 -40 -23 1 -100 -173 82 -235 19 101 -308 -93 92 -96 4 -37 -91 -36 -44 93 -103
6620 -103 380 -101 227 63 -197 -159 109 57 -165 -9 -92 -147 44 -22 -41 -217 62 386 100 160 -162 110
6642 110 62 -265 51 8 -189 105 97 -85 50 136 191 42 -229 63 120 35 -46 88 121 -189 -240 111 -179 126
6666 126 31 -37 181 86 -97 29 148 -25 219 -267 -108 -65 -82 -100 -12 19 -82 109 55 47 254 -8 179 71
6690 71 141 -23 5 223 -57 31 195 226 -115 -131 54 -123 80 69 -25 -25 109 -74 86 -67 59 -13 -68 -286
$$ packed form
6527A01k74J06J12o5l38M06j45J17j0R1j54R1j44K48j66o2J24L7j45K5K98j93
6549F0n4J38l7k19K08r5j34J87J65m56L99j60pn6R5m2J16k16M6J26J89j91j97
6572a35J66j97L07j42k20J85J42Mj53p5K35j27j5N3j51l3jm8K22l34L39O6p5k4
6596a1r1p2J46R4j06J7K4j01p3K55l17K54Q2m09K15J85j88J00m1n4N5qJ37j96
6620a03M83m81L28j64k60L8K68n2k22J56q3n5J91o6j9j76K79L24k86O0l22K72
6642A10m8l27L16m3j97K94qj82J35Q6N5j49k71K92N7q5q1J34L3l10n1L51k90L05
6666A26r5o8K18r5j83J26J19j73K44m86J59M3j7j8Q8L1j01J91n4qK07k62J87j08
6690G1P0j64K8K18k80Q8J64L1l41j6J85j77K03j1r4%J34j83J60j53J26p2n5k18
$$ plain form
6714 -286 14 -176 174 -217 199 -164 -193 -164 115 -2 -34 45 -5 11 -21 223 -8 95 110 -28 3 10 -6 -295
6738 -295 -104 56 -89 177 -142 68 52 -49 8 74 -221 -122 -150 -134 -249 70 -28 -46 -94 82 60 81 -325 -27
6762 -27 -173 -125 -205 -45 -97 8 71 -369 -201 -73 -20 211 211 66 136 -298 -86 -104 -120 35 23 102 -97 91
6786 91 -84 -289 -34 46 -334 96 56 88 -89 108 -254 -29 3 -24 120 214 62 32 -87 -224 120 28 -294
6809 -294 259 221 13 103 -83 -128 16 86 -43 -28 -300 105 60 -90 -150 -21 -26 88 -142 -141 -200 -18 189 -231
6833 -231 -112 209 -29 -49 25 -276 -22 -29 -3 126 -94 12 122 89 128 -96 -243 38 -36 125 125 -58 -177
6856 -177 16 -116 63 69 24 -49 -7 -56 65 -36 129 -196 -132 255 235 268 107 -29 -32 -164 88 13 105 -51
6880 -51 17 -88 -43 -51 40 -16 -122 -114 126 28 45 51 -115 125 -9 63 84 69 -102 20 344 58 45 141 -121 34
$$ packed form
6714b86L00j90L50l91M16l63k9K9K79j17l2P9n0J6l2K44k31J03J5j38L1Pj6k89
6738b95J91J60j45K66l19K10j6j01N7O6k95R9k8J6j15L19r8j8m8J76k2K1m06K98
6762b7j46M8q0J60n2J05O3m40J68J28N3K31%j45P0m34K12j8j6J55j2P9j99J88
6786I1j75k05K55Q0l80M30m0L2j77J97l62K25L2k7J44R4j52l0j19j37L44r2l22
6809b94N53l8k08R0j86m5J44P0j29J5k72M05m5j50o0J29nJ14k30Jn9J82K07m20
6833b31J19L21k38k0P4l01K54pK6J29k20J06J10l3L9k24j47K81p4J61%j83j19
6856a77J93j32J79Om5p3M2m9J21j01J65l25O4L87k0L3j61j36lj32K52p5R2j56
6880e1O8j05M5qR1n6j06QK40r8J7Oj66K40j34P2K1j5j71J22L24k86j3R6k62J55
$$ plain form
6906 34 72 -125 46 299 -79 -41 114 90 -295 -137 -76 -101 -24 208 -221 57 124 -54 142 286 14 -18 120
6929 120 -113 333 7 -172 148 -82 40 -28 92 187 -60 133 77 -90 -147 216 -25 28 87 -52 254 -87
6951 -87 31 201 -152 -190 227 -40 21 -35 -13 -51 -21 -88 -7 332 23 -103 119 337 -264 86 -125 69 179
6974 179 -174 162 95 64 20 -117 -83 -246 -107 80 3 -42 45 -149 -18 137 -28 -17 -50 142 102 75 -218 -144
6998 -144 -44 -28 -45 85 117 10 -63 46 72 251 97 -9 196 -59 20 72 11 10 68 47 -309 -10 -163 -89
7022 -89 -82 -95 -32 -120 -137 -24 -196 46 -199 39 98 79 314 51 -51 28 -12 -169 -97 28 -151 90 -45 -171
7046 -171 130 -118 -136 -29 57 -65 -121 -54 -285 60 177 -336 -189 116 137 138 -129 28 -125 -32 -181 -97 48
7069 48 -186 257 32 2 103 119 -193 107 147 -200 278 25 -197 11 -40 -234 -23 19 -143 152 -14 -206
$$ packed form
6906C4L8j97J71K53l78L8J55k4l85J58O1k5P7K32m29K78O7j78J96J44k72l2J38
6929A20k33M46l26j79L20k30J22o8J20R5k47J93n6j67n7L63k41N3N9j39L06l41
6951h7J18J70l53l8M17k67O1n6K2l8L0o7Q1L39l09j26K22K18o01L50k11J94J10
6974A79l53L36o7l1m4j37L4j63J39J87p7m5Q7j94J31J55j65J1l3J92m0k7k93P4
6998a44J00J6j7J30L2j07p3J09K6J79j54j06K05k55P9N2o1jN8k1l56K99j53P4
7022h9Pj3O3q8j7J13j72K42k45K38N9j9K35k63j02P9m0j57P2J25j79K41j35j26
7046a71L01k48j8J07Q6j22n6O7k31L45J17n13J47L05K1Jk67J57j53R3j49Q4J45
7069D8k34M43k25l0J01J6l12L00M0l47M78k53k22K08n1j94K11M2j62K95j66j92
$$ plain form
7091 -206 130 206 -54 -17 -8 -74 173 182 -257 -121 293 -76 101 188 -211 80 34 -83 166 96 -322 -138 -143 -187
7115 -187 74 -35 -132 -132 75 -143 -396 33 -59 -89 75 35 119 73 167 59 80 107 186 133 -44 -58 246 258 -133
7140 -133 -61 -13 -188 -290 17 -126 251 -140 -14 45 7 -42 97 201 -38 292 19 -51 219 83 -160 118
7162 118 -120 -101 -78 129 -138 111 151 -226 105 79 -172 56 257 -152 99 190 -358 -72 122 -206 42 -120
7184 -120 201 143 -4 -253 48 11 -158 77 -8 110 -157 -42 -19 68 256 -91 -178 -8 -315 -103 113 -4
7206 -4 -136 228 12 71 -100 28 -317 53 -201 -431 141 66 -57 240 -166 -47 178 6 17 214 -94 -112
7228 -112 181 -125 226 268 216 -278 94 118 94 241 80 -147 233 126 -185 60 -173 -260 130 20 -221 11
7250 11 -118 -27 -109 -30 -134 -85 -138 35 23 130 -136 -33 82 -197 -35 89 48 8 211 125 -1 152 -109
$$ packed form
7091b06L36P6k60L7Ro6K47Rm39J36M14l69J77Q7l99K91m6j17K49p0m18J84nm4
7115a87K61j09r7%K07k18k53M29r2l0J64m0Q4m6R4j08K1K7P9n3j77j4L04J2l91
7140a33P2M8j75j02L07j43L77l91J26N9l8m9J39J04k39L30k73p0K70j36k43K78
7162A18k38J9K3K07k67K49M0l77L31k6k51K28K01m09K51R1n48K86J94l28K48j62
7184a20L21n8j47k49L01l7j69K35q5J18k67J15K3Q7J88l47q7J70l07K12K16j17
7206dj32L64k16N9j71J28l45L70k54k30N72p5j23K97m06J19K25j72J1J97l08j8
7228a12K93l06L51M2n2m94L72K4k4J47j61k27L80j07l11K45k33q7L90j10k41K32
7250A1j29R1q2P9j04M9n3J73j2J07k66J03J15k79J62J24m1m0K03q6j26J53k61
$$ plain form
7273 -109 -24 119 -153 315 77 -188 -210 166 110 -327 118 -255 -93 -47 -236 -99 157 18 261 -25 -47 -31
7295 -31 134 -161 -152 31 -108 168 140 -33 -140 296 -23 -87 226 33 -238 37 -154 55 -26 -148 -100 -44 209
7318 209 -29 55 99 -267 125 12 -184 142 -72 -11 -63 -96 -251 -163 -56 -95 13 296 35 -33 128 45 -61
7341 -61 69 152 -150 102 41 -139 -46 -258 1 -25 -66 208 49 -187 15 52 26 132 -10 131 103 122 -167
7364 -167 49 45 112 67 -40 -18 -134 -119 6 -186 131 -175 70 176 -21 150 212 -135 -103 200 3 -136 -175
7387 -175 99 50 229 63 -205 -79 43 -60 -50 -50 101 5 80 12 66 -93 241 36 125 -44 -82 23 56 0
7411 0 59 -8 -171 46 -73 -188 -15 -55 4 -128 -3 -115 67 66 19 -237 -42 -127 -54 59 -110 -129 35 1
7435 1 41 381 243 70 -139 35 -139 -83 -13 89 -251 -130 -91 -125 -7 85 28 156 -84 -21 215 -206 -104
$$ packed form
7273a09Q5J43k72M68k38k65k2L76n6m37M45l73J62M6j89J37K56j39K43k86k2J6
7295c1J65k95RJ83j39K76k8j73j07M36l19o4L13j93k71K75j91K09q1j22M8N6K53
7318B09k38Q4M4l66L92j13j96L26k14O1n2l3j55Q8J07l9J08K83k61o8J61q3j06
7341f1J30Q3l02K52o1j80R3k12K59k6m1K74j59k36K02L7k6J06j42J41k8J9k89
7364a67K16mO7m5j07K2j16J5J25j92L17l06K45J06j97J71O2l47L2L03j97j39l9
7387a75K74m9J79j66k68J26J22j03J0%J51r6P5o8N4j59L34k05Q9j69l8J05L3n6
7411@N9o7j63K17j19j15J73m0N9j32J25j12J82jm7k56J95q5P3J13j69j9J64l4
7435AM0L40j38j73k09J74j74N6P0J02l40J21L9l4J18R2n7J28k40O3K36m21J02
$$ plain form
7458 -104 -89 156 -86 -199 0 55 29 327 -11 -46 74 131 -19 148 265 170 89 -101 47 -85 53 -79
7480 -79 -22 338 130 -47 -254 265 15 12 -165 -121 201 -98 108 -60 80 -37 -81 188 214 314 73 243
7502 243 -54 -22 196 -127 -110 138 -150 52 -28 -177 178 -256 -285 -94 -261 61 72 50 35 200 98 -52
7524 -52 -129 -178 75 49 57 -175 103 3 202 68 -32 3 -246 57 139 6 20 -150 -13 108 -212 -128 116
7547 116 41 206 67 287 98 -31 -32 22 73 -183 148 99 -159 -146 245 -296 -59 -113 104 4 -45 76 -190
7570 -190 -188 -268 204 -10 78 -16 -129 26 26 158 65 -67 60 -45 -87 -146 167 -20 188 -23 -18 -66 -17 9 -5
7595 -5 -209 104 25 -62 -149 -19 158 10 104 -147 130 -276 -155 -49 -42 -94 46 9 -164 -29 -28 40 -311 -161
7619 -161 265 164 169 156 -30 13 114 -21 -254 119 -92 55 64 18 12 -263 -51 40 60 -48 44 13 15 -70 -45 56
$$ packed form
7458a04J5K45k42j13J99N5k6K98l38l5J20N7j50J67J17r5q1j90J48j32J38j32
7480g9N7L60k08j77k07N19k50lj77M4L22k99K06j68J40j17m4K69K6J00k41J70
7502B43k97L2K18l23J7K48k88K02q0j49L55m34k9J91j67L22J1k2j5J65j02j50
7524e2p7m9K53k6Qk32K78j00J99j34j00L5k49L03Q2j33J4j70J37J21l20Q4K44
7547A16p5J65j39K20j89j29jN4N1k56L31m9k58J3L91n41K37n4K17j00m9J21k66
7570a90Kq0M72k14Q8r4j13J55%J32r3j32J27j05m2n9L13j87K08k11Nm8M9K6j4
7595ek04L13p9q7q7J30J77j48R4k51K77m06J21J06Pn2J40l7j73J35JO8l51J50
7619a61M26j01Nj3j86M3J01j35k33L73k11J47Rm6ok75K12R1K0j08R2l1Kq5K5J01
$$ plain form
7645 56 -10 27 -142 -192 -63 -14 101 194 63 235 29 0 -96 -36 34 30 188 30 15 35 71 205 111 -92 209
7670 209 -157 52 -118 17 -69 -311 73 -235 72 69 65 166 41 216 101 -235 -45 55 127 -5 71 164 -132
7693 -132 -54 83 -11 8 -42 -258 -169 -99 272 -211 -164 94 179 172 -364 123 -118 -137 -145 -102 -42 -215 -104 -41 -83 99
7719 99 232 -81 -51 108 -53 -34 55 124 190 188 -4 -57 263 -156 87 71 -203 44 37 261 214 204 251 -53 -113
7744 -113 -30 -113 89 -72 -50 -61 148 -202 133 44 -186 153 -77 -159 -165 -124 -141 34 -89 -241 332 22 -92
7767 -92 3 29 -230 108 28 -91 -58 -112 -42 -93 242 -14 -67 97 -36 10 145 74 -79 89 110 100 -28 -280
7791 -280 308 123 -231 29 -171 -85 154 -68 22 -110 38 -96 81 -15 -306 -27 -70 -170 -8 180 -140
7812 -140 286 -7 1 -42 231 -171 78 -70 59 -84 -283 -111 121 72 -111 59 -28 23 10 129 -84 111
$$ packed form
7645E6o6L7j69n0J29M9J15R3j31J72k06k9r6O0P0mJ58j58j5K0L6J34r4k03L01
7670B09l66K09j70J35q6k42L84l08L07lmJ01j25J75j15l36J90J00P2j32P6R3k96
7693a32P8J37r4J9n0k16Q9P0L71m83M7K58Q5pn36M87k41j9qM3O0j73J11O3m2J82
7719I9J33l13L0J59j61J9Q9O9O6kj92n3L20m19K43j6k74K47pK24m7j0M7l04o0
7744a13Q3q3K02j61K2j1K09l50L35q9k30L39k30q2oM1j7J75j23j52N73l10j14
7767i2R5K6k59L38q0j19L3n4P0n1L35k56n3J64j33M6J35p1j53J68K1j0j28k52
7791b80N88j85l54K60k00Q6K39k22R0j32J48j34J77r6k91K79m3j00J62J88l20
7812a40M26k93Qm3K73m02K49j48J29j43j99J72K32m9j83J70q7N1j3J19k13J95
$$ plain form
7834 111 -58 -108 -162 -24 -212 -22 92 44 108 -23 33 -11 170 -158 -43 -145 16 -70 137 33 174 121 82
7857 82 -59 -6 -211 -96 196 -183 -153 64 -145 2 -4 128 43 -5 259 -72 -67 134 -198 147 97 10 158 -56
7881 -56 -347 -172 63 -150 -124 -312 -99 -164 -240 -146 -43 -112 -10 12 77 37 68 8 -73 215 14 -68 -12 -3 -59 -70
7907 -70 -125 107 -38 322 155 -2 317 -350 37 289 -269 172 302 -79 -105 130 -112 77 113 -197 58
7928 58 169 -17 -74 116 42 77 175 159 -68 16 -68 -31 -66 -12 -39 33 -100 -39 -225 4 -147 -102 -191 -47 -31 120
7954 120 72 -105 200 124 -279 5 -18 -51 -19 -118 -178 -30 285 -55 -202 -488 -154 -58 -8 10 1 78 36 -35 68
7979 68 21 -111 169 -81 95 134 6 -16 51 -6 111 17 -48 67 70 -151 -7 122 90 77 -111 -248 46 -158
8003 -158 -219 15 -65 -34 156 -131 -8 195 -216 -84 152 115 101 209 -126 131 264 -91 119 30 -204 -54
$$ packed form
7834A11j69n0n4J38j88J90J14m8O4j31N6m4J81l28J15j02J61q6K07j04J41n3l9
7857H2j41N3k05J15K92l79L0K17k09J47oJ32q5m8K64l31NK01l32L45n0q7J48k14
7881e6k91J75K35k13K6j88K13o5p6R4J03o9J02K2O5m0L1o0q1K88k01q2N6Rn6j1
7907g0n5K32j45L60j67j57L19o67L87K52n58M41J30l81k6K35k42J89L6l10K55
7928E8J11j86n7J90p4L5R8j6k27Q4q4L7l5N4k7P2j33O1j86K29j51M5q9J44J6J51
7954A20m8j77L05p6m03K84k3l3L2r9o0J48L15l40j47k86L34R6N0J8rP7m2p1J03
7979F8m7j32K80k50J76L9j28k2O7n7J17r4o5J15Lk21J44J29l2j3j88j37K94k04
8003a58o1K34q0L1J90k87J23K03m11J32K36l7j4J08l35K57J33l55K10q9k34J50
$$ plain form
8025 -54 -49 7 -347 203 131 -57 -9 -35 -96 117 121 61 233 -173 -45 79 -55 -120 72 -47 61 -41 34 -89
8049 -89 -29 -157 -260 -35 -52 127 -25 72 -9 104 376 -137 182 -52 124 8 118 -185 -47 -160 225 -165
8071 -165 -37 1 -60 8 114 -139 53 -131 -8 52 -97 -16 57 -58 118 -25 103 193 25 63 -4 173 -95
8094 -95 220 91 34 -125 -27 -130 49 197 -68 -252 330 -142 -28 -140 -97 -133 16 61 101 66 -142 13 -171
8117 -171 -139 -4 -113 65 130 184 44 100 -36 145 0 89 -39 -397 195 102 -212 -115 -193 72 140 -62 -60 29
8141 29 -96 -249 102 74 97 90 57 23 1 -121 -126 140 72 -21 -27 -134 -25 -62 -146 -23 273 198 120 -320 154 78
8167 78 -70 0 -238 226 115 151 43 187 165 119 -179 180 -47 -73 -83 -127 41 -43 -110 -52 -132 3 -42 10
$$ packed form
8025e4NN6l54N50p2j88M8k6o1K13Mo0J72m06J28J24j34o5J92j19J08j02P5j23
8049h9O0j28j03K25j7J79j52R7q1J13K72n13L19k34J76j16J10l03J38j13L85l90
8071a65J28L8o1O8J06k53J92j84J23O0j49Q1P3j15J76j43J28R0j68L8o7J77k68
8094i5L15j29n7j59R8j03J79J48k65j84N82m72J14j12M3l6J49M5M0l5k08J55j84
8117a71L2J35j09J78O5N4j40N6j36J81j45Q9j28l58N92r3l14R7p8K65O8k02KQ9
8141B9j25j53L51k8K3pl3l4k2j22nK66o8r3oj07J09l7q4J23K96p5p8m40M74p6
8167G8j48P0k38M64j11L6j08J44k2m6k98L59k27k6j0m4J68q4o7N8q0J35m5N2
8191A0
$$ Imaginary data points
##PAGE= N=2
##DATA TABLE= (X++(I..I)), XYDATA
$$ plain form
0 0 0 0 0 0 0 0 0 0 8 -8 8 -8 8 -16 16 -22 24 -32 32 -40 48 -56 64 -73 83 -97 110 -124 140 -160 179 -202
32 -202 226 -253 282 -314 348 -388 429 -476 528 -584 646 -716 794 -882 978 -1092 1221 -1369
50 -1369 1547 -1761 2025 -2359 2799 -3405 4294 -5736 8463 -15426 68448 117830 -34794 3916
64 3916 53030 21479 -30868 -41026 -18818 15080 -7442 -15818 9159 11682 4397 29703 -4389
77 -4389 -44614 11567 20406 -64178 -38557 28007 922 -27777 -14733 14917 37199 -4596 -15571
90 -15571 47538 39198 -22060 391 25774 -18557 -25291 12421 -1316 -13733 6769 2154 2694
103 2694 6726 -8194 7244 2351 -28476 6477 12851 -44991 -17366 39047 2167 -29638 7720
116 7720 28988 7597 -7986 2266 25839 18839 -19867 -2631 28185 -19681 -27645 24478 1568
$$ packed form
0@%%%%%%%%Qj6J6j6J6k4L2l8M6n6O4p2Q8j04J20j37J56j80K07k34K64l00L39l81
32b02M28m79N35n96O62p36Q17r05J004j112J230j362J510j676J860k070K313k590
50a369K916l308L786m384N158o204P699j0030J4199k3889Q3874M9382j52624L8710
64C916M9114l1551n2347j0158K2208L3898k2522q376K4977K523p285K5306l4092
77d389m0225N6181Q839q4584K5621O6564k7085k8699J3044K9650K2282m1795j0975
90a5571O3109q340o1258K2451K5383m4331o734L7712j3737j2417K0502m615N40
103B694M032j4920J5438m893l0827L4953O374n7842K7625N6413l6880l1805L7358
116G720K1268k1391j5583J0252K3573p000l8706J7236L0816m7866p964N2123k2910
$$ plain form
129 1568 -24457 6299 687 -14996 -1275 -765 -5308 -5878 -7426 7664 3749 -27838 -7281 38533
143 38533 1319 -33758 24762 39267 -14925 -8389 20689 16796 4804 -17305 -6189 21294
155 21294 -5614 -19094 9967 3668 -6737 10408 -8977 -35064 991 21936 -20365 -25087
167 -25087 14742 20694 1667 -18424 -7068 30555 4687 -34806 6372 22780 -13634 -3574
179 -3574 17537 6194 4988 8449 -2462 -4480 1404 -2123 -2320 -4508 -9196 9760 6298 -29558
193 -29558 -4358 29941 -7180 -17199 15427 10769 -4655 -7375 -4078 7483 -2070 -16226 4236
206 4236 13289 -10328 -2776 23549 4199 -10299 12355 637 -20718 -2494 1079 -7921 -3115
219 -3115 -2525 8780 8400 -13722 1933 20643 -7400 -11882 16512 4801 -20509 -266 16693
$$ packed form
129A568k6025L0756n612j5683J3721N10m543n70j548J5090l915l1587K0557M5814
143C8533l7214l5077N8520J4505n4192O536K9078l893j1992k2109J1116K7483
155B1294k6908j3480K9061o299j0405J7145j9385k6087L6055K0945m2301m722
167b5087L9829N952j9027k0091J1356L7623k5868l9493M1178J6408l6414J0060
179c574K1111j1343j206L461j0911k018N884l527j97k188m688J8956l462l5856
193b9558K5200L4299l7121j0019L2626m658j5424k720L297J1561r553j4156K0462
206D236R053k3617P552K6325j9350j4498K2654j1718k1355J8224L573r000M806
219c115N90J1305l80k2122J5655J8710k8043m482K8394j1711k5310K0243J6959
$$ plain form
232 16693 -2440 -8454 3092 8315 7235 -9451 -7877 15731 1811 -12485 6566 -2362 -14287
245 -14287 5555 2707 -13905 -1344 12205 1086 -9890 -3018 9530 9776 -7207 -9955 16276
258 16276 10145 -22200 -5937 14737 -2596 -4835 1767 -904 6240 4144 -4474 1677 3081 1241
272 1241 3542 -6299 -12850 4962 9573 -12727 -7095 17422 4029 -10948 1554 6397 4580 -3116
286 -3116 -9410 6225 4954 -15753 -4592 8589 -2703 -570 8571 180 -4273 6282 3620 -8858
300 -8858 -4141 3438 838 -4410 -9014 4092 13837 -5726 -3709 15836 410 -10998 2592 3320
314 3320 -4229 -1961 2257 2339 -2122 -3212 1433 3111 -3983 -2857 8316 -458 -10727 4170 4852
329 4852 -6911 1551 3841 -4405 -1359 230 637 -437 -3409 4837 8751 -4564 -8348 5780 7184
$$ packed form
232A6693j9133o014J1546N223j080j6686J574K3608j3920j4296J9051q928j1925
245a4287J9842k848j6612J2561J3549j1119j0976O872J2548K46j6983k748K6231
258A6276o131l2345J6263K0674j7333k239O602k671P144k096q618O151J404j840
272A241K301r841o551J7812M611k2300N632K4517j3393j4977J2502M843j817p696
286c116o294J5635j271k0707J1161J3181j1292K133R141q391m453J0555k662j2478
300h858M717P579k600n248m604J3106R745j9563K017J9545j5426j1408J3590P28
314C320p549K268M218Q2m461j090M645J678p094J126J1173q774j0269J4897O82
329D852j1763Q462K290q246L046J589M07j074k972Q246L914j3315l784J4128J404
$$ plain form
344 7184 -7790 -5393 7096 394 -3764 -1370 -2464 3889 4162 -1872 3232 1718 -1601 3529 -2192
359 -2192 -7303 3373 4900 -7002 -8186 4489 7017 -3206 -3335 4224 7480 -587 -11050 -2393
373 -2393 5658 -5323 -4853 3270 -653 1249 4276 -509 -37 4193 4380 -1486 -5713 -110 3355 -2476
389 -2476 -5423 2390 9097 -2290 -7395 5243 4289 -4372 -407 829 -35 -811 -3662 -1597 -1448 -1362
405 -1362 3324 1199 -3193 942 4773 699 -4470 2291 5848 -3185 -3802 1543 16 -1186 -951 1062
421 1062 3393 -2552 -1614 2608 -1973 -1734 3212 2128 -1876 -2818 585 472 -4110 -1376 1868 2404
437 2404 2017 -620 1276 2982 938 2064 -968 -4060 621 -65 -3993 -3426 1008 5969 1069 -4377
453 -4377 1292 3560 -779 -4095 -2814 2541 128 -4985 -1623 451 1608 3082 698 447 2776
$$ packed form
344G184j4974K397J2489o702m158K394j094O353K73o034N104j514l319N130n721
359b192n111J0676J527j1902j184J2675K528j0223j29P559L256q067j0463Q657
373b393Q051j0981M70Q123l923J902L027m785M72M230J87n866m227N603L465n831
389b476k947P813O707j1387n105J2638r54q661L965J236q64p76k851K065J49Q6
405a362M686k125m392M135L831m074n169O761L557r033o17N345j527j202K35K013
421A062K331n945R38M222m581K39M946j084m004r42L403j13m582K734L244N36
437B404l87k637J896J706k044J126l032l092M681o86l928N67M434M961m900n446
453d377N669K268m339l316J281N355k413n113L362K074J157J474k384k51K329
$$ plain form
468 2776 3157 -134 -5769 -729 5530 -1277 -4875 -123 3644 1986 -3728 -980 5011 -69 -3689
483 -3689 -1234 -1235 -683 123 647 -171 270 2780 -908 -3982 1390 2787 -486 -2050 -1087 3632 118
500 118 -5491 1406 4938 -695 -436 450 -134 -169 -239 -908 -1996 320 1987 -1312 -900 1280 3633 3325
518 3325 -3025 -2042 3119 -3288 -4604 236 -37 1501 2445 -383 193 802 -102 -432 -1557 -2135 -222
535 -222 2267 -1136 -4007 2859 4262 -1610 -276 -397 -177 3063 -1502 -1399 4048 1205 -618 -632 -4002
552 -4002 -1720 2779 6 -3905 1565 5534 -767 -2988 336 243 1422 -1617 -4530 2453 1506 -3451
568 -3451 2196 1765 -756 4217 1384 -3338 680 3555 -760 -2939 272 819 -1214 -2822 -2899 3064
584 3064 3678 -4358 1075 5388 -3275 -2698 1163 -2902 -239 1323 -2315 -471 2238 1448 1266 665
$$ packed form
468B776L81l291n635N040O259o807l598M752L767j658n714K748N991n080l620
483c689K455jN52Q06N24q18M41K510l688l074N372J397l273j564R63M719l514
500A18n609O897L532n633K59Q86n84l5p0o69j088K316J667l299M12K180K353l08
518C325o350R83N161o407j316M840k73J538R44k828N76O09r04l30j125n78J913
535b22K489l403k871O866J403n872J334j21K20L240m565J03N447k843j823j4l370
552d002K282M499k773l911N470L969o301k221L324r3J179l039k913O983r47m957
568c451N647m31k521M973k833m722M018K875m315k179L211N47k033j608p7N963
584C064O14q036N433M313q663N77L861m065K663J562l638J844K709p90j82o01
$$ plain form
600 665 494 3081 2307 -5175 -2914 5200 -1465 -4944 2127 2 -842 2243 -2667 -310 4382 -434
616 -434 -1458 -743 -3841 -958 1791 -2742 -2343 5563 3638 -2482 960 1552 -1093 2014 -1852 -3545
632 -3545 3458 -73 -2722 3521 -77 -1311 4859 -604 -5643 751 2214 -1529 -1608 226 202 1476
648 1476 -1732 -4702 2965 3132 -3232 2979 3170 -3637 2221 1931 -5347 14 2751 -1336 -462 204
664 204 804 3668 -240 -3451 2115 1888 -6481 -2230 4277 -2411 -651 4796 -1277 -124 2630 -3276
680 -3276 -933 1875 -1283 1435 582 -3605 2131 2802 -5223 -1981 5485 -165 -4350 1704 998 -236
696 -236 2532 -2531 -1412 4142 -2594 -2665 2555 -2167 499 5365 -2493 -3015 4428 625 -3655 62
712 62 1144 365 1445 -2925 -3394 4222 61 -4300 3777 958 -2885 3823 -528 -4804 2760 1599
$$ packed form
600F65j71K587p74p482K261Q114o665l479P071k125q44L085m910K357M692m816
616d34j024P15l098K883K749m533L99P906j925o120L442N92k645L107l866j693
632c545P003l531k649O243l598j234O170n463n039O394J463l743p9J834k4J274
648A476l208k970P667J67o364O211J91o807N858k90p278N361K737m087Q74O66
664B04O00K864l908l211N566k27q369M251O507o688J760N447o073J153K754n906
680c276K343K808l158K718q53m187N736O71q025L242P466n650m185O054p06j234
696b36K768n063J119N554o736p1N220m722K666M866p858n22P443l803m280L717
712F2J082p79J080m370m69P616m161m361Q077k819l843O708m351m276P564j161
$$ plain form
728 1599 -2645 80 -1038 170 3515 -625 -2109 4492 2310 -4946 274 2091 -4245 1148 3050
743 3050 -3865 634 2384 -2739 644 -366 -2364 3726 91 -5109 2614 2889 -4451 -514 4466
758 4466 -1310 -978 3145 -866 159 2996 -2188 245 1843 -4182 322 2211 -4683 1765 5018
773 5018 -3858 -1888 3355 -1728 -3588 55 -535 688 2129 -2168 -269 4981 -1160 -2277 3769
788 3769 -1507 -1819 4143 -2932 -2636 5471 1017 -2085 892 -712 457 1433 -3387 -2024 4684 66
804 66 -4851 1543 709 -3484 2100 307 -3385 3392 1142 -3053 1702 -558 -902 4209 -1479 -3677
820 -3677 4307 1708 -4556 1032 3026 -1809 -343 1045 -2928 1208 1690 -2335 1794 1004 -3412 2704
836 2704 405 -5994 2430 3712 -3738 395 2965 -1215 -100 1769 -885 401 1322 -2219 62
$$ packed form
728A599m244K725j118J208L345m140j484O601k182p256N220J817o336N393J902
743C050o915M499J750n123L383j010j998O090l635n200P723K75p340L937M980
758D466n776L32M123m011J025K837n184K433J598o025M504J889o894O448L253
773E018q876J970N243n083j860L643n90J223J441m297J899N250o141j117O046
788C769n276l12N962p075K96Q107m454l102K977j604J169R76m820J363O708m618
804F6m917O394q34m193N584j793l692O777k250m195M755k260l44N111n688k198
820c677P984k599o264N588J994m835J466J388l973M136M82m025M129p90m416O116
836B704k299o399Q424J282p450M133K570m180J115J869k654J286R21l541K281
$$ plain form
851 62 1735 -3052 761 3762 -3760 98 4584 -3863 -1621 3508 -1342 -805 951 -1624 728 1344
867 1344 -2848 181 4189 -1079 -1264 3043 -1354 -2466 3106 -1355 -3020 3575 -457 -2309 1831
882 1831 -1578 309 3155 -3057 -1760 3954 -730 -3421 1895 1575 -987 1425 -261 -2531 2360
897 2360 731 -2653 2390 259 -1644 3497 -1299 -4123 3733 1200 -3963 603 1216 -1272 227
912 227 -317 -1177 2305 937 -2194 1283 1306 -2797 1930 1812 -4266 1875 3310 -3984 -332 2312 -971
929 -971 1009 690 -1124 1683 75 -3303 417 1551 -2431 -153 2301 -2858 -898 3556 -1451 -1322
945 -1322 3071 -861 -520 970 -2260 1024 2398 -2841 316 3120 -1893 -822 2235 -651 -614 2305
961 2305 -703 -2132 1664 -522 -2029 1409 -1253 -728 2921 -2644 -1886 3979 -300 -1734 1811 133
$$ packed form
851F2J673m787L813L001p522L858M486q447K242N129m850N37J756k575K352O16
867A344m192L029M008n268j85M307m397j112N572m461j665O595m032j852M140
882A831l409J887K846o212J297N714m684k691N316l20k562K412j686k270M891
897B360j629l384N043k131j903N141m796k824P856k533n163M566O13k488J499
912B27n44q60L482j368l131L477K3m103M727j18o078O141J435p294L652K644l283
929i71J980l19j814K807j608l378L720J134l982K278K454n159J960M454n007J29
945a322M393l932L41J490l230L284J374n239L157K804n013J071L057k886L7K919
961B305l008j429L796k186j507L438k662N25L649n565P58N865m279j434L545j678
$$ plain form
977 133 -923 649 -1066 -876 2058 353 -1424 1741 242 -1796 2390 389 -2885 2800 1703 -3557
993 -3557 353 628 -1067 709 -1188 -871 2743 -374 -2149 1631 1336 -1504 634 863 -3080 66
1009 66 2252 -2577 -358 2835 -89 839 -212 -1700 2210 639 -2982 1353 1303 -2365 -19 1316
1025 1316 -1265 50 2291 -832 -1416 1520 -183 -682 784 -1748 805 1951 -3182 -285 2544
1040 2544 -1149 -428 1948 -626 -185 858 -759 -894 658 86 -139 1059 -713 -839 2072 -807
1056 -807 -2139 2515 -431 -2333 918 -521 -642 1282 -621 -34 1615 -897 -1276 1361 -38 -965
1072 -965 1316 236 -1835 951 1325 -1835 679 1491 1 1283 -866 -1261 1746 -1129 -2384 1493
1088 1493 551 -1378 288 799 -448 527 1632 -1022 -1421 481 -369 -364 -499 -931 2176 980 -2819
$$ packed form
977A33j056J572j715J90K934j705j777L165j499k038M186k001l274N685j097n260
993c557L910K75j695J776j897L17L614l117j775L780k95k840K138K29l943L146
1009F6K186m829K219L193k924R28j051j488L910j571l621M335n0l668K346J335
1025A316k581J315K241l123n84K936j703m99J466k532K553J146n133K897K829
1040B544l693P21K376k574M41J043j617j35J552n72k25J198j772j26K911k879
1056h07j332M654k946j902L251j439j21J924j903N87J649k512l79K637j399r27
1072i65K281j080k071K786L74l160K514Q12j490J282k149l95L007k875j255L877
1088A493r42j929J666N11j247R75J105k654l99J902q50Nj35m32L107j196l799
$$ plain form
1105 -2819 979 2276 -1266 223 1147 -335 157 438 -826 -956 -85 553 115 176 -379 996 2047
1122 2047 -1843 -1042 1892 -1067 -1993 409 -1147 -40 752 -525 616 686 -521 220 4 -752 73
1139 73 1139 -281 -1359 708 361 -1707 461 622 37 1124 -209 289 1362 -1033 -799 615 -1057
1156 -1057 -1174 -77 153 -462 760 995 230 -322 685 -303 -183 -780 -521 1529 -61 -1997 1106
1173 1106 1051 -983 567 677 416 544 -24 111 -466 -276 353 -224 -897 -306 1305 889 -1477 -54
1191 -54 1993 -464 -1018 -106 -715 -13 -61 -470 351 -66 426 621 -1014 -79 999 739 -741 -737 1350
1210 1350 513 -1383 -170 243 -130 234 -757 61 131 -80 507 -51 -956 440 -106 -548 -512 65 1103
1229 1103 255 -414 453 -36 -68 -76 -351 883 213 -282 681 -157 -680 -159 -200 219 -359 -334 678 -567
$$ packed form
1105b819L798J297l542J489R24j482M92K81j264j30Q71O38m38O1n55J375J051
1122B047l890Q01K934k959r26K402j556J107P92j277J141P0j207P41k16p56Q25
1139G3J066j420j078K067l47k068K168J61n85J087j333M98J073k395K34J414j672
1156a057j17J097K30o15J222K35p65n52J007r88J20n97K59K050j590j936L103
1173A106n5k034J550J10k61J28n68J35n77J90O29n77o73N91J611m16k366J423
1191e4K047k457n54R12o09P02m8m09Q21m17M92J95j635R35J078k60j480MK087
1210A350q37j896J213M13l73L64r91Q18P0k11N87n58r05J396n46m42L6N77J038
1229A103q48o69Q67m89l2qk75J234o70m95R63q38n23N21m1M19n78K5J012j245
$$ plain form
1249 -567 -142 879 -227 -310 -269 131 1 -1166 412 1379 -334 -236 375 33 -42 -558 371 772 -148 1095
1269 1095 153 -1271 -139 142 -283 -717 -749 1258 599 -1178 50 1302 514 -355 -543 119 -471 -262
1287 -262 443 -817 -54 991 -185 -330 -623 3 1476 -518 -961 929 -71 -632 -616 -663 351 417
1305 417 322 -135 -38 703 163 -44 -30 -306 440 453 -1661 -40 735 -468 332 -14 -441 344 -207 -550
1325 -550 343 -85 -24 140 75 -786 -787 747 -319 -333 1510 38 101 925 -345 339 -17 -822 685 91
1345 91 -1497 224 864 -292 -260 612 -71 -659 189 -31 -887 342 290 -647 -79 -837 38 1475 -1061
1364 -1061 -177 2063 -77 -382 396 76 205 139 -423 -802 -155 596 -177 -82 -64 -347 1014 -746 -2215
1383 -2215 691 449 -948 457 -216 -545 396 -492 -602 655 628 246 404 486 -516 437 503 -1443 -105
$$ packed form
1249e67M25J021j106q3M1M00j30j167J578R67j713R8O11l42p5n16R29M01r20J243
1269A095r42j424J132K81m25m34l2K007o59j777J228J252p88q69j88O62n90K09
1287b62P05j260P63J045j176j45k93O26J473j994m43J890j000n61J6m7J014O6
1305D17r5m57R7P41n40k07J4k76P46J3k114J621P75j203Q00l46m27P85n51l43
1325e50Q93m28O1J64o5q61jJ534j066j4J843j472O3Q24j270O84l56q05J507n94
1345I1j588J721O40j156L2Q72o83n88Q48k20q56J229n2r37N68p58Q75J437k536
1364a061Q84K240k140l05P78l20J29o6n62l79O47P51p73R5J8k83J361j760j469
1383b215K906k42j397J405o73l29R41q88j10J257k7l82J58Q2j002R53O6j946J338
$$ plain form
1402 -105 1134 -890 -203 549 -741 819 444 -1217 885 358 -1200 434 316 -606 74 352 -466
1419 -466 -332 864 -14 146 1278 -29 248 1042 -915 141 1132 -1520 -322 1320 -1042 -311 315
1436 315 -148 167 400 -99 -554 132 -148 -309 62 -566 -509 1365 -862 -1046 1954 36 -763 997 297
1455 297 81 625 -751 -630 349 -426 -228 135 -748 -433 1002 15 -1332 1261 1134 -1245 409 215
1473 215 -938 911 -89 -1079 1089 91 -440 672 -115 -75 924 296 -1130 -112 673 -995 -431 343
1491 343 -986 282 440 -1584 569 1140 -1275 730 736 -1002 386 402 -924 87 519 -371 105 362
1509 362 -550 190 855 -888 -5 1386 -1301 -1113 1096 -1302 -853 881 -737 27 753 -638 77
1526 77 1120 -321 294 1017 -709 -435 1010 -440 -1278 1173 225 -1101 1041 89 -730 967 -633
$$ packed form
1402a05J239k024O87P52j290J560l75j661K102n27j558J634j18r22O80K78q18
1419d66J34J196q78J60J132j307K77P94j957J056R91k652J198J642k362P31O26
1436C15m63L15K33m99m55O86k80j61L71o28N7J874k227j84L000j918p99J760p00
1455B97k16N44j376J21R79p75J98L63q83L15J435r87j347K593j27k379J654j94
1473B15j153J849j000r90K168r98n31J112p87M0R99o28j426J018P85j668N64P74
1491C43j329J268J58k024K153N71k415K005Oj738J388J6j326J011M32q90M76K57
1509C62r12P40O65j743Q83J391k687J88K209k398M49J734j618P64P26j391P15
1526G7J043j441O15P23j726K74J445j450q38K451r48j326K142r52q19J697j600
$$ plain form
1543 -633 -811 1056 -798 -721 635 -903 -570 988 -187 -691 1121 968 -639 428 704 -453 670
1560 670 -20 -1124 1071 100 -1266 869 116 -1055 829 -47 -1186 368 367 -800 -86 -279 -881 39
1578 39 329 -1382 475 1088 -1090 11 1059 -635 371 946 -1039 658 533 -947 138 292 -815
1595 -815 443 681 -810 9 795 -787 -902 983 -510 -675 812 -897 -362 887 -787 19 738
1612 738 -622 375 1124 -947 -65 1093 -241 -709 772 136 -1112 250 -39 -182 842 -353 -713
1629 -713 1128 -636 -812 1065 -569 -875 937 -423 -916 764 155 -387 638 461 -439 454 198
1646 198 -713 690 403 -1240 481 29 -1370 570 437 -1296 758 403 -790 264 -154 -635 314
1663 314 -104 -865 280 752 -821 -106 1106 -408 305 891 -729 252 714 -1057 265 234 -1284 344
$$ packed form
1543f33j78J867j854P7J356j538L33J558j175n04J812j53j607J067K76j157J123
1560F70o90j104K195r71j366K135p53j171J884q76j139J554jj167P14j93o02R20
1578C9K90j711J857O13k178J101J048j694J006N75j985J697j25j480J085J54j107
1595h15J258K38j491Q19P86j582j15J885j493j65J487j709N35J249j674Q06P19
1612G38j360R97P49k071Q82J158j334m68J481o36j248J362k89j43J024j195l60
1629g13J841j764j76J877j634l06J812j360m93J680o09n42J025j77r00Q93k56
1646A98r11J403k87j643J721m52j399J940j33j733K054l55j193J054m18m81R49
1663C14m18p61J145M72j573P15J212j514P13N86j620R81M62j771J322l1j518J628
$$ plain form
1681 344 389 -1038 255 823 -203 -227 745 46 -493 318 -631 -233 1001 -567 -149 1066 -690 -143
1699 -143 1432 -976 -261 1105 -858 -756 416 -187 -393 -6 45 -354 291 -139 -590 942 -21 -589
1717 -589 853 -215 -995 1205 -196 -466 874 172 -89 398 -296 -117 463 -315 -335 495 -89 -692 502
1736 502 376 -937 416 469 -844 555 508 -874 825 603 -253 668 -95 -803 306 324 -682 -11
1754 -11 433 -329 161 442 -780 118 782 -874 -209 693 -1091 -68 551 -1019 411 529 -462 25
1772 25 388 -47 57 291 -258 169 212 -350 -563 922 35 132 753 -638 -575 946 -341 -878 211 -174
1792 -174 -252 116 -570 -139 521 -265 -426 365 -49 -635 675 435 -521 599 388 -1048 397 166 -531
1811 -531 635 -241 -215 679 -173 -358 178 -143 -463 421 212 -674 -40 48 -555 65 407 -309 303 294 -393
$$ packed form
1681C44M5j427J293N68j026k4R72o99n39Q11r49L98J234j568M18J215j756N47
1699a43J575k408P15J366j963J02J172o03k06L87N1l99O45m30m51J532r63n68
1717e89J442j068p80K200j401k70J340p02k61M87o94J79N80p78k0Q30n84o03J194
1736E02j26j313J353N3j313J399m7j382J699k22q56R21p63p08J109J8j006O71
1754a1M44p62M90K81j222Q98O64j656O65R02j784J023O19j570J430J18r91M87
1772B5L63m35J04K34n49M27M3n62k13J485q87R7O21j391O3J521j287n37J089l85
1792a74p8L68o86M31O60p86j61P91m14n86J310k40r56J120k11j436J445k31o97
1811e31J166q76K6Q94q52j85N36l21l20Q84k09q86O34Q8o03O20L42p16O12ro87
$$ plain form
1832 -393 292 204 -717 661 313 -695 -112 37 -263 410 166 -153 315 256 -448 -410 493 -224 70 662
1852 662 -682 109 637 -538 -121 440 83 164 -248 -277 338 237 -603 -444 286 -114 -428 428 -80 -439
1872 -439 866 193 -657 165 -267 -58 152 -746 156 463 -585 35 439 70 -227 38 2 -504 261 354
1892 354 -357 162 326 -266 42 -223 -619 585 31 -160 681 109 -346 441 280 -221 -92 -196 -155 -118
1912 -118 118 -77 -138 98 -383 102 224 -460 119 327 -509 107 176 -298 135 -291 107 357 192 -59 140
1933 140 458 -36 -299 175 34 -325 390 -247 -7 547 1 372 196 -570 397 390 -632 -212 6 -285
1953 -285 -181 -308 -68 -9 78 448 -135 162 486 152 121 -310 -269 269 -492 -352 249 -139 48 259 -3
1974 -3 141 74 173 100 -61 115 -87 -164 92 -262 -201 74 -817 385 244 -169 155 -206 -114 -106 -427 -83 -88 -131
$$ packed form
1832c93O85q8r21J378l48j008N83J49l00O73k44l19M68n9p04L8R03p17K94N92
1852F62j344P91N28j175M17N61l57Q1m12k9O15j01q40J59P30m00l14Q56n08l59
1872d39J305o73q50Q22m32K09K10q98R02L07j048O20M04l69k97K65l6n06P65R3
1892C54p11N19J64n92L08k65l96J204n54j91Q41n72m55P87j61n01J29j04M1L7
1912a18K36j95o1K36m81M85J22o84N79K08q36O16O9m74M33m26L98K50j65k51J99
1933A40L18m94k63M74j41l59P15o37K40N54n46L71j76p66R67pj022M20K18k91
1953b85J04j27K40N9Q7L70n83K97L24l34l1m31M1N38p61J40O01l88J87K11k62
1974cJ44o7R9p3j61J76k02p7K56l54O1K75q91J202j41m13L24l61R2Ql21L44nm3
$$ plain form
1998 -131 -81 162 0 39 120 318 -112 -174 391 -206 -54 517 -289 -141 -111 -320 185 78 -195 87 32 170
2020 170 -126 -103 -17 -261 -247 83 -515 -104 123 -9 107 -211 249 134 -217 -122 204 32 29 -82 292 10
2042 10 -213 42 79 -310 429 48 -277 -124 -173 145 -371 -393 72 60 -1 -38 -158 160 134 4 311 -50 -13
2065 -13 309 -210 -186 333 133 117 -165 -47 326 -20 -179 -142 35 -15 -233 -156 -194 -464 112 -7 -141 46
2087 46 35 158 457 -201 135 609 -216 77 55 163 -64 79 236 95 -109 165 33 130 130 -428 168 11
2109 11 -528 181 -249 -329 184 23 -265 84 99 168 -21 3 60 316 11 -236 -98 490 -280 -124 244 -223
2131 -223 3 386 -390 -9 -12 -355 -82 -302 -497 69 116 -224 14 328 31 51 -69 187 62 408 75
2152 75 -400 286 -281 -38 -142 -399 225 312 -265 67 174 -64 -196 -231 38 197 49 -137 -23 248 151
$$ packed form
1998a31N0K43j62L9Q1J98m30o2N65n97J52N71q06J48L0k09N05j07k73K82n5J38
2020A70k96K3Q6k44J4L30n98M11K27j32J16l18M60j15l51R5L26j72lj11L74k82
2042A0k23K55L7l89P39l81l25J53m9L18n16k2M65j2o1l7j20L18k6j30L07l61L7
2065a3L22n19K4N19k00j6k82J18L73l46j59L7J77n0k18P7l8k70N76j19j34J87
2087D6j1J23K99o58L36M74q25K93k2J08k27J43J57j41k04K74j32R7%n58N96j57
2109A1n39P09m30q0N13j61k88L49J5O9j89K4N7K56l05k47J38N88p70J56L68m67
2131b23K26L83p76L81ll43K73k20j95N66M7l40K38L14k97K0j20K56j25L46l33
2152G5m75O86n67K43j04k57O24Q7n77L32J07k38j32l5K69J59j48j86J14K71r7
$$ plain form
2173 151 -74 417 121 -70 271 -113 -448 283 -103 -244 68 -290 77 201 -25 -35 2 -152 -293 100 193
2194 193 -432 -35 328 -167 246 149 -286 496 394 12 499 -32 -145 166 113 -320 -25 320 -312 -544 110
2215 110 -335 -77 250 -359 -98 319 -134 7 -46 -326 246 326 -586 219 523 58 1 309 98 212 183
2236 183 -201 -161 17 -347 -285 202 -509 -241 103 -588 -273 545 -227 -52 359 -271 -170 -2 62 -119 234
2257 234 131 -482 237 378 15 466 85 -245 603 -299 -531 113 -167 -180 364 -374 -294 293 -321 -295 -22
2278 -22 221 -174 35 -173 -312 160 22 -449 369 213 -380 382 380 -245 632 242 -514 42 164 -326 -141
2299 -141 -308 -362 49 -26 -481 -289 240 -272 -104 369 -464 122 324 -637 203 260 -376 18 294 -315 235
2320 235 345 -170 -71 392 65 -325 130 -308 -299 325 -292 -165 477 -190 -211 351 -110 41 420 -214 -85
$$ packed form
2173A51k25M91k96j91L41l84l35P31l86j41L12l58L67J24k26j0L7j54j41L93R3
2194A93o25L97L63m95M13r7m35P82j02l82M87n31j13L11n3m33K95L45o32k32O54
2215A10m45K58L27o09K61M17m53J41n3k80N72Q0r12Q05L04m65n7L08k11J14k9
2236A83l84M0J78l64O2M87p11K68L44o91L15Q18p72J75M11o30J01J68O4j81L53
2257B34j03o13P19J41l63M51l81l30Q48r02k32O44k80j3N44p38Q0N87o14K6K73
2278b2K43l95K09k08j39M72j38m71Q18j56n93P62ko25Q77l90p56N56J22m90J85
2299a41j67n4M11p5m55J92N29n12J68M73q33N86K02r61Q40N7o36L94K76o09N50
2320B35J10n15R9M63l27l90M55m38RO24o17J27O42o67k1N62m61J51L79o34J29
$$ plain form
2341 -85 381 -156 -221 239 -76 -134 367 120 -377 533 34 -456 422 249 -365 404 31 -388 477 2 -561
2362 -561 175 -143 116 242 -14 -3 221 118 -603 48 327 -456 75 415 -591 703 84 -688 41 515
2382 515 -408 259 -117 -480 22 90 -512 -149 147 -173 14 322 -431 -152 616 -304 -59 465 -535 18
2402 18 243 -568 280 48 -297 314 488 -160 -280 326 -445 -92 110 -298 -349 436 -172 -287 703 -291 -45
2423 -45 576 -357 -251 440 -215 -559 237 -173 108 274 -302 -290 332 168 -567 443 234 -555 236 -24
2443 -24 -388 126 -156 -559 156 119 -194 693 -209 -214 506 116 -385 338 424 -129 66 142 -223 314 173 -395
2465 -395 160 332 -533 411 215 -661 287 136 -411 82 197 -314 184 269 -114 106 238 -129 -135 551 -137
2486 -137 -312 548 -15 -271 309 -685 -16 550 -253 -242 317 -420 78 112 -267 87 392 -125 -181 360 75
$$ packed form
2341h5M66n37o5M60l15n8N01k47m97R10m99m90Q78j73o14P69l73m19Q65m75n63
2362e61P36l18K59J26k56J1K24j03p21O51K79p83N31L40j006J294o19p72P29M74
2382E15r23O67l76l63N02O8o02L63K96l20J87L08p53K79P68r20K45N24j000N53
2402A8K25q11Q48k32l45O11J74o48j20O06p71L53K02m08n1P85o08j15R90r94K46
2423d5O21r33J06O91o55l44P96m10K81J66n76J2O22j64p35J010k09p89P91k60
2443b4l64N14k82m03P15l7l13Q87r02nP20l90n01P23Q6n53J95P6l65N37j41n68
2465c95N55J72q65R44j96q76R48j51n47M93J15n11M98Q5l83K20J32l67oO86o88
2486a37j75Q60n63k56N80r94O69N66q03J1N59p37M98L4l79L54L05n17n6N41k85
$$ plain form
2507 75 -111 645 -43 -16 504 -521 -257 507 -244 -71 373 -193 -186 238 328 -415 84 124 -222 79 -104 -405
2529 -405 329 42 -484 119 -185 -298 449 -145 -534 514 117 -108 193 -14 -190 18 -170 -282 273 485
2549 485 -212 -136 79 -391 82 318 -283 84 176 -597 100 149 -351 32 52 -312 245 117 -108 -82 156 44
2571 44 -332 88 177 -255 256 -190 204 455 -217 41 509 -538 -141 321 -452 -73 421 -102 -267 -62
2591 -62 -9 -4 -40 -90 21 202 -124 -200 265 -75 -426 364 -234 -354 500 148 -193 344 -117 -124 172 -184 43
2614 43 138 -116 -441 217 301 -409 305 20 -219 555 248 -395 216 84 17 177 -143 -187 -3 44 -203 -241
2636 -241 84 190 25 87 -315 -189 50 -307 243 340 -491 14 -43 -398 69 363 -327 113 164 -143 -87 37
2658 37 -30 142 44 -83 -37 265 -330 -112 475 -176 -237 257 -129 -233 60 -358 -119 -90 -241 -7 63 -208
$$ packed form
2507G5j86P56o88K7N20j025K64P64p51J73M44n66PM24R0p43M99M0l46L01j83l01
2529d05P34k87n26O03l04j13P47n94l89J048l97k25L01k07j76K08j88j12N55K12
2549D85o97P6K15m70M73K36o01L67R2p73O97M9n00L83K0l64N57j28k25K6K38j12
2571D4l76M20Q9m32N11m46L94K51o72K58M68j047L97M62p73L79M94n23j65K05
2591f2N3Nl6n0J11J81l26p6M65l40l51P90n98j20Q54l52l41N37m61pK96l56K27
2614D3R5k54l25O58Q4p10P14k85k39P74l07o43O11j32o7J60l20m4J84M7k47l8
2636b41L25J06j65O2m02J26K39l57N50R7q31N05n7l55M67K94o90M40N1l07N6J24
2658C7o7J72r8j27M6L02n95K18N87o51o1M94l86j04K93m18K39K9j51K34P0k71
$$ plain form
2680 -208 44 642 81 -274 22 258 -222 -31 65 -409 -15 213 -250 262 -211 397 311 -63 149 69 -49
2701 -49 -258 47 -57 -70 -492 -75 -69 290 83 -247 293 205 -169 196 -62 -284 319 212 -229 32 -45 48
2723 48 -67 28 247 133 150 -231 -27 255 -507 -138 136 -412 -144 382 124 9 378 213 -88 78 27
2744 27 305 43 -312 -16 35 -108 -311 139 -57 -199 66 197 -60 13 -175 -170 -58 -380 17 52 -238 169
2766 169 386 -57 -18 154 334 204 -78 -6 60 66 -189 -299 202 -46 -72 133 -237 -272 400 -58 54 129 150
2789 150 104 -254 -199 118 -160 -144 20 278 321 128 276 307 -121 154 266 -55 -227 -63 -106 -124 -73 188 409
2812 409 -259 54 289 4 -5 -106 103 122 -289 22 187 -61 -274 114 503 -160 -165 309 19 -19 236 -121
2834 -121 178 45 -57 -73 40 -151 192 -51 -241 -174 -156 -67 -97 -262 63 145 -378 -48 -64 26 -77 283 257
$$ packed form
2680b08K52N98n61l55K96K36m80J91R6m74L94K28m63N12m73O08q6l74K12q0j18
2701d9k09L05j04j3m22M17OL59k07l30N40q8l74L65k58k22O03j07m41K61p7R3
2723D8j15R5K19j14J7l81K04K82p62L69K74n48K68N26k58j15L69j65l01J66n1
2744B7K78k62l55K96N1j43k03M50j96j42K65J31k57P3j88NJ12l22L97L5k90M07
2766A69K17m43L9J72J80j30k82P2O6Ok55j10N01k48k6K05l70l5O72m58J12P5K1
2789A50m6l58N5L17k78J6J64K58M3j93J48L1m28K75J12l21j72J64m3j8N1K61K21
2812D09o68L13K35k85rj01K09J9m11L11J65k48k13L88L89o63nM74k90l8K55l57
2834a21K99j33j02j6J13j91L43k43j90O7J8Q9l0j65L25Q2n23L30j6R0j03L60k6
$$ plain form
2857 257 199 288 241 -299 141 -44 149 -24 -64 29 -3 -43 -109 79 -54 26 139 237 31 -512 -11 -68 -189 61
2881 61 -93 124 100 -170 78 506 75 60 134 336 -50 -119 -188 -216 92 79 75 -207 -52 150 -22 -128 -259
2904 -259 307 -141 -211 2 35 -48 -135 30 9 194 210 119 110 -44 -57 462 47 -160 241 12 -214 223 133 -170
2928 -170 -41 61 83 44 -280 -220 111 -317 -38 66 -165 -127 -265 217 -136 -71 284 -133 37 41 -71 -20 -27
2951 -27 -237 -10 125 -99 13 137 -286 -57 427 -74 151 -40 -160 23 -95 -92 10 156 -436 -47 198
2972 198 -46 87 371 7 88 10 -20 -117 288 -265 -31 151 -284 -31 234 -179 -351 212 -18 -274 15
2993 15 -25 -100 82 -128 -238 241 -5 29 339 -20 15 138 235 -339 115 -119 -152 177 27 -260 286 -21
3015 -21 -209 182 -27 -280 124 91 -597 415 -152 -467 144 211 -295 185 246 -113 97 15 42 126 126 -448 -18
$$ packed form
2857B57n8Q9m7n40M40j85J93j73m0R3l2m0o6J88j33Q0J13R8k06n43N01n7j21K50
2881F1j54K17k4k70K48M28m31j5P4K02l86o9o9k8L08j3mk82J55K02j72j06j31
2904b59N66m48p0K13L3q3q7J65k1J85J6r1rj54j3N19m15k07M01k29k26M37r0l03
2928a70J29J02K2l9l24O0L31m28K79J04k31L8j38M82l53O5L55m17J70Mj12N1p
2951b7k10K27J35k24J12J24m23K29M84n01K25j91j20J83j18LJ02J46n92L89K45
2972A98k44J33K84l64Q1p8l0r7M05n53K34J82m35K53K65m13j72N63k30k56K89
2993A5m0p5J82k10j10M79k46L4L10l59L5J23R7n74M54k34l3L29j50k87N46l07
3015b1j88L91k09k53M04l3o88J012n67l15O11O7n06M80O1l59K10q2K7Q4%n74M30
$$ plain form
3038 -18 260 -241 142 301 -322 1 101 -68 121 -2 -294 126 181 -265 -29 82 -368 -121 205 -54 -111
3059 -111 404 -102 -101 228 -291 -55 222 -394 122 7 -183 -37 309 -194 -341 244 -227 -282 89 45 -20 140
3081 140 -126 -98 499 -381 -250 381 -142 -234 274 185 -56 184 100 -270 117 71 -160 46 67 -221 -38 91
3103 91 -279 327 280 -420 476 133 -577 167 -21 -314 105 -73 -115 88 186 -105 263 109 -173 405 341 -400
3125 -400 98 -74 -313 72 131 -439 151 344 -638 47 344 -367 180 75 -529 -84 250 -197 -122 483 -131
3146 -131 -52 275 -250 -17 224 -501 -192 415 -102 -145 202 -380 -5 39 -265 -172 320 -67 -300 268 -187
3167 -187 -414 457 -36 -433 184 -379 -88 129 -142 -338 723 125 -227 215 -44 -459 43 -148 -289 -79
3187 -79 -24 -350 232 160 -347 465 26 -372 181 13 -652 335 -109 -207 267 -25 -327 384 138 -354 -95
$$ packed form
3038a8K78n01L83J59o23L23J00j69J89j23k92M20N5m46K36J11m50K47L26k59n7
3059a11N15n06JL29n19K36K77o16N16j15j90J46L46n03j47N85m71n5L71m4o5J60
3081A40k66K8N97q80J31O31n23r2N08q9k41K40q4l70L87m6k31K06K1k88J83J29
3103I1l70O06m7p00Q96l43p10P44j88k93M19j78m2K03R8k91L68j54k82N78o4p41
3125d00M98j72k39L85N9n70N90J93r82O85K97p11N47j05o04M45L34m47P5O05o14
3146a31P9L27n25K33K41p25L09O07n17m3L47n82L75M4l04R3M92l87k33N68m55
3167a87k27Q71m93l97O17n63K91K17k71j96J061n98l52M42k59m15N02j91j41K10
3187g9N5l26N82p2n07Q12m39l98N53j68o65R87m44r8M74k92l02P11k46m92K59
$$ plain form
3208 -95 235 -123 15 108 -322 155 270 -324 145 255 -319 35 314 -429 170 5 -351 -130 123 -370 -242
3229 -242 457 -134 -61 364 -73 57 608 -478 -156 598 -227 -45 440 -320 37 601 -192 -345 142 -191
3249 -191 -23 268 -220 89 321 -208 -38 379 177 -7 375 63 11 370 50 -197 222 27 -540 439
3269 439 -165 -223 318 -218 -204 365 22 -239 211 185 -203 153 -125 -372 33 109 -205 302 -62 -115 80 -24
3291 -24 -232 345 105 -230 218 -14 -312 -161 -109 -27 194 27 -84 229 122 -120 109 229 -292 -133 -14
3312 -14 -267 34 275 -62 39 -99 -256 266 222 15 187 270 -270 113 411 -198 32 346 -132 14 17 -281
3334 -281 -96 122 -231 107 133 -6 -90 316 5 -101 -122 -64 -261 552 134 -110 133 219 16 430 145 -339
3356 -339 416 -317 -316 -57 15 -238 -150 -69 -497 188 107 -67 180 81 14 229 32 -214 160 163 -339 180 71
$$ packed form
3208i5L30l58J38R3m30M77J15n94M69J10n74L54K79p43N99j65l56K21K53m93J28
3229b42O99n91P3M25m37J30N51j086L22P54q25J82M85p60L57N64p93j53M87l33
3249a91J68K91m88L09K32n29J70M17k02j84L82l12n2L59l20k47M19j95n67R79
3269D39o04n8N41n36J4N69l43k61M50k6l88L56k78k47M05P6l14N07l64n3J95j04
3291b4k08N77k40l35M48k32k98J51N2Q2K21j67j11L13j07k42K29J20n21J59J19
3312a4k53L01K41l37J01j38j57N22m4k07J72Q3n40L83K98o09K30L14m78J46Lk98
3334b81J85K18l53L38K6j39q4M06l11j06k1N8j97Q13m18k44K43Q6k03M14k85m84
3356c39P55p33JK59P2k53Q8Q1m28O85q1j74K47r9o7K15j97k46L74Ln02N19j09
$$ plain form
3379 71 -135 447 -76 -80 -38 3 -326 184 8 -247 166 146 -371 17 93 -164 -41 466 -348 -212 133 -174
3401 -174 -64 -27 -199 180 371 -245 -30 288 -107 234 65 -94 -58 180 -77 -9 267 -195 -64 105 14
3422 14 -207 380 -300 -174 378 107 39 0 -104 91 318 85 25 257 -95 -521 135 53 -145 405 -4 -212
3444 -212 129 -172 -197 -42 -106 -93 207 -86 -275 101 164 -249 -5 167 -46 227 5 -236 103 227 -213
3465 -213 293 207 110 99 15 -182 135 -26 -247 22 139 51 -122 139 -105 -47 222 -78 91 189 53 -161
3487 -161 79 -107 1 201 -140 32 118 92 49 195 161 22 38 -152 -16 59 -76 -121 -77 -214 32 318 -144
3510 -144 -149 32 -189 -352 48 12 -10 335 73 -270 124 22 75 114 85 -159 78 209 -216 -47 204 -120
3532 -120 -101 -137 -125 62 160 87 151 -335 133 199 -85 -108 29 122 34 -95 -117 2 -224 226 -205 101 224 -237
$$ packed form
3379G1k06N82n23mM2M1l29N10j76k55M13k0n17L88P6k57J23N07q14J36L45l07
3401a74J10L7j72L79J91o16K15L18l95L41j69j59L6K38k57O8K76m62J31J69r1
3422A4k21N87o80J26N52k71o8l9j04J95K27k33o0K32l52m26O56q2j98N50m09k08
3444b12L41l01k5J55o4J3L00k93j89L76O3m13K44J72k13K73k22k41L39J24m40
3465b13N06q6r7j1q4j97L17j61k21K69J17q8j73K61k44N8K69l00J69R8j36k14
3487a61K40j86J08K00l41J72Q6k6m3J46l4j39J6j90J36P5j35m5M4j37K46K86m62
3510a44nJ81k21j63M00l6k2L45k62l43L94j02N3L9k9k44K37J31m25J69K51l24
3532a20J9l6J2J87R8p3O4m86M68O6k84k3J37R3q8j29k2J19k26M50m31L06J23m61
$$ plain form
3556 -237 -60 185 30 100 -13 -288 56 -17 -33 6 78 -160 19 -22 52 182 6 -284 -93 -105 -64 90 101
3579 101 -98 49 188 11 4 179 218 29 -384 -47 73 -172 -192 -51 -128 99 5 81 -78 -174 -75 19 118 -54
3603 -54 -161 176 -27 11 116 -171 -185 -54 133 294 -19 -236 125 -42 -120 -286 14 -125 129 -211 -47
3624 -47 72 183 277 35 132 -101 -70 -26 -75 -179 19 -49 111 42 -26 252 46 63 172 -61 -180 203 15
3647 15 67 -41 -177 -154 44 246 271 -17 154 168 -24 155 -70 22 126 219 37 31 -33 94 39 74 69 118 -30
3672 -30 -33 92 0 -191 -45 11 -270 98 -59 -180 -63 52 -157 207 -44 -54 -194 63 -176 86 -102 100
3694 100 213 -206 -232 145 134 28 166 -44 -146 -104 -135 -176 282 231 -192 -123 -14 -171 229 142 -312 65 -183
3717 -183 18 -171 94 97 41 183 -59 146 314 96 -57 124 -221 -54 -122 -146 15 17 -168 -185 -31 -232 -6
$$ packed form
3556b37J77K45j55P0j13k75L44p3j6L9P2k38J79m1P4J30j76k90J91j2M1J54J1
3579A01j99J47J39j77pJ75L9j89m13L37J20k45k0J41p7K27r4P6j59r6R9R4R9j72
3603e4j07L37k03L8J05k87j4J31J87J61l13k17L61j67p8j66L00j39K54l40J64
3624d7J19J11R4k42R7k33L1M4m9j04J98o8J60o9o8K78k06J7J09k33j19L83j88
3647A5N2j08j36K3J98K02K5k88J71J4j92J79k25R2J04R3j82oo4J27n5L5nM9j48
3672c0lJ25r2j91J46N6k81L68j57j21J17J15k09L64k51j0j40K57k39K62j88K02
3694A00J13m19k6L77j1j06J38k10j02M2l1m1M58n1m23O9J09j57M00q7m54L77k48
3717a83K01j89K65Ln6J42k42K05J68k18j53J81l45J67o8k4J61Kj85j7J54k01K26
$$ plain form
3740 -6 -106 131 9 103 7 -32 165 -213 -97 202 -204 -133 345 -172 114 271 -11 172 267 264 -153 265 64
3763 64 -51 206 -111 -308 80 44 -40 -67 164 -168 145 -48 100 106 -172 96 253 -21 333 -17 -180 -35
3785 -35 191 361 -321 218 181 118 -101 398 -416 -1 -2 11 -117 174 -214 -113 -49 8 237 -46 -150 16 173
3808 173 -24 281 323 -169 -9 143 -245 32 258 -401 196 38 -254 -18 -12 -94 -206 113 219 -66 71
3829 71 -51 69 420 -13 -12 61 36 -62 122 -183 -216 340 -102 -75 162 -280 -95 161 -194 -257 -12 -51 149
3852 149 177 -6 -114 -21 8 -141 187 223 -310 277 -111 -57 281 56 43 52 -91 -213 25 6 -72 315 -142
3875 -142 -212 80 2 -167 4 20 -253 30 51 -194 166 238 -140 310 198 -278 -64 42 -235 175 -183 47
3897 47 46 -50 -262 173 -26 -275 -124 211 -248 -308 -186 -356 -98 161 -289 96 -66 1 -63 -197 54 6 208
$$ packed form
3740fj00K37j22R4r6l9J97l78J16K99m06P1M78n17K86J57k82J83R5lm17M18k01
3763F4j15K57l17j97L88l6q4k7K31l32L13j93J48Ok78K68J57k74L54l50j63J45
3785c5K26J70o82N39l7o3k19M99q14M15jJ3j28K91l88J01O4N7K29k83j04J66J57
3808A73j97L05M2m92J60J52l88K77K26o59N97j58k92K36Oq2j12L19J06k85J37
3829G1j22J20L51m33JP3k5r8J84l05l3N56m42K7K37m42J85K56l55o3K45l9K00
3852A49K8j83j08R3K9j49L28L6n33N87l88N4L38k25j3Rj43j22K38j9p8L87m57
3875a42p0K92p8j69J71J6k73K83K1k45L60P2l78M50j12m76K14J06k77M10l58K30
3897D7jr6k12M35j99k49J51L35m59o0J22j70K58K59m50L85j62O7o4j34K51m8K02
$$ plain form
3920 208 -108 -43 -94 -254 -134 -43 111 -130 291 34 -181 65 -23 -148 182 24 -294 166 -27 -9 309 -84
3942 -84 -129 114 -81 -95 -87 381 -184 249 -56 -40 289 -66 -431 243 64 -305 167 -246 -34 10 57 -348 -1
3965 -1 28 -202 181 18 -294 109 213 -142 218 27 -235 160 -81 -32 476 27 -48 -73 -104 -114 161 75 -234
3988 -234 136 303 -214 155 32 -243 47 -34 -332 241 -42 -276 264 277 -21 -225 448 -210 -60 82 -116
4009 -116 -71 257 -54 -168 307 67 -188 279 113 -89 117 -168 5 237 -310 -51 131 -52 -177 66
4029 66 -165 -254 -4 -58 -193 147 115 33 148 -152 -13 186 -181 74 266 -150 -195 219 -280 -37 230 -151
4051 -151 -196 111 -179 -107 59 139 -458 -9 -31 12 253 75 -269 72 -95 -197 308 -30 -225 162 -24 -202
4073 -202 197 96 -234 -40 58 -192 -219 215 -346 -154 135 -27 103 -20 -200 -10 -30 -43 17 -145 -212 -95
$$ packed form
3920B08l16O5n1j60J20R1J54k41M21k57k15K46q8j25L30j58l18M60j93J8L18l93
3942h4m5K43j95j4QM68n65M33l05J6L29l55l65O74j79l69M72m13K12M4M7m05L47
3965aK9k30L83j63l12M03J04l55L60j91k62L95k41M9N08m49p5k5l1j0K75q6l09
3988b34L70J67n17L69j23k75K90q1k98N73k83k34N40J3k98k04O73o58J50J42j98
4009a16M5L28l11j14M75k40k55M67j66k02K06k85J73K32n47K59J82j83j25K43
4029F6k31q9K50n4j35L40l2q2J15l00J39J99l67K55J92m16m5M14m99K43K67l81
4051a51m5L07k90P2J66Q0n97M49k2M3K41j78l44L41j67j02N05l38j95L87j86j78
4073b02L99j01l30J94R8k50k7M34n61J92K89j62J30j23j80J90k0j3O0j62o7J17
$$ plain form
4095 -95 205 -160 -88 77 -290 24 101 -68 -23 318 -161 -177 213 -246 -90 65 -81 28 113 -191 85 92 15
4118 15 -82 -21 119 -7 86 35 -48 184 15 -196 276 51 -57 175 162 -31 188 -113 -226 -82 -101 -90 287
4141 287 112 -69 140 53 33 90 -36 -36 53 264 -285 -62 -66 -161 229 -90 -221 41 16 22 -12 129 251 -40
4165 -40 -209 -163 -53 -106 -127 -43 151 -1 -128 149 10 -134 102 -55 -188 -120 -232 74 -5 -212 95 -173
4187 -173 127 -42 214 -52 -149 78 -158 48 282 -193 -230 -200 -146 28 42 104 102 201 -186 104 -28 -78 307
4210 307 198 -97 365 -10 203 113 30 -56 -330 23 150 -62 6 33 103 125 -222 -134 -100 -57 -6 192 -14 135
4234 135 181 -286 17 231 99 -206 19 10 -228 179 150 -232 44 28 -15 129 31 -81 30 -79 -144 61 -165
4257 -165 -136 -59 243 18 -50 304 -7 -84 113 48 -113 56 -166 209 -136 -98 -38 145 -63 4 -232 -265 100
$$ packed form
4095i5L00l65P2J65l67L14P7j69M5L41m79j6L90m59J56J55j46J09Q5l04K76Pp7
4118A5r7O1J40j26R3n1q3K32j69k11M72k25j08K32j3j93K19l01j13J44j9J1L77
4141B87j75j81K09q7k0N7j26%Q9K11n49K23mr5L90l19j31K62k5Ol4J41J22k91
4165d0j69M6J10n3k1Q4J94j52j27K77j39j44K36j57j33O8j12L06p9k07L07k68
4187a73L00j69K56k66r7K27k36K06K34m75l7L0N4J74J4O2kR9l87K90j32n0L85
4210C07j09k95M62l75K13r0q3q6k74L53J27k12O8K7P0K2l47Q8L4M3N1J98k06J49
4234A35M6m67L03K14j32l05K25rk38M07k9l82K76j6m3J44r8j12J11j09o5K05k26
4257a65K9P7L02k25o8L54l11p7J97o5j61J69k22L75l45L8O0J83k08O7k36l3L65
$$ plain form
4280 100 -60 26 -226 149 -122 0 59 -153 137 119 173 -122 -117 196 119 205 -362 153 31 18 -233 100 -140
4303 -140 -45 126 146 -214 74 63 150 80 31 -12 150 24 -154 109 -9 259 128 81 58 -40 -105 -22 -81 85
4327 85 32 13 20 -336 -41 219 64 103 -127 169 153 121 -60 16 25 -115 122 -121 66 -132 84 -164 -48 -84
4351 -84 -105 -55 -139 64 0 394 158 111 42 65 -233 75 -202 -30 8 -72 -12 51 -241 -98 -171 -72 -41 20 -60 -126
4377 -126 10 2 169 103 186 -126 30 -165 48 25 80 -44 -113 24 20 76 144 -98 -46 166 -252 -47 50 -50
4401 -50 73 83 148 22 57 -15 -95 -61 48 -21 28 -4 102 -133 -61 -166 -20 -39 -199 97 204 118 134 9 194
4426 194 50 16 -28 57 224 179 -26 0 83 -226 -124 -122 -94 -108 67 -80 -150 -168 -105 -184 -23 68 -252 210 105
4451 105 137 175 -141 -49 -4 -322 25 -54 -96 67 -46 90 136 -16 134 54 138 86 -172 -2 35 -217 -169 -11
$$ packed form
4280A00j60Q6k52L75k71J22N9k12K90j8N4k95NL13p7Q6n67N15j22j3k51L33k40
4303a40R5J71K0l60K88j1Q7p0m9m3J62j26j78K63j18K68j31m7k3r8o5Q3n9J66
4327H5n3j9Pl56K95K60j55L9k30K96j6l2j81P6Rj40K37k43J87j98K16k48J16l6
4351h4k1N0q4K03o4L94k36m7o9K3k98L08k77J72L8q0O0O3k92J43p3R9L1O1q0o6
4377a26J36qJ67o6Q3l12J56j95K13k3N5j24o9J37mN6O8k42N2K12m18K05R7j00
4401e0J23J0O5j26L5p2q0L4J09o9M9l2J06k35P2j05J46j9j60K96J07q6J6j25J85
4426A94j44l4m4Q5J67m5k05K6Q3l09J02KK8j4J75j47p0j8O3p9J61R1l20M62j05
4451A05L2L8l16R2M5l18L47p9m2J63j13J36M6j52J50q0Q4n2k58J70L7k52M8J58
$$ plain form
4475 -11 285 -21 -272 -234 192 -214 29 122 38 164 -125 -12 -22 -105 234 215 -132 -156 -138 -83 -75 111 -31 -164
4499 -164 -108 42 86 -50 -126 -18 -76 -61 -9 42 -44 34 198 -23 142 -187 -231 77 -20 257 2 -205 33 -10
4523 -10 170 109 -216 7 3 -385 58 172 -87 -198 -132 -72 -121 100 -67 192 131 -164 -166 168 -14 48 27 -27
4547 -27 168 123 -53 -2 -30 30 -161 82 -74 -82 -174 -217 -125 -37 110 -3 -31 -24 -21 53 203 -22 -50 64 -129 -28
4573 -28 34 -135 -174 -91 119 -186 368 5 40 66 73 -130 -103 -153 -19 147 -167 100 103 -43 -34 -87 -117 -31 74 -123
4599 -123 -45 58 -62 258 41 52 269 -282 -137 148 -75 163 166 -215 -17 -200 158 -85 -89 -38 -102 -133 151
4622 151 17 -11 38 -77 33 43 -69 -74 -246 -38 -204 87 -34 -83 -32 92 4 67 -215 51 211 -24 105
4645 105 110 -204 -232 271 -233 -100 231 37 -15 4 248 -176 122 33 -149 298 -103 -55 34 83 -1 71 16 -63
$$ packed form
4475a1K96l06k51L8M26m06K43R3q4J26k89J13j0q3L39j9l47k4J8N5QJ86j42j33
4499a64N6J50M4j36p6J08n8J5N2N1q6P8J64k21J65l29m4L08r7K77k55k07K38m3
4523a0J80o1l25K23ml88M43J14k59j11O6O0m9K21j67K59o1k95kL34j82O2k1n4
4547b7J95m5j76N1k8O0j91K43j56qr2m3R2Q8J47j13k8PLP4J50k25k8J14j93J01
4573b8O2j69l9Q3K10l05N54l63L5K6Pk03K7n0J34J66l14K67Lj46Rn3l0Q6J05j97
4599a23P8J03j20L20k17J1K17n51J45K85k23K38Ll81J98j83L58k43mN1o4l1K84
4622A51j34k8M9j15J10J0j12nj72K08j66K91j21m9N1J24q8O3k82K66J60k35J29
4645A05Nl14k8N03n04J33L31j94n2J9K44m24K98q9j82M47m01M8Q9M9q4P2n5p9
$$ plain form
4669 -63 51 32 57 -237 -23 44 107 140 -38 197 46 40 -2 135 -11 262 211 -419 -99 -67 -31 -57 -53 -214 353
4694 353 21 43 -10 112 119 187 10 68 -69 159 56 -58 94 -30 58 19 -204 135 29 3 15 -22 -199 -75
4718 -75 -8 39 69 262 44 -2 29 97 -1 -178 166 -70 75 -175 -65 -327 47 169 109 -119 17 39 26 74
4742 74 -39 -79 -58 65 -182 -112 144 -146 -287 -23 53 76 -114 -17 74 152 -61 26 85 -86 60 157 -118 9
4766 9 -100 47 -216 62 28 -16 215 -15 -99 164 -16 81 53 -64 104 128 -119 -71 190 -160 -241 10 -261
4789 -261 20 -188 274 191 66 -121 -132 -131 126 156 120 -12 -23 176 -43 -14 167 64 -38 11 -174 58 -42
4812 -42 82 33 -12 299 -31 32 73 153 69 15 -54 -13 -4 -113 -198 165 -5 57 142 -67 -47 17 -20 -95 -199 66
4838 66 85 105 -133 -111 143 7 -224 66 -38 117 49 -189 -71 74 -99 -224 75 104 93 68 -22 -1 165
$$ packed form
4669f3J14j9K5k94K14O7O3L3j78K35j51om2J37j46K73n1o30L20L2L6k6Mj61N67
4694C53l32K2n3J22PO8j77N8j37K28j03j14J52j24Q8l9k23L39j06k6J2l7j77J24
4718g5O7M7L0J93k18m6L1O8r8j77L44k36J45k50J10k62L74J22o0k28J36K2j3M8
4742G4j13m0K1J23k47P0K56k90j41K64P6K3j90R7R1P8k13Q7N9j71J46R7k75J27
4766Ij09J47k63K78l4m4K31k30q4K63j80R7k8j17J68K4k47M8K61l50q1K51k71
4789b61K81k08M62q3j25j87j1JK57L0l6j32j1J99k19K9J81j03j02M9j85K32j00
4812d2J24m9m5L11l30O3M1Q0q4n4o9M1Rj09q5L63j70O2Q5k09K0O4l7p5j04K65
4838F6J9K0k38K2K54j36k31K90j04J55o8k38J18J45j73j25K99K9j1k5r0K1J66
$$ plain form
4861 165 61 -79 -160 -244 -118 99 30 -189 -111 79 -44 204 -155 -65 -188 109 132 159 -82 -374 -211 64
4883 64 -44 364 -171 -160 157 83 44 209 -19 -56 53 -100 44 152 -68 -123 -47 108 -75 120 39 -116 228
4906 228 76 178 203 -86 -26 164 76 139 257 -9 40 39 -143 6 154 49 6 -89 -5 -224 0 203 111 172
4930 172 -85 -98 -184 172 87 110 39 -232 29 -12 -301 -55 -161 -7 122 -155 -36 193 -173 223 88 -89
4952 -89 -115 -81 46 262 -206 -25 -293 105 7 -126 52 124 -199 -145 163 -180 -89 53 -130 108 -22 45 29
4975 29 -56 216 -148 119 -78 -157 152 77 67 153 -77 112 124 -157 -70 89 51 74 -205 250 -53 19 150 -18
4999 -18 -149 77 7 -240 -81 55 29 41 43 112 4 -97 -43 -72 138 40 130 118 -109 72 80 -95 -103 -10 -93 -147
5025 -147 15 -13 -120 -228 -19 126 -62 143 42 -105 117 -53 67 -145 -227 88 -90 -16 -30 -81 149 -238
$$ packed form
4861A65j04j40q1q4J26K17o9k19P8J90j23K48l59R0j23K97K3K7k41k92J63K75
4883F4j08M08n35J1L17p4l9J65k28l7J09j53J44J08k20n5P6J55j83J95q1j55L44
4906B28j52J02K5k89O0J90q8O3J18k66M9jj82J49J48j05m3r5Q4k19K24K03r2O1
4930A72k57j3q6L56q5K3p1k71K61m1k89K46j06J54J29k77J19K29l66L96j35j77
4952h9k6L4J27K16m68J81k68L98r8j33J78P2l23N4L08l43R1J42j83K38j30O7j6
4975B9q5K72l64K67j97p9L09p5j0Q6k30J89J2k81Q7J59l8K3k79M55l03P2J31j68
4999a8j31K26p0k47J59J36k6J2KO9j08j01N4k9K10r8R0j2k27J81Qj75qR3q3n4
5025a47J62k8j07j08K09J45j88K05j01j47K22j70J20k12q2L15j78P4j4n1K30l87
$$ plain form
5047 -238 -21 159 -174 -196 131 -10 -55 295 56 -159 139 -85 189 2 105 12 70 -93 23 211 -32
5068 -32 137 -94 48 -203 155 -205 31 -70 -258 -155 112 6 52 51 120 -155 -219 127 185 -10 100 24 31
5091 31 75 -34 94 29 34 133 46 -192 -115 103 -27 89 -18 51 132 146 -41 157 -13 86 78 157 17 -160 107
5116 107 167 12 -83 208 2 -36 -17 105 90 -198 54 -118 8 20 160 -51 -107 -71 -236 132 51 119 -11
5139 -11 -38 59 -312 -24 165 0 -17 -67 97 -196 84 -190 69 17 -39 -35 -94 40 -81 120 -61 -113 -143 -274
5163 -274 -128 71 -148 42 39 106 93 44 -5 -303 54 -59 -162 214 -149 -2 -111 -85 79 75 -161 85 82 -23
5187 -23 -194 127 61 241 -94 159 357 -111 -73 59 146 -59 -39 -34 119 -180 67 -158 -82 38 381 -54 -2
5210 -2 161 17 -61 190 17 -59 68 119 -176 232 -97 -216 172 -19 245 -213 -55 -39 -86 122 -83 14 149
$$ packed form
5047b38K17J80l33k2L27j41m5L50k39k15K98k24K74j87J03r3N8j63J16J88k43
5068c2J69k31J42k51L58l60K36j01j88J03K67j06M6jO9k75o4L46N8j95J10p6P
5091C1M4j09J28o5NR9q7k38P7K18j30J16j07O9Q1J4j87J98j70R9qP9j40j77K67
5116A07O0j55r5K91k06l8J9J22j5k88K52j72J26J2J40k11n6L6j65L68q1O8j30
5139a1k7R7l71K88J89j65j7n0J64k93K80k74K59n2n6Mn9J34j21K01j81n2l0j31
5163b74J46J99k19J90lO7j3m9m9k98L57j13j03L76l63J47j09K6J64mk36K46lj05
5187b3j71L21o6J80l35K53J98m68L8J32Q7k05K0NJ53k99K47k25P6J20L43m35N2
5210bJ63j44p8K51j73p6J27N1k95M08l29j19L88j91K64m58J58J6m7K08k05R7J35
$$ plain form
5233 149 -7 224 -92 76 -60 -47 62 139 119 -101 69 -238 -86 -3 35 113 -72 -40 -56 -157 76 46 27
5256 27 56 -26 -66 -12 98 314 -83 8 126 49 -153 -76 -107 151 -161 -39 68 -2 -20 106 79 23 -29 -127 77
5281 77 0 168 16 217 39 42 -248 57 -194 147 -185 -106 -57 -124 -171 -69 -133 -77 174 16 135 62 -124 -47
5305 -47 199 42 -25 32 145 -82 -134 -17 13 -125 60 117 186 22 97 -85 -76 -21 138 -186 142 26 -123 -56
5329 -56 -29 -154 175 138 -147 -198 12 -32 15 -17 -64 -119 -135 -102 -312 147 21 80 240 -173 45 168 -130 97
5353 97 113 45 38 -359 144 181 10 -97 -160 205 -13 -9 75 30 -61 -85 -99 -149 180 13 45 110 37 49 97 -37 84
5380 84 145 160 -18 118 -70 -127 30 45 -123 -303 -47 185 -23 32 -330 295 124 -112 64 -44 -105 24
5402 24 108 -37 12 -50 -30 157 141 -24 -84 -158 -171 -46 11 -165 17 75 80 66 59 -38 97 63 -194 -83 15 -67 -84
$$ packed form
5233A49j56K31l16J68j36J3J09P7k0k20J70l07J52Q3L8P8j85L2j6j01K33l0j9
5256B7K9q2m0N4J10K16l97R1J18p7k02P7l1K58l12J22J07p0j8J26k7n6n2r8K04
5281G7p7J68j52K01j78Lk90L05k51L41l32P9M9o7m7J02o4N6K51j58J19p3j86P7
5305d7K46j57o7N7J13k27n2J17L0j38J85N7O9j64P5j82RN5J59l24L28j16j49O7
5329e6K7j25L29l7k85n1K10m4M7l2m7n5j6L3k10M59j26N9J60m13K18J23k98K27
5353I7J6o8pl97N03L7j71j07o3L65k18MQ4m5r1k4j4n0L29j67L2O5p3J2M8j34J21
5380H4O1J5j78J36j88n7J57J5j68j80K56K32k08N5l62O25j71k36J76j08o1J29
5402B4Q4j45M9o2K0J87j6j65o0p4j3J25N7j76J82N8Nj4pr7J35l4k57J11R8q2j7
$$ plain form
5429 -84 355 -43 -136 103 -194 272 223 -126 -1 181 62 -19 78 -56 154 34 -129 -26 -97 -369 48 -186
5451 -186 68 174 -91 -22 69 -87 -59 34 23 17 -105 89 -180 149 178 -405 -55 209 -71 187 13 -92 -69
5474 -69 167 -216 -12 121 -70 -70 188 88 8 157 -208 112 290 138 105 255 -64 -116 151 -4 73 102 -202
5497 -202 -22 46 -60 52 -109 43 5 30 -48 59 68 20 -141 329 156 124 53 26 100 491 -93 -115 278 106
5521 106 250 -3 177 56 -4 -21 -204 -98 -2 -192 -69 126 -192 61 267 -279 119 -12 44 -21 -63 -201
5543 -201 30 93 57 204 110 -86 -62 402 -35 3 -35 -213 -209 192 -49 159 85 -185 120 -107 -55 130 68 -153
5567 -153 -176 196 -212 -262 11 -34 90 77 -65 -131 200 -123 -31 143 33 -56 -44 -10 -41 181 21 -36 109 -20
5591 -20 -205 93 -150 31 105 -19 -124 157 111 -190 110 -113 51 102 -88 -219 11 276 34 198 21
$$ packed form
5429h4M39l98r3K39k97M66m9l49J25J82j19q1R7j34K10j20j63J03p1k72M17k34
5451a86K54J06k65O9R1j56K8R3j1oj22J94k69L29K9n83L50K64k80K58j74j05K3
5474f9K36l83K04J33j91%K58j00q0J49l65L20J78j52l3J50l19n2K67j55P7K9l04
5497b02J80O8j06J12j61J52l8K5p8J07Rm8j61M70j73l2p1k7P4L91n84k2L93j72
5521A06J44k53J80j21o0j7j83J06R6j90J23J95l18K53K06n46L98j31N6o5m2j38
5543b01K31O3l6J47r4j96K4M64m37L8l8j78MM01k41K08p4k70L05k27N2J85o2k21
5567a53k3L72m08n0K73m5J24j3j42o6L31l23R2J74j10q9J2L4l1K22j60n7J45j29
5591b0j85K98k43J81P4j24j05K81m6l01L00k23J64N1j90j31K30K65k42J64j77
$$ plain form
5612 21 -136 220 138 -139 -213 92 -219 24 113 -176 137 53 -181 132 61 -78 -144 195 -127 -3 -119 60
5634 60 -26 137 -40 -230 217 -77 -183 48 -150 -132 -63 -30 72 154 -171 74 13 -123 154 157 9 -151 146
5657 146 -20 -38 84 -188 -371 -29 -66 63 301 98 -225 120 -215 -125 343 -54 -5 72 44 -45 32 -228 -151
5680 -151 209 47 -67 107 -172 -217 196 -12 -29 196 288 -176 -138 8 26 208 -183 21 -23 -161 -59 -98
5702 -98 -69 -149 88 -106 -209 -128 136 -262 61 104 -81 -103 92 -64 130 237 -147 104 -165 -266 212 -55
5724 -55 -138 -52 -72 32 -124 295 -199 -241 155 -153 -233 200 -164 234 33 -437 58 -34 -108 272 116 -16 -269
5747 -269 109 -157 -111 97 52 -123 188 126 -139 169 109 -101 81 109 4 47 42 -109 32 -20 -344 71 126
5770 126 -86 71 -51 -158 245 128 -68 -99 0 -17 -1 178 164 -51 -125 -200 63 24 -19 -76 94 -393 139
$$ packed form
5612B1j57L56q2k77p4L05l11K43Q9k89L13q4k34L13p1j39o6L39l22J24j16J79
5634F0q6J63j77j90M47k94j06K31j98J8O9L3J02Q2l25K45o1j36K77Lj48j60K97
5657A46j66j8J22k72j83L42l7J29K38k03l23L45l35R0M68l97M9P7k8q9P7k60P7
5680a51L60j62j14J74k79m5M13k08j7K25R2m64L8J46J8J82l91K04m4j38J02l9
5702i8K9q0K37j94j03Q1K64l98L23M3j85k2J95j56J94J07l84K51k69j01M78k67
5724e5q3Q6k0J04j56M19m94m2L96l08q0M33l64L98k01m70M95r2p4L80j56j32k53
5747b69L78k66M6K08m5j75L11o2k65L08o0k10J82K8j05M3nj51J41n2l24M15N5
5770A26k12J57j22j07M03j17j96l1R9j7J6J79j4k15p4p5K63l9m3n7J70m87N32
$$ plain form
5793 139 -286 141 39 288 -134 78 117 111 237 82 -301 145 -158 32 -147 13 -131 -165 150 -117 -27 -23
5815 -23 0 -40 205 -51 20 56 -87 164 -13 47 169 -148 -28 126 -42 53 134 71 65 59 238 106 132 -33 -50
5840 -50 -246 19 15 -72 58 192 -16 212 -55 -126 -263 -132 147 121 23 -64 -9 -3 -202 -66 222 -103 -148 39
5864 39 83 62 94 119 115 36 63 51 84 -107 -167 -88 -119 23 -118 -239 -143 57 -147 -127 34 9 22 52 84 116 192
5891 192 -166 65 173 83 -52 -107 253 -55 280 -2 -48 -106 -170 -67 -236 -49 -57 164 73 -90 268 -27 97
5914 97 -43 -27 33 270 -159 65 198 -39 -104 86 -89 142 -57 -148 109 -135 -156 -133 41 5 -88 139 183
$$ packed form
5793A39m25M27j02K49m22K12L9oJ26j55l83M46l03J90j79J60j44l4L15k67R0M
5815b3K3m0K45k56P1L6j43K51j77O0J22l17J20J54j68R5Q1o3ooJ79j32K6j65j7
5840e0j96K65mq7J30J34k08K28k67p1j37J31K79k6r8q7N5Oj99J36K88l25m5J87
5864C9M4k1L2K5mp9K7j2L3j91o0P9l1J42j41j21R6K00k04K0J61k5J3L0L2L2P6
5891A92l58K31J08r0j35n5L60l08L35k82m6n8o4J03j69J87qK21r1j63L58k95J24
5914I7j40J6O0K37m29K24J33k37o5J90j75K31j99r1K57k44k1K3J74l6r3K27M4
$$ [...]
8191a36
##END NTUPLES=NMR FID
##END=
