##TITLE=1H_Ser 3705-N3
 200.13Hz, CDCl3.
 8 sc
 
 3.4.2026
##JCAMPDX= 6.0         $$ Bruker NMR JCAMP-DX V2.0
##DATA TYPE= NMR FID
##DATA CLASS= NTUPLES
##ORIGIN= UXNMR, Bruker Analytische Messtechnik GmbH
##OWNER= pz
$$ XWIN-NMR		Version 3.5
$$ Fri Apr  3 15:37:32 2026 Russian Standard Time (UT+4h)  she@DPX200
##.OBSERVE FREQUENCY= 200.1313
##.OBSERVE NUCLEUS= ^1H
##.DELAY= (6, 6)
##.ACQUISITION MODE= SIMULTANEOUS
##.ACQUISITION SCHEME= undefined
##.AVERAGES= 8
##.DIGITISER RES= 18
##SPECTROMETER/DATA SYSTEM= spect
##.PULSE SEQUENCE= zg30
##.SOLVENT NAME= CDCl3
##.SHIFT REFERENCE= (INTERNAL, CDCl3, 0, 14.3821)
##AUDIT TRAIL= $$ (NUMBER, WHEN, WHO, WHERE, WHAT)
$$ ##TITLE= Audit trail, XWIN-NMR		Version 3.5
$$ ##JCAMPDX= 5.01
$$ ##ORIGIN= Bruker BioSpin GmbH
$$ ##OWNER= she
$$ F:/spectra/data/she/nmr/H-C/1/audita.txt
$$ ##AUDIT TRAIL=  $$ (NUMBER, WHEN, WHO, WHERE, WHAT)
(   1,<2026-04-03 15:35:41.12 +0400>,<she>,<DPX200>,
      <created by zg, POWCHK disabled, PULCHK disabled
       configuration hash MD5:
       00 E9 B6 7A A2 85 ED C7 34 08 36 98 17 FE 4E 26
       data hash MD5: 16K
       59 33 38 8E 85 FC 77 5C AE 70 9E AC F4 3B F2 23>)
$$ ##END=
$$ 
$$ hash MD5
$$ C4 21 3A 64 0C 75 C1 DE CF E8 BE E9 95 FB 34 A9
##$RELAX= 
##$RELAX= 
##$RELAX= 
##$RELAX= 
##$RELAX= 
##$RELAX= 
$$ Bruker specific parameters
$$ --------------------------
##$DU= <F:/spectra>
##$EXPNO= 1
##$NAME= <H-C>
##$PROCNO= 1
##$TYPE= <nmr>
##$USER= <she>
##$AMP= (0..31)
100 100 100 100 100 100 100 100 100 100 100 100 100 100 100 100 100 100 
100 100 100 100 100 100 100 100 100 100 100 100 100 100 
##$AQSEQ= 0
##$AQ_mod= 1
##$AUNM= <au_zg>
##$AUTOPOS= <>
##$BF1= 200.13
##$BF2= 200.13
##$BF3= 200.13
##$BF4= 200.13
##$BF5= 200.13
##$BF6= 200.13
##$BF7= 200.13
##$BF8= 200.13
##$BYTORDA= 1
##$CFDGTYP= 0
##$CFRGTYP= 5
##$CHEMSTR= <none>
##$CNST= (0..31)
1 1 145 1 1 1 1 1 1 1 1 1 1 1 1 1 1 1 1 1 1 1 1 1 1 1 1 1 1 1 1 1 
##$CPDPRG= <>
##$CPDPRG1= <>
##$CPDPRG2= <>
##$CPDPRG3= <>
##$CPDPRG4= <mlev>
##$CPDPRG5= <mlev>
##$CPDPRG6= <mlev>
##$CPDPRG7= <mlev>
##$CPDPRG8= <mlev>
##$CPDPRGB= <>
##$CPDPRGT= <>
##$D= (0..31)
0 0.7 0 0 0 0 0 0 0 0 0 0.03 0 0 0 0 0 0 0 0 0 0 0 0 0 0 0 0 0 0 0 0 
##$DATE= 1775216140
##$DBL= (0..7)
120 120 120 120 120 120 120 120 
##$DBP= (0..7)
150 150 150 150 150 150 150 150 
##$DBP07= 0
##$DBPNAM0= <>
##$DBPNAM1= <>
##$DBPNAM2= <>
##$DBPNAM3= <>
##$DBPNAM4= <>
##$DBPNAM5= <>
##$DBPNAM6= <>
##$DBPNAM7= <>
##$DBPOAL= (0..7)
0.5 0.5 0.5 0.5 0.5 0.5 0.5 0.5 
##$DBPOFFS= (0..7)
0 0 0 0 0 0 0 0 
##$DE= 6
##$DECBNUC= <off>
##$DECIM= 32
##$DECNUC= <off>
##$DECSTAT= 4
##$DIGMOD= 1
##$DIGTYP= 9
##$DL= (0..7)
0 120 120 120 120 120 120 120 
##$DP= (0..7)
150 150 150 150 150 150 150 150 
##$DP07= 0
##$DPNAME0= <>
##$DPNAME1= <>
##$DPNAME2= <>
##$DPNAME3= <>
##$DPNAME4= <>
##$DPNAME5= <>
##$DPNAME6= <>
##$DPNAME7= <>
##$DPOAL= (0..7)
0.5 0.5 0.5 0.5 0.5 0.5 0.5 0.5 
##$DPOFFS= (0..7)
0 0 0 0 0 0 0 0 
##$DQDMODE= 0
##$DR= 18
##$DS= 0
##$DSLIST= <SSSSSSSSSSSSSSS>
$$ [...]
##$SUBNAM0= <"">
##$SUBNAM1= <"">
##$SUBNAM2= <"">
##$SUBNAM3= <"">
##$SUBNAM4= <"">
##$SUBNAM5= <"">
##$SUBNAM6= <"">
##$SUBNAM7= <"">
##$SUBNAM8= <"">
##$SUBNAM9= <"">
##$SW= 18.0517328524113
##$SWIBOX= (0..15)
0 0 2 0 0 0 0 0 0 0 0 0 0 0 0 0 
##$SW_h= 3612.71676300578
##$TD= 16384
##$TD0= 1
##$TE= 0
##$TE2= 300
##$TE3= 300
##$TEG= 300
##$TL= (0..7)
0 120 120 120 120 120 120 120 
##$TP= (0..7)
150 150 150 150 150 150 150 150 
##$TP07= 0
##$TPNAME0= <>
##$TPNAME1= <>
##$TPNAME2= <>
##$TPNAME3= <>
##$TPNAME4= <>
##$TPNAME5= <>
##$TPNAME6= <>
##$TPNAME7= <>
##$TPOAL= (0..7)
0.5 0.5 0.5 0.5 0.5 0.5 0.5 0.5 
##$TPOFFS= (0..7)
0 0 0 0 0 0 0 0 
##$TUNHIN= 0
##$TUNHOUT= 0
##$TUNXOUT= 0
##$USERA1= <user>
##$USERA2= <user>
##$USERA3= <user>
##$USERA4= <user>
##$USERA5= <user>
##$V9= 5
##$VALIST= <valist>
##$VCLIST= <CCCCCCCCCCCCCCC>
##$VD= 0
##$VDLIST= <DDDDDDDDDDDDDDD>
##$VPLIST= <PPPPPPPPPPPPPPP>
##$VTLIST= <TTTTTTTTTTTTTTT>
##$WBST= 1024
##$WBSW= 4
##$XGAIN= (0..3)
0 0 0 0 
##$XL= 0
##$YL= 0
##$YMAX_a= 302896
##$YMIN_a= -371964
##$ZGOPTNS= <>
##$ZL1= 120
##$ZL2= 120
##$ZL3= 120
##$ZL4= 120
##$ABSF1= 10
##$ABSF2= 0
##$ABSG= 5
##$ABSL= 3
##$ALPHA= 0
##$AQORDER= 0
##$ASSFAC= 0
##$ASSFACI= 0
##$ASSFACX= 0
##$ASSWID= 0
##$AUNMP= <proc_1d>
##$AZFE= 0.1
##$AZFW= 0.1
##$BCFW= 1
##$BC_mod= 2
##$BYTORDP= 1
##$COROFFS= 0
##$CY= -3
##$DATMOD= 1
##$DC= 2
##$DFILT= <>
##$DTYPP= 0
##$F1P= 0
##$F2P= 0
##$FCOR= 0.5
##$FTSIZE= 0
##$FT_mod= 4
##$GAMMA= 1
##$GB= 0.15
##$INTBC= 1
##$INTSCL= 1
##$ISEN= 128
##$LB= 0.25
##$LEV0= 0
##$LPBIN= 0
##$MAXI= 10000
##$MC2= 0
##$MEAN= 0
##$ME_mod= 0
##$MI= 1.114404
##$NCOEF= 0
##$NC_proc= 0
##$NLEV= 6
##$NOISF1= 3.799351
##$NOISF2= 2.8
##$NSP= 1
##$NTH_PI= 0
##$NZP= 0
##$OFFSET= 14.38212
##$PC= 1
##$PHC0= -3709.091
##$PHC1= 11.3923
##$PH_mod= 1
##$PKNL= yes
##$PPARMOD= 0
##$PSCAL= 0
##$PSIGN= 0
##$REVERSE= no
##$SF= 200.129724274929
##$SI= 16384
##$SIGF1= 3
##$SIGF2= 2
##$SINO= 400
##$SIOLD= 16384
##$SREGLST= <1H.CDCl3>
##$SSB= 0
##$STSI= 0
##$STSR= 0
##$SW_p= 3205.1282051282
##$SYMM= 0
##$S_DEV= 0
##$TDeff= 0
##$TDoff= 0
##$TI= <>
##$TILT= no
##$TM1= 0
##$TM2= 0
##$TOPLEV= 0
##$USERP1= <user>
##$USERP2= <user>
##$USERP3= <user>
##$USERP4= <user>
##$USERP5= <user>
##$WDW= 1
##$XDIM= 8192
##$YMAX_p= 0
##$YMIN_p= 0
$$ End of Bruker specific parameters
$$ ---------------------------------
##NTUPLES= NMR FID
##VAR_NAME=  TIME,          FID/REAL,        FID/IMAG
##SYMBOL=    X,             R,               I
##VAR_TYPE=  INDEPENDENT,   DEPENDENT,       DEPENDENT
##VAR_FORM=  AFFN,          ASDF,            ASDF
##VAR_DIM=   8192,          8192,            8192
##UNITS=     SECONDS,       ARBITRARY UNITS, ARBITRARY UNITS
##FACTOR=    0.0002768,     1,               1
##FIRST=     0,             0,               0
##LAST=      2.2672688,     0,               0
##MIN=       0,             -371964,         0
##MAX=       2.2672688,     302896,          0
$$ Real data points
##PAGE= N=1
##DATA TABLE= (X++(R..R)), XYDATA
0@%%%%%%%%%%%%%%%qJ6j6J6j6K1k9L2l2M0m8N5o3P1q3R5j09J21j35J54j74J93
$$ 0 0 0 0 0 0 0 0 0 0 0 0 0 0 0 0 -8 8 -8 8 -8 13 -16 16 -16 24 -24 31 -32 39 -44 51 -58 63 -72 82 -92 101
37A01k14K39k68K98l29L63m01M44m89N38n92O52p19P92q72R62j062J175j306J456
$$ 101 -113 126 -142 156 -173 190 -211 233 -256 282 -310 342 -377 415 -457 505 -557 618 -688 768
57G68j630J835k080K379k753L239l896M825o237Q611j3282K5615j14447k74911
$$ 768 -862 973 -1107 1272 -1481 1758 -2138 2687 -3550 5061 -8221 17394 -97053 -371964
71c71964L67547K30532j68789N0335J33620k01308o7493K29683p7084k79793J51224
$$ -371964 -4417 226115 57326 107661 241281 39973 -27520 202163 125079 -154714 -3490
82c490J84894k88383j47446K65201L788j87245J57658Q9196l07879n1280L47043
$$ -3490 181404 -106979 -254425 10776 14564 -172681 -15023 74173 -233706 -284986 62057
93F2057P8425j54488R9950O4641k09578M1192K61496j42198k26559K26743J34592
$$ 62057 140482 -14006 85944 150585 -58993 -17801 243695 101497 -125062 101681 236273
104B36273k85758p4631K06596o5388j56092J14690r698k35362J04029K99524j09643
$$ 236273 -49485 -124116 82480 17092 -139000 -24310 -34008 -269370 -165341 134183 24540
115B4540j74465J86191M3822k14621J00480K35124j30375j12554K07206K4512
$$ 24540 -149925 36266 80088 -134533 -34053 201071 70696 -41858 165348 189860
125A89860k30907L3780J45429j57542r3498J79603n6954k26558J38774J94120
$$ 189860 -41047 -7267 138162 -19380 -112878 66725 9771 -216787 -78013 116107
135A16107j79635j13578J65916j0650j40794J42987J63670j27844k7099J84208
$$ 116107 -63528 -177106 -11190 -21840 -162634 -19647 144023 16179 -10920 173288
145A73288o9175j88755J29170J19202j68989k3326J60811j01358j79045J22705
$$ 173288 104113 -84642 44528 163730 -5259 -28585 132226 30868 -148177 -25472
155b5472J01425j62826m5211J19910p7927p9636K05381Q9460j85832M288J57978
$$ -25472 75953 -86873 -132084 -12174 -90101 -169737 35644 125104 -60728 -56440 101538
166A01538r0536r9773J63565P2380j33256K5121J02625j37998j06016J59470L5634
$$ 101538 11002 -88771 74794 147174 13918 39039 141664 3666 -102350 57120 92754
177I2754j76126P448R1537j07170k1123J79828j6103j84712L9031J25399o9474
$$ 92754 -83372 -75924 15613 -91557 -112680 67148 51045 -133667 -94636 30763 -38711
188c8711k1637J56174J0196j17168O0864N7151j40672j1429J69963k9946j58088
$$ -38711 -60348 95826 106022 -11146 49718 106869 -33803 -45232 124731 94785 -63303
199f3303L4291O2723q2562M539J03165p9698j34715Q5757Q9849p7925K2003J22570
$$ -63303 -29012 33711 -48851 -44312 58853 -20845 -155560 -69803 20046 -57879 -35876 86694
211H6694n8216r4461Q2341L8277q5179M6658J19995o7645j08516O0036L3773p9098
$$ 86694 28478 -65983 16358 54635 -30544 16114 136109 68464 -40052 19984 53757 -25341
223b5341K5629N8818j10807p4169J08918L8167p7001L1705O1392p9355m9107R3242
$$ -25341 288 59106 -51701 -125870 -16952 21215 -55786 -24081 37311 -42044 -91151 2091
235B091L0249n1022N9536O5073r0209m9672Q1715K089o0175M3434K4616r6203
$$ 2091 32340 -18682 40854 105927 15718 -33954 47761 49850 -10325 33109 57725 -38478
247c8478k7004Q6671L135o6327K1336J6784p5724K060R2971l404m0090N4652J8274
$$ -38478 -65482 21189 24324 -42003 -20667 -3883 -79607 -77547 15424 12020 -28070 26582 44856
260D4856p2098J480P2471k924l0517L8093K284p3850J588O4643k4667m9839J9623
$$ 44856 -27242 -25762 46709 43785 13268 51361 53645 -20205 -18617 46026 21359 -28480 -8857
273h857j3527n0550L2937N8530k4949l0670L1140L872m0792K1588N9061p695j1805
$$ -8857 -22384 -72934 -39997 18533 -6416 -37086 -5946 -2074 -42866 -21278 37783 30088 18283
286A8283K9847k1247m5980L2507M2264k6918k9714L963j4312k4163K4205K7304
$$ 18283 48130 26883 -19097 13410 55674 28756 -958 3005 -11307 -35470 -11265 16039
298A6039l2382k6521J8339q544j8152L7234L5289q719m862N303j3503m018L3002
$$ 16039 -16343 -42864 -24525 -33069 -51221 -13987 21302 12583 7721 13024 -479 -4497 28505
311B8505L0440j8659k8619k709q531p038K0101L437k8573j8552m640l295O474
$$ 28505 58945 40286 11667 8958 427 -6611 13490 16927 -11646 -30198 -34838 -38133 -31659
324c1659J9791J7144p284k1295j110J1717J4975K7223J5255j4208k0866p062J1741
$$ -31659 -11868 5276 -2008 -23303 -24413 -12696 2279 29502 44757 30549 9683 2621 14362
337A4362J5202Q49l357j5480l4036r720J6721M598j466L875j2952k4242q70L2302
$$ 14362 29564 30413 27056 11576 -22460 -32180 -15459 -10861 -12327 -8452 -21404 -45646 -46516 -14214
351a4214K4060j178Q154J603k7450M337M2304N530j5399N885j2233l6841J46L2243
$$ -14214 9846 8668 16822 18425 -9025 -4688 37616 43146 27747 33632 21399 -15442 -15296 16947
365A6947p6k7924J66n122l9565P068N1823n104k5195K1478J348l0071K5028N2393
$$ 16947 16871 -11053 -10887 -16009 -55574 -48506 3317 -1787 -26982 -5504 -4156 -34227 -9199 43194
379D3194m703k5095J7683n45m1577J6607N2431k6912m2588J8480j5008m9093K8222
$$ 43194 38491 13396 31079 30534 -11043 5564 57995 31083 -11505 6975 -8033 -57126 -28904
392b8904M7972l3999l3164L0174J002l6185L8958O0813l4049k9550M7180o927
$$ -28904 19068 -14931 -48095 -17921 -16919 -53104 -14146 46667 12618 -16932 30248 23321
404B3321m4151M9718M9892n4960l3775L5233j9383m7402M5008M2255o7347l4871
$$ 23321 -20830 28888 78780 23820 -9955 25278 5895 -41507 3501 45756 -21591 -56462
416e6462N1583j7085m5799O2432M0873o8255r644O4035j7509l3849O9649L7626
$$ -56462 -4879 -21964 -67763 -5331 35542 -32713 -42357 21678 4169 -29680 39969 77595
428G7595p4603j6648O1207k7833m3611O9121J6611r7477q199O1176l9621l7136
$$ 77595 2992 -13656 47551 19718 -23893 45228 61839 -35638 -43837 17339 -22282 -59418
440e9418P0023J0284q5670J0251P3838l5222l0988Q7779J2743r0517K5214P4778
$$ -59418 10605 20889 -64781 -54530 19308 -15914 -46902 40877 53620 -36897 -11683 63095
452F3095m7957k2723Q1571j5481r9703K5600O4326o1709l2967P8536k0820r9483
$$ 63095 15138 -7585 73986 58505 -41198 -15598 48728 -12981 -45948 32588 11768 -87715
464h7715M4669O8659o8799j0764R6566k3896q4606O0867O7338o4272n500Q8152
$$ -87715 -43046 25613 -43186 -53950 42616 18720 -65886 -5019 62319 -1953 -7453 80699
476H0699l9621r1847O6818N7037q7956r154Q1968n7215q3810P4774M2374q5418
$$ 80699 41078 -50769 16049 73086 -14870 -24024 57944 729 -83081 -8307 34067 -51351
488e1351P535Q5283n6845p4587R0364N0175q4357J9685Q5001o7571n7038J01809
$$ -51351 -43816 41467 -15378 -89965 399 50574 -33783 -14098 70903 3332 -53706 48103
500D8103K7121r5824K1298P3068p5867n9172R2210J3936j00053K9098O8223r2047
$$ 48103 75224 -20600 698 73766 -2101 -61273 30937 44873 -55180 -26082 42141 -49906
512d9906m4617J15445J2621r2216M2930O4756q0011j8793J14446n954r8346N4415
$$ -49906 -94523 20922 33543 -58673 -15743 49013 -30998 -49791 64655 58701 -39645 14770
524A4770O7973r4465k6352J05938k6074r5908N6557L7962j03708k352J14814l1253
$$ 14770 82743 -11722 -38074 67864 41790 -54118 2439 40401 -63307 -65659 49155 17902
536A7902r7378N9697M9504q5414J4636J08956m9263p6372R1903M0494j02562Q974
$$ 17902 -79476 -19779 29725 -55689 -41053 67903 18640 -57732 34171 74665 -27897 -18923
548a8923R5634m8924p0793P0447J2993j00130L4508J00527p7551q4696Q1577K2902
$$ -18923 76711 27787 -43006 27441 40434 -59696 -25188 75339 -2212 -86908 -5331 17571
560A7571q0953M3393P7836p6332m3359J00513O146r9803M3813R0648o9204m5858
$$ 17571 -63382 -19989 57847 -18485 -61844 38669 44815 -54988 -11175 79473 10269 -35589
572c5589Q3859j4230q0841O9140O0356j11325m8381R6527O09p3968N2039M4325
$$ -35589 48270 34040 -46801 22339 82695 -28630 -77011 19516 20125 -53843 -1804 42521
584D2521r2980j0707J02523l3397q3346Q2794O6452q4792j4719P7417l4494n2532
$$ 42521 -50459 -61166 41357 7960 -75386 7408 73860 -10932 -25651 51766 17272 -35260
596c5260Q1227K2547j16824m371J05023k7172o5797N9910O264r4692K4889Q2895
$$ -35260 45967 68514 -48310 -52681 52342 25170 -40627 19283 25547 -69145 -44256 38639
608C8639n5280m7496R2432K4499r2862R554P3000m2182k6442Q2914j5063r8723
$$ 38639 -16641 -64137 28295 52794 -40068 -30514 42486 304 -26138 56776 41713 -57010
620e7010M5563Q8538n7640m9425N2764j8634p0756N2609O2105p1536k5295Q6935
$$ -57010 -11447 77091 19451 -29974 22790 4156 -66600 -13991 48114 -23422 -48717 38218
632C8218j6328q6966M2418N6568n4053K376P4074l9615o9707O8339N6777p4560
$$ 38218 21890 -65076 -22658 33910 -20143 -17767 56307 16692 -53015 15324 72101 -2459
644b459k5305N8440l1732m7764P3691K9712q4497L54O5821m8939n6953O3251L3608
$$ -2459 -27764 30676 -1056 -48820 24871 54583 -29914 -29560 36261 -12678 -69631 -6380 27228
657B7228n2749J7817N3780n6898m3201Q0329K5490p4182Q872N0558m2163j5073
$$ 27228 -25521 -7704 46076 -10822 -54023 26306 51796 -22386 -13514 37044 -5119 -20192
669b0192P0505q463p9574J6602M7076m9103k5257O7870N349n5710L1019K9632
$$ -20192 50313 41850 -37724 -21122 25954 -23149 -48406 19464 24813 -30897 122 29754
681B9754o8809j1358Q0896j480n6023K8065L1048m3057N438O0602l3520o7733
$$ 29754 -39055 -50413 30483 29003 -27020 1045 32093 -10964 -5526 55076 21556 -46177
693d6177L9779L7883n0077K602N7272l0100m6904L6304M491n7823K0439P1353
$$ -46177 -6398 31485 -18592 -15990 41282 11182 -35722 582 5073 -52750 -32311 39042
705C9042k0829m7322L3825J4076m0906K4527M4689n1399l7052N7890J9091m2319
$$ 39042 18213 -29109 4716 18792 -22114 2413 47102 -4297 -41349 16541 35632 -6687
717f687J3110K9171m2255k8149L8674l451m2649L5860N0338m2853l3798L3310
$$ -6687 6423 35594 -6661 -34810 3864 413 -42236 -6376 43962 1109 -32689 621
729F21m751k5780L8775K4374m8332j0220N4018M558l8322J4975J4331m4418k848
$$ 621 -4130 -29910 8865 33239 -15093 -25313 28705 33263 -5059 9916 24247 -20171 -23019
742b3019M5511j7253l0255M0626J7579n1609j7234K6840o549o875M0418P178m9078
$$ -23019 22492 5239 -25016 15610 33189 -18420 -35654 -8814 -15363 -22238 18180 25358 -23720
755b3720L505N0019j3015k9149K2476L76k9391K1626L1543k5561j8178K9022j849
$$ -23720 -20215 29804 16789 -12360 10116 10492 -18899 2727 34270 8709 -9469 19553 17704
768A7704m6737l361L0002n140J407L1288j9262m4686K0300L5873j5739j1866J6860
$$ 17704 -29033 -32394 -2392 -7532 -6125 25163 5901 -38785 -18485 17388 1649 -10217 6643
781F643j874j1765K4095J8336l0294j4052K5435j0887l1813J6297K2427r020L935
$$ 6643 4769 -6996 17099 35435 5141 -8911 16524 5637 -26176 -9879 12548 3528 7463
794G463N896l1528k4844K7913K8409j3636j0884J3381k859l726K4522J210k9883
$$ 7463 13359 -18169 -43013 -15100 13309 -327 -11211 2170 -689 -4415 20107 21317 -8566
807h566J764K0831q812j0259J5338J0838j0125p508o258k3739o544L3245J6346
$$ -8566 -6802 14029 5217 -5042 10296 21134 11009 3501 -2757 -26496 -33040 205 16551
820A6551k0481q701M721l566P162J3088o049j3000Q019J7251j754o503R142K610
$$ 16551 -3930 -12631 -7910 -11476 -4314 8774 2725 -10275 -2256 14995 13241 6738 15880 18490
834A8490j3026n824o346j0758R746K0957M36j7021j4759k176O015P190O941j993
$$ 18490 5464 -360 -6706 -17464 -7718 13239 13675 -3346 -18105 -20281 -14266 -7076 -135 -2128
848b128o111P410J0975j024j142R16o74o69o153l958O205P306M752l555j9565
$$ -2128 -8239 -829 10146 9122 7980 8896 8222 7553 1400 -2558 3647 10953 15705 12150 -7415
863g415j7216L445J4239Q411k393n440j233j111M937R601m446n093J0504K649
$$ -7415 -24631 -21186 -6947 1464 -929 -6369 -7602 -8713 -3776 5825 1379 -3714 6790 9439
877I439r085M270J1986J295n403o390j3189j4092J0147K4240k649j7174j684m057
$$ 9439 354 4624 16610 17905 12502 6112 -7077 -21169 -11022 13218 10569 -6605 -8289 -12346
891a2346q863J2698J3727r898m734J3914K243j1026Q580J7825p501j2599N706
$$ -12346 -21209 -8511 5216 -4682 -9416 4498 6741 -4285 4295 22120 14619 2020 7726
904G726p618j3734K1498K0308k1370k0523M354m083q141J7721J4398j9594p781
$$ 7726 108 -13626 7872 28180 6810 -13713 -9359 -13442 -21583 -3862 10536 -9058 -16839
917a6839K1358k608j6724J9300J7514k0321o379J6567q404r268K5397J1116l3628
$$ -16839 4519 1911 -14813 4487 22001 1680 -4699 11868 3464 -5804 19593 30709 -2919
930b919j5360J7511m482j1051K4925O314l3465j682K4773j1307j3029K7474R625
$$ -2919 -18279 -768 -5250 -16301 8624 14938 -18527 -20209 4564 -6743 -19772 7702 17327
943A7327k7424O47K3661j0423r914K9819J978l9702Q06K6505j3110p983K7165
$$ 17327 -10097 -9450 14211 3788 -6126 23693 25671 -14031 -13225 13280 170 -7813 19352
956A9352o498l7442O308K5701j6567r301L1561j338l5874J2877K7244k0342l426
$$ 19352 12854 -24588 -18280 7421 -9146 -18447 13114 11776 -24098 -11221 16023 -4319 -7745
969g745L3869j1094l6217J7174K6039k0162n152K7739j6072l8543K1028K5691
$$ -7745 26124 15030 -21187 -4013 22026 1864 -3288 24451 8379 -30164 -9136 16555
981A6555k6815k669L1787j9849l2647K7884K2273k5471K590K9564j9810k9782
$$ 16555 -10260 -12929 18858 -991 -33638 -5754 16519 -8952 -6362 23202 3392 -26390
993b6390L1348K1915l1176K451K8447k8144k7970L4982J4852l1018M766K3967
$$ -26390 4958 26873 -4303 -1852 26595 -1549 -29519 5463 20315 -10703 -5937 18030
1005A8030k8276k2590L7370J5250l3327O960K6474k9386j7321M1759P187l3510
$$ 18030 -10246 -32836 4534 19784 -13543 -6583 19891 -9495 -26816 14943 22130 -11380
1017a1380J2845K1871l2822j4703L9814O034l4171J0828J9014l5556p684M6260
$$ -11380 1465 23336 -9486 -24189 15625 21659 -12512 -1684 17330 -18226 -25910 20350
1029B0350k991l7792J6786J7728l1909j412M0585o694l2181K0641J6589l7903
$$ 20350 17359 -20433 -3647 14081 -17828 -19240 21345 14651 -17530 3111 19700 -18203
1041a8203q35M5743j0613l3067K1905Q076l5061J0201L9875j9545l2391K4057
$$ -18203 -19038 26705 16092 -16975 4930 13006 -22055 -11854 28021 8476 -23915 142
1053A42J2582l2669Q147L8834k1647k7131K9657L275l6283J8855L7567k4705k5498
$$ 142 12724 -19945 -11798 27036 5389 -21742 7915 11190 -25093 -6238 31329 6624 -18874
1066a8874K4502K263k8093J9144L1307l2655k3551L4616J997l1606K2025K5634
$$ -18874 5628 7891 -20202 -1058 30249 -2406 -25957 8659 10656 -20950 1075 26709
1078B6709l2843j3990L0079n452k5553K6609K4686l6136j7327L2847n167k4423
$$ 26709 -6134 -20124 9955 4503 -21050 5559 30245 -5891 -23218 9629 4462 -19961
1090a9961K9586J5641l9992m124L4199j1164k3282K7589J4339l5887m560L1607
$$ -19961 9625 25266 -14726 -18850 15349 4185 -19097 8492 22831 -13056 -17616 13991
1102A3991j3024j8541L5073O803m4688J562L2920j4626j3606K9761k32l6579Q217
$$ 13991 967 -17574 17499 24302 -20386 -18824 14096 -530 -14136 15625 15393 -21186 -12969
1115a2969L0357j8778j5241L3053N48l8401J1400K7865k0161o449L0129j1227
$$ -12969 17388 -1390 -16631 16422 16970 -21431 -10031 17834 -2327 -8776 21353 10126
1127A0126l6091J6570K8095k0085r162K6851j0115l2101K0781K2440k6053o92
$$ 10126 -25965 -9395 18700 -1385 -10547 16304 6189 -25912 -5131 17309 -8744 -9436
1139i436L0174j5457l0119K2093K0040k0325L30K3181k0913k6936K9748K0276
$$ -9436 20738 5281 -24838 -2745 17295 -3030 -2700 20481 -432 -27368 2380 22656
1151B2656k8408l06K2798k2305j9823L0114J0720k6122O386K0985k3664j9345
$$ 22656 -5752 -6058 16740 -5565 -25388 4726 15446 -10676 -4290 16695 -6969 -26314
1163b6314L2281J3011k5605O164J7500k7185j0168L6571L270k9357Q281J4700
$$ -26314 5967 18978 -6627 -463 17037 -10148 -20316 16255 19525 -9832 -1551 13149
1175A3149k3011p843L0200l16k6520J2231J4314k8011l812L4578k357k3638J2799
$$ 13149 -9862 -17705 12495 12179 -14341 -2110 12204 -15807 -19619 14959 12602 -11036 1763
1188A763Q442k5072L387L2435o565k4880J3128Q681k3394L013K8805j3221k2620
$$ 1763 10205 -14867 -11480 20955 14390 -10490 2638 11319 -12075 -9062 19743 6522 -16098
1201a6098J7105N727k4815Q368K8002j3557k0210J6334L820k1727J2957K7959
$$ -16098 1007 6734 -18081 -9713 18289 4732 -15478 856 4676 -17051 -4094 23865
1213B3865j6369j9990J8953P06k0919J4497K0937j9953j5157J8738r43k0234J3939
$$ 23865 7496 -12494 6459 7165 -13754 743 21680 1727 -13430 5308 4365 -15869 -1930
1226a930J9246k1434j3220J9533k802j6607K0867J7970k2900j1368J6535k729
$$ -1930 17316 -4118 -17338 2195 -607 -17214 3653 21623 -1277 -12645 3890 1161
1238A161j1250J9253J3209k4500q827J9781m896j4897J6464P357k3765l204J8196
$$ 1161 -10089 9164 22373 -2127 -10954 8827 3931 -10966 5498 12855 -10910 -14114 4082
1251D082o728r607J9294O766k4481n511J8887k711m476K0777J239k6584J178J8773
$$ 4082 -2646 -12253 7041 13807 -10674 -16185 2702 -9 -4485 16292 17531 -9053 -7875 10898
1265A0898p591q220J3855J8j9365L256J4879j0567p150J7271k461k2734M330J6942
$$ 10898 3307 -4913 8942 8960 -10405 -7149 7730 -2837 -9987 7284 4823 -17911 -13581 3361
1279C361l613J169J3831r139k0606P972J7919o451m970J2401m858j4772Q665Q058
$$ 3361 -252 917 14748 5609 -14997 -7025 10894 4443 -527 11874 7016 -7756 909 8967
1293H967j2961k390J2406o522j5089P831J2260m181q48O790j1893j3175J5569
$$ 8967 -3994 -6384 6022 -500 -15589 -7758 4502 321 -527 6263 -5630 -18805 -3236
1306c236J5354o816j249N639p483o820Q688L237r831Q61R682p025j1111Q125O656
$$ -3236 12118 5302 4053 9692 2209 -4611 4077 7314 -2517 -1656 8026 1001 -10110 -1985 4671
1321D671o787l55J80j1938j645J7643R720o278m742Q76m322j378J0236K002p225
$$ 4671 -2116 -2471 -2291 -14229 -15874 1769 11489 5211 469 1345 -2977 -4355 5881 7883 658
1336F58M464N057q832n318M934J367l445k372l136n092L672J4193L256j1258o488
$$ 658 5122 10179 1347 -3971 963 2330 -1115 -3487 -6623 -11715 -8043 6150 9406 -1852 -8340
1351h340K69J016O904Q317j462k733K261qm399l629K870L292k298k323k734k601
$$ -8340 -8071 -7055 -151 8166 6704 3971 6232 6224 1825 -1804 1066 4358 2060 -263 -2997 -5598
1367e598N500O453m881j0105n840K272R327P707J174k580l335mJ443j391J32L835
$$ -5598 -98 6355 1474 -8631 -14471 -12199 -2872 4835 6009 3429 94 90 1533 142 274 4109
1383D109L718O43m629n727J801L868j429l981p726m774P443J0684J657n285n862
$$ 4109 7827 8470 3841 -1886 -85 3783 2354 -1627 -9353 -14127 -6684 4000 5657 372 -5490
1398e490j340L28L127O123J229P22N160k96r179j955N436N10j175k904n205k520
$$ -5490 -6830 -6502 -3375 2748 3977 4699 9859 9563 384 -1571 3865 4375 3200 296 -4909 -7429
1414g429P052Q682m489j3307j963K074M03P968O755l741j302N222k977p137K386
$$ -7429 -377 8305 3816 -9491 -11454 -9380 -8977 -1009 5746 2005 703 5925 2948 -4189 -1803
1429a803R030J028l747Q5l574m374Q310N914j4239j0226M273L109K593O947J028
$$ -1803 7227 8255 4508 4593 1019 -3355 4955 10869 -3370 -13596 -9323 -6214 -3621 3326 4354
1444D354q308l434O361r10n999Q639J1275m851l270K628n445k505J0187N92j3870
$$ 4354 -3954 -7388 -1027 -1937 -7936 703 11978 7127 3857 6485 1040 -1465 8722 9314 -4556
1459d556n459Q105M114j902K912k164j3455m95J0955k797k991J2465N332q409
$$ -4556 -10015 -1910 2204 302 3214 1050 -12405 -12900 -1945 -4742 -7733 4732 10064 1655
1473A655k337K631l029P50J1139O47j4438j174J1267j627n110L459o776j2847
$$ 1655 -682 1949 -1080 -330 10809 11456 -2982 -4156 7111 5484 374 3833 -2943 -15790
1487a5790O640R763m097k220R411J93j1240J16P412k331L170J3524m451j4609
$$ -15790 -9150 613 -3484 -5704 3707 3900 -7340 -7224 188 -2143 1027 14551 10100 -4509
1501d509N486Q996n454k537K583p584q344R086R002q801m207P917n946j0840Q374
$$ -4509 977 9973 4519 1982 4565 -3019 -11363 -2277 6725 -2076 -6283 1634 -4312 -15152 -6778
1516f778P844l243N217Q468r160r938R035Q951o185j487M831q082o032J2848L527
$$ -6778 1066 -2177 3040 11508 2348 -7590 1445 10396 4211 2724 7555 -527 -6559 6289 9816
1531I816j3277j890M658q239m443J0895N056o024K722N312r770o380J5259O379
$$ 9816 -3461 -5351 -693 -8932 -13375 -2480 2576 -3448 -726 4586 -5184 -11564 3695 10074
1545A0074q086L104M113j0201q81J2316j210j2691O31M263q240j743J1843q89
$$ 10074 1988 5092 9205 -996 -1877 10439 9229 -3462 -2831 1432 -6808 -8551 3292 2403
1559B403j0550M519L364j1617J969J5787Q46p116M284K123q408K181J3676m247
$$ 2403 -8147 -3628 -264 -11881 -9912 5875 6721 -395 3889 6012 -2396 -215 13461 9214
1573I214j2787N200L405r564K785R413q650r213O026J143q249M145J3141l523
$$ 9214 -3573 1627 5032 -4532 -1747 7666 -984 -10197 -4171 -3028 -11277 -7132 6009 2486
1587B486q176O306J002p768Q499J2342q815q386P283N89o883M916N972j0766q020
$$ 2486 -5690 616 1618 -6150 2349 14691 5876 -2510 4773 5362 -1521 3395 9367 -1399 -9419
1602i419Q456k93r481P502R106j0318n405Q116q76l991J1111P336j1425n227J0517
$$ -9419 -963 -1256 -10737 -3235 5871 -4447 -9852 -1736 -2612 -6603 4508 11844 419 -4808 5709
1617E709Q99o323P388L565j3681k915J0002m641p864Q628K875j2220k164R058
$$ 5709 6608 285 7673 11238 -2443 -5358 4644 3 -7861 767 3642 -8578 -10742 -1684
1631a684j906l861J1123K612j3424J307J3055k172m439Q900k34j2369J624Q980
$$ -1684 -3590 -7451 3672 6284 -7140 -5833 7222 5050 611 9511 9277 -3092 -1468 7512
1645G512n411n588Q071n89j4446J398J0005n346k802R912k933j0948O800J0938
$$ 7512 2101 -3487 4584 3995 -10451 -9053 952 -4394 -7196 2716 -217 -11165 -4365 6573
1659F573m607k882Q646j751j1097O181J0056q165k321Q673p009j2525P312P015
$$ 6573 1966 -916 7730 5979 -5118 1063 11119 2954 633 9306 2297 -10228 -2916 4099
1673D099p411k882O870l939p952Q317Q703r370j754J1183m467q337J0960P560
$$ 4099 -3312 -6194 676 -3263 -11215 -2898 5805 -3565 -5319 5864 1397 -6940 4020 11580
1687A1580q481n3N800q312q402J0078O403j0510k477O801p576o104J0717L155
$$ 11580 3099 3046 8846 534 -7868 2210 8613 -1897 -4374 2427 -5149 -11253 -536 2619
1701B619j0482K326Q493n677l846J1712M643r119J73N868q200k958J3626J605
$$ 2619 -7863 -5537 2956 -2721 -6567 5145 9788 669 842 6710 -1490 -4448 9178 10783
1715A0783j2856K27M967p783k483Q957j098r520L894P648p427l218J2908N66j0157
$$ 10783 -2073 -1846 3121 -4662 -7145 1812 714 -8806 -4912 2736 -4691 -7909 4999 5565 -4592
1730d592L639N216o818L201J2005k891j2570J587N553o435j267R097m535r835
$$ -4592 -953 4263 -2555 646 12651 9760 -2810 -1223 4330 -2105 -3372 5725 1190 -8645
1744h645O567L464r911J973R665l060o320M314N235m947L487R247o841j0463O187
$$ -8645 -2078 1386 -8525 -6552 3113 53 -6267 -1953 3282 -1665 1822 11069 4228 -6235 -48
1759d8N978o911L334N956p929n917N432J314p609Q53Q529l843o872N513M107m819
$$ -48 5930 -981 2353 8309 380 -5537 -105 1209 -6400 -5547 2982 -861 -7733 -2220 1887 -2932
1775b932L795O015q558n760J0279K878k975K609J939p558m903O008J586p327L723
$$ -2932 863 6878 -1680 -7440 2839 5717 2742 5351 7290 -268 -5171 837 2423 -4904 -1181
1790a181N802p747m201O723k11l164M276J793p111j605R318M050n105J199K139
$$ -1181 4621 -3126 -7327 -604 -815 -3979 297 2090 -5021 -6626 2692 6742 1637 2836 4975
1805D975p785q57Q603r22m715L754O38o595k126M654L03l660K561J676o757P66
$$ 4975 -2810 -3667 4936 4014 -701 3053 3691 -2904 -5030 -376 -73 -3733 -1172 504 -6253 -5487
1821e487R342m11m764K097n98l680L078O630p70m347J519N32n741n4N509j567
$$ -5487 3855 3444 -1320 777 179 -3501 -423 6207 5437 1090 2609 3141 -2600 -2654 2855 1288
1837A288l053K500j751n047K865N025j202l618J24Q48j054M007N161k538l773
$$ 1288 -1765 735 -1016 -6063 -3198 1827 625 -2993 -2869 -2021 -3075 932 6093 3555 -218
1852b18J901n90k246K819K906j742k135q84j345k119J647L999k469l560P79K70
$$ -218 1683 1093 -1153 1666 4572 2830 695 -189 -1534 -3653 -2006 1993 -476 -4036 -3257 -2987
1868b987J00L779J826k494j797R91P91R77K107J713j466l257K9n16n13K281L69
$$ -2987 -2887 892 2718 224 -1573 -582 209 1186 3293 5006 3540 283 312 -204 -717 1564 1933
1885A933k451k174r71O59J578J075J19j306j703P98K783J462J403m78j088j336
$$ 1933 -518 -2692 -3663 -3004 -1426 -351 -232 -1538 -3241 -2443 340 1802 3205 2727 1639 303
1901C03N7J179J834o58j416m31k828j016K195J003j057n21j411j113K59K760K474
$$ 303 360 1539 3373 2715 1299 868 -1960 -2976 -781 222 -835 -1356 -2767 -3880 -3621 -861 1613
1918A613j385n40N04o45M26L781J189k676r74K83j689o23K338J085l313j592K61
$$ 1613 228 -312 192 -453 -27 3754 4943 2267 1293 1576 -113 -736 1602 2687 -626 -2218 -1957
1935a957k335p38N022J314l537m24J715j049J501M906k0m400L04K841j738o98
$$ -1957 -4292 -5030 -8 1306 -2231 -2655 -940 -1989 -488 4418 4398 -2 302 3143 1405 707
1951G07M226j575n100Q24N12l575P36M781r79m769L01J853j312J670N642k146
$$ 707 4933 3358 -1742 -918 -406 -3981 -3245 1536 557 -4212 -3911 -2058 -3370 -1700 3942 1796
1967A796m909L915L810l205J062K987l227m266K813J919m167N74N059l995o658
$$ 1796 -3113 802 4612 1407 2469 5456 2229 -2037 776 2695 -1472 -898 4161 166 -6492
1982f492K725J717k925L426M796m842l722N638L248l260P47L914l951k660O525
$$ -6492 -3767 -2050 -4975 -1549 3247 -1595 -5317 321 3569 309 1056 4970 1019 -1641 4884
1997D884L51n884K380L811p259m755M414R28k614L679K637p386k996Q248J960
$$ 4884 5235 -649 1731 5542 -1717 -6472 -2058 -1130 -3744 -65 2572 -4814 -7810 438 2398
2012B398n439L431L536n010Q80P549k561n470L629K349p282k473O540j66m766
$$ 2398 -3041 390 3926 -1084 -204 7345 4784 -686 2943 5292 -1990 -4463 2077 1911 -2855
2027b855M549j92j0294P84R559j799m200N069J716n087K590P073m360n892P256
$$ -2855 1694 1502 -8792 -8008 1551 -248 -4448 621 2337 -2750 -160 6913 2553 -3339 3917
2042C917K297q675J898P227m076m385M659l546q459L695R042l583n058N405J14
$$ 3917 6214 -2461 -563 6664 2588 -1797 2862 -684 -9143 -5448 3594 11 -5047 358 472
2057D72o857N802O352p826j877R468n79o947M862N159o658k999M951l755p835
$$ 472 -6385 -583 5769 -2057 -3934 5534 4955 -1992 2870 8029 1371 -1628 3323 -432 -8267
2072h267P960P524r265l754O041l718m436Q361L469q604Q36R727k178o802O431
$$ -8267 -307 7217 -2048 -5802 239 -3479 -7915 446 3915 -4689 -3853 5874 3696 -3106 3325
2087C325L783q627M80P465o570m564J0277J880j1091j837N515m469k543R347J054
$$ 3325 7108 -1519 -1039 6426 -144 -4708 5569 7449 -3642 -5479 36 -4433 -6976 2371 3425
2102C425j0493L090R917o642m765R678K6p923N300N992p658k109R834j213j1998
$$ 3425 -7068 -3978 5939 -703 -5468 4210 4236 -3687 1613 7605 -53 -2162 7672 6459 -5539
2117e539J552O596o234l81J0047m697j1081P166O454q470r73R578k099o503P279
$$ -5539 -3987 2609 -3625 -4006 6041 1344 -9737 -2571 3883 -4587 -5560 4018 1919 -4584 2695
2132B695M596r881O90J1112n714j0348P206M591p480K844P265r169q850R109N000
$$ 2695 7291 -2590 -1900 9212 3498 -6850 356 4947 -2533 311 7576 -1593 -10443 -1334 3666
2147C666q903Q50R268n285o071J0010J065j0855N398R680q229n971R396K347q076
$$ 3666 -5237 -4387 4881 -404 -6475 3535 4600 -6255 -857 8823 594 -5377 4019 6366 -1710
2162a710L072N398j0662n777J2686J546j0727M030O736q571k406R895k080q677
$$ -1710 1362 6760 -3902 -9679 3007 4553 -6174 -2144 4592 -3979 -6385 3510 1430 -7247
2176g247P772P704r549m017J1308m74q593N691L003j1620N54J2944l362r638N649
$$ -7247 525 8229 -1320 -5337 5971 5497 -3096 2595 5598 -6022 -5468 7476 4114 -5524 125
2191A25L513r595M05J0015m602p149R686L966j1912J278J0836m516o486P551R35
$$ 125 3638 -5957 -5552 4463 -139 -7288 2398 6364 -5548 -4270 6566 2050 -4436 3115 4050
2206D050r469M241J0912p162q729P685J927r987L925Q721p680m766J0047n66j0582
$$ 4050 -5419 -1178 9734 2572 -6157 1528 3455 -6532 -2607 6114 -1566 -6332 3715 3149 -7433
2221g433M393Q822o358m346Q409l84q921O774Q392r924m735R231j676p911O690
$$ -7433 -3040 5782 -576 -4922 3487 3103 -5818 956 9348 -576 -5311 3920 2244 -5667 1023
2236A023N699q858k980Q711k699q901P496O672r082j556Q876l963o145Q844L776
$$ 1023 6722 -2136 -5116 3595 896 -8005 -509 6163 -2919 -4475 4401 438 -5707 3137 6913
2251F913j0008q08Q709k829o084P079L230j0175L01Q544n445n603Q705K005r113
$$ 6913 -3095 -3903 4806 1977 -4107 2972 6202 -3973 -3672 4872 -573 -6176 2529 4534 -4579
2266d579J171O642m074m022Q056J310r382J587Q397m806l585Q283o14q891L076
$$ -4579 -3408 3234 -840 -4862 3194 4504 -4878 -3291 5106 300 -3285 4998 4384 -4507 -1431
2281a431O199n590k351P292j168q046K822O314n838j909P406k534p351M885N298
$$ -1431 4768 -822 -3173 4119 2951 -5095 -2273 4041 -1797 -3706 3700 1166 -6185 -1300 3998
2296C998n739m74O576k171o501M169M971n621r11O748l425o657N567L249n809
$$ 3998 -1741 -2215 4361 2190 -4311 -142 4829 -792 -1703 5045 1620 -5037 530 3779 -2030
2311b030k87M794l224m951N304L605n461k7O223l671m661N837J972m765J614M145
$$ -2030 -2317 2477 -747 -5698 -394 3211 -2250 -2277 3946 275 -4386 1451 3423 -1342 272 4417
2327D417m484l389N262J792n052J79L670l844k831N866N25n385K086L009l863
$$ 4417 -67 -3456 1806 3598 -1454 -1275 2395 -1449 -4280 1586 2111 -3274 -1188 1821 -2042
2342b042j652M948J081l178J817K466m376j641N837j42m585J580K086l898N34
$$ -2042 -3694 1254 2335 -843 974 3440 -936 -2577 3260 3118 -1467 113 2199 -1699 -1165
2357a165L484j564l587J231J726k420n47M414j94k876J954O17l404J377M080o86
$$ -1165 2319 755 -2832 -1601 125 -2295 -2842 1572 1378 -1498 456 1073 -2331 -954 3126 2440
2373B440k421N45O88j226L23J551j731l072J883J439k369N65K179j104q78K90
$$ 2440 19 564 1252 26 349 1900 169 -2903 -1020 419 -1950 -1385 794 -310 -1188 -898
2389h98j44r01J832K767j91k440J97J244r16Q87J85k057p18J574J46p56o08pr
$$ -898 -1042 -1943 -111 2656 2465 25 222 1466 550 1437 1622 -435 -1153 421 567 -189 -797 -804 -813
2408h13o37n76K12N27J673J884j299j791l8J347J320J22q29j76m79R8O52p09j903
$$ -813 -1450 -2026 -1814 -1287 386 2270 971 -820 -858 489 1809 1931 1102 926 447 545 1197 488 -1415
2427a415L80K61q62k55N69J448N27q63j01j395p05L407J679j390m01N44n29k25
$$ -1415 -1035 -774 -1636 -1891 -1322 126 653 -210 -311 -1706 -2411 996 2675 1285 884 1428 899 674
2445F74Q58m92k138K5K152j093k213K169O99k050k62R52k382Q61L941R96k841
$$ 674 1532 1040 -1098 -1073 1079 -14 -2227 -58 641 -1409 -1671 -719 -3101 -2240 1701 2697 -144
2462a44n4J734j065o91K766p01l296J837K720l379j735K813p10k665J113J239
$$ -144 -198 1536 471 -220 2546 1845 -1451 386 3106 -273 -2008 805 95 -2570 -1457 -218
2478b18k097l5M944m22n100J599K891k736J092M089k516l222L677J348m031p12
$$ -218 -2315 -2350 2594 2172 -2928 -1329 1562 -1174 -82 4007 1491 -1731 1946 3294 -737 -1449
2494a449L484j789l331L057J806m699J286N094m012m171L969J908k398J771L474
$$ -1449 2035 246 -3085 -28 1778 -2921 -1635 3459 -553 -4724 -755 1153 -1245 526 4000
2509D000l546l199M811J323n648J142N038l956k519M757n63n276L062L366n343
$$ 4000 454 -2745 2066 3389 -2259 -1117 3921 -35 -2554 2203 1640 -3636 -574 2792 -2551
2524b551k464N611J427m484L184L228o244j496P235j222m969L892L278n838m70
$$ -2551 -5015 596 2023 -2461 723 3951 -2293 -3789 3446 2224 -2745 1147 4425 -1413 -1883
2539a883N500k510n365M557L211o998p44P649k501m506M713J452o770J441P134
$$ -1883 3617 1107 -4258 299 3510 -3488 -4232 3417 916 -3590 1123 2575 -4195 -2754 4380
2554D380k960m554N167K124o856R25O282m438m392P149L56p735K580O297m869
$$ 4380 1420 -3134 2033 4157 -2699 -1774 4508 70 -4322 2827 3183 -4552 -1972 4325 -544
2569e44l528O309l36p330M018P230n938l896P216o95p304M928N311o797k081P625
$$ -544 -4072 2237 1901 -5429 -1411 5819 -119 -4015 3201 2506 -4798 130 5441 -1356 -3437 4188
2585D188j842p321M415N567p085k065P949k912p030P025M516q294q74P991l498
$$ 4188 2346 -4975 -560 5007 -2078 -4143 3806 894 -6136 889 5405 -2889 -3763 4228 730
2600G30n602O640L308q057p8P966m397o293P898K657q768J208P781n659m821Q084
$$ 730 -4872 1768 5076 -2981 -3059 4907 510 -5783 2115 4772 -3996 -2788 4993 -666 -5487 2597
2616B597K066r186K013P745n700m712R101O05r736L647O896o873l534Q888k78
$$ 2597 4663 -4523 -2510 5235 -465 -5177 3924 4529 -5207 -1560 5336 -1537 -5071 3817 3539
2631C539r035M061O721p646k427R309j450q835N545N637p899j356R079k594q431
$$ 3539 -5496 -1435 5286 -2360 -4787 4522 3072 -5763 -218 5419 -2480 -3836 5243 2649 -5782
2646e782O073M848p900p75Q941m145p835O773M838r085O67Q737m395o938P612
$$ -5782 291 5139 -2761 -3536 5405 1260 -6575 198 5036 -4049 -3382 5355 960 -5978 1634
2661A634L263q908J607Q590n323o956Q170K710q976K440P550p029n624R309J519
$$ 1634 4897 -4011 -2404 6186 863 -6093 2077 4787 -4189 -1749 5801 -1228 -6852 2457 3976
2676C976q763K719P557o855m561Q911L49q426M689P094p946m244R803m75q402
$$ 3976 -4787 -2068 5489 -1366 -5927 2984 3333 -5093 -404 6690 -1256 -5500 4303 3828 -4574
2691d574M641N306q196k638J0193j720q754N267N492q412j380R305k652p603P236
$$ -4574 67 5373 -2823 -5461 4732 3012 -5742 -475 5017 -3395 -4775 4530 1878 -5725 1511
2706A511M324r163p63R030k909o404O449K943r165R93R549n450p256P519K397
$$ 1511 5835 -3328 -4091 4939 2030 -4374 2075 5018 -4147 -3154 6395 945 -6311 1208 3605
2721C605q341K083P561n119n042P909J417r090K103Q602n456m050P453j44q106
$$ 3605 -4736 -2653 4908 -211 -5253 2656 4073 -5017 -2914 5688 232 -3818 3635 3491 -4615
2736d615L966O729p069m416P470P26p282L406O104p281k696Q385j212p595M801
$$ -4615 -649 6080 -989 -5405 2065 2791 -4491 -1085 5019 -2262 -4958 3427 2215 -5380 -579
2751e79N784n860k186O890k135o486N572M824q284j500Q181k532o151N503K627
$$ -579 5205 -655 -2841 4049 1914 -4572 1000 5824 -2460 -3960 4221 1689 -4462 1041 3668
2766C668p592M09P213l499n280O403L227p016J14O278m361m057P614J087p716
$$ 3668 -3924 -3515 3698 199 -5081 1322 4549 -2467 -2353 3925 -436 -4493 3121 4208 -3508
2781c508J835O050l830l922N224M95o461K238O061n163l356O841L68o560K719
$$ -3508 -1673 4377 547 -3375 1849 2344 -4117 -1879 4182 -981 -4337 2504 2872 -3688 -969
2796i69L969m616j045O719j109o160K530N122m934k390N599j674n310M675L316
$$ -969 3000 -1616 -2661 4058 2949 -3211 -681 4441 -493 -2883 2716 1042 -4268 407 3723
2811C723n731p20N515j934m548L421K754m815R88N391k835n241M589K674m826
$$ 3723 -2008 -2728 2787 853 -3695 -274 2480 -2335 -1347 4044 1209 -4032 557 3231 -1595
2826a595L30M344l042k715M318J134m938M37L950k273l437M124J357m196J948
$$ -1595 -1265 3079 37 -2678 1640 2774 -2164 -1727 2223 -50 -3487 637 1994 -2202 -254
2841b54L362l973k478M670Q05l318J128K675k916j680L773m9m608K042K931l175
$$ -254 3108 -865 -3343 1327 2132 -1186 -58 2617 -299 -1979 1794 1745 -2863 -821 2110 -1065
2857a065q57L425p02k963K318J353k912o60L785k57k573J769J256l189n8L414
$$ -1065 -1922 1503 801 -2162 156 1509 -1403 -2063 1722 1465 -1108 661 1917 -1272 -1330 2084
2873B084j555k473K233J301k672M5K202j129j928J999P05k656P51K995j168j597
$$ 2084 529 -1944 289 1590 -1082 -1037 1165 36 -1892 107 812 -1844 -1093 1902 734 -863
2889h63J573k05j627J071J562j488r53J782m1j757M64J527j424q32J893o87j622
$$ -863 710 505 -1122 -51 1511 23 -930 852 811 -946 -482 1045 -379 -1211 682 -5 -1627
2906a627J466J144j063n92O37K71q21Q72R29j290o39J196j37q62Q89R1o57nQ8
$$ -1627 -161 983 -80 -672 -35 236 -585 287 1216 -74 -713 483 346 -516 373 464 -193 -198 -110
2925a10P8k89M26M00m99p68O74K09k29O92l01k84M9p9M26j43k49L13k82l50l84
$$ -110 -32 -321 105 505 6 -762 -88 121 -108 584 283 -1 48 -31 395 252 3 316 34 -316 -700
2946g00O64J80k1m7L0l45n35R73L45o93K65K12m21m89R57k06k36j21N06p67n21
$$ -700 -36 144 123 76 106 -239 -774 199 544 -149 116 328 -93 -582 375 169 -67 -188 318 -449 -970
2967i70J376N45j452J35R53j000n38J895j20j687P05J232j271q72J561lj503R17
$$ -970 406 951 -501 -366 587 -413 -951 944 824 -863 -158 1074 -197 -1069 492 489 -1014 -97
2985i7J240k111kK281q95j907J103J011j506M09K412j475j724J813J063k599J19
$$ -97 1143 -968 -970 1311 416 -1491 -388 623 -883 -474 1938 463 -1261 552 1615 -984 -865
3002h65K530j471j571K111N76l046Q22K759k055j824J986J143k294J005K495k645
$$ -865 1665 194 -1377 734 1310 -1736 -914 1845 -210 -2034 -48 1095 -1199 -194 2301 -344
3018c44j641L120L66l039J338K236k045j470K886l38l502J921K858l238j616L580
$$ -344 -1985 1135 1501 -1538 -200 2036 -9 -1479 1407 1069 -2433 -512 2346 -892 -2508 1072
3034A072J20l128K100K014l615p25M141o80l438K302K884l825o22L470j641l398
$$ 1072 1192 -1936 164 2178 -1437 -2162 1979 1299 -2139 163 3047 -778 -1400 2070 429 -2969
3050b969L517K017m367k11M156j720k864K969J147m305R14M858k516l241M241
$$ -2969 548 2565 -1802 -2013 2143 423 -2441 528 1675 -2630 -1716 3142 626 -2615 1626
3065A626R02m649J391L223l175k077M669Q92n140Q46M214l434k270M332m29m395
$$ 1626 2528 -2121 -730 2493 -682 -2759 1910 2802 -2338 -1492 2722 -712 -2982 1350 921 -3474
3081c474L015M089m198j995M643l51m282K297L374m056j238N394j154n580L077
$$ -3474 -459 3630 -568 -2563 2080 1729 -2553 -256 3118 -938 -2176 3218 2064 -3516 -439
3096d39L239m618n10M792k069m058M267K672n211j192N531j796l652M481J584
$$ -439 2800 -1818 -2328 2464 395 -3663 604 3276 -1935 -3127 2404 608 -3044 1437 3021
3111C021n144P55N170l172m234M329K111n245J169M445l600l364N432O20n981
$$ 3021 -2123 -1368 3802 630 -3604 725 2836 -2409 -1240 3205 -395 -3759 1673 2293 -3688
3126c688J571N103l308k391M967l3n255K404M530m452k547N296N33n385K490L698
$$ -3688 -2117 2986 -322 -2713 2254 2221 -3034 -630 3900 -552 -3099 2197 2730 -2655 -165 3533
3142C533n163j649O045j420n469L430L833m222j310N194j875n015M532L436n898
$$ 3533 -1630 -3279 2766 1346 -4123 -693 3140 -1082 -2392 2802 927 -4088 444 3880 -2018
3157b018m24O303k355m442M015J787n506P45N191k881m460M750K460n660N67M806
$$ -2018 -2442 3861 1506 -2936 1079 2866 -2640 -1895 3296 415 -4045 705 3165 -2495 -1928 2878
3173B878l431l328N465J325n734J439N071l408l397M899M41n377K259N069m796
$$ 2878 -553 -3881 1584 2909 -2825 -1386 3685 277 -3120 1779 2220 -3157 -898 4171 -625
3188f25k907N625m0n210K447L331m244j521O081p71n390K911M111m817j770N680
$$ -625 -3532 2093 2053 -3157 -710 2621 -1623 -3144 2937 2166 -3224 -313 3798 -1019 -2789 2891
3204B891j573m424L933K848n428q43N406j849m353L503K688m836j15N507k827
$$ 2891 1318 -3106 827 3675 -1753 -2596 2810 961 -3392 111 2799 -2037 -2152 3355 528
3219E28m108M305J992m951O49M807k791l009M125J387n747R12N301l502k929N050
$$ 528 -3580 725 2717 -2234 -1585 3222 431 -2578 1547 2934 -2813 -1901 3400 -102 -3031 2019
3235B019J27n293K203M154m364j869M626K06m291K005M129m279j876M916n81n107
$$ 2019 2146 -3147 -944 3210 -1154 -3023 1603 1809 -2482 -477 3652 -627 -2503 2413 1832 -3275
3251c275L016L583m202j548M847j380m333L404K694m500j016M982j367l516L001
$$ -3275 -259 3324 -878 -2426 2421 1041 -3292 112 2806 -1694 -2710 2272 905 -2611 390
3266C90K523m734J14M384j728l650L400J914m147K28M072k796k781L919J355m871
$$ 390 2913 -1821 -1707 2677 949 -2701 699 2613 -1534 -1306 2766 -30 -2811 1108 2463 -2408
3282b408J227L863l003k456L961O73m149J321L494k905k158M295J65m416J941
$$ -2408 -1181 2682 -321 -2777 1184 1857 -2292 -971 2523 -382 -2540 1755 1920 -2496 -555
3297e55L254l691r31L489k36l673J932K601l106j074L821o41l720K303K863l737
$$ -555 2699 -992 -1923 1566 1330 -2343 -411 2190 -916 -1990 1831 1190 -2530 -227 2636 -1101
3313a101o75M004j564k812K787J526l423k95L615j504k971K623J669l354M37L223
$$ -1101 -1776 2228 664 -2148 639 2165 -1258 -1553 2062 558 -2413 210 1879 -1475 -1038 2185
3329B185j907k728K842J014k716M83K627j728j794K963L81l508J466K579k215
$$ 2185 278 -2450 392 1406 -1310 -827 1800 72 -1722 1241 1622 -1886 -420 2159 -56
3344e6j565K679rk508J226K155k674j326L045K6k382J517J325k179n29K609p33
$$ -56 -1621 1058 1049 -1459 -233 1922 -752 -2078 967 993 -1389 128 1453 -726 -1255 1354 621
3361F21k594J884J696k064o41K065o90j784J653J161k328k27K637p52j776J467
$$ 621 -1973 -89 1607 -457 -1098 967 277 -1507 146 1307 -1021 -1248 1389 637 -1139 328
3377C28O88k046M38J816j272j477J990Q30j803j71J645j238q90K011k43j839R23
$$ 328 1016 -1030 -592 1224 -48 -1525 465 1295 -508 -679 966 -272 -1162 849 606 -1233 -310
3394c10J542r78j081J192n4j215P10J342j355p77J707j25j276L55P22j079L7J401
$$ -310 1232 254 -827 365 311 -904 -194 1148 -207 -984 723 598 -678 -323 399 -680 -643 758
3412G58m13j331P18J137r44n67J050m83m07R88N94j319k47J214l29p47J12O15
$$ 758 345 -986 -268 869 -75 -642 408 -75 -482 506 1100 -219 -466 748 419 -328 -216 399
3430C99n84j72Q35m88r37Q47O14o59k53M25j63K28O31j59r46p9O08K68q08N09
$$ 399 -185 -357 478 -10 -947 -100 514 -145 -398 27 -136 92 723 564 -382 -461 147 415 -393 116
3450A16K08m03L97j93m96j81K53P2Q4j49L6J94K00k32J50k40L7L84M46l01m41
$$ 116 324 -79 318 125 -371 -552 -299 -227 -143 -292 -256 -62 138 -94 56 -184 -147 237 683 382 -59
3471e9L9L87j20q19M74k14J69K34K10m52l80M36K89m00j29O20k14K17O05o26p41
$$ -59 -20 367 247 -572 -98 -312 -143 91 301 -151 -531 -95 194 -206 -335 285 71 288 893 267 -474
3492d74O78N11p56j81M07k2m18N91J92j022o12J395m07p44P23M32q43O61P52p18
$$ -474 204 715 -41 -222 185 163 -255 336 528 -494 -1106 289 -118 -862 -139 293 -550 111 863 145
3512A45p53O17N79j059P4J179q05o31J098N4j481L79J427j062m48R74P4r97O98
$$ 145 -608 9 588 -471 -397 782 -23 -654 444 498 -983 -604 823 -239 -687 287 361 -636 62
3531F2J078j566m82J513j8j135Q11Q45j526m3J328o59j470J054J299j479n96J415
$$ 62 1140 -426 -908 605 587 -548 263 1108 -418 -461 867 208 -1262 -208 1091 -388 -984 431
3549D31n00j209J431P59j817k09K476r31j210J222Q09j785PK071j375j657K143
$$ 431 -69 -1278 153 912 -905 -1114 1362 431 -779 443 1252 -533 -526 1545 170 -1487 656
3566F56P22k375Q5K003j447j054J993J25k021O06K122j486j340K112L56k243J168
$$ 656 1378 -997 -912 1091 -356 -1410 583 708 -1313 -707 1415 -71 -1411 701 1057 -1186 -18
3583a8J590j861o44K115j04k182N48J938k228m80K372n10k268J536J746k313l58
$$ -18 1572 -289 -933 1182 1078 -1104 -556 1382 -846 -1326 1046 536 -1732 -196 1550 -763 -1121
3600a121K499q96j993J804J225k053m16K456j062k061K057R08k378L5K499j401
$$ -1121 1378 482 -1511 293 1518 -535 -951 1505 443 -1618 439 1347 -1031 -996 1503 102
3616A02j936K295P80k573J48K427j214j548K081R89k707P19K436k010j623K408
$$ 102 -1834 461 1241 -1332 -1184 1243 29 -1519 562 1551 -1156 -437 1999 -11 -1634 774
3632G74L68k356P02K368k185j460K677P7l051J316K309k091p72K286rk497J634
$$ 774 1142 -1214 -512 1856 -329 -1789 888 965 -2086 -770 1539 -552 -1324 962 953 -1544 90
3649I0J758k509o65K731m12k590J621J639k745j65K359r17k418K417J144k295
$$ 90 1848 -661 -1326 1405 993 -1597 24 1663 -1082 -1247 1112 195 -2223 194 1338 -957
3665i57k55K641j259j670J824J110k740P31K651j871j757K438O17k886N71K340
$$ -957 -1212 1429 170 -1500 324 1434 -1306 -575 2076 205 -1552 886 1503 -1383 -812 1528
3681A528j842j546K920K13l163J089K502k036j376K948k64k611J480K407k604
$$ 1528 -314 -1860 1060 1273 -1890 -801 1701 -335 -1711 1237 973 -1638 -158 2249 -355
3696c55j039K928o33k542J759J404k521n61L194j039k648K068J332k237n81K833
$$ -355 -1394 1534 901 -1641 118 1522 -999 -1560 1634 595 -2053 15 1347 -890 -1471 1362
3712A362r05k212K283J166k867q8K791r37k471K491Q20k790Q68K216j723k078
$$ 1362 457 -1755 528 1694 -1173 -1261 1530 593 -1878 613 1433 -1357 -489 1727 4 -2074
3728b074K590P88k697P33K212j794j401K647L20k943J017K143j779j025K343k63
$$ -2074 516 1304 -1393 -660 1552 -242 -1643 1004 1324 -1619 -602 1541 -238 -1263 1080 817
3744H17j994P98J904k225j206L294k64k525J130J513k013m32K448q09k156J766
$$ 817 -1177 -379 1525 -700 -1906 1388 1124 -1401 -271 1242 -771 -1203 1245 436 -1720 46
3760D6J779k398n36K351r98k071K396J024k746O7K707j498j524J978N34k489K57
$$ 46 1825 -573 -1109 1242 244 -1827 569 1593 -1153 -1086 1621 123 -1401 577 1111 -1378 -1121
3777a121K435j292j463K353K83k404O07J824j348j325K391K24k244P78J685j439
$$ -1121 1314 22 -1441 912 1195 -1209 -602 1222 -126 -1451 940 1164 -1080 -302 1383 -56
3793e6j186K071j85k052J194J891k125o42K222j51k545J458J249j790j70K059
$$ -56 -1242 829 644 -1408 -214 1677 -448 -1090 1132 981 -1564 -106 1143 -647 -817 1242
3809A242k50k384J178J689k261l15K113q65j342J736P76k334J92J915o55j690
$$ 1242 992 -1392 -214 1475 -786 -1101 1012 147 -1195 541 1317 -1017 -825 1090 435 -1255
3825a255J367J009j900N87J893j717j789K152O68j884M32J279j095r74J899M9
$$ -1255 112 1121 -779 -192 1701 -16 -1805 347 1015 -869 -437 842 -253 -1227 672 721
3841G21j854M42J936j209r81J989m08j245N70J059j126j132K098k95j305O16J127
$$ 721 -1133 -691 1245 36 -945 1044 636 -609 -39 1020 -106 -1238 860 565 -740 -124 1003
3858A003j260m06J329k42j523J109J039j477N4J097n05r81J072O80j475j10J462
$$ 1003 -257 -663 666 424 -1099 10 1049 -428 -374 723 218 -763 309 989 -486 -596 866
3875H66n55j136J166%j226M86J218p16r75J042P69j241k87J266o81p08J208K91
$$ 866 311 -825 341 341 -885 -399 819 103 -872 170 939 -302 -589 677 -4 -712 496 787
3893G87j388N92J116r76r38J056J80j134Q18N85j015n47J381k50j069O59N07n16
$$ 787 -601 -9 1107 131 -807 249 429 -705 113 698 -317 -864 517 267 -802 -143 364 -152
3911a52n07J099k79n08N09M50o04m71P10o6o26L71O42q76m3O69k78o32K26M92
$$ -152 -659 440 161 -347 162 612 8 -463 247 181 -445 -74 568 -308 -351 318 40 -592 -366 126
3931A26k87j54O56n6o39L65M28p65N2Q17l69j14J21k5n42J07K61R1m32L35J18
$$ 126 -161 -315 341 285 -354 11 439 -326 -274 543 174 60 181 156 -386 -279 -18 73 -359 -24 94
3952I4m79L32L40l70j16J54L05l75J25J96m6J5Q6j66Q1j53K91r8l41J41J37m28
$$ 94 -385 -53 287 -83 -199 -45 260 -115 10 206 160 175 261 95 176 23 314 216 -125 16 153 -275
3974b75J88J10k4k04L2J47K11O5k37q9K37j79J13m3K28l05o2R2jl7q5r4o9M67
$$ -275 -87 23 -1 -205 -173 -26 185 250 13 -76 161 -18 95 52 280 -25 -87 5 4 -33 -118 -212 -281 186
3998A86m55K11k5L51l74J83J32o6j84M7L73n35n5K82l7l96L55P0k56J64K53j82
$$ 186 -269 -58 -83 268 -106 77 209 143 -41 6 379 -156 -211 71 34 -362 -7 63 -193 -29 224 42
4020D2l75L80K94m16Q6L84l25k57M37L17p72n8O37l97l46O49o8m99M55P9n17N3
$$ 42 -333 47 341 -75 11 395 70 -187 250 567 -205 -263 374 -23 -369 280 212 -287 168 247 -270 -217
4042b17P07k82m12K19M31n37l12P03j74o21P04N02j108J7N92k72k86N76J66p24
$$ -217 490 208 -204 15 446 -91 -403 300 126 -495 209 711 -397 -380 212 -60 -346 230 396 -328
4062c28J83O57o07p8K08K43q22K76J022r28k35Q65R1q17L24K88m10l57O73Pq24
$$ -328 -145 512 -95 -173 35 278 -544 -268 754 -174 -409 456 547 -270 54 342 -68 -425 248 255 -569
4083e69K85J028r31l49P09k24n82O49Q87j004n11J070J6r33N56N67r75J50P86
$$ -569 -284 744 -187 -536 173 -51 -633 16 903 -101 -612 458 474 -459 97 664 -311 -161 625
4102F25n32q46P69L92p82k48J000l59n17Q38N9j267L29J198m77n47O12K8p53N49
$$ 625 93 -753 16 408 -374 -622 378 19 -498 340 399 -868 -539 659 182 -365 247 275 -478 71
4122G1N95q51n63R77N84j456L26J028j095j62Q64n1j157P52R62j140j69J007r9
$$ 71 666 -185 -748 229 813 -643 -317 711 -384 -546 318 267 -890 -138 824 -316 -485 522 423
4141D23r48O00P39j221l29J440j69q27J62O31p88m24J082m51p54Q65Q57j065m95
$$ 423 -525 75 814 -407 -736 704 535 -292 -130 501 -287 -711 371 -80 -834 31 888 -177 -672
4160f72J474o97m68P78J10j320M46R89l68j313J240L83r56j40J240p17r62J436
$$ -672 802 105 -363 415 525 -795 -349 640 272 -1041 199 582 -374 -514 726 9 -953 483
4178D83L15j486K64Q10n11m73J187J3q79K27Q24o79o56J071k50j131Q03Q64j388
$$ 483 798 -688 -424 386 -125 -598 589 602 -277 -50 774 95 -561 510 260 -871 -68 796 -592
4197e92m5J353m04j087O63N59q03k5R19l28r66Q45J013j302j89R87n22n86N16
$$ -592 -637 716 312 -775 -112 447 -356 -381 538 210 -756 89 1102 -200 -389 598 76 -510 6
4216FO17j395L60J276q05o16Q92N51j269M95J033j040q60J211N1p76J26J005r99
$$ 6 623 -772 -412 864 59 -557 335 886 -383 112 1145 105 -755 456 507 -269 -143 862 -137
4235a37l37P08K43j300N40R79j176k70J344j41j238Q47N36j045j74J143l17q77
$$ -137 -474 234 477 -823 -283 696 -480 -750 594 453 -785 62 598 -447 -621 522 205 -672
4253f72P84O64r73l04J098o29q18J000M05j067l52J556n12j013J015L67j331L77
$$ -672 112 776 -197 -501 597 -32 -850 150 555 -512 -864 692 180 -833 182 549 -782 -405
4271d05R51m39p29R66L42j215K14J048p58n86J020N7j130J72J031p23l97Q13L27
$$ -405 546 107 -622 344 686 -529 -315 733 -25 -611 409 466 -664 -492 539 -184 -581 232 559
4290E59j251K92P93l88p16J036q1p40L61P05r58k06J210l59q76O57M08o47n42
$$ 559 -692 -400 393 5 -711 325 244 -496 -135 570 -388 -594 616 257 -619 38 446 -201 -743
4309g43J094l55o85M72O32p67n4Q97k26o69L77O64r04j0O63k25q62P93L57q11
$$ -743 351 -4 -689 -217 415 -352 -406 491 265 -404 -27 637 -267 -277 386 161 -701 92 449 -362
4329c62O0P03l12o44P09M49j233M17R79o14n09O87N1n34M00K34k90p86P68n3o10
$$ -362 -302 401 89 -555 154 603 -630 -213 766 152 -357 330 381 -153 247 481 191 -595 173 120 -490
4350d90L52M47l88o24Q65j08o14L77O67q71J96N74j51m62L49L43o21k91O52k25
$$ -490 -138 309 -79 -703 162 54 -560 -183 484 -387 -191 383 232 -230 119 462 -159 -450 202 -23
4370b3l99N29M89q16K6M79k78m19L81L32n06k97R86m56k78N03N2n37J57M55l34
$$ -23 -422 107 596 -220 -194 285 7 -412 -31 301 -205 -502 484 28 -250 253 305 -232 -75 380 46
4391D6l96M63L91q17J48J92%k54N83N6r05K29O32l54j91K66K76n79M25J04l64
$$ 46 -350 113 504 -313 -165 27 27 -227 356 412 -493 -264 368 14 -177 89 365 -214 211 315 -49
4412d9R3J92j3m88K34J8j95J3L76o4o69O16O7l73j00P24m28J06J05k0l69J04K37
$$ -49 44 236 223 -265 -31 -13 -208 -195 181 117 -552 64 131 -242 -342 382 -46 60 165 145 -224 -120 117
4435A17j52k9Q2J19m07K01J82k36j85O9k8J31P4K48m8j39M6k3k69L38J68l31P2
$$ 117 -35 -64 18 137 -270 -69 113 -123 -308 -239 -267 -136 -62 186 138 -1 45 22 -247 91 259 -72 0
4458@K25k95j40J74J11j47j14K93p4q8J50k4P8k10J20o1J12M30n91J46l22K41
$$ 0 225 -70 -210 -36 75 -72 -186 107 33 -55 95 71 149 -61 59 -2 110 540 -51 95 -227 14
4480A4M2K0j46J67k67L43N1k17J21l5l6j23p4l9j0K62J89m03J21q2J75k9k23K95
$$ 14 56 76 -70 97 -170 173 224 7 128 93 57 -66 -140 -179 -189 73 262 -141 -20 -102 73 44 -179 116
4504A16M6r5o4J45j40P5j21P2n04L87L6k81L28K7q9j8K42J68k76K00l83K95l78
$$ 116 162 67 3 148 8 83 -38 34 -470 -83 -47 -328 0 27 -62 -80 162 330 54 254 -129 166 -212
4527b12K94l59N10l35l39K45K65j38%k9q39Q29OJ54p4q81Q80j02L20M28q96M23
$$ -212 82 -277 233 -102 -441 -196 69 -69 -69 -98 -937 -108 -102 52 -22 -903 -23 -125 195 623 -273 150
4549A50m06J009j107N39K50l15k06J75NM5q0j65J43K6N3J14r8k15K26J99o14J17
$$ 150 -256 753 -354 185 435 120 -86 89 94 139 59 -106 37 63 116 230 132 -83 143 342 -272 -155
4571a55J85j12j98J37J00k11L5N28n51K06l64L38k35M65P4m8l70L39Q0n24n6L29
$$ -155 30 -82 -280 -143 -43 -254 -219 309 -242 -36 -400 -62 -297 168 242 194 -176 163 243 -281 -337 -8
4593hj88k32Q13n48n4K11J63j08l82K73O0k74J73P9k18L59j8ol49M57Qj30o25
$$ -8 -196 -428 385 -163 -217 -6 157 49 -333 -60 0 -274 -101 -22 -240 119 101 95 -254 203 211 81 -544
4616e44P16o2j96J87K00p82J17P53n57j04O3M30n77L52L66l81l66O90K8n28L30
$$ -544 172 110 -86 101 301 -481 -364 389 -168 -272 -209 221 -356 -4 362 -19 -385 305 333 -195 135
4637A35K43l75l35P20k61m75K73J55j86l02P92r9l15N7N6o45L90o34O51jm72J037
$$ 135 378 3 -332 388 127 -348 -75 80 -106 -408 384 285 -30 27 83 -562 -172 -806 -155 -156 -628 409
4659D09n63n11O88O48m31o02O76l23m03P91m41J84L0K73o55K20N43m01l58mL90
$$ 409 -154 -665 23 671 240 -362 314 -9 -412 379 -62 122 152 425 -230 -10 533 132 -226 -230 160
4680A60n08K43P89p75o1M31j18m64k6O27l08l96Q33j50m78K04K33l05l78O89j54
$$ 160 -348 -105 684 -91 -152 279 161 -303 -329 298 -10 -406 427 277 -201 3 236 -69 -447 242 88
4701H8k73J88N54n26l18P30k69l15n9K26j39q5O03l27n20L12L77o39K64N20j41
$$ 88 -185 3 557 31 -287 443 174 -141 -200 26 -113 -198 405 78 -442 -130 247 -392 -128 392 251
4722B51n52N52j50l79P8P13o01m02K59O29n53M4M21l11m00N19L68q01J70M31k16
$$ 251 -301 251 101 -278 -200 513 -88 -490 -231 398 -155 -111 310 -1 -401 118 486 -315 -145 286 70
4743G0l14O79o3j80l24M70k51j61L06K89p37m11Q46j201q8J043M06q10j07P24
$$ 70 -244 435 372 192 -132 338 87 -74 232 521 -216 -627 219 -982 -1070 -27 379 -431 -538 186
4763A86J89k12n42J005j260R27k78k31N8R4J02p60N42K6J06j9q2P65l70k77K03
$$ 186 375 163 -379 626 -634 293 15 -216 -158 -64 38 -722 -180 -154 -48 -67 -149 616 246 -31 172
4784A72j437N54J071J27j052L37M46q93N98J12N8k04L20K41q34M01J30l82q8L78
$$ 172 -1265 -711 360 487 -565 -228 218 -675 -77 35 93 -111 209 450 -384 17 147 -235 -323 55
4804E5L6n77M63Qj36j34M84k5l44k60P65l34k2K99j92k10K29O3n31j28K03M62
$$ 55 91 -486 -23 -15 -151 -285 199 174 -170 -430 335 1 -21 278 86 -124 105 168 -363 -491 -288 174
4826A74n41M20J41m27p5O25j48n21L92M48m91k4Q0J67n12L83K59m85k52N22j9
$$ 174 -367 53 194 -233 -308 317 169 -352 40 488 -3 -27 53 220 -292 91 350 -135 -387 135 116
4847A16k63J49K30l41n5K18M4m71M32K21l61o1N05n74K95P7j5nk65Q6m3L27l56
$$ 116 -147 2 232 -109 -164 54 98 -373 59 280 -81 -142 363 -211 84 161 146 141 -124 -38 -81 246 -110
4870a10R7o8NK77j99j28K63J48n71M5K39K30l32L32j54m06J36K99j53j65K45J26
$$ -110 -13 -81 -76 201 2 -126 137 285 -286 -241 -2 228 -104 228 74 -332 -196 103 -50 -215 30 156
4892A56k10K74R8l13n5L51j90l94M29j90m4j53N59m02j96L57qk37n3K04m7k09
$$ 156 -54 220 318 5 -50 301 111 -283 146 -44 -88 -241 318 -84 -280 77 69 -168 -221 -17 -64 -273
4914b73L87Km50N26n7k69J83jl2o1R5j2j41J68J86k84R4K92m17J2J62j1j45j80
$$ -273 114 116 -334 192 135 -134 49 48 16 -45 50 38 -103 65 251 -33 61 353 -64 -52 110 99 -46 -226
4938b26K73J99j96j72K58k73K33M4J1j81N9J14L8k78K79j18k80J84O0J83k44K06
$$ -226 47 246 50 -122 136 -137 96 140 151 -30 29 143 181 -97 182 64 -216 -32 28 211 -33 173
4960A73l2l85K42j08jK52Jkl48Q0K98j61J92n8J3j43L9k29K88m11K09J51j70R2
$$ 173 141 -244 -2 -110 -111 141 142 140 -208 -128 170 9 201 143 156 13 52 -177 111 -300 -91 60 -110 -18
4984a8J57j76O5j65K58k55L46l6k34j39Q2K54j11j1Rj6k16L88j63K5L9M5l97M24
$$ -18 139 -37 28 -137 121 -134 212 176 -58 -197 -115 139 28 17 26 10 -206 182 19 44 83 128 -269 155
5008A55j01j22J71mj73K03n6M8K0j1j51j67O6J49L3l1j57J44j64k88N22j83J81
$$ 155 54 -68 103 99 -74 129 73 121 141 130 -21 -188 -122 27 60 29 -128 16 -148 -436 86 -97 84
5031H4l9j49M6L01r4j73j5K08j62O2k01K27p2J14r2k87J16J30M2k68L9J96M8Q
$$ 84 45 -104 -58 243 149 -24 -39 169 7 69 -132 95 23 137 45 -242 -126 4 46 -222 -183 13 61 69
5055F9L6l1j08j11K56j69P5p4q5j2J38J7N8j76L00j25k2p6QJ39j29N7j01Oj29
$$ 69 105 74 -34 -145 111 -58 17 -57 -142 -154 -16 1 59 -117 183 58 36 -40 -32 107 -22 35 -66 -60 -189
5080a89K32L33o16L26k72K85j65N7j69J91J23K5k25J87r6n7r6L14j75j45M22l12
$$ -189 43 376 -240 86 -186 99 -66 -9 -178 13 136 161 -64 123 27 -30 -126 188 13 -132 290 -22
5102b2j20P8L04m8m68O23l16k19J64J59j85M8J73j22k39J88J1o7L17k10N8j13
$$ -22 -142 -64 240 192 -276 347 31 -188 -24 135 -50 -2 171 49 -190 -2 9 -58 259 49 107 -6
5124fK19o7l38K03N35m52k34k5K73m04K49o0n7j95N30k5j19j12K64k1l03L20o8
$$ -6 213 146 -192 11 546 94 -140 -165 108 -296 -47 -107 -164 -359 171 146 27 -85 179 158 -145 175 107
5147A07k57L82m8m43l4M34J33m52K52j27k24P7L38J73o00J83J64l08J52J54j70
$$ 107 -150 232 184 -259 -293 141 274 -178 74 -53 -277 -200 138 311 -289 -106 58 -250 -98 56 -114
5168a14j46M00P8k25j28J69L3m09J46L04l95P7L29k52r5J86J21j93j83Q46p62
$$ -114 -260 140 218 -7 -135 34 67 -342 -196 108 -287 -210 119 -133 -228 -42 79 -114 -297 549 -213
5189b13j23N10m5k68K69j22J9l8N1K84o00K40J29k44J12J65k7m43K89J83j29M3
$$ -213 -336 174 129 -139 130 8 27 -11 40 324 -276 -36 93 -151 -39 126 99 -344 -55 128 -1 42
5211D2J32j70q5J86j19P0k36O40k90l63L93j21j60k40M86Q0l48o7M29m53kL74
$$ 42 174 4 -81 105 -14 56 -180 460 170 -193 200 79 -81 -321 165 245 -103 -170 259 -194 -196 178
5233A78K79o61L73L99o80J36K39m36j41O37l32j39p8M42l06k18J41L07j83J55
$$ 178 457 -204 169 568 -112 24 263 -173 -314 323 -9 -148 -226 216 -90 -308 -167 140 -43 112
5253A12N4p2m22O20m47o0L51k44J11PP4l4k40K39J74m97O9M16Qm85J07N47o45
$$ 112 166 94 -328 292 -155 -215 136 -108 3 10 84 50 -190 49 223 -274 -205 211 219 -266 -159 388 -257
5276b57J43M9N9j93K93K04n13K7P14j86n74L73J17j88j08J99l4m05K92M9m5O6
$$ -257 -114 -65 -6 -199 94 298 -215 -188 526 340 -234 139 256 68 -40 159 125 -280 12 61 16 82
5298H2Q9l32p5M95o1k70j25N13l31k74L96J7l63PK31J72l22L01J2m58K97L07m17
$$ 82 171 -161 -236 259 198 -72 -197 316 -15 -289 107 124 -239 -232 -1 171 -151 150 162 -296 1 308 -109
5321a09r3O37m71l09N03O3j25k88L43J69k58J20k2k46J38O2k49j09L80j19j17
$$ -109 -202 435 -36 -345 158 221 96 -192 151 320 62 182 160 -86 52 114 -135 -244 136 17 -100
5342a00k41O19j61k61J93P0l87O51k54J07j28r5J68k59m8K76j91n0J58Ol73K63
$$ -100 -341 278 117 -144 49 119 -268 383 129 236 108 13 181 -78 -126 150 -41 -91 67 73 -300 -37
5364c7L95k5o53L55J03m67L57P0Rl15K33j23J88j51M32n07n6Q1j14J79k77J42
$$ -37 358 333 -320 35 138 -329 28 98 107 -208 25 -98 90 -61 371 -136 -192 -111 -225 -46 -323 -181
5386a81O0j82N96k41l64N94j02k41N7L12l18K4J50P4j56m17P12l81j13K15j49
$$ -181 -121 -303 293 52 -312 282 180 -61 -4 308 -10 14 164 238 82 -335 377 -4 -117 98 -51
5407e1k4M0M22l70o7M6R2p4R5k4l2k72J64kk6J22m5k8m0J34j48R3K78n8k34m8
$$ -51 -75 -35 387 17 -50 -4 88 14 109 85 53 -219 -55 -57 -83 39 -6 -34 -74 60 -88 5 283 225 -9 -57
5433e7P3m8k12L17J35q7M4j79R2k36L60k41j77j31O49m1m66K49O9L8k66J12K0
$$ -57 16 -32 -244 73 208 121 165 -14 78 -158 202 -39 -216 -347 302 261 -205 44 113 151 -115 -3 17
5456A7J21l50P99l50m01M36k62k26J70r0l3K43n7l7lP3P0p8L1K87l93j01J77j11
$$ 17 138 -212 587 237 -164 272 10 -216 -46 -136 -169 74 17 -20 -23 50 120 42 73 360 -33 -134 43 -68
5480f8Q0j69K38r7RP7l8k40J63J7j17Q4N17m39J9M9k30J30R6L6l6j8Mj06K11n0
$$ -68 12 -157 81 -16 -7 70 32 -208 -45 -28 -145 -61 456 17 36 85 -145 -15 81 117 81 63 67 -39 172 122
5506A22J72l34J53nj37N0k50K15J01j88J88k15O7K28l4q7J76q1N0j56K11q3l40
$$ 122 294 -40 113 108 -29 21 -229 -14 87 -101 87 -128 -61 167 133 46 222 141 191 35 246 163 -177
5529a77L37l72J25p6j7M20j70j03J18j57J96k16j38Q0L40k15N8J92m3k38K56k88
$$ -177 160 -212 -87 -163 -180 240 70 -33 85 -72 124 -92 -230 -150 190 -25 33 225 182 -56 200 -88
5551h8p0j78N29k13j5j40M7k41M17k4L5L3k07J16m34M11K74O4l40j37L91k93K6
$$ -88 -158 -336 193 -20 -35 -175 -128 -369 48 24 59 92 -115 1 -433 -22 252 316 -24 -161 230 -63 -37
5574c7J75l11K81J29j42nJ57l53K86m24N1L61l7k02M50l24k5J57J7l5k48R6J40
$$ -37 138 -173 108 237 95 90 247 -106 180 -244 -193 168 131 -71 379 55 30 187 204 169 -79 17 157
5597A57j90p1K25l40J62K03l20K18j27N9j66K11K52l09J31P1j75j03L63Ql25J19
$$ 157 -33 -104 121 -219 -57 146 -174 44 -83 -24 -190 21 273 -36 95 166 -9 -112 251 259 -66 53
5619E3m4M2k2J32j70l69L22Q5j10k22L36j40J48r0J11kn8K33k63j42J34K00l98
$$ 53 9 51 29 161 -9 -378 -56 29 -81 -303 33 -107 41 -49 62 60 2 235 -28 -170 -36 164 -234
5642b34m1O2J81q3J92M8k89J55j3j43J41%L15m13M9nK90l08J32L76p59K66J20
$$ -234 -275 -213 -32 -115 77 125 -164 -9 -22 -165 -24 -24 291 -122 -73 -78 212 -96 36 412 -347 -81 39
5665C9j79J48J05J18n46K01L66k05k72K56M4k71N9M45l79k3K43R6m36K14P5k31
$$ 39 -140 8 113 231 -315 -114 252 47 -225 31 75 -196 -137 308 -71 -94 149 245 -191 23 98 -133
5687a33J58K18l32J38L02l78J74n06M55n9l5k7J03j68k86N64j73O3j5J5l86K01
$$ -133 25 243 -89 49 351 -27 147 -359 96 37 2 -25 78 -90 -376 188 15 78 63 78 -308 -107
5709a07K70R6l24MK06r5p9J39m5l75L42K23m15L5N38j85m04N37j58r8k22K52J39
$$ -107 163 259 -65 -61 145 50 -29 110 65 -310 32 255 -160 -125 413 228 -176 361 203 105 -117 135 274
5732B74n72K15J23LK56R8n01k21K90k08J84J76K16l55k21M25j54r8L6K39k28k14
$$ 274 -298 -83 40 43 299 397 -104 -325 -35 -243 -59 117 333 -22 -243 182 28 -70 -34 205 -23 -237
5754b37M24J00l49nL16l27P2K96q1n28K74J81k75j63P92m40j42K42n8k15K0J73
$$ -237 187 287 -62 -67 249 -78 -6 290 209 -319 -45 136 -139 -302 490 50 -92 150 92 -123 -103 70
5776G0K40n74L22o0o2N2K86k27k92N26j98Rj26J54m44NM88K49m28n5K23j15j15
$$ 70 310 -264 58 -2 -64 -12 274 47 -245 281 83 92 -34 120 -324 -319 169 418 -10 -65 158 43 -72
5799g2K16k56j02R8L03k74j89M40m2o27L97L89m15K21Q9q5j22l0k6j20K29P2j65
$$ -72 144 -112 -214 -116 187 -87 -276 164 122 -505 -108 281 -134 87 176 91 -31 -61 -87 -207 22 94 -71
5822g1k10M17Mk56R7k2q5k10M84J28n90K83M69o87R0K30K84n29K05R9l56r8N16
$$ -71 -281 136 140 -116 -19 -41 -126 -336 148 276 -314 -31 438 -249 -159 71 355 -174 31 130 -226 -324 192
5845A92k27o4M3RJ34l35K98p8k23K0M59n24J68M55l25j25j35Q25o86j6M98j67
$$ 192 -35 -99 -56 -47 87 -248 50 -28 -251 -231 228 -296 -128 327 2 -123 -258 567 -119 -135 363 196
5867A96k00L8J57m40K18J42j52k32K51K69p39O27L49m04m16M01j2j89j36K09K3
$$ 196 -4 34 191 -249 -31 111 -41 -273 -22 247 -492 135 484 80 -336 65 53 -136 -272 -63 -40
5888d0j21J86J69o58M81K03p2k17J47l4K3k49M86m03m8J29J09k74J12K81k71k50
$$ -40 -161 25 194 -464 17 220 148 -69 78 44 67 -182 304 -99 -147 -18 91 -183 -71 210 -61 -311
5910c11K68N20n85K75l9l24J33K18k18n6K69q5m9l0K47Nl50qp8p2L88J15k59j68
$$ -311 -43 477 -108 167 128 -196 -63 155 -63 -119 150 65 16 -14 233 238 -112 -120 -198 -270 118 233 -26 -194
5934a94N74j98l27%L91k37m09L82P9j56N1L45k21j99M37j06l93N0J83K2k4J98
$$ -194 380 182 -145 -145 246 9 -400 -18 61 -95 -44 301 80 -119 318 212 -181 -131 52 74 50 248
5956B48m59J21N8P6n03K68J27J50j25n1J50K92m30J10j23j18L63l06j57J17L37
$$ 248 -211 -90 -32 44 -459 -191 -64 86 -39 -90 60 352 -78 32 -91 -209 154 -152 -309 -192 145
5977A45j75k38L21j20p4K74n4j23k75K46J04j19q8N27l83J44j05L9l38L02J95
$$ 145 -30 -268 53 -67 -141 133 79 -44 -319 -73 31 -88 -176 351 -32 112 7 46 -292 10 205
5998B05r5l45M64p7l50p1K73m5l04L60l2N8R8j28j67J17J32J69n84M21n2j39l02
$$ 205 110 -235 229 152 -198 -269 4 -41 -345 15 -17 41 139 11 -156 -39 93 262 -322 99 47 -92 -394
6021c94L70K22j89l7J94k54K25j6K6R3l06J75p8n5M7N9m21L92j00J97k53J11J85
$$ -394 -24 198 9 -28 166 -88 137 121 147 240 -66 109 31 -24 23 82 -339 53 -47 150 -103 8 193
6044A93j89Mr6K10k88L73k2m52J99L27l68L84l22Q4NJ40J53m20r6q9K80K09j63
$$ 193 4 8 -88 122 -166 207 185 -267 -68 259 -109 275 -47 37 42 182 335 -85 -181 -270 10 219 56
6067E6J04r1r0Kj11PL7L92k95j98J43J2l2J09m6j49M06k78O1L1k37M13k00n4P9
$$ 56 160 69 -21 -19 -130 -123 -86 306 11 -187 -44 -32 -64 45 -1 -150 256 -22 39 70 -167 246 46 -8 71
6092G1j50N1L6m5J38j78P9KJ88p3n1j94J37N0M3Qk84M56k34j08q9K06R6k74J87
$$ 71 -79 -28 8 -37 101 -77 2 4 192 119 68 -126 11 61 104 112 -172 284 50 -58 -147 59 155 -119 68
6117F8j1k01N0K04l9j72K89p1j54J02q8o0k4J13Q4k95L41K1m31N7J25K23kj48
$$ 68 57 -144 -94 110 71 -101 188 117 -37 65 -23 -83 -107 6 90 -205 136 157 -274 -217 -92 131 129 -19
6141a9L4j74j5J81q7K7K58O0J5m23L01J15k66J50M7j80k4K30j28j58j70O21k17
$$ -19 15 -159 -174 7 -80 -53 205 265 280 -143 158 273 7 157 204 24 0 230 102 -56 -226 395 178
6164A78j99m5K29l48L18J13l57k5j49K38k39N63l86M1j59R2K91k74j21L29k68
$$ 178 -21 -66 163 -185 133 246 -111 -136 -285 -47 -286 277 -109 -68 -227 -135 156 -118 -239 90 -178
6185a78K48K29l26N5k40L44l36J90J97j14l04K12j14l67N91J58k00j82J04n0p
$$ -178 70 299 -27 28 -212 132 -204 -14 183 69 -235 -23 -137 -504 87 245 45 -137 -33 -83 -90
6206i0J34L63m52q9K37k18m32L82M07J8l01L98m16K8n2L88n42r3M58n4m05M34
$$ -90 44 407 -45 -134 103 -115 -547 -165 242 260 -41 357 -59 -31 -83 305 -237 -330 128 74 -331 103
6228A03L8n23J54K62N7r8K79J40m58rK11k70J88J78K87r85M25j2j35p0L76q9k66
$$ 103 141 -382 -228 34 91 -7 272 412 -46 -55 156 -114 74 252 539 -446 -21 -33 -168 -238 138 49 -217
6251b17J60L61m14j45J52J12k63J66L95m57rL20j06m25M25M03k97j31o3J24m43
$$ -217 -57 304 -110 -255 -103 9 -254 -88 307 -150 -159 161 55 -370 55 458 161 30 -33 91 -352
6272c52J04N23o49j1N07O2m18K17L88m20K0J84o1k72K49K49m94J63J76m8j69r0
$$ -352 -248 275 -374 -385 122 184 -234 -17 371 -49 -29 155 94 -178 71 320 -174 -11 165 117 -52 -142
6294a42J80M9j60L40k18n03M83L07m76N7L45l10k48N85j08k20Q5nj28m34P16l68
$$ -142 38 87 -73 267 49 -454 29 336 -140 -83 262 -48 -296 289 181 -39 46 41 -87 -521 195 -173
6316a73P3J62M39o38J24J04m2k93L03RO9l6K1k4k98J86J66j63j33M81l79p9K36
$$ -173 -100 62 501 -137 -13 91 49 -244 59 68 137 101 122 98 -200 -14 152 -11 -144 337 -42 -121 115
6339A15K48k98k0J6j3j04k9J74k80K32K93m53l7K17K37k12k19M65l67l56M66J35
$$ 115 363 65 45 61 48 -56 -85 89 -191 41 334 -119 -156 61 298 86 -133 332 -35 -391 75 210
6361B10o20N85J45l89J66R7l6l46M4M96m69J16N1J50m43J32M24l17J4K61k53m30
$$ 210 -410 175 320 -69 97 194 158 -188 -144 352 -117 -1 50 200 -243 -111 313 -4 10 271 18 -412
6383d12N51J05p2q8K73p2k74K3n7P5K2J73j15j39J2K90l36j72O16n47l87N62J28
$$ -412 139 244 172 84 357 285 11 34 -23 52 74 247 132 -7 5 295 -41 -213 403 -144 -531 31 159
6406A59l79P6M30j07m74L47Q5l09K91Ok08m4L86m9m35N7M68n26j84O04jm38J24
$$ 159 -220 -144 286 179 -295 52 137 -172 119 125 -83 -127 259 210 -225 -168 300 -226 -410 194 193 -245 -121
6429a21J9l0r9L19J3l32J95M7l14J26O3M19m97K71Kl11J33M33k97k25N55l30j33
$$ -121 -102 -132 -231 88 101 -231 -36 11 -303 -177 -114 305 -192 79 81 -230 -97 336 39 -186 369 39 -94
6452i4M8K02K0m90K80M05n78M15P4k32j68M76J84n96J24r9o8J69m1J29l61M3K24
$$ -94 -46 156 176 -314 -34 371 -207 208 282 50 -118 358 542 -54 70 -29 -97 72 31 160 -201 -158 66
6475F6R7l6m49N25l46J00j05j16n9N27l06J84j94L1O7J99N5K1l27k53L01l2p1
$$ 66 163 127 -322 203 -143 -43 -148 -264 -323 204 -102 82 -112 -81 -14 185 240 261 -66 -319 -18 -50 -121
6498a21J15J34j05L1q0n1O4K17k53M8k30L45r9K2J37J98l48J19k50N6J61N2j65
$$ -121 -6 128 23 54 -26 -77 -13 204 -49 -1 -231 114 15 37 174 372 24 143 -107 -51 110 162 -3
6521cl05L09L41k47k14J22k22K49J40l25Q6r7L30j36j84N12n21oK00K43j92J23
$$ -3 -308 1 342 95 -119 3 -219 30 170 -155 -69 -166 164 28 -156 356 -165 -171 29 272 80 203
6543B03j90j64M67k17n5R2k70K4K52k86J34L05n74J85L93m05P1kO4j26J47k12
$$ 203 13 -151 316 99 44 136 -134 -110 142 -144 -10 295 -279 -94 299 -106 -35 -37 27 -99 48 -164
6565a64j94K63k27O96l91PJ98K10k48k47j29M07k5O5l02J24P1n4o4K76l16N2k24
$$ -164 -358 -95 -322 374 -17 -10 188 398 150 -97 -226 181 156 221 -81 43 114 60 -4 272 -44 8 -216
6588b16L77k14k18J76J10J95m49J44k01q2L83R5J4j99J64k23K84j60j43L94k42
$$ -216 161 -53 -271 -95 15 210 -239 -95 -296 -378 5 100 114 -85 79 -144 140 -20 -163 231 -11
6609a1j74K67n1R7P5k9N5n31N17j66n8l1l2J52o3J77k36K44l53K14J01j74k6R5
$$ -11 -185 82 31 128 203 174 229 -302 215 49 -9 -40 -72 80 17 194 -42 202 -151 63 164 -10 -36 59
6633E9n1j72K25Km5l70M60j09K26m23L05k32Q8J05j49k31M60j32n3L62m35q3J19
$$ 59 8 -164 61 63 18 -352 108 -1 225 -198 107 -125 -37 68 -81 -312 148 16 -37 325 -110 -193 -74
6656g4J05M4n8j59K40k47L69L2n03J58K11k45R3N7M8l82K88JJ43k3l13O07l62
$$ -74 31 75 17 -142 98 -149 220 252 -251 -93 118 -127 -34 23 71 -311 -23 -22 121 98 -215 392 30
6679C0j47M20m91j74N64K05o97Q3J90j73J76j7Qp0o1L13o5j43j36M23k03R2k12
$$ 30 -117 303 -188 -362 202 407 -290 -207 -17 -190 -14 -31 -23 -93 -154 159 94 -49 -185 238 35 127 -85
6702h5qj2J14qk43L00L38m06J13j33J51k47P7J26q6j35j96N50l83jP0L42k12J0
$$ -85 -93 -105 9 1 -242 58 396 -10 103 -30 121 -126 -49 77 -9 -144 -340 210 -173 -174 -104 238 26 36
6726C6K78k95N1J19k26k58O2K94j3q3l21K07M1J18j5j80j75K52j4K15Q2j53k42
$$ 36 314 19 70 189 -37 -295 -233 61 48 -35 -356 -149 -108 10 -5 -185 -360 -108 -122 93 175 22 -220
6749b20M13J79m73oN42m38j00R1L8q5J0M31n14j14L12k9j91K54q1k23L63l01K62
$$ -220 193 372 -101 -107 435 -3 -103 -12 26 -59 -49 382 -132 -246 66 37 -154 100 19 -204 159 -142 120
6772A20l30p0N19l38k8K97J57n11M5K5J84j96o8J35n4L02j0k47k40P21m39j44
$$ 120 -210 -280 239 -99 -127 170 327 -184 -139 -114 70 -126 -194 -59 -113 189 179 -68 -308 413 -26 -170
6794a70K72o9k53l0O36l96k6L87N0m69j68M89k02k67L45K9m40K72N56o38l36P52
$$ -170 102 33 -220 -250 386 -10 -36 351 401 -68 -236 253 51 -216 129 158 -282 -10 546 -92 -428 324
6816C24k46m2j02K09m4k81N46N1m42k64N73k68k22N35K4n25N2K95k70l20O87r1
$$ 324 78 36 -66 143 99 -182 364 415 -27 -291 282 14 -208 327 351 -174 -122 173 -97 -417 270 179
6838A79n68K86L20j21j76L89k33l65L05Q9j52l0L66l76p0l1O35n00P5K21n00O
$$ 179 -389 -103 217 96 -80 309 76 -289 16 105 -47 -77 289 -87 -157 -188 447 -53 22 243 -257 -251
6860b51N76j07m36L49m4k45j28M87N4n74K89J45km06L24J84n38K41J05j1m1j70
$$ -251 325 218 -218 131 87 -158 -286 201 255 -319 -30 115 113 -293 31 215 -323 -82 23 12 -29 -199
6882a99R4l32M55J02j83j98N52k96k7R7L8j6k69L90k53n5J77l5j55J50O7k23J77
$$ -199 -105 -437 18 120 -63 -261 291 -5 -32 65 103 87 -182 208 -45 -100 77 42 -113 37 104 -119 58
6905E8J14j47J01n10Q32m59l55N03p0r9j39O40n05j93L37j15k22L78J80j92k16
$$ 58 172 25 126 -384 448 -11 -366 137 67 -32 -171 469 -36 -229 108 -7 -229 149 329 137 -79
6926g9k5K09q5K7K85m08j10L83k00k87j5O19q8n05K86K25n25R6L90n91L56Q8K44
$$ -79 -104 105 20 47 332 -76 -186 197 -3 -290 -305 314 226 -279 7 232 -293 -197 193 -398 -42 46 290
6949B90o42N13K69m24oJ4K32l18m9N5j03N2J16K60l67o1K06Q9j82M33n53Q0K48
$$ 290 -352 161 430 6 0 14 246 -72 -121 -66 -169 -117 -1 259 -108 -169 37 126 -56 377 -176 -96 152
6972A52Q8j70j43K33j67n29Q76l79K61j70M5j0m3l5j18J01K18J3m13J22J13j07
$$ 152 240 70 -73 160 -7 -536 340 -39 222 52 97 87 44 9 -109 -8 210 223 -190 -68 45 -62
6994f2o8L96m4j80k31o4Q6p5J95L74n75J93J76K9k31J07rj45l0M39l25m93L97
$$ -62 -130 266 222 42 -189 -253 -167 -242 -47 327 -248 -55 121 150 -81 26 17 -128 -158 281 -44 -537 -140
7017a40J89j08l54O00o2l11m1L17J07k71K8K23j75j00J57j97J65J94k56j34K46
$$ -140 49 -59 -413 187 125 -186 -227 90 197 -74 -46 177 2 -98 59 -138 27 221 -35 -169 77
7038G7j24nK36K39m13p9N23m01P5j3l37O7K5L32l14k34N64l15j85L43R4j05k54
$$ 77 -47 -52 184 423 10 -69 454 53 128 115 -222 -155 -130 202 -112 -346 218 -97 -282 61 155 50 -204
7061b04J89m7m9L78l1m29J96L26k27l79N8L22k08Ro9K62l95K46Q5r5K1K94m03
$$ -204 -15 -62 -111 267 236 -193 3 329 102 -277 -219 103 -105 -96 -165 97 -298 -52 33 -62 -41 253 -150
7084a50R4Q3j29K68k34J97k64L0K4j30J18L16j46k80K65k22p2J92J34k81J61R
$$ -150 -56 27 -102 166 -68 129 -135 -105 -81 -211 -93 223 77 -203 62 -160 -232 -40 94 -187 -26 -17
7106a7O4m8o7PJ6j8o9O7l3L06l76R9J48k84L12K2j42J87l44K44m8j02N5K20q2
$$ -17 47 -1 -68 -61 -45 -63 -132 -65 -98 208 -168 -69 79 -205 107 129 -13 174 -170 74 26 -76 -21 199 117
7131A17j83O9J23j25j1K94j07j77r7N3k23K35L04j82m7j00j14K41l30K37m1J09
$$ 117 -66 3 126 1 -10 284 177 0 -97 -44 -267 -32 272 90 43 -57 -171 70 -260 -23 -64 45
7153D5m06L69J23k93M94l73j5M5Nn7o2M15k58o9K00j17J31l52J33J42n7r4J36
$$ 45 -361 8 131 -162 332 -41 -56 -11 -6 -63 -125 290 32 -37 163 46 177 -175 -42 100 43 -51 85
7176H5k08P2K14k64J73k31J50j49J08N4R7m36L61J86k74N3K19J34l89L51k68j6
$$ 85 -123 -51 163 -101 72 -159 -9 -158 -50 4 101 -335 26 212 -62 -9 210 344 -45 306 38 22
7198B2j04j0J32j53L49m33J89j9J91k15j0J32K42k72n3J07k97P6R0oj9M0L42l77
$$ 22 -82 -92 40 -113 236 -197 -8 -27 164 -51 -61 71 313 41 -12 95 -202 -126 -36 -42 -61 -21 321 -56
7222e6n1J15N5k23o8N26m72J80J4n6m01O00O6l85o6J84n4N4J54j21o8J15J30j16
$$ -56 -107 8 63 -160 -228 298 -174 6 20 -36 -437 163 229 -156 -222 -38 -92 -38 116 -5 -73 42 172 56
7246E6k18L82J57l78J00K6k17k08L3L00j82P3J92k83K94P8j95K3p3J87k81J62
$$ 56 -162 220 377 -1 99 125 -92 -300 -267 33 -149 -76 116 -167 127 205 10 33 -40 147 -134 28
7268B8J6l4k75L17K85l89R9K08k64k18M05l38k69L07K56J89l18J05K01j26k01
$$ 28 44 10 -265 52 337 -52 47 255 -9 -227 178 -160 -429 -122 134 323 5 110 311 185 -16
7289a6kO8j93K89j85j18q0L10l14K56J04j5o2R2m3l11m1M01j4l35Q2K77j06j29
$$ -16 -18 50 -143 146 -39 -157 -237 73 -241 15 119 104 42 134 91 -220 -261 140 126 -209 -127 150 44 -85
7313h5K93j62J0l67K40p0m3K56oj92L95n7j27j35L10j45l15J59L7L56j78J86k73
$$ -85 208 46 56 -311 -71 -141 -184 72 66 -126 269 212 85 -50 260 115 -200 -41 -4 352 174 360 87
7336H7n7K1L8q5M5L77m47k82K99K35k28j24K70Q2m35L15j23k66K66l0Q1k25M82
$$ 87 30 51 89 4 49 426 -21 -303 -4 231 3 -121 149 231 -204 111 -12 -278 -12 -42 39 -186 296
7359B96j80j92k64M56k2j44L71j49k97J50K48n46M1L87q7l39K71J21l44L4j7K79
$$ 296 116 -76 -340 116 94 -50 321 172 -125 25 273 -273 -232 155 68 -271 0 121 -223 -189 -206 73
7381G3j82j2P5j95O6R1K88o25M07L07m55K27j72k2p9N19k58j15J24J22k09l3l
$$ 73 -109 -121 -46 -241 -175 -84 204 -421 -14 293 -162 65 -107 -129 -208 311 53 -62 62 184 -25 -58 -61
7404f1K2k22L39J48o05K32J10jj34r1L63j2q8J10Q4k32M3K9j03j23M31j90k37
$$ -61 -39 -261 78 226 -379 -147 -37 -38 -172 -263 100 88 0 110 194 -38 5 34 -69 -192 239 49 -188
7427a88K77J30j78j33K64k7m26L33j89m3o6L77o7n03M38J09m5J7K8J9k06j68L48
$$ -188 89 219 41 -92 172 145 -281 52 -137 -180 -246 131 64 -439 -1 108 63 80 108 127 -79 -247 101
7450A01j95J85J45m10K8K34K27l05k06L61l82O1L39k49j09J08L00k95N2K26l83
$$ 101 -94 91 236 -174 -146 88 315 10 -196 165 -217 -156 183 -66 -175 -67 233 -62 -10 216 -167
7471a67J59j76L25l38J86j15p6L48j45O4O6o5K0j7P2k27K03l03K65M24j49l98
$$ -167 -8 -184 141 -197 -11 -126 -202 146 1 65 131 66 86 69 141 -86 117 -186 79 503 354 -44
7493d4j5K58P6j35q8j90p4K21J25j49K03p8P1m26J82K8rLK77m56N52m71J97J51
$$ -44 -59 199 275 140 52 -138 -212 9 134 -15 188 110 181 -245 -63 -35 -44 -41 236 -220 332 -139 58 209
7517B09m77L50j70K21J83l41j71M81k82K10k58L71l91J31k68K23j9j11K02j32
$$ 209 -268 82 -88 133 316 -25 -196 285 3 213 -45 326 -65 66 -202 21 2 -109 93 -39
7537c9J24j74K7P9j19K46l37J13k0J61p0k39J51R8Rm6J85j68J39k42K49q4l7j46
$$ -39 85 -89 -62 17 -102 144 -193 -80 -100 61 -9 -248 -97 1 10 -36 149 -19 120 -122 127 43 6 -140
7561a40R0Q3j92M09j56Q5m16K01K05j56m7J08N5P8j98N1pl65L62r4K41k22J09
$$ -140 -50 33 -159 250 94 179 -237 -36 169 13 -34 74 129 207 9 60 53 -312 50 -44 197 -25 84
7584H4j60j87J60J72j15M7K07l1l8p7r7K82p3k32J11rj3J93k19J1R4k59J41J97
$$ 84 -76 -263 -103 69 -46 1 208 177 139 62 -35 247 174 -58 53 44 31 224 5 16 110 -149 -8 189
7608A89k80M1K75L1k38j90K6j27L22n1J91qj41j2J21O7m18j9M10k36r8l0J07K18
$$ 189 -91 -50 225 256 18 -172 -146 -273 49 -2 189 181 40 28 149 216 -202 -221 189 -47 -145 -175 -68 150
7632A50j99N0J35j06k99J65q0M08l51J45O1lK2K14l47M0P2l00J55J40m9J13j90
$$ 150 -49 1 136 30 -269 -104 -184 224 -127 18 79 76 98 312 -35 5 77 -223 -68 72 23 136 -54
7655e4L4qj38N7J17q5J11j17j2J7J19J45p8j17j14K13k73J59K6n2Q2J34m5j76
$$ -54 -20 -28 -166 -109 8 -77 34 -83 -95 -78 41 186 108 -9 -123 90 -183 -24 2 -50 32 166 121 -55
7679e5MJ94Rk51p4O0p5K26k59J31R0j40j88L68R7k05J23M0K02k89L3K84j81rJ03
$$ -55 -51 143 152 -99 -173 -113 -188 38 -221 -90 0 -140 -328 40 137 -68 55 95 297 8 41 325 144 135 238
7704B38l39J70L0Jq1J4k74K75j62L9o5J05n3J12m3q0P2l4N1j32j34K56p3N7J16
$$ 238 -101 69 99 100 19 33 -241 34 -128 -89 -154 -49 -102 10 -33 -113 -41 -75 -24 -156 -290 -34 -107 -50 66
7729F6k96K36l3r3k06K77K15j07K3k68K47k50Q5K28j0l3j19J46M5J46l76P6J97
$$ 66 -230 6 -27 -120 -326 -49 166 59 82 -186 61 -189 -104 124 114 81 -38 108 153 299 -77 -1 196
7752A96o7J17k48M43m32Q3j0K08l75J38J41l96p1J80r1J98k12L84j11j74R6K44
$$ 196 129 246 -2 441 9 92 82 290 -85 53 194 -202 -273 -93 -184 14 -198 186 75 -99 -3 241
7774B41j85k58J92o6K95k83J06j78N6O6K14k50p4M5L5M3J84k13Q7J5Kj91l3M71
$$ 241 56 -202 -10 -76 219 -64 42 -136 -80 -14 200 -50 -124 -79 -44 -1 183 -30 57 72 74 -117 -150 321
7798C21m2l21p2R1j93J22J24L4j9k33M5J21J32j79J23l36M14k60J52k30N02l14
$$ 321 279 -42 -114 -23 -216 -94 30 64 45 -188 -143 -22 110 -69 54 -282 132 -128 24 -206 296 -18
7820a8Q5M4Q1j79L01l14j59j5J66j51K23k6n7L26k95J63l6P4k73J24l15K25K36
$$ -18 67 111 192 13 314 0 -159 -174 -8 -159 64 38 -19 307 12 175 139 213 -60 64 -251 -26 210
7843B10K2j22J68j22p5J77k23K5l06K48L9k79K85J24l40k2J88J77k88j00M48k83
$$ 210 232 110 278 156 81 258 35 60 -246 2 41 -238 47 171 -169 -191 -3 174 -114 -214 234 -49
7865d9J2O2j18m1K90k5q2k90K86l20K65l0N2p5M8j2k63K91K86k22q3J11K22j47
$$ -49 -37 25 -93 -134 156 131 49 -241 45 -275 -10 -40 12 -63 -15 -27 -290 1 287 65 -18 93 315 168
7889A68j32m3J82J38k68o0J06p2l9J88k23j09RL00k16J79k3q6L4K45l27J16L5
$$ 168 36 -7 175 313 45 -15 91 19 -20 168 -55 -164 -155 145 -71 108 85 -1 33 278 -49 67 102
7912A02P9j93q5m2R1j7p1K12k0o3j8k50j6L54m7j49j95N06j09j54K19l4l53L47
$$ 102 181 -12 -97 -139 -48 -65 -136 76 56 -7 -25 -275 -291 63 16 -133 -328 178 69 -85 134 100 -253 94
7936I4r8j75k7L84R5l14J79J7j33J68o2J36q4k46M7O9K19m54J53P0J06k72J11
$$ 94 -4 -179 -206 178 273 -41 138 155 22 190 128 264 180 -66 -19 50 269 -185 -32 38 144 -128 -17
7959a7k31M89l08L0j4lj14k23L91j58l2L9q0m2K24J57j78J98j74k7j9j26K66q1
$$ -17 -248 241 -67 -37 -51 -54 -168 -391 0 -158 -190 -151 -231 -273 -49 108 -70 128 -46 -73 -92 -218 48 -33
7983c3j9K58j34k04O5K29k08K4K19m68L65R6j62Q1j27L46k13k93J03O1N4k4J73
$$ -33 -52 206 72 -132 -67 162 -46 -22 197 -271 94 190 28 109 -18 328 115 -178 -75 -14 40 16 189
8006A89k84j21L51p4n8N6nJ93l15N6n2J8n9MK6j33O2K34k99L01J41k07l8N9p4
$$ 189 -95 -216 135 61 3 59 54 247 -68 -12 -64 -46 -105 -101 -75 -208 -146 88 -211 90 231 24 -14 45 -29
8031b9m04M56J09j07j76J13j31P2R9j72L00k86K89M3k77K56Q3j50l86M64j5k09
$$ -29 -433 23 132 25 -151 -38 -169 -97 2 -170 130 -156 133 176 -101 155 238 88 -298 166 151 -58
8053e8O5k5l5o4j72M69j67n8P2O5J13k87l6l6J39l7j26K89k65K36k43L01j29L65
$$ -58 7 -18 -53 -117 -289 180 13 -45 27 92 205 -82 -118 -154 -15 -52 -178 111 -154 82 -161 140 11 376
8077C76m60J84J4l32L12N6k08J35L0k23k7J57r8O3O6J45j77j01mK04J85j68K6
$$ 376 -84 100 114 -218 94 150 -58 77 107 -116 -143 14 -84 -21 45 190 13 -88 -92 112 297 129 155
8100A55k79M45j59o2%p9p3o9K87j55o0J61l0k82K68ml04K83K3P5q9Q7n9k6k36
$$ 155 -124 321 162 100 100 21 -52 -121 166 11 -49 112 82 -200 68 64 -240 43 66 141 52 139 80 54 -182
8125a82K76J09j71j65J57m2J25j21K9jK72j27kj4j45R6j75n8L52J4j47O1k97M5
$$ -182 94 203 32 -133 24 -18 107 -14 15 14 286 159 157 143 -2 94 -81 -139 213 227 80 141 -156 -111
8149a11L18l48K41q8J49k15Jj01K95j61j07Q9R2O1k30P6kK40j98J11j08J35l03
$$ -111 207 -141 100 12 161 -54 -53 -154 141 -20 -127 -38 54 115 -115 -39 -41 199 1 112 4 139 -164
8172a64N23k16k00K36l35L40J02j84j46L03l78L6J11k05N5K97j96p1K10
$$ -164 359 143 -57 179 -156 184 286 102 -44 259 -119 -83 28 -177 -122 175 -21 -92 118
8191A18
$$ Imaginary data points
##PAGE= N=2
##DATA TABLE= (X++(I..I)), XYDATA
0@%%%%%%%%%%Qj6J6k4L2l6M4n6P2q8J04j20J44j70J95k31K71l14L62m17M80n46
$$ 0 0 0 0 0 0 0 0 0 0 0 8 -8 8 -16 16 -20 24 -32 40 -48 56 -64 80 -90 105 -126 145 -169 193 -224 256 -290
32b90O20p03P96q99J011j132J266j417J578j754J947k157K389k642K917l216L544
$$ -290 330 -373 423 -476 535 -597 669 -748 830 -924 1023 -1134 1255 -1387 1530 -1686 1858
49A858l906M305m742N225n763O364p041P806q678R686j0869J2277j3985J6110
$$ 1858 -2048 2257 -2485 2740 -3023 3341 -3700 4106 -4572 5114 -5755 6522 -7463 8647
63H647j8838K2488k7651L5568m9378Q0297k75372N1660L84752k93735k6351J47873
$$ 8647 -10191 12297 -15354 20214 -29164 51133 -224239 -172579 212173 -81562 -107913 39960
75C9960q4688r0229K73228J5048k25191J19796K54972k37208j73676K63805O1802
$$ 39960 -44728 -134957 138271 153319 -71872 47924 302896 65688 -107988 155817 217619
86B17619k73215M3321R3610k67440q7398L39007O3401k59332q03J13055j50556
$$ 217619 -55596 -12275 81335 -186105 -273503 65504 128905 -130427 -131230 -18175 -168731
97a68731J3305K73867n7442k21520K19574K06099k47522r7058K56719l531j99887
$$ -168731 -155426 118441 60999 -160521 59053 265152 17630 -79428 177291 173760 -26127
108b6127P0254N2882j99441M0663K55547j35838k77472J25234R7333k06137M4245
$$ -26127 44127 97009 -102432 -61769 193778 57940 -219532 -94298 3035 -203102 -158857
119a58857K52205r7847j54637J95280R0593k03678K5952K12718q2981j14923J74962
$$ -158857 93348 -4499 -159136 36144 126737 -76941 -50989 161729 78748 -36175 138787
130A38787J4927k19303Q5919J93716j94856j89374J49372L2656j66439P6482J56657
$$ 138787 153714 -65589 20330 214046 19190 -170184 -20812 11844 -154595 -78113 78544
141G8544j38678r7061J66426p580j70762J31158J89083j27064n3881J80464l6632
$$ 78544 -60134 -157195 9231 1651 -169111 -37953 151130 24066 -29815 150649 114017
152A14017j73856J10862J31769j64218r7349J24731l2040j15908J32815P2287
$$ 114017 -59839 51023 182792 18574 -78775 45956 13916 -101992 30823 103110
162A03110k19522n6744J73082m2463j15256J52751J08570j36783j1492J32117
$$ 103110 -116412 -173156 -74 -42537 -157793 -5042 103528 -33255 -44747 87370
172H7370p1925r4000J65060P9566j74172k0052J31947o7688o9560J30641k2017
$$ 87370 15445 -78555 86505 166071 -8101 -28153 103794 36106 -33454 97187 75170
183G5170k11488J1742J50079n5385p0837J18998J8819j38446L1800J03127q4943
$$ 75170 -136318 -124576 25503 -29882 -100719 18279 37098 -101348 -69548 33579 -51364
194e1364j3715J79886K150j62194L7678J15308o1292l5651Q1887o0626j37921
$$ -51364 -65079 114807 116957 -45237 -7559 107749 46457 10806 92693 32067 -105854
205a05854P4294J09859r0916m3956R1158n4029j18584P4335P7844p1069K0024
$$ -105854 -31560 78299 -12617 -56573 34585 -19444 -138028 -63693 14151 -56918 -36894
216c6894J18148m9486j08392P6110Q4767o2379q65O9590p5488p3670J08826N0043
$$ -36894 81254 31768 -76624 -514 84253 21874 21009 90599 15111 -58559 50267 100310
228A00310j07957j9720N2324p2742o3600Q8113M5412o8551J8613O2901p3317n1346
$$ 100310 -7647 -27367 24957 -47785 -111385 -23272 22140 -46411 -27798 35103 -38214 -89560
240h9560J01579L9965o1249L0141M7715o8858k3137R5102J2498q6654l721L1047
$$ -89560 12019 51984 -9265 20876 68591 -267 -23404 71698 84196 -2458 -6179 24868
252B4868n9001j3973Q3398q197p6767K2290K3069o6509k723Q3412R323m2338K9258
$$ 24868 -34133 -48106 35292 27095 -49672 -27382 -4313 -70822 -73545 9867 19190 -23148 6110
265F110K4461m8456P815P9356r933o1408J8847J3598m0967J9560M8140m0551n8258
$$ 6110 30571 -17885 -10070 69286 59353 -2055 16792 30390 -10577 8983 57123 16572 -41686
278d1686J6523R426l9380J0520N5887j1144l3882K2624M97l0794L9236N5580k3950
$$ -41686 -25163 -15737 -55117 -44597 11290 146 -33736 -11112 -10615 -41409 -2173 53407 29457
291B9457l2485J8076R964j1193J9703K2250l7467l8585J5771J401k4911J9417
$$ 29457 -3028 15048 25012 13819 33522 55772 18305 -20280 -4509 -3108 -28019 -8602
303h602K2264l0655k5806N299j672M640L4198K7046j8448k4345J5141J8654N062
$$ -8602 13662 -16993 -42799 -37500 -39172 -34532 -334 26712 8264 -16081 -940 17714 22776
316B2776J9584N182l0777j7052O560K404J869M778m384k3639k9475j389J7433
$$ 22776 42360 47542 16765 -287 6273 8677 10546 15324 10940 -12699 -42174 -43563 -26130
329b6130J0982J1147K572j9920j3595J1690K6596K3796K673n672n894j4608M328
$$ -26130 -15148 -4001 -1429 -21349 -34944 -23254 3342 27138 29811 24139 18245 3637 7965
342G965K8044N178j6490j0356j7702k4768m33K4586Q991k1570j3171J79j5886
$$ 7965 36009 41187 24697 14341 -3361 -28129 -28562 -3976 5015 -16555 -29726 -29547 -45433
355d5433Q228M6069R644k2751O190O810j5178J4468M1234K394l3863o098N401
$$ -45433 -37205 8864 18508 -4243 1947 8757 -6421 8047 49281 51675 17812 11714 17115
368A7115k6032J018M2453j4393m9968M388O255k8788J3912M4423j2568l7115J5443
$$ 17115 -8917 -7899 34554 20161 -29807 -25419 -19164 -47952 -34040 10383 -2185 -39300 -23857
381b3857K0470j8565K0031N9331j5248m7251K4103J4554l5166K1369M4441m1414
$$ -23857 -3387 -21952 -1921 57410 42162 -5089 19014 33568 -1598 19771 64212 22798
393B2798n3414K0805Q391l8792J5286M7064l9934m9148M4079J7990l8437L9650
$$ 22798 -30616 -9811 -1420 -40212 -24926 22138 -17796 -66944 -22865 -4875 -43312 -3662
405c662N6611m8580l8088N1730J3874l5563L6407M5598o2241m7601N4397L775
$$ -3662 52949 4369 -33719 18011 31885 -3678 32729 78327 16086 -31515 22882 26657
417B6657n6227L4200L6723p6878l2865O4177m347m6712M8180L9770o9996k2299
$$ 26657 -29570 4630 41353 -35525 -68390 -4213 -8560 -55272 -7092 32678 -37318 -59617
429e9617P9289N779m3399N7145L4752q6285j2859Q1550j7410n3537M9219J4464
$$ -59617 19672 25451 -17948 39197 73949 -12336 -25195 56355 38945 -14592 34627 49091
441D9091q9777r186P5507k7601n8109N8980K0034r2467R612R2984k8298m0850
$$ 49091 -40686 -49872 25635 -1966 -60075 -1095 18939 -73528 -63916 29068 770 -40080
453d0080P4399R858q7216K7723R1402l9288m9873O8558M20j00093K6079P9682
$$ -40080 34319 44177 -43039 -15316 76086 36798 -13075 55483 55903 -44190 -18111 61571
465F1571o6526m9649P6563j4506r7019M3783Q1646n8875l2126Q3353j1124q5136
$$ 61571 -4955 -54604 21959 7453 -89566 -45783 35863 -23012 -55138 28215 17091 -68045
477f8045O3147Q6093p3657l0601Q8001k6323q6773O6404O1668q7134k5039P8287
$$ -68045 -4898 81195 7538 -23063 64938 38615 -48158 18246 79914 -7220 -32259 46028
489D6028m0467q7926P1581O2320r2082j8608Q6037m3520o9014R4680N1229r4835
$$ 46028 5561 -82365 -10784 51536 -40546 -59154 26883 -16637 -85651 9029 60258 -34577
501c4577K621R2483m3975o2269R0316M0119j01087K704Q0834o8308o3159J01807
$$ -34577 -31956 60527 16552 -45717 44599 84718 -16369 -13665 67169 -1139 -64298 37509
513C7509K2290j14911Q521P4193o5303m1474J03188J1119j05417L6135R3024o9001
$$ 37509 59799 -55112 -46591 27602 -37701 -79175 24013 35132 -70285 -34150 58874 -10127
525a0127m0701J10137M735j02416M2971O8517q2951k2141J08052k2296j18454
$$ -10127 -50828 59309 64044 -38372 4599 73116 -9835 -31976 76076 53780 -64674
536f4674L7488O8694p8262k0882R8209l4111r5752P4638O4549r4350r178J08508
$$ -64674 -27186 41508 -36754 -57636 40573 6462 -89290 -14652 49897 -44453 -53631 54877
548E4877k3507q0255O5434M7328q4228J1176J00853o2639j01831P7188N1871q6969
$$ 54877 31370 -48885 16549 63877 -20351 -9175 91678 29039 -72792 4396 56267 -30702
560c0702P579P6772o6690o6428Q8565K5317j01760K2072J01431n4547o6655Q3954
$$ -30702 -23123 53649 -13041 -79469 9096 34413 -67347 -45275 56156 1609 -65046 18908
572A8908K2075p9280M7322P4423r3031n5138J08228K5801q9078K0879N4177q2411
$$ 18908 40983 -38297 9025 83448 -9583 -64721 43507 69308 -19770 1109 55286 -27125
584b7125l5328R6644j4340r7439N9783P6637q6015m0128Q6327n074o1060O4211
$$ -27125 -62453 34191 19851 -77588 -17805 58832 -27183 -67311 19016 13942 -47118 17093
596A7093M2298r7829r881J18931q936q9301M0993L1026q4157O980Q9557m3733
$$ 17093 59391 -38438 -48319 70612 61676 -27625 13368 44394 -39763 -32783 56774 13041
608A3041o9722P1684L1830r8929r984Q6565k3551m8139O7570R162q9675L7602
$$ 13041 -56681 15003 46833 -52096 -62080 24485 934 -47205 20365 29527 -60148 -22546
620b2546J01837n0815p0450N5488J5758o1987L7968O8137o6921n0751P5188j198
$$ -22546 79291 28476 -41974 13514 29272 -32715 5253 73390 6469 -44282 30906 29708
632B9708r4511K9274P4534m9368k7248O5962k2111p1647N8795O7775p1236m0496
$$ 29708 -64803 -35529 39005 -10363 -37611 28351 6240 -65407 -6612 61163 -10073 -50569
644e0569P1135J025n0155N7603M0858q4806j8840P2949k8022o4219N7460M5242
$$ -50569 20566 21591 -28564 29039 69897 -14909 -33749 39200 11178 -53041 4419 49661
656D9661o2000j2483N0142m1068n0543P1731L7963p7481n964O8908k1718k9580
$$ 49661 -12339 -24822 25320 -15748 -66291 5440 43403 -34078 -40042 28866 7148 -22432
668b2432O1046K609p8466J2402O5507l1557l6260O0094J3624o9028O979L9220
$$ -22432 38614 41223 -37243 -24841 40666 9109 -27151 32943 46567 -22461 -15482 23738
680B3738n4260k1370P8285N836p0300J5435M5322l4424j0947N4035j8813o4190
$$ 23738 -30522 -51892 26393 32229 -38071 -22636 22686 -11738 -22685 31350 12537 -51653
692e1653M0898N9388m2044j5988N4709k0649n8271L0364K3803m8860R095O5657
$$ -51653 -10755 48633 6589 -9399 45310 24661 -33610 -3246 20557 -28303 -19208 46449
704D6449k4245o4490K4605L0309l7637O388M5864l7305l8727O1033L2838m8611
$$ 46449 22204 -42286 -17681 12628 -25009 -18621 27243 -10062 -48789 12244 45082 -3529
716c529k281L5020l0464k9897M2622J4706m0196J9991M5370m6242m9090L5680
$$ -3529 -5810 29210 -1254 -31151 11471 26177 -14019 5972 51342 5100 -43990 -8310
728h310J3573l0629K3892K5491m4763j6572N4711R278m6311N802K8249k7625n125
$$ -8310 5263 -25366 -1474 24017 -20746 -37318 17393 26671 -19640 -13838 14411 -13214 -18339
741a8339N0789m101l8730K8113K0386n2593k0846L8608N632j6978K2497M740m9249
$$ -18339 32450 28349 -10381 17732 38118 -14475 -35321 3287 8919 -8059 14438 19178 -30071
754c0071m183N1023p811m0401K0302J8008k3034J5916L4940k2830k5238K6707
$$ -30071 -34254 16769 8958 -31443 -11141 6867 -16167 -251 34689 11859 -13379 13328
766A3328O643l8812j73M1211N13j6836J4512j6362m4315J8190M0726j8720k4139
$$ 13328 19971 -18841 -19014 22197 22710 5874 20386 4024 -40291 -22101 18625 -95 -24234
779b4234J7191O021j2136J6235J7089k6636j5859K9862M909k6144J7989L0535
$$ -24234 -7043 -1022 -13158 3077 20166 -6470 -22329 7533 12442 -13702 4287 34822
791C4822j4355j2613K492k2988j8025L0012K7284k2057k2957J1667K784r711J4367
$$ 34822 20467 7854 10346 -12642 -30667 -655 26629 4572 -18385 -6718 -3934 -13645 722
804G22K774k7725K938L0097j655j1428J6095J2320j3707j1199M28p845J207L0435
$$ 722 3496 -24229 -21291 8806 7151 -4277 11818 24138 10431 -768 -340 -8185 -6978 23457
818B3457J0516l1765j7538P853q83J41P347q190j2631Q962J7856j526r643P454
$$ 23457 33973 2208 -15330 -7477 -8360 -8219 -872 -9062 -21693 -12731 5125 3599 -6044 1410
832A410O700j0823k212O552R13J1899J6706p521k4270j2106L689Q850L451j180
$$ 1410 8110 -2713 -4925 1627 2540 14439 31145 23624 -646 -12752 -9063 -213 3238 2058
846B058o930q818L650Q850m220n481K687K069K107J285K400J0577Q965k77p729
$$ 2058 -4872 -13690 -10040 -1190 -5410 -10891 -8204 -6135 -4028 -2743 -343 10234 19199 18922 11193
861A1193j4956p999J1974J5759J580j1173j1635l542l75J296L888m568p204Q826
$$ 11193 -3763 -11762 212 15971 17551 6378 -5257 -8799 -9174 -7878 -3990 -8558 -15762 -6936
875f936O205p745M447J3710N31q184l513k697j012J4871K1615p536k5199l805
$$ -6936 -731 -8476 -4029 9681 10212 2028 -1485 -4182 -5194 9677 31292 23756 -1443 -5248
889e248L118o189P087J0255j4388j1437J0464L326j1869M726J6293n915j3842
$$ -5248 -2130 -8319 -1232 9023 -5365 -16802 -6338 -3012 -14881 -10155 6138 223 -13619
902a3619R331O528n207J8758J8892k3749k3229J1554O985o511J0415Q568k2756
$$ -13619 -4288 2240 -2967 15791 34683 10934 -12295 -741 6244 -267 10148 18716 -4040
915d040j5575J7939J710k0174J1216J8343j9956j0440K1413K524r500K0045J1550
$$ -4040 -19615 -1676 34 -20140 -8924 9419 -10537 -20977 436 2960 -6540 13505 25055
928B5055l0593j3434K7485P472j3673J4277O449l4150p478K7577o212k0331J8748
$$ 25055 -5538 -18972 8513 15985 2312 16589 23038 -11112 -18590 8987 2775 -17556 1192
941A192R745k8810m746K7271l185j5437K2439O802l4984J776L7348m358j6530
$$ 1192 10937 -17873 -22619 4652 1467 -13970 8469 15271 -19713 -17937 19411 15053 -1477
954a477K0280j365l4930M901L2037j1597j9366K2112J522l7357O068L3100j6780
$$ -1477 18803 17438 -17492 -12591 19446 7849 -11517 10595 12117 -25240 -19172 13928 -2852
967b852j5372K7837l865l4749J7049L4993j5793j4709K4254n682l3948J9680L4483
$$ -2852 -18224 9613 5748 -29001 -11952 23041 7248 -7461 16793 11111 -22837 -3157 31326
980C1326k4850j6465K7397j2113l5065K3875K7643k7487j1147K6845j1736k9829
$$ 31326 6476 -9989 17408 5295 -29770 -5895 21748 -5739 -16886 9959 -1777 -31606
992c1606K7949K9506l0198r350L1085j4816k8164L4205K3275l3962o176K5978
$$ -31606 -3657 25849 -4349 -13699 17386 2570 -25594 8611 31886 -2076 -8252 17726
1004A7726j8973k4375L3490J9211l7386o293K9342j9154k2188L7927J4115l8975
$$ 17726 -1247 -25622 7868 27079 -10307 -16600 12742 -6412 -28600 9327 23442 -15533
1016a5533L167K8238k2562j7125L9227J1983l7735J240K6472k4066j3320M3060
$$ -15533 -12366 15872 -6690 -23815 15412 27395 -10340 -9100 17372 -6694 -20014 23046
1028B3046J782m5038Q641K6927k5499q798L8183l143l8155J2941K4625k8693p391
$$ 23046 24828 -20210 -11569 15358 -10141 -18939 19244 16101 -22054 -9113 15512 -13181 -20572
1041b0572M4951m904m1047J6257K1414k8748K548L8793j5966l7991K0560K3528
$$ -20572 24379 19475 -21572 -5315 16099 -12649 -10101 28692 12726 -25265 -4705 18823
1053A8823k8958k101L7011j6720l5561K5832J5653l2673R837L8380k3018l2695
$$ 18823 -10135 -12236 24775 8055 -27506 -1674 13979 -18694 -8857 29523 6505 -26190
1065b6190K4604J5132k5551R232L0555k7246k9475L4230J4092l3542J0362K8136
$$ -26190 -1586 13546 -12005 -2773 27782 536 -28939 5291 19383 -14159 -3797 24339
1077B4339k9205k0650L2264N471k7336J6648K5507l3152k2716L5935P321k8357
$$ 24339 -4866 -25516 6748 12219 -15117 1531 27038 -6114 -28830 7105 14426 -13931
1089a3931J8105J9941l7182j0539L8685l718k8688K0524J7447l3138r527L5387
$$ -13931 4174 24115 -13067 -23606 15079 11361 -17327 3197 20644 -12494 -22021 13366
1101A3366k622k5006K4086J1886m1761k923M0961p291k3105K2267M970l4658L558
$$ 13366 10744 -14262 9824 21710 -20051 -22974 17987 10696 -12409 9858 14828 -19830 -16272
1114a6272L5144j3419k3249K6184P593l7321N758L5533j5412j7283K5395l103
$$ -16272 18872 5453 -17796 8388 15981 -21340 -15582 19951 4539 -12744 12651 9548
1126I548l3935J5426L3624j7522j9795K2853j622l1377J6419K8873k4159j2543
$$ 9548 -24387 -8961 24663 7141 -12654 10199 8577 -22800 -6381 22492 -1667 -14210
1138a4210K8180q773l1333K0251K6667k1180j0401K1753j0887k5047K7773K5841
$$ -14210 13970 5197 -26136 -5885 20782 -398 -10799 10954 67 -24980 2793 28634
1150B8634k9751j1450K5191j1647k1848K8070J5813k9313l818K2601j6373k0336
$$ 28634 -1117 -12567 12624 977 -20871 7199 23012 -6301 -10119 12482 -3891 -24227
1162b4227K9501J6987l0098m401K1360j6888j2625L4830P492l3475J613K2525
$$ -24227 5274 22261 -7837 -12238 9122 -7766 -20391 14439 21931 -11544 -9931 12594
1174A2594j4914j0686K8093L350l0037N012J9872k0649r497L2220K40l1632P038
$$ 12594 -2320 -13006 15087 18437 -11600 -6588 13284 -7365 -16862 15358 15598 -16034 -8996
1187h996J5390j8523p22L0773m583k9560R401J8316j8012j598K7736q153k7122
$$ -8996 6394 -12129 -12851 17922 13339 -16221 -6820 11496 -6516 -8114 19622 11469 -15653
1200a5653J5296J3452k1620K179K6464j3509k6030J4035J2152j9287N757K6161
$$ -15653 -357 13095 -8525 -6346 20118 6609 -19421 -5386 6766 -12521 -6764 19397
1212A9397j5757k5407J8521J1474j8889R062K2873j8350j8362K0053P488j9212
$$ 19397 3640 -21767 -3246 8228 -10661 -1599 21274 2924 -15438 4615 12103 -7109
1224g109P355J9521j9513j8431K0562N008j8770J2506J6194k3999j5690K0408
$$ -7109 246 19767 254 -18177 2385 7393 -11377 1129 17323 -6676 -22366 -1958
1236a958N627j2556J2790J3368k2492j1371K3657L341j6713J1691J0969k1561
$$ -1958 3669 -8887 3903 17271 -5221 -16592 7065 10406 -6307 5384 16353 -5208
1248e208o130K1501k015j4905J1656O140k4111p512K2549K780j0875J2573K020
$$ -5208 -11338 10163 8148 -6757 4899 11039 -13072 -20584 1965 4745 -6130 6443 8463
1261H463k4922R43K5015k498j1782J1506M287j6800J626J8080p918j2268J2857
$$ 8463 -16459 -15516 9499 7001 -4781 6725 11012 -5788 -4162 13918 6000 -6268 6589
1274F589R36k2005L537K0650m366q899P250o802j7997R799K1238n058r902J0138
$$ 6589 7525 -14480 -10943 9707 5341 -3558 3692 -3110 -21107 -11308 9930 4872 -5030 5108
1288E108L39j3599P713J2782j0640n099J2483l321j3673O964J3148p105q662K669
$$ 5108 5447 -8152 -439 12343 1703 -3396 9087 5766 -7907 -943 12205 5100 -3562 -893
1302h93p308j0564J5105J6302j0983q649O244k817o019J0174O932p577o16J0580
$$ -893 -8201 -18765 -3660 12642 1659 -6990 -746 -3563 -9582 592 7524 -53 -669 9911
1316I911l242j0790P620Q387r298n568K192p452k76J5489N123j3935r452K796
$$ 9911 6669 -4121 3499 11886 2588 -2980 -788 -8240 -8516 6973 12096 -1839 -11291 -8495
1330h495m1Q95R187M000p682K542P236o252m834P963L847m909k773m68j415L497
$$ -8495 -8536 -7641 1546 5546 -2136 406 7642 1390 -3444 4519 8366 3457 684 216 -1199 2298
1346B298Q415j965j6346p244N543L916M582N802m547n502J784K174k069n11N295
$$ 2298 10713 8748 -7598 -14842 -9299 -5383 -801 5001 454 -5048 -3264 -1090 -3159 -3670 1625
1361A625N609j948k563M82k06L687L723p614j0742j678O179Q013K599n565p397
$$ 1625 7234 5286 2723 3205 2999 6686 10409 2795 -7947 -9625 -3446 4567 7166 1601 -5796
1376e796l315L45L229J104J290M830L302p29l184k646M153N330k052m303l597
$$ -5796 -9111 -8766 -5537 -4433 -3143 1687 4989 4260 1076 -1570 2583 7913 5861 1558 -2039
1391b039p40Q246P228m881j1428o439K27K930L024L574O26k302J167Q31p134R30
$$ -2039 -2779 5467 12695 7814 -3614 -10053 -9826 -6896 -3872 -298 328 -1974 -807 24 -7110 -6180
1407f180R365L024j872j363j401J005O606M208q551j2919j617Q147J181K924J761
$$ -6180 3185 6209 4337 2974 1573 2578 9184 13392 4841 -8078 -9695 -1548 -367 2557 4318
1422D318p214n211L485p76n439M665J0366J349n181J1J806j436O318N131j1961
$$ 4318 -2896 -8107 -4622 -5398 -10837 -6172 4194 5543 362 373 2179 743 7061 12192 231
1437B31q954R269P253j374P26l188j0724m568O634J129n381N548R959o432p329
$$ 231 -8723 546 7799 6425 7151 3963 -6761 -11329 -4695 -3566 -8947 -3399 6560 128 -7201
1452g201M680L43r46R608K989j1667k365J2164N472n717j969l111j0627m50J1850
$$ -7201 -2521 -2178 -3124 6484 9473 -2194 -4559 7605 13077 7360 5391 2280 -8347 -8797 3053
1467C053j129p454P121K905j2091m650O077J046J187R111J758j1686L44J4373
$$ 3053 1924 -5530 1591 4496 -7595 -12245 -6168 -5122 -3935 5176 6934 -4752 -4408 9965
1481I965R01q518K252j945r298P101J1355o529p622M289j539j2270p39R746j29
$$ 9965 10866 2348 4600 2655 -6643 458 11813 5284 -2338 1951 412 -11858 -12597 -2851 -2980
1496b980j191R131k895j3945O547J3697m198m456M845k131m567Q874Q989j0187
$$ -2980 -4171 4960 2065 -11880 -5333 8364 4166 -290 4555 2424 -2143 6731 15720 5533
1510E533r264O138k879j0844O837R560o543j879M988q174q903J0409J1394n563
$$ 5533 -3731 2407 -472 -11316 -4479 5081 -1462 -3341 1647 -6527 -15430 -5021 6373 810
1524H10m566O981j783m404J2294N662j4059l810P894m125n091R398L652j0360
$$ 810 -3756 3225 1442 -2962 9332 14994 935 -2875 5019 894 -4197 5201 8853 -1507
1538a507l557L703p602o217J4185P393j0968j018P184n722m27J3405Q54j1974
$$ -1507 -5064 -1361 -8963 -15180 -995 6398 -4570 -5588 1596 -4126 -4553 8852 9706 -2268
1552b268J178Q776l700l308R943r60j3889J71N237r267j229J3982j358j2112J677
$$ -2268 -1090 7686 3986 678 10621 9661 -4228 -4057 1180 -8087 -9316 4666 3308 -8804 -7127
1567g127M930n144J824J2815j400j2424O187R420o153J29R710p086j0994O163
$$ -7127 -2197 -7341 -5517 7298 5898 -6526 -339 9081 2928 3057 12767 5681 -5313 850
1581H50M463q633N67R664n608j2663M207M759o849M709J1873q330r604R691O622
$$ 850 5313 -3320 -2753 6911 1303 -11360 -7153 -2394 -9243 -4534 7339 -991 -10595 -904 5718
$$ [...]
8191c3
##END NTUPLES=NMR FID
##END=
