##TITLE=1H_Ser 3705-N
 200.13MHz,CDCl3,
 8 sc
 
 14.8.2025
##JCAMPDX= 6.0         $$ Bruker NMR JCAMP-DX V2.0
##DATA TYPE= NMR FID
##DATA CLASS= NTUPLES
##ORIGIN= UXNMR, Bruker Analytische Messtechnik GmbH
##OWNER= pz
$$ XWIN-NMR		Version 3.5
$$ Thu Aug 14 13:52:51 2025 Russian Standard Time (UT+4h)  she@DPX200
##.OBSERVE FREQUENCY= 200.1313
##.OBSERVE NUCLEUS= ^1H
##.DELAY= (6, 6)
##.ACQUISITION MODE= SIMULTANEOUS
##.ACQUISITION SCHEME= undefined
##.AVERAGES= 8
##.DIGITISER RES= 18
##SPECTROMETER/DATA SYSTEM= spect
##.PULSE SEQUENCE= zg30
##.SOLVENT NAME= CDCl3
##.SHIFT REFERENCE= (INTERNAL, CDCl3, 0, 14.3821)
##AUDIT TRAIL= $$ (NUMBER, WHEN, WHO, WHERE, WHAT)
$$ ##TITLE= Audit trail, XWIN-NMR		Version 3.5
$$ ##JCAMPDX= 5.01
$$ ##ORIGIN= Bruker BioSpin GmbH
$$ ##OWNER= she
$$ F:/spectra/data/she/nmr/H-C/1/audita.txt
$$ ##AUDIT TRAIL=  $$ (NUMBER, WHEN, WHO, WHERE, WHAT)
(   1,<2025-08-14 13:51:39.73 +0400>,<she>,<DPX200>,
      <created by zg, POWCHK disabled, PULCHK disabled
       configuration hash MD5:
       00 E9 B6 7A A2 85 ED C7 34 08 36 98 17 FE 4E 26
       data hash MD5: 16K
       A5 6C BD E8 E4 F2 0D E3 20 BF ED CC FF AB 48 CE>)
$$ ##END=
$$ 
$$ hash MD5
$$ 9F E1 7C A1 41 AC B3 5B 22 7A BE 45 46 AD 1D 18
##$RELAX= 
##$RELAX= 
##$RELAX= 
##$RELAX= 
##$RELAX= 
##$RELAX= 
$$ Bruker specific parameters
$$ --------------------------
##$DU= <F:/spectra>
##$EXPNO= 1
##$NAME= <H-C>
##$PROCNO= 1
##$TYPE= <nmr>
##$USER= <she>
##$AMP= (0..31)
100 100 100 100 100 100 100 100 100 100 100 100 100 100 100 100 100 100 
100 100 100 100 100 100 100 100 100 100 100 100 100 100 
##$AQSEQ= 0
##$AQ_mod= 1
##$AUNM= <au_zg>
##$AUTOPOS= <>
##$BF1= 200.13
##$BF2= 200.13
##$BF3= 200.13
##$BF4= 200.13
##$BF5= 200.13
##$BF6= 200.13
##$BF7= 200.13
##$BF8= 200.13
##$BYTORDA= 1
##$CFDGTYP= 0
##$CFRGTYP= 5
##$CHEMSTR= <none>
##$CNST= (0..31)
1 1 145 1 1 1 1 1 1 1 1 1 1 1 1 1 1 1 1 1 1 1 1 1 1 1 1 1 1 1 1 1 
##$CPDPRG= <>
##$CPDPRG1= <>
##$CPDPRG2= <>
##$CPDPRG3= <>
##$CPDPRG4= <mlev>
##$CPDPRG5= <mlev>
##$CPDPRG6= <mlev>
##$CPDPRG7= <mlev>
##$CPDPRG8= <mlev>
##$CPDPRGB= <>
##$CPDPRGT= <>
##$D= (0..31)
0 0.7 0 0 0 0 0 0 0 0 0 0.03 0 0 0 0 0 0 0 0 0 0 0 0 0 0 0 0 0 0 0 0 
##$DATE= 1755165099
##$DBL= (0..7)
120 120 120 120 120 120 120 120 
##$DBP= (0..7)
150 150 150 150 150 150 150 150 
##$DBP07= 0
##$DBPNAM0= <>
##$DBPNAM1= <>
##$DBPNAM2= <>
##$DBPNAM3= <>
##$DBPNAM4= <>
##$DBPNAM5= <>
##$DBPNAM6= <>
##$DBPNAM7= <>
##$DBPOAL= (0..7)
0.5 0.5 0.5 0.5 0.5 0.5 0.5 0.5 
##$DBPOFFS= (0..7)
0 0 0 0 0 0 0 0 
##$DE= 6
##$DECBNUC= <off>
##$DECIM= 32
##$DECNUC= <off>
##$DECSTAT= 4
##$DIGMOD= 1
##$DIGTYP= 9
##$DL= (0..7)
0 120 120 120 120 120 120 120 
##$DP= (0..7)
150 150 150 150 150 150 150 150 
##$DP07= 0
##$DPNAME0= <>
##$DPNAME1= <>
##$DPNAME2= <>
##$DPNAME3= <>
##$DPNAME4= <>
##$DPNAME5= <>
##$DPNAME6= <>
##$DPNAME7= <>
##$DPOAL= (0..7)
0.5 0.5 0.5 0.5 0.5 0.5 0.5 0.5 
##$DPOFFS= (0..7)
0 0 0 0 0 0 0 0 
##$DQDMODE= 0
##$DR= 18
##$DS= 0
##$DSLIST= <SSSSSSSSSSSSSSS>
$$ [...]
##$SUBNAM0= <"">
##$SUBNAM1= <"">
##$SUBNAM2= <"">
##$SUBNAM3= <"">
##$SUBNAM4= <"">
##$SUBNAM5= <"">
##$SUBNAM6= <"">
##$SUBNAM7= <"">
##$SUBNAM8= <"">
##$SUBNAM9= <"">
##$SW= 18.0517328524113
##$SWIBOX= (0..15)
0 0 2 0 0 0 0 0 0 0 0 0 0 0 0 0 
##$SW_h= 3612.71676300578
##$TD= 16384
##$TD0= 1
##$TE= 0
##$TE2= 300
##$TE3= 300
##$TEG= 300
##$TL= (0..7)
0 120 120 120 120 120 120 120 
##$TP= (0..7)
150 150 150 150 150 150 150 150 
##$TP07= 0
##$TPNAME0= <>
##$TPNAME1= <>
##$TPNAME2= <>
##$TPNAME3= <>
##$TPNAME4= <>
##$TPNAME5= <>
##$TPNAME6= <>
##$TPNAME7= <>
##$TPOAL= (0..7)
0.5 0.5 0.5 0.5 0.5 0.5 0.5 0.5 
##$TPOFFS= (0..7)
0 0 0 0 0 0 0 0 
##$TUNHIN= 0
##$TUNHOUT= 0
##$TUNXOUT= 0
##$USERA1= <user>
##$USERA2= <user>
##$USERA3= <user>
##$USERA4= <user>
##$USERA5= <user>
##$V9= 5
##$VALIST= <valist>
##$VCLIST= <CCCCCCCCCCCCCCC>
##$VD= 0
##$VDLIST= <DDDDDDDDDDDDDDD>
##$VPLIST= <PPPPPPPPPPPPPPP>
##$VTLIST= <TTTTTTTTTTTTTTT>
##$WBST= 1024
##$WBSW= 4
##$XGAIN= (0..3)
0 0 0 0 
##$XL= 0
##$YL= 0
##$YMAX_a= 325446
##$YMIN_a= -445680
##$ZGOPTNS= <>
##$ZL1= 120
##$ZL2= 120
##$ZL3= 120
##$ZL4= 120
##$ABSF1= 10
##$ABSF2= 0
##$ABSG= 5
##$ABSL= 3
##$ALPHA= 0
##$AQORDER= 0
##$ASSFAC= 0
##$ASSFACI= 0
##$ASSFACX= 0
##$ASSWID= 0
##$AUNMP= <proc_1d>
##$AZFE= 0.1
##$AZFW= 0.1
##$BCFW= 1
##$BC_mod= 2
##$BYTORDP= 1
##$COROFFS= 0
##$CY= -3
##$DATMOD= 1
##$DC= 2
##$DFILT= <>
##$DTYPP= 0
##$F1P= 0
##$F2P= 0
##$FCOR= 0.5
##$FTSIZE= 0
##$FT_mod= 4
##$GAMMA= 1
##$GB= 0.15
##$INTBC= 1
##$INTSCL= 1
##$ISEN= 128
##$LB= 0.25
##$LEV0= 0
##$LPBIN= 0
##$MAXI= 10000
##$MC2= 0
##$MEAN= 0
##$ME_mod= 0
##$MI= 1.114404
##$NCOEF= 0
##$NC_proc= 0
##$NLEV= 6
##$NOISF1= 3.799351
##$NOISF2= 2.8
##$NSP= 1
##$NTH_PI= 0
##$NZP= 0
##$OFFSET= 14.38212
##$PC= 1
##$PHC0= -1560.025
##$PHC1= 10.19228
##$PH_mod= 1
##$PKNL= yes
##$PPARMOD= 0
##$PSCAL= 0
##$PSIGN= 0
##$REVERSE= no
##$SF= 200.129724274929
##$SI= 16384
##$SIGF1= 3
##$SIGF2= 2
##$SINO= 400
##$SIOLD= 16384
##$SREGLST= <1H.CDCl3>
##$SSB= 0
##$STSI= 0
##$STSR= 0
##$SW_p= 3205.1282051282
##$SYMM= 0
##$S_DEV= 0
##$TDeff= 0
##$TDoff= 0
##$TI= <>
##$TILT= no
##$TM1= 0
##$TM2= 0
##$TOPLEV= 0
##$USERP1= <user>
##$USERP2= <user>
##$USERP3= <user>
##$USERP4= <user>
##$USERP5= <user>
##$WDW= 1
##$XDIM= 8192
##$YMAX_p= 0
##$YMIN_p= 0
$$ End of Bruker specific parameters
$$ ---------------------------------
##NTUPLES= NMR FID
##VAR_NAME=  TIME,          FID/REAL,        FID/IMAG
##SYMBOL=    X,             R,               I
##VAR_TYPE=  INDEPENDENT,   DEPENDENT,       DEPENDENT
##VAR_FORM=  AFFN,          ASDF,            ASDF
##VAR_DIM=   8192,          8192,            8192
##UNITS=     SECONDS,       ARBITRARY UNITS, ARBITRARY UNITS
##FACTOR=    0.0002768,     1,               1
##FIRST=     0,             0,               0
##LAST=      2.2672688,     0,               0
##MIN=       0,             -445680,         0
##MAX=       2.2672688,     325446,          0
$$ Real data points
##PAGE= N=1
##DATA TABLE= (X++(R..R)), XYDATA
0 0 0 0 0 0 0 0 0 0 0 0 0 -8 8 -8 8 -8 12 -16 16 -20 24 -31 32 -40 48 -56 64 -72 81 -95 108 -124 140 -156
34 -156 178 -196 221 -247 276 -308 343 -380 422 -464 514 -568 628 -691 762 -838 921 -1017
52 -1017 1121 -1238 1371 -1520 1691 -1892 2126 -2406 2746 -3171 3721 -4457 5497 -7076 9745
67 9745 -15079 29741 -155290 -445680 39153 218992 10782 139843 325446 9401 -142958
78 -142958 144194 114406 -252139 -168125 75959 -92186 -186655 54882 51466 -83633 102303
89 102303 187097 -115981 -165645 136204 138923 -38117 117689 175178 -145831 -185372 74296
100 74296 -54880 -257021 36435 247633 -38350 -147984 98119 71048 -107786 70862
110 70862 160918 -155390 -194040 157056 184373 -33247 10916 44530 -150388 -133259 82571
121 82571 8290 -133843 61571 170824 -48924 -86427 63819 -30213 -96289 124031 144390
132 144390 -112939 -76017 161275 57880 -127806 1333 33346 -183702 -122445 120442
142 120442 38911 -77087 113552 166850 -78707 -119742 64163 47315 -28025 92210 77267
153 77267 -137677 -104934 74691 -4966 -114482 -8724 16764 -73822 26217 156261 33931
164 33931 -43824 103000 76362 -135438 -96838 53518 -14142 -38580 100572 37584 -161630
175 -161630 -82768 100334 24613 -57809 68693 78557 -59761 -6126 94444 -20254 -82123
186 -82123 33279 15995 -113745 -52975 78793 42537 12621 74813 -2535 -124811 -23235
197 -23235 86124 -3168 -33484 54986 12030 -79187 -5506 51796 -45698 -45975 82514 42325
209 42325 -79455 -4092 85988 5245 -28205 27106 -36073 -114464 -10562 91732 23351
220 23351 -17893 44111 11966 -60048 -2598 38878 -24638 -11627 53453 -4346 -74867 -10940
232 -10940 40221 -10533 -10871 33926 -21325 -54774 51589 90132 -3565 -20777 21241 -32340
244 -32340 -76931 -5218 34170 -17881 -6064 50494 -4499 -64270 5952 55077 10363 3649
256 3649 23129 -20216 -39745 20020 38638 -17455 -28985 -1289 -26163 -32878 28758 42505
268 42505 5288 18735 23742 -36506 -53635 7674 32045 -1840 -1476 10190 -30316 -34175 32679
281 32679 42691 -5415 -3463 14692 -12219 -21805 14266 23891 -8490 -16328 -10287 -35840 -34443
294 -34443 19264 41188 21903 13705 1520 -19512 -8683 20801 18881 -5455 -10313 -10984 -28071
307 -28071 -18397 15410 14962 66 5551 1115 -15312 -4171 26028 30351 4455 -15059 -19915
320 -19915 -26824 -16179 12944 20128 6540 -2722 -6477 -2350 5657 13121 18626 9403 -11556 -22686
334 -22686 -19545 -6887 6457 10542 6214 -7766 -18749 -4774 14905 20333 21829 11612 -11027
347 -11027 -20300 -13443 -3631 5021 10213 3811 -14530 -19224 270 9668 10369 24141 15103 -18606
361 -18606 -22909 -2538 1504 -1568 10358 9014 -20370 -25189 8019 17808 8784 22845 18567 -18345
375 -18345 -23755 2678 5208 -4388 5753 3208 -28211 -29332 6455 13310 8000 28664 21038 -18063
389 -18063 -13892 15709 8664 -4285 10158 -186 -39788 -30556 12771 5852 -7817 22673 18107
402 18107 -23901 -11277 28705 16765 -442 19298 8298 -40260 -31279 13331 1909 -14744
414 -14744 14296 7223 -31196 -7808 32418 13728 -2021 23118 10779 -33320 -14357 25387
426 25387 421 -15088 17249 -1280 -45747 -13439 29809 3980 -9219 22333 7196 -37193
438 -37193 -6655 37396 4411 -11116 27501 8279 -37909 -4296 32547 -1845 -16475 13946
450 13946 -8660 -51712 -11785 31906 -3410 -11650 28440 3833 -33270 15602 48981 4772
462 4772 -4094 29611 -4456 -51725 -8615 23547 -25329 -28574 17959 -12543 -47945 12154 48658
475 48658 5058 5121 44504 7612 -36748 12225 39313 -17353 -22601 14210 -28316 -62501 1478
488 1478 32257 -13405 -5743 34853 -1572 -31193 30704 52226 -8404 -6675 29573 -21526 -54101
501 -54101 10029 25313 -31100 -18613 25491 -14577 -40537 28019 46456 -14645 -1087 40317
513 40317 -12599 -42440 23414 33648 -24101 -9413 23898 -29913 -53274 22166 37700 -22813
525 -22813 -5620 30716 -21742 -33462 42376 40264 -26818 -7505 30309 -18610 -33370 34574
537 34574 28466 -39349 -13423 23835 -33649 -43660 32604 30553 -26279 3268 37758 -15521
549 -15521 -27066 41853 33071 -29016 1509 30948 -33692 -44330 25248 14691 -38584 -7266
561 -7266 17814 -34661 -24889 59870 47876 -21113 3383 26072 -30607 -21784 45544 12625 -49372
574 -49372 -8008 23353 -32018 -32241 33801 13810 -33570 16672 40720 -24950 -17997 50343 20845
587 20845 -36228 -2451 12603 -42258 -26460 44339 17753 -31988 11027 23895 -39427 -22859
599 -22859 46361 19805 -24937 11402 16413 -38662 -14798 50796 9274 -48671 -4161 19331
611 19331 -23245 1767 50768 423 -42467 8524 20904 -35948 -20013 39568 12409 -20577
623 -20577 23295 17894 -44157 -14492 45686 5219 -34089 7629 13304 -30831 -2824 41739
635 41739 -7605 -42854 10708 16952 -29809 6145 56569 11108 -25173 7976 -606 -42776
647 -42776 -3651 44082 -6548 -40289 10557 17099 -23236 3270 30954 -16105 -27240 28154
659 28154 23874 -24701 89 38675 -2947 -30163 3386 -8717 -39278 12271 51708 -595
671 -595 -28523 8144 4440 -26116 4652 29068 -15208 -23006 27149 14797 -27014 5672 32343
684 32343 -11591 -25915 8517 -51 -19623 22120 40441 -18502 -38737 4167 -104 -23801
696 -23801 11637 29055 -8341 -5113 29432 3317 -32588 1720 27175 -10686 -20101 9381
708 9381 -5005 -17409 24435 28262 -26659 -31891 9487 7883 -6339 21319 26042 -14163 -13686
721 -13686 13920 -12239 -33882 7872 25964 -6449 -8775 12897 -1139 -10067 20045 17346 -27322
734 -27322 -22480 17121 8706 -7069 14325 9114 -23261 -13597 8826 -10263 -17179 22087 32519
747 32519 -3772 -10233 5522 -9786 -12031 17704 8683 -25804 -11758 19513 8729 -6275 6868
760 6868 1649 -21124 -7687 13209 -4265 -6792 24658 20440 -14139 -16914 -3950 -8134 -1230
773 -1230 21147 10979 -17259 -5281 16601 332 -11820 1406 -3147 -14836 553 12263
785 12263 -1475 -1265 18742 11504 -17582 -16919 -33 -264 8140 21349 2528 -20095 -9331 4644
799 4644 -3980 -7907 4706 6006 -1430 7661 11431 -4005 -2460 11811 418 -18974 -13910 -280
813 -280 4769 9799 11809 -5029 -19508 -5855 8884 3272 3239 12039 7528 -151 727 -3372 -10552
828 -10552 -5583 4570 -1105 -13180 -7517 5559 8741 9729 5359 -9206 -12540 670 10562 8619
842 8619 5511 5198 1453 -5840 -7686 -7759 -7266 1116 7361 -152 -7130 -5034 2692 8495 5340 -2163
858 -2163 -6914 -4508 5726 12387 8835 2918 -1930 -5283 -7407 -10049 -7092 1838 5964 4038 -703
873 -703 -7454 -6636 3894 10414 6811 -1021 -2091 2788 4201 5154 4241 -5065 -10002 -5836 -6047 -8111
889 -8111 -583 9100 9068 2284 -1497 -3920 -5568 4836 14768 5049 -5447 -2323 -1743 -5279 -2276
904 -2276 784 -5545 -7715 857 2927 -3164 4558 15423 6647 -3461 -1541 -4356 -7033 4731
918 4731 11854 -1155 -11463 -4302 -2155 -8483 -634 8507 -930 -3368 8007 4771 -4402 5071
932 5071 12605 159 -8882 -1723 -2033 -7601 4777 11743 -6712 -13785 -822 -1153 -6705 5194
946 5194 12228 36 -3534 7962 3648 -7288 5119 12625 -5165 -10586 1473 -2517 -8891 4245
960 4245 8526 -10210 -12983 4069 2895 -4399 10046 15560 -3757 -5089 8369 -296 -9096 6439
974 6439 9951 -10156 -12676 2283 -2710 -9846 7700 10678 -10649 -7761 10725 3308 -3658 11819
988 11819 11440 -10014 -8628 6681 -2546 -10598 7694 8969 -14202 -9564 8033 -2125 -7023 11937
1002 11937 11254 -9794 -4811 11106 -83 -7673 11203 8932 -14801 -8299 7802 -5323 -9290
1015 -9290 10708 7171 -14667 -6282 10972 -900 -5526 14844 10012 -14356 -3738 12254 -4027
1028 -4027 -7589 11636 4413 -18059 -6533 10092 -5987 -9505 12851 6465 -15288 -200 14328
1041 14328 -4054 -5161 16714 7439 -14866 -3018 10528 -7061 -8117 13643 2063 -21584
1053 -21584 -4715 10809 -5960 -4132 16093 4243 -15454 1750 15763 -3656 -5012 15356
1065 15356 1553 -19164 191 11497 -8913 -7398 11736 -1592 -19001 1514 14056 -5713
1077 -5713 -4077 17209 2849 -16059 4082 11697 -9552 -3403 16684 -143 -19063 9 9843
1090 9843 -8790 -2534 16009 -3820 -19744 5881 15139 -5492 -590 13987 -5073 -17742 6034
1103 6034 12401 -9567 -3989 14364 -4198 -16816 6993 9989 -10745 -1107 15504 -3041 -14200
1116 -14200 7611 10326 -10961 -2114 14334 -5670 -16646 6412 8047 -10151 1812 15771
1128 15771 -6524 -16374 7005 10810 -6891 2991 14520 -8705 -15584 10432 9267 -11644 -1415
1141 -1415 9592 -9273 -12241 11083 8226 -11736 679 14206 -6796 -11503 11769 7378 -10202
1154 -10202 4127 12654 -9796 -13610 8043 5060 -11714 2197 11694 -10585 -11802 11844 6355
1167 6355 -8681 5483 10754 -10276 -9792 12564 7303 -9424 1945 7597 -12974 -10415 12732
1180 12732 4298 -10461 3737 8964 -9276 -6599 12808 4443 -9668 4471 9555 -11510 -8589
1193 -8589 11152 1388 -9773 5258 6970 -11859 -6985 11950 4284 -7195 6579 7672 -12260
1206 -12260 -5829 13192 2124 -9105 4520 3578 -13020 -5312 11562 1289 -8525 5331 6411
1219 6411 -10992 -3264 12838 1017 -7024 6713 4712 -10731 -3025 10405 -926 -9015 4001
1232 4001 3182 -11837 -2814 11222 -816 -6065 7214 3806 -10003 -1209 11746 1232 -5196
1245 -5196 5977 1841 -11801 -1411 10059 -3613 -8238 3862 1093 -8343 1603 10105 -1067
1258 -1067 -5469 6642 2709 -9228 811 10412 -1075 -4458 4455 -2172 -10941 8 8733 -2211
1272 -2211 -5124 5279 2072 -6850 2901 8486 -3427 -4247 4944 -744 -8278 1272 8056 -1345 -4186
1287 -4186 2327 -2572 -7968 4211 10161 -935 -2756 4304 -485 -5760 1302 4088 -4328 -3488 4491
1302 4491 -870 -7072 2211 6589 -1887 -2788 1811 -2697 -3676 6264 8189 -1300 -3699 2101 -1561
1317 -1561 -5624 1490 3001 -3379 -469 3865 -2584 -5914 1174 4424 -857 -1713 1926 -708 -982
1332 -982 7219 5946 -3668 -3659 188 -2465 -3220 1463 1809 -1929 -765 1583 -3591 -5287 2212 5083
1348 5083 892 785 1629 -307 1487 4222 1362 -4700 -4692 -305 -659 -1016 2088 1316 -1310 109 -333
1365 -333 -3526 -1892 3528 5408 2181 -548 -1159 -1608 -13 2096 -518 -4071 -1804 1104 1563 974
1381 974 74 -240 -683 -898 -1661 -1821 705 4395 4747 1050 -2575 -3949 -1562 1508 1088 -240 -1098
1398 -1098 -1254 595 1589 -793 -1518 -711 797 432 -866 764 3006 3225 2534 -785 -5655 -4932 100
1415 100 1909 828 -518 -491 -1038 -732 1166 439 -1775 2282 4472 1038 -632 1081 1353 -326 -792
1432 -792 -2528 -6073 -4535 2837 4047 -432 113 528 -1846 -458 2649 773 -445 3077 4287 -1132
1448 -1132 -3915 -179 -371 -2488 -71 -689 -5059 -1043 5485 3173 -2409 -760 435 -2022 -512
1463 -512 4280 1370 -1468 3608 3123 -4728 -4682 585 -37 -1640 1053 681 -4073 -512 6130 1192
1479 1192 -4267 323 1904 -1951 1381 5195 -2 -2770 1919 685 -6798 -4234 3447 1294 -936
1494 -936 3152 1181 -4637 685 6372 -189 -4271 1204 2065 -2792 -196 3599 -2756 -4530 2093
1509 2093 408 -6394 -164 6831 2519 -425 2875 1 -5537 623 5380 -2196 -5261 2231 1238
1524 1238 -4537 -141 2839 -3101 -2655 4459 1784 -4438 1805 7367 123 -2872 2259 -1441 -5982
1539 -5982 1709 5202 -2752 -3877 3070 674 -5354 383 3956 -2772 -1497 5725 708 -4656 2794
1554 2794 5823 -2469 -3203 2484 -1187 -4654 3162 5120 -4369 -3994 3818 -669 -5430 2266 4070
1569 4070 -2731 -104 5732 -331 -5503 2991 4934 -3882 -2827 3441 -1955 -4812 3961 4085 -4683
1584 -4683 -2627 4214 -588 -3927 4254 5156 -3568 -1357 4587 -2716 -5510 3660 3015 -5523 -1939
1599 -1939 4184 -1555 -3375 4893 3827 -5179 -618 5898 -1852 -4209 4371 2417 -4901 -1005 3252
1614 3252 -3811 -4756 4669 3895 -4545 72 4679 -2661 -2746 5759 2770 -5253 -528 3937 -2947 -3131
1630 -3131 5092 1678 -5623 -257 4282 -3171 -2590 5416 1524 -5570 615 4358 -2778 -2739 5105 1638
1646 1638 -4916 913 4043 -4103 -2596 5528 1035 -5208 364 2838 -4130 -2114 5179 1308 -5115
1661 -5115 1557 3707 -3600 -1207 5706 -461 -5424 1022 2707 -3329 -1021 5257 -657 -5399 1975
1676 1975 3706 -3395 -671 5063 -828 -4254 2478 2291 -4982 -2200 4837 -528 -4448 2223 3013
1691 3013 -3470 366 5830 -805 -4701 2020 2625 -3566 -290 4372 -2097 -5110 2123 1408 -4572
1706 -4572 184 5177 -821 -3004 3271 2652 -2963 663 4461 -2448 -4383 3412 2082 -3897 71
1721 71 3547 -2927 -3604 2281 756 -3776 1282 5537 -975 -3491 2274 627 -3429 1496 3966 -3049
1737 -3049 -3033 3439 1700 -3403 25 2518 -2922 -3043 3096 491 -3459 2039 4432 -2115 -2693 2566
1753 2566 681 -2224 2264 3367 -3067 -2312 3287 162 -4063 182 2394 -2660 -1182 3538 416
1768 416 -2518 2176 3207 -3000 -2917 2137 220 -1951 2483 1922 -3672 -1946 3053 18 -2825 1346
1784 1346 2569 -1941 -514 3102 -931 -2762 1784 1820 -3225 -1662 2411 553 -892 2061 797
1799 797 -3536 -1301 2710 -534 -2123 1931 1858 -1588 -188 1826 -1279 -1871 2199 1662 -2245 -832
1815 -832 2173 -17 -1411 1180 -663 -3428 -555 2595 -52 -1005 1785 1544 -1461 -236 1647 -1104
1831 -1104 -1217 2136 863 -2573 -963 1126 -969 -1370 865 -17 -1933 983 3192 132 -483 1584
1847 1584 563 -1513 -180 532 -904 -250 1365 97 -2475 -989 797 -459 -426 1291 300 -750
1863 -750 1390 1519 -202 -753 580 -353 -1227 136 742 -602 8 1074 -640 -1499 -62 940 194
1880 194 384 645 -68 -368 692 716 -749 -836 314 -368 -508 152 241 166 -1 387 -567 -705 560 1377
1900 1377 723 240 323 -581 -698 54 -446 -478 -372 -42 -4 -321 149 661 274 699 652 455 495 459 558 501
1922 501 -670 -1143 -960 -946 -612 -223 -36 8 -224 46 432 418 782 951 176 -93 101 -86 -440 -91 -46
1943 -46 -668 -1112 -266 131 -398 316 676 -109 -322 672 599 -255 681 775 -204 -829 -110 118 -696 -216 626
1964 626 -422 -954 574 -26 -486 167 1081 -192 -372 703 717 -395 112 702 -897 -901 694 -91 -845
1983 -845 13 1042 -447 -922 285 468 -602 419 951 -685 -573 1030 171 -792 -70 197 -1119
2000 -1119 -549 623 405 -994 374 1256 -798 -573 939 198 -540 1109 648 -1439 -982 1060 188
2017 188 -1435 -34 864 -724 22 1313 -156 -1142 974 995 -942 -678 905 169 -840 846 354
2034 354 -1573 -742 1253 -56 -1252 848 727 -610 -58 1154 -684 -1349 1214 1003 -1276 -108
2050 -108 1415 -304 -770 796 -102 -1796 -137 1716 -153 -995 980 638 -1292 81 1061 -1063
2066 -1063 -954 1606 906 -1400 -233 1530 -545 -1011 1146 159 -1778 958 2149 -510 -1131 965
2082 965 -24 -1465 -12 958 -878 -806 1548 378 -2099 125 1434 -793 -262 1594 80 -1191
2098 -1191 1093 1752 -1098 -1661 935 -239 -1897 511 594 -1302 -327 1835 -74 -2063 213 1441
2114 1441 -437 186 1856 -263 -1687 1146 990 -1392 -900 1347 -309 -1220 885 948 -1516 -327
2130 -327 1709 -826 -1718 1128 1641 -964 183 1463 -1039 -1775 1297 906 -1637 -519 1962 -355
2146 -355 -1188 1138 141 -1474 305 1612 -1224 -1471 1608 1423 -978 -99 1057 -1300 -1196 1771 523
2163 523 -1672 165 1808 -949 -1171 949 67 -1436 793 1795 -1111 -1340 1795 432 -1932 -15
2179 -15 942 -1444 -695 1730 152 -1630 537 1471 -1503 -1038 1436 -111 -1243 1153 1354 -1824 -867
2196 -867 1756 205 -1843 58 1183 -927 57 2006 -175 -1815 801 1110 -1120 -367 1186 -207
2212 -207 -1001 1194 1091 -2030 -783 1702 -79 -1301 959 803 -1765 34 1439 -602 -1567 943
2228 943 1164 -1370 231 1967 -462 -788 936 242 -1824 -39 1485 -326 -1288 878 822 -1454 34
2245 34 1809 -648 -993 1282 666 -1394 36 1072 -841 -1221 1061 243 -1896 330 1743 -771
2261 -771 -983 1233 378 -1216 298 1232 -759 -810 1173 358 -1721 295 1007 -768 -733 1359 35
2278 35 -1453 666 1342 -1037 -866 1340 202 -1227 227 1292 -1235 -663 1308 -137 -1438 554
2294 554 921 -823 -425 1281 535 -1282 874 1280 -925 -482 1222 -393 -866 686 488 -1096 -463
2311 -463 756 -522 -1198 714 959 -1108 147 884 -207 -756 936 597 -705 -443 1200 -249 -1037
2328 -1037 586 299 -1049 -461 1079 -400 -659 871 739 -706 3 1162 -91 -597 790 346 -1153
2345 -1153 -173 588 -892 -929 699 463 -716 130 822 -333 -633 914 230 -683 17 967 -358 -507
2363 -507 283 101 -1101 96 727 -500 -430 840 376 -772 339 223 -347 -164 418 9 -486 3
2381 3 554 -274 -418 578 -175 -473 371 158 -388 -97 554 354 -427 -188 278 -260 -49 545 -102 -528 80
2402 80 157 -386 -164 127 -61 -21 81 296 -484 20 477 -86 -460 197 176 55 283 94 -260 -298 -21 155
2424 155 -222 -12 396 20 -18 -23 156 -448 99 268 -31 -239 -32 172 119 97 -272 -239 -99 138 238 45
2446 45 11 77 329 19 -177 -327 -145 100 183 251 -53 65 37 259 -257 -285 33 26 -4 25 116 -259 -243 270
2470 270 28 -417 -194 113 291 -201 61 -241 -353 159 335 -276 -329 439 265 110 8 85 -245 -416 146
2491 146 36 -574 -49 689 -147 -269 92 -208 -553 139 618 -86 -220 496 91 -382 294 -274 -568 -340
2511 -340 469 -51 -615 -56 622 -336 -414 108 20 -257 400 526 -432 -609 381 -54 -697 -181 325 -309 7
2532 7 715 -97 -690 -19 368 -569 -244 859 372 -255 350 645 -661 -160 785 -200 -847 166 373 -322
2552 -322 314 839 -380 -873 164 376 -722 -85 835 -283 -448 612 205 -606 -64 497 -339 -385 415
2571 415 436 -620 162 525 -402 -578 673 125 -566 68 415 -468 -651 445 286 -808 445 1081 -637
2590 -637 -558 920 -120 -888 40 937 -895 -198 1061 11 -1039 174 607 -933 -403 1046 207
2607 207 -1060 672 813 -510 -443 949 -114 -908 361 620 -1090 -386 1075 -86 -1060 437 764
2624 764 -771 -142 941 -225 -990 552 758 -929 -117 921 -230 -644 549 720 -1032 -308 1137
2641 1137 -316 -1093 500 493 -1007 107 811 -472 -983 769 508 -894 -118 886 -579 -786 1014
2658 1014 527 -1463 180 1202 -700 -638 790 248 -1081 202 1251 -564 -1021 828 164 -1282
2674 -1282 173 940 -840 -726 1131 161 -1092 130 1046 -457 -937 1098 7 -862 367 932 -957
2691 -957 -772 882 -5 -1092 323 897 -757 -696 1482 65 -1141 307 1101 -517 -369 846 -50
2708 -50 -1254 346 794 -1095 -646 1086 -201 -1165 644 544 -712 1 1248 -129 -902 341 978
2725 978 -932 -408 1103 -218 -1279 676 232 -1221 -277 967 -136 -928 630 623 -697 109 1433
2742 1433 -470 -885 779 779 -940 -288 824 -404 -690 763 274 -1391 -222 1344 -173 -629 826
2759 826 236 -1314 -134 952 -499 -835 942 504 -915 -144 764 -852 -968 822 352 -1247 70
2776 70 1201 -355 -1142 957 12 -1049 200 837 -665 -661 1285 417 -806 231 900 -754 -461 663
2794 663 118 -1148 305 1154 -760 -441 780 -131 -840 489 592 -947 -331 1090 421 -979 628
2811 628 567 -678 -286 1197 -86 -843 629 780 -685 -317 798 80 -800 294 695 -900 -333 1194
2829 1194 -34 -1086 581 608 -329 -11 905 -69 -903 556 503 -577 -258 756 -332 -277 660 140
2847 140 -467 -120 796 -111 -663 585 618 -535 65 455 -404 -352 831 319 -664 4 778 8 -547 507
2867 507 12 -918 239 674 -165 -580 597 375 -725 112 537 -276 -386 787 376 -584 45 828 -397
2886 -397 -212 416 -352 -448 156 611 -691 -458 575 121 -513 181 374 -248 -132 447 117 -147 193 448
2906 448 -196 -277 390 -11 -569 254 412 -511 -410 -128 -290 -110 164 -14 -300 199 462 -102 -291 245
2926 245 607 -195 2 359 -88 -496 -125 -305 -90 -161 483 57 -141 177 -131 -113 -87 230 -278 -68 103
2947 103 255 15 -213 96 376 -1 123 143 -36 -209 -17 50 -60 146 82 200 -68 -19 -108 -141 282 -94
2969 -94 196 171 -113 -50 -77 47 -37 71 109 196 -20 90 28 19 -71 -22 -146 114 105 -137 300 325 83 -65 107
2994 107 -52 -202 -208 -22 -93 -125 293 366 -61 144 -26 -372 -164 444 -197 -4 237 190 -4 -162 161 -159
3016 -159 -225 130 173 -487 -50 76 -153 -90 -250 304 -225 -81 400 11 -273 171 395 -315 -124 150 -99
3037 -99 -647 -123 570 -341 -525 619 44 -418 5 379 -225 34 843 411 -291 202 347 -302 -226 310
3057 310 17 -510 315 341 -274 -253 497 79 -461 285 171 -269 -401 587 -170 -991 372 607 -588 -259
3077 -259 523 -136 -395 330 292 -774 -176 396 -125 -337 622 338 -818 -197 357 -335 -591 466 363
3096 363 -222 -451 434 -283 -241 585 257 -568 -3 713 -91 -313 379 435 -899 -183 870 -532 -403 850
3116 850 237 -661 277 472 -557 -159 516 361 -679 175 923 -337 -709 539 -7 -770 195 701 -506
3135 -506 -209 788 115 -1036 -82 251 -731 -299 882 268 -773 203 692 -402 -106 499 40 -526 326
3154 326 595 -696 -276 677 -174 -987 231 519 -470 -46 1081 -190 -538 605 953 -749 -288 742
3172 742 -242 -577 818 443 -940 -398 643 -30 -870 371 361 -592 -45 926 -483 -1081 661 963
3190 963 -669 -9 591 -174 -776 541 249 -998 -68 1240 -208 -637 677 315 -961 -146 752 -528
3208 -528 -845 630 747 -1102 102 912 -378 -630 761 319 -847 524 1085 -94 -534 600 486
3225 486 -923 -32 603 -477 -475 1053 440 -687 200 824 -587 -461 854 102 -748 435 852 -617
3243 -617 -833 865 77 -820 211 954 -439 -466 1020 13 -730 124 755 -758 -583 826 -105 -708
3261 -708 305 509 -449 -526 724 -105 -409 484 746 -700 180 933 -288 -949 356 699 -708 -168
3279 -168 880 -131 -1132 351 689 -736 -265 902 -30 -351 505 355 -606 -222 1077 -229 -838
3296 -838 624 359 -782 -15 823 -375 -806 584 346 -590 72 648 -311 -527 536 388 -760 95
3314 95 601 -395 -295 651 173 -672 -261 858 -236 -637 511 196 -676 100 746 -397 -316 396 28
3333 28 -705 -114 657 -230 -619 394 -77 -745 -202 633 -320 -466 627 56 -558 171 687 -386 -276
3352 -276 736 97 -661 111 626 -476 -451 745 -224 -677 293 494 -183 -362 575 251 -652 266 620
3371 620 -101 -196 426 -197 -644 93 543 -636 -78 503 -222 -746 365 166 -564 -146 577 -212 -460 54
3391 54 381 -238 -212 700 -10 -401 404 540 -558 96 280 -277 -513 405 246 -347 -58 637 105 -301
3411 -301 200 99 -291 -118 226 6 -577 130 523 -477 -51 200 -145 -255 568 133 -402 183 604 10
3431 10 -249 58 247 -401 -29 32 -262 -445 296 -22 -296 -204 232 -358 3 461 46 -209 9 522 -205
3452 -205 -622 12 -311 6 96 -147 -163 -56 175 165 -202 54 114 204 89 244 37 -179 15 -73 -107 -547
3474 -547 199 319 -129 30 88 -278 -143 264 129 76 8 -55 188 83 -23 -163 -257 134 72 306 -76 83
3496 83 159 -44 -87 -155 -180 87 145 204 124 -329 276 -31 6 -167 -156 365 220 144 19 -170 -68 42 0 -219
3520 -219 -246 46 28 3 -145 81 180 149 252 -95 -83 43 162 24 82 -199 -34 -275 210 296 -165 -189 56
3543 56 124 -167 86 -270 -398 77 33 20 -46 249 88 259 -126 232 -129 -71 393 128 -452 -225 294 295 -290
3566 -290 187 131 -531 81 111 67 -174 65 102 -328 -24 -79 32 -212 318 226 -453 -139 363 -37 -218 298
3588 298 190 -287 -27 476 -496 -314 414 421 -388 96 237 80 -19 668 -92 -443 327 95 47 -245 -37
3609 -37 152 -233 -87 235 -160 -619 424 100 -167 340 320 -153 -271 263 117 -556 197 193 -167 -422 446
3630 446 26 -237 264 353 -468 -248 608 115 -229 274 331 -375 -168 339 -28 -661 129 533 -249 -304 356
3651 356 -131 -636 460 147 -91 -60 860 -73 -628 348 277 -213 -38 612 -305 -138 332 467 -746 14
3671 14 300 -178 -286 360 96 -370 -208 494 -428 -379 261 509 -470 215 522 -106 -79 423 257 -464 192
3692 192 582 -320 -643 411 135 -570 -24 468 -189 -460 535 28 -510 201 364 -86 -383 490 159 -633
3712 -633 280 530 -456 -320 469 135 -423 -41 462 -593 -336 488 -69 -741 58 445 -291 -184 643 54
3732 54 -672 277 414 -567 -446 435 -71 -648 179 109 -189 -96 471 54 -639 152 560 -424 -353 570 -6
3753 -6 -256 253 270 -455 70 508 -62 -412 153 -64 -441 -224 442 -12 -626 420 140 -592 52 589 -191
3774 -191 50 422 337 -515 -98 598 -240 -635 586 -116 -360 -39 412 -310 -333 232 189 -468 -101 652 -247
3795 -247 -168 448 358 -665 -25 432 -375 -578 460 311 -708 -167 438 -436 -460 414 204 -527 -2 287
3815 287 -88 -279 344 92 -687 243 295 -148 -343 249 -140 23 283 222 -332 -214 352 -85 -622 115 389
3836 389 -246 -281 442 -137 -267 387 613 -195 -290 281 145 -392 73 400 -375 -91 436 278 -408 41 343
3857 343 -204 -227 245 164 -671 244 476 -520 72 348 -208 -436 368 103 -328 -223 412 72 -471 86 354
3878 354 9 7 102 -259 -218 277 266 -123 -159 226 64 -489 540 102 -151 -112 123 -296 -414 65 155 -333
3900 -333 -28 169 -239 -594 320 167 -270 101 252 -108 -305 196 68 -292 65 516 -47 -217 165 255
3920 255 -164 21 47 -290 -2 418 233 -364 -285 354 -22 -131 560 144 -272 -14 209 -207 177 45 138
3941 138 -310 -111 55 -407 -507 107 -58 -222 103 445 -146 18 191 -71 -171 635 -136 -311 13 134
3961 134 8 -292 219 -97 -100 -217 349 116 -146 -81 105 -94 -7 302 108 -416 -106 -272 58 6 -154 -130
3983 -130 -125 193 204 186 -259 178 95 -162 -3 253 -142 95 185 95 155 58 113 -223 -44 85 37 -182 -6 154
4007 154 -351 -84 266 -134 -254 -78 -20 -131 -160 174 400 5 -151 14 17 21 -84 0 -180 -108 144 -155 29
4030 29 -147 110 99 -199 -53 49 246 188 0 58 -182 -139 -65 -7 -240 -43 -61 -106 -261 -42 -57 246 216 -29
4054 -29 70 -106 337 31 -10 -39 38 -87 -185 -1 153 -138 110 188 -48 159 -29 32 16 -6 123 -194 225
4077 225 99 122 28 255 -53 -102 157 76 -43 -184 232 185 -50 39 178 -343 138 83 -88 -238 -61 54
4099 54 -185 233 -42 -252 -99 123 159 -86 -1 180 11 -160 -40 77 96 -11 238 -203 -281 21 93 -390
4121 -390 -277 -35 222 -263 222 -14 -3 -137 59 165 34 87 -57 -321 83 91 -146 -164 196 -114 -374 -115
4143 -115 112 -372 -177 45 68 -190 -71 254 -31 -126 185 117 -14 -39 393 -5 -65 342 228 -30 51 160
4165 160 -128 -208 392 211 -409 66 117 104 -262 337 18 -138 80 349 -462 -58 365 -1 -495 126 297
4186 297 116 -284 -125 163 -259 157 309 -243 -53 280 42 -244 -126 74 -204 109 298 60 -76 3
4206 3 324 48 -113 -3 98 -200 103 196 169 -301 386 208 -134 198 116 -198 -181 447 256 -295 -42 205
4228 205 -131 -228 150 -155 -178 -6 93 -465 -197 457 -320 -306 171 49 97 34 359 -138 -160 211 64 -234
4250 -234 31 252 -45 9 68 154 -158 -89 293 -91 -162 -47 130 -55 -18 225 -99 -294 209 177 -159 125
4272 125 356 30 -191 -113 110 -141 -43 257 72 -225 -105 107 -444 81 437 198 -225 151 137 -392 205
4293 205 406 -122 144 399 -73 26 318 471 -15 -262 -86 -197 -190 249 429 -159 -193 141 -167 -36 -140
4314 -140 65 -88 -8 208 129 -265 -58 -187 -104 -61 248 44 -211 -46 169 -513 -185 268 -78 -20 250 286
4336 286 -14 -27 184 -8 -685 28 196 -209 46 180 227 -334 132 -7 -343 45 455 -211 -78 145 255
4357 255 -58 -60 117 69 -189 69 76 -283 128 76 27 -206 224 189 -217 -20 85 -24 -94 132 -30 -176 60
4380 60 227 -252 -147 150 -150 -86 -113 349 -235 -312 63 -85 -49 -4 113 181 35 88 -108 -428 -102 153 -73
4403 -73 -190 287 109 -130 137 69 -2 3 -133 -335 138 -89 83 162 -258 339 55 -5 218 8 -142 -28
4425 -28 71 -352 118 -10 81 -27 -81 -183 6 -138 121 -66 -323 -172 374 -80 -143 22 83 -50 -107 183
4447 183 365 94 133 131 -185 -65 5 -54 -255 46 208 -135 168 112 13 18 175 -104 -118 -100 104 -43 117 109
4471 109 284 259 -22 52 -152 -74 108 -172 -176 -224 57 116 -52 -10 90 -31 -57 -273 67 151 249 74 -74 58
4495 58 78 -313 -287 -80 124 42 129 -1 104 -77 171 -116 -56 -17 49 -152 -6 -14 291 -25 -261 -139 -32
4518 -32 -103 7 46 56 37 100 -65 -5 -102 -15 -148 -10 -100 -66 130 25 151 -46 184 -23 132 279 -158 -44
4542 -44 288 -131 -221 -43 19 -87 305 -323 -193 159 136 146 245 49 -200 -155 149 218 237 98 107 -180 -251 -255 -3
4567 -3 -57 63 -242 -123 8 122 108 -162 106 -75 95 76 26 -186 -351 105 -70 159 20 355 187 21
4589 21 116 122 225 -98 13 174 60 190 -71 -59 -74 -147 30 283 -8 -23 67 92 24 -20 143 146 -14 -81 -177
4614 -177 79 39 131 -167 -199 56 -233 -167 -32 -105 100 105 -49 61 -72 -57 12 -270 95 454 49 315 6
4637 6 -76 115 -25 -33 166 -232 30 268 -164 331 -37 -7 -300 -26 63 30 35 -69 83 -23 -42 13 -107 -33
4661 -33 -120 -103 47 -92 -37 -151 106 61 16 -112 -111 -152 -133 128 101 -26 -172 61 137 -292 107 -249 -105 103
4685 103 -52 -197 -87 -22 324 83 298 -97 128 -122 157 -88 -148 -123 154 211 48 0 -17 -160 -93 -232
4707 -232 6 55 -43 270 -111 103 38 155 115 -142 -277 44 65 90 -226 -74 65 170 -33 -129 -117 -191 182
4730 182 -30 -83 13 109 -340 -99 106 -228 120 193 -12 16 -120 6 -46 359 -141 267 -89 -10 46 208 48
4753 48 27 263 11 83 -43 -187 -84 106 98 175 -231 -258 136 88 -128 100 -303 -134 20 -43 -135 -155 35 16
4777 16 22 -84 -129 151 153 364 -41 -286 -127 -181 -29 2 -161 49 -64 -14 -177 279 82 75 -55 -8 115 176
4801 176 -9 -141 353 -250 75 129 -171 0 23 72 -31 108 108 180 102 -109 80 -159 -10 149 -29 -59 214
4824 214 152 38 -96 17 -60 -326 211 -123 16 -94 109 -42 47 -243 110 220 -127 96 129 111 -123 -43
4846 -43 14 -224 -159 -20 -37 -50 155 192 -132 -102 135 -35 51 271 152 252 26 -166 -232 171 -130 -115 81
4869 81 63 -132 -58 278 -92 -22 0 -171 -144 53 72 305 -66 198 198 -46 195 -16 18 -238 340 -131 -73 53
4893 53 -128 130 -99 192 28 5 68 -9 -64 -167 117 335 -191 189 128 60 71 -26 12 -66 86 137 129 48 32
4918 32 182 209 157 126 19 -65 -107 203 -288 -183 -87 -132 223 -25 -62 75 -4 55 -245 35 96 -178 137 -14
4942 -14 -198 -161 56 228 -5 -6 174 96 -209 35 -22 67 102 -167 -316 -72 -27 175 34 -71 196 2 235
4965 235 8 -269 172 -38 74 284 243 89 -124 -210 -89 152 53 -184 37 49 31 54 -78 -43 56 -86 2
4988 2 -170 131 77 -44 -106 95 53 -141 -17 73 210 63 143 307 -7 87 136 106 54 127 61 -11 -214 -314 -40
5013 -40 -169 -8 -74 -65 -19 -279 201 -159 -78 -78 -51 -148 -341 308 78 -79 88 -41 195 305 -65 31 -201 263
5037 263 -39 116 22 -232 -66 167 138 2 215 35 27 -35 -225 8 97 -3 22 -234 -12 153 88 -203 94
5060 94 -142 -82 135 -142 4 183 -179 127 -214 -352 -34 115 -189 29 128 7 -117 -74 128 -67 31 67
5082 67 -33 -18 106 123 12 -60 -172 -74 172 63 -68 106 -97 -292 -35 54 41 -168 -64 -65 -7 196 92
5105 92 120 -96 122 69 -187 -65 1 -34 -154 127 -71 285 59 -174 26 262 -290 -106 370 -14 36 4
5127 4 -272 5 57 -163 168 37 -27 -258 264 -90 88 -111 434 254 -143 -9 41 155 172 -437 -287 181
5149 181 -63 -113 121 156 70 -59 -9 -12 -29 -86 178 130 -25 168 136 -4 69 233 88 -11 369 -76 -338 -59
5173 -59 11 -109 -38 -150 -46 -16 -126 -43 80 38 99 28 64 -33 130 131 -103 -32 252 247 36 -44 74 -227 157
5198 157 94 12 -6 -95 -65 134 -1 -81 24 77 -101 77 7 35 163 258 70 -212 -84 -76 -34 -4 66 -216 159
5223 159 -164 -86 -239 93 118 -108 29 -71 101 -166 -71 -159 -178 -76 -169 195 185 -28 144 74 218 0 -231
5246 -231 39 -107 208 183 -46 109 102 -59 -378 -68 83 72 -168 46 -63 -179 -223 -45 108 -26 -224 35
5268 35 84 99 -8 -16 -179 -195 137 114 278 112 304 -302 89 -57 -3 104 38 -63 -16 5 -92 103 -3 93
5292 93 -96 -32 69 -25 241 -228 82 -106 -74 85 -76 -65 -258 166 44 -139 -233 6 76 107 -154 -17 -52
5315 -52 -53 50 -410 -81 154 142 -111 -110 -139 44 255 9 -47 13 2 137 45 -2 -41 -266 -143 173 29 27 15
5340 15 -29 -28 61 218 -14 -293 -240 -23 27 -464 88 -110 -31 31 317 -24 -288 20 75 119 -283 4 -50 38
5364 38 -92 -17 -37 29 -223 68 -13 43 217 -310 -155 87 -138 -130 -61 -17 -55 -166 35 7 -277 115 -173 -358
5388 -358 -65 -133 95 -19 -271 380 21 176 -82 -91 3 40 -130 -190 -42 -77 69 -186 139 -92 -154 -50 204
5411 204 -28 5 -5 106 16 -213 150 -116 -64 119 -68 -243 329 60 -199 205 183 67 -161 -180 49 -201
5433 -201 -262 -106 -123 -82 5 45 100 -126 216 143 44 -53 47 -49 -46 73 -80 -69 19 62 139 -132 -119 202 -81 -58
5459 -58 52 -85 7 -136 208 203 59 125 20 51 -43 -65 -24 104 -133 -46 -180 106 -102 26 209 -33 -268
5482 -268 118 73 18 -386 52 -89 -95 -5 186 -138 -89 -41 9 -63 -105 -67 -91 -9 -41 179 15 -91 -138 -67 -171
5507 -171 -108 -143 -101 -47 112 -135 98 296 138 -18 -448 2 47 265 140 100 -132 -34 -18 -48 266 -143 -89
5530 -89 169 -69 330 -3 -150 162 -138 175 27 -31 -16 -233 -145 23 111 -151 -52 -142 335 -46 -65 85 -9
5553 -9 -53 114 -88 190 88 -35 -48 65 -57 -48 221 -20 0 -11 -70 -23 33 -114 113 -31 -83 -149 147 -196
5577 -196 119 -115 31 -189 -138 -8 -152 -50 246 68 221 285 -23 158 -80 192 291 173 76 -94 202
5598 202 -2 -204 188 -35 -6 130 218 58 -73 -10 -24 21 -169 89 -51 -99 -124 8 -282 -110 -88 -195 24
5621 24 269 -59 -44 -208 22 -13 -106 176 116 184 -60 -33 49 39 -285 105 276 31 -79 55 -150 -127 34
5644 34 -76 -96 13 85 179 3 126 95 310 104 -59 204 149 -87 -47 49 -119 -235 -68 -189 -41 81 -56
5667 -56 128 244 17 -44 -7 69 24 -14 147 -75 44 -227 31 36 187 -160 -98 50 -84 61 34 64 -50 -58
5691 -58 199 20 156 79 83 43 73 49 -175 148 -121 58 -187 -140 -36 -185 -122 331 102 -215 -39 59 31 -18
5715 -18 48 -172 -8 20 38 219 2 -234 -146 -66 40 -22 158 193 -79 145 266 -81 -45 -83 -154 -150 -152 -48 26
5740 26 -42 -181 61 8 128 -17 107 -157 -165 385 124 -197 -332 494 -27 -80 -167 -86 -201 -17 178 0 259
5763 259 -101 133 53 -350 156 286 165 -164 -104 155 55 -227 -147 -47 -8 -101 11 51 -62 -71 -255 -84 262
5786 262 69 110 84 -114 4 -14 135 148 124 -134 6 190 88 69 103 85 -105 23 -80 -57 -8 -86 -43 14
5810 14 -87 65 54 64 -100 -30 53 115 -195 -120 152 32 -150 -84 -155 37 28 -63 104 102 -13 7 183 -103 -156
5835 -156 -230 87 -48 54 37 165 -53 -211 -119 -87 33 22 183 -160 -208 337 191 -99 90 -254 -341 -72
5857 -72 18 137 -1 -175 -59 -171 90 112 -105 -155 87 119 -154 54 283 122 13 -205 23 -169 -173 116
5879 116 -198 165 -118 274 43 -118 42 45 -166 -9 191 -258 50 -20 -174 -137 -221 238 56 -208 120 52
5901 52 -109 100 64 -379 -69 174 94 -29 99 78 35 21 298 -68 -164 53 120 -95 122 276 -122 -49 19
5924 19 104 -280 -179 -109 243 90 -11 -170 -147 -51 -50 46 -88 -83 141 -31 -410 104 393 -238 346 182 -170
5947 -170 70 -96 -157 -134 106 110 -55 222 -35 81 -257 96 188 20 -18 -122 427 -137 -5 5 -57 182 79
5970 79 37 48 130 -266 -248 43 -75 -84 -143 -108 141 -117 124 -91 -8 34 36 -91 -109 108 466 -29 -47 116 287
5995 287 55 6 193 -38 -299 137 -37 -34 -176 5 130 27 266 -98 -20 -266 145 -121 -154 204 117 -201
6017 -201 -142 160 46 -19 -46 215 -239 163 68 -507 -44 -11 -93 -279 -112 84 167 43 -216 345 44 -122
6039 -122 131 -45 140 -66 122 131 -114 -41 -59 33 145 32 23 110 -78 439 -191 -33 2 28 31 139 -46 -70
6063 -70 216 74 139 -69 -90 51 126 -170 20 325 -95 86 -65 -215 -174 48 25 -35 278 230 86 -100 -32
6086 -32 154 25 27 -176 -72 -221 -65 59 132 57 0 -128 -5 -81 15 72 -216 -141 12 -50 -134 53 -176 -154
6110 -154 6 116 -61 -107 -65 -138 89 113 7 176 249 102 73 -127 -182 149 -119 -118 73 210 93 -152 -296
6133 -296 180 245 1 115 45 -151 41 46 48 106 -348 -140 91 158 -44 -33 -155 -149 58 10 71 81 -37 152 -46
6158 -46 271 30 -49 207 -77 135 -68 181 27 112 -334 -8 210 -26 -120 3 -94 255 -37 -290 -116 90
6180 90 39 -16 -16 10 21 134 93 57 148 -64 197 -85 527 106 -71 -2 29 -365 199 4 4 156 80 19 299
6205 299 -54 272 17 -5 150 265 -151 173 -128 18 304 -107 79 -58 65 56 292 -4 -241 184 314
6226 314 -121 5 40 82 -54 34 101 -20 62 4 -110 -224 47 -44 41 -277 -70 -109 31 98 136 144 -84 -118 61
6251 61 -255 239 263 -6 72 3 0 -150 -105 -175 -166 -225 243 -149 42 37 177 109 -207 88 -143 -162 81 293 -185
6276 -185 47 50 -96 -123 24 -110 -68 46 214 261 -194 -194 257 -69 95 122 -49 -144 -112 35 -208 -81 109
6299 109 59 -32 413 -39 108 -35 71 -168 -73 90 -70 -106 92 127 40 -82 -37 -53 -110 -81 156 -57 -87 105
6323 105 17 -43 238 177 -170 27 326 102 -126 -125 146 -117 -126 96 -11 -52 40 154 -234 38 101 57 -77 -406
6347 -406 231 53 -87 -22 130 -2 73 131 120 -50 -93 163 -153 108 -18 53 -17 292 57 -50 130 -160
6369 -160 -65 -233 12 20 -67 167 -208 111 128 347 152 -66 -39 -62 249 -37 -12 116 -79 -80 -113 -322 -330 -1
6393 -1 -103 163 148 108 24 360 185 74 252 90 -145 10 -189 11 -78 -127 9 -81 103 -127 130 292 -25
6416 -25 92 179 -164 -232 111 94 78 42 10 301 -69 174 162 -250 129 52 -159 -138 12 -1 -238 -29 82 215
6440 215 195 129 -179 -39 -211 187 -115 -12 20 -28 504 188 91 61 -16 -305 57 57 70 -81 -21 181 251 -236
6464 -236 62 177 51 19 8 62 63 -193 76 -30 -69 57 -82 102 -176 -20 -210 -12 48 98 -9 -94 -53
6487 -53 57 119 134 125 -180 -46 -187 65 -113 -227 -101 -21 -95 -84 14 -97 70 -188 -161 165 38 30 -5 27 -179
6512 -179 129 -153 92 75 -48 -34 103 -119 -20 79 -71 20 -147 64 -310 157 115 -24 245 -72 3 -100
6534 -100 93 195 -15 -174 126 132 -16 194 105 10 -281 143 -88 -260 -22 180 95 -11 76 -17 135 -122
6556 -122 121 155 -88 -158 151 66 -310 -115 123 -125 -155 -74 28 141 -170 166 1 189 -94 115 -334 -75
6578 -75 172 -135 -27 189 -15 88 103 -22 -374 37 63 -63 -66 97 5 27 43 -70 -272 -224 271 -222 67
6601 67 22 309 -65 -2 127 -183 57 -74 -200 384 -72 -92 79 -91 -39 10 -19 -224 -80 -85 10 189 -134
6624 -134 -18 -204 102 -78 -64 -171 38 127 167 28 -34 23 126 10 27 134 -42 169 -286 257 66 4
6646 4 -209 55 94 22 -189 185 202 170 -111 -32 131 -106 171 -84 -6 260 -60 136 45 -8 12 -113 91 34
6670 34 -23 177 20 -115 -82 -178 113 -140 241 150 -192 -19 -21 7 359 -209 -26 -230 -86 135 77 61 60 -127
6694 -127 247 3 65 -23 191 -55 -92 -64 -31 151 21 -114 -90 169 -198 -188 -96 58 28 -268 -237 12 -60 -115
6718 -115 -85 -118 -258 -210 18 -117 0 -74 81 34 -293 -81 -430 25 -93 -190 -66 -182 134 -62 27 41 92
6741 92 41 -59 -129 -208 -16 57 68 71 -130 147 35 -55 -36 -96 24 -211 16 -249 -128 21 5 -244 -278 -67
6765 -67 -265 238 157 -268 -219 -18 -21 72 17 0 -173 -187 -121 303 47 -115 21 -11 -209 129 21 230 240 -94
6789 -94 -163 -283 336 107 250 -163 75 200 -119 126 -73 60 -20 -164 100 -33 -65 -97 -234 7 139 -106
6811 -106 -170 11 15 -146 -147 -25 -319 -241 -105 145 44 -83 161 97 -119 67 -402 8 -87 -82 -127 -28 9 -156
6835 -156 -171 104 -117 -102 -53 40 27 136 64 132 -24 -109 94 -65 132 172 -116 -78 -55 92 14 -105 128 -159
6859 -159 -11 -143 -15 11 -288 -52 -50 29 -51 14 -144 -29 81 40 -88 69 227 -205 -375 -53 -188 -268 -175
6882 -175 167 -41 -240 296 51 -159 -18 -108 -91 -18 -137 30 -41 -79 227 60 -138 202 -82 37 279 231
6904 231 -52 91 236 64 154 232 -88 -132 -175 145 -154 -27 263 80 -112 186 31 -258 180 -1 279
6925 279 9 5 -142 -270 34 89 -88 -29 -152 -17 -96 -71 265 13 156 -145 -8 -224 -36 -267 -78 -300
6947 -300 0 -30 -388 -6 107 -7 -101 -72 120 54 -249 48 15 -165 -53 129 -158 -109 28 20 87 -24 107
6970 107 -322 -269 269 49 402 72 -22 359 52 -62 -39 -225 -49 75 12 -26 -265 -114 -99 3 87 -56
6992 -56 -18 -115 205 -62 -52 60 45 33 187 -117 31 80 -111 -86 -90 -59 -41 86 48 -38 -170 22 33 159 -77
7017 -77 133 148 -25 -160 -113 278 180 -25 -44 57 195 -194 80 0 -84 -152 118 151 361 -46 101 -105 64
7040 64 50 158 15 -32 236 -98 -56 186 -3 146 -35 -72 87 61 -152 182 107 -89 139 59 89 -112 34
7063 34 -6 18 -178 136 -57 -35 -2 -119 58 -224 -79 67 160 90 202 -174 -39 -212 132 -103 -41 0 49
7086 49 -265 -16 76 123 325 118 70 -109 372 -120 -56 10 -9 -79 -31 185 -44 32 126 -240 52 -177 -136 -162
7110 -162 -65 -1 28 262 -290 -83 81 -92 -21 98 -218 -22 124 -46 -102 -159 -110 -52 224 68 -209 -172 -159
7133 -159 -83 7 -205 -18 206 -115 103 213 165 -159 93 283 93 -11 -102 -310 -37 56 124 212 -47 28 129
7156 129 -32 -89 -7 300 -67 61 107 -85 274 -66 -286 276 -52 130 164 -66 -57 -208 -102 -142 -68 262 -112
7179 -112 62 -74 136 -7 -191 -35 0 -85 -117 20 -241 48 -172 -85 -155 23 -32 254 -153 -123 15 -25 -28
7202 -28 76 -246 -109 61 2 -94 90 -142 -108 356 106 72 -36 -47 -503 129 -56 14 7 157 28 -71 -132 -197
7226 -197 23 -97 29 -35 -35 56 -143 118 163 25 109 -53 -57 114 -99 242 -287 61 -7 198 152 89 72 84
7250 84 138 148 190 -33 74 -263 300 82 -223 -335 6 -171 -29 -84 -112 -89 75 -20 -122 165 178 -35 203
7273 203 -108 -138 177 -330 -405 -8 -137 168 47 80 -37 -53 -106 120 103 -187 -5 48 -45 -313 -248 157 46
7296 46 12 127 -84 48 -178 179 -41 165 -186 64 213 74 -240 -82 -77 199 74 200 -215 -22 4 -49
7318 -49 -69 -18 -10 66 -248 -228 41 53 21 -106 103 -57 98 322 -188 5 63 31 -233 -185 64 -61 41 76
7342 76 267 -20 -80 -129 2 110 -36 60 232 -129 165 86 -61 105 -132 -87 78 -23 107 57 -1 110 149
7365 149 -314 49 89 -114 -199 58 17 67 -260 157 -37 -146 122 -154 -63 213 16 60 -247 -43 80 -141
7387 -141 -67 -52 44 -55 -158 -22 175 -7 185 160 -184 95 -49 24 171 184 26 -157 34 109 -138 192 107
7410 107 -239 -1 -148 -103 -6 -91 11 50 -42 212 -332 36 -184 -33 17 -24 81 -24 -85 -137 -164 -55 -170
7433 -170 -37 -235 -159 291 49 2 97 -49 -3 167 77 -56 -171 174 220 212 159 36 201 314 138 90 345
7456 345 -75 -39 244 -94 -35 2 5 221 87 -155 19 4 -95 59 92 -280 50 65 388 213 -42 -263 88
7479 88 22 -250 -154 13 0 54 187 112 216 -10 39 54 -131 63 195 162 148 -9 -58 122 -168 8 191 -62
7503 -62 35 -160 61 -19 -88 39 12 -117 195 -13 -157 118 -63 -202 -3 -239 209 -24 379 -56 -94 -60
7525 -60 -55 54 -246 -114 267 71 227 -211 92 18 144 -11 209 192 -128 -1 -27 15 193 -32 10 66 7
7548 7 103 -175 -109 89 134 115 178 -1 174 -199 212 -13 -259 -105 78 -3 72 -115 -138 187 -240 163 -30
7571 -30 96 -124 -69 -78 -58 194 -2 -254 133 120 -31 117 177 -123 -228 -45 48 40 -44 -135 87 -185 106 -240
7595 -240 -148 -204 -24 -100 406 -208 222 -67 38 97 72 52 -32 85 -31 234 228 190 -113 169 315 -164 -303
7618 -303 245 165 -52 106 -137 108 -269 -131 -183 108 213 -412 -330 172 -1 -209 197 31 -96 47 -70
7639 -70 64 -160 163 120 -47 -87 -110 142 -133 67 64 -62 -93 36 -7 29 -62 -34 -104 -27 95 -125 113 143 68
7664 68 -152 -55 -105 45 -59 -4 -34 41 -22 109 96 95 -17 34 276 -18 163 180 -35 77 26 -37 81 52 -9
7689 -9 124 -3 229 13 159 -83 -48 159 -44 228 225 28 294 -139 94 112 -166 -238 214 25 -97 -82 -113
7712 -113 141 118 -1 -123 -271 95 -64 -106 -115 -87 68 38 56 -202 0 -60 -43 -177 47 -383 49 138 116 -95
7736 -95 -85 245 243 -31 -22 -120 54 166 -128 -329 -77 -236 19 138 186 -125 -61 -208 23 207 3 57 -58
7759 -58 -41 -73 92 -80 -158 193 -169 -106 46 -168 -84 -253 -26 229 62 -2 280 -220 -145 214 209 60 -42
7782 -42 133 -112 39 -42 -102 -110 199 24 137 -111 -2 -86 400 309 -83 -286 134 -196 -42 -102 97 -31 9
7805 9 -137 102 -25 -83 78 -22 -152 106 -81 62 -19 165 47 132 180 -7 95 0 120 146 -72 50 -336
7828 -336 310 42 10 6 -32 39 -56 33 -14 -287 -52 -24 297 43 36 -93 23 -5 2 -72 -130 2 239 -74 155
7853 155 -91 -341 150 -53 -9 155 -107 -312 -184 -151 160 -62 -298 156 295 -175 234 -188 123 -32 2
7874 2 88 -152 -69 -198 10 152 -47 -115 81 175 -133 -240 18 -64 -170 -36 -189 133 -138 -251 71 -56
7896 -56 -172 -27 -78 116 45 -178 -126 -24 22 217 -107 30 156 113 -26 66 -29 21 328 -37 47 157 53
7919 53 147 10 -29 -176 22 91 -72 196 -64 28 141 -24 30 36 153 -150 -57 -181 212 121 -105 -186 19 -102
7943 -102 13 147 25 -72 187 -30 -384 -193 -14 -89 94 -188 -23 -87 287 115 -37 107 174 365 195
7964 195 -100 85 -211 -39 -415 117 -19 155 106 -209 -194 145 -6 216 -71 -39 -12 79 59 140 -130 9
7986 9 -65 165 -89 -84 -85 -290 -129 177 49 63 -154 -47 -74 98 90 -182 126 -26 -86 -11 52 223 61 -74 107
8011 107 -14 4 216 3 112 -54 65 243 -126 -124 -92 -210 -372 178 129 -59 -116 -181 -139 82 50 28 -174
8034 -174 17 269 -140 122 -110 2 -68 -9 -124 186 6 119 -8 -24 117 -60 2 58 -129 37 -16 84
8056 84 -11 230 48 -15 -136 -27 66 -54 0 196 -38 -96 -44 -38 148 175 31 -179 346 40 -220 32 67 -43
8080 -43 -242 -221 -84 -3 95 71 -36 207 -151 -110 -49 -76 149 42 -133 51 72 -74 111 108 -71 266 53 262
8104 262 -126 -77 53 -115 -245 -62 -224 -405 124 126 56 -192 76 35 -125 120 -193 -67 -308 -136 117 401
8126 401 -53 -160 202 176 -351 -20 -271 138 -79 187 -111 -70 36 -67 54 15 -5 -268 31 -31 -13 48
8148 48 -73 86 91 -93 49 -53 64 -2 -40 -79 -211 30 54 11 27 36 -170 -275 8 128 558 -276 -209 285
8172 285 129 -89 139 156 -15 90 174 -75 20 -114 -253 165 57 185 57 -113 -85 108 -181
8191a81
$$ Imaginary data points
##PAGE= N=2
##DATA TABLE= (X++(I..I)), XYDATA
0 0 0 0 0 0 0 0 0 0 0 -8 8 -8 8 -16 16 -24 24 -32 40 -48 57 -72 82 -97 113 -136 158 -182 209 -241 273 -313
32 -313 357 -402 455 -512 576 -644 721 -805 895 -997 1103 -1223 1354 -1495 1650 -1820 2005
49 2005 -2211 2434 -2681 2955 -3261 3604 -3987 4426 -4928 5513 -6199 7022 -8029 9296
63 9296 -10942 13182 -16418 21536 -30880 53539 -231160 -109420 252312 -105736 -50204 153026
75 153026 -20928 -179566 173944 235864 -87624 -55375 243511 69062 -133462 35990
85 35990 56198 -168027 -76383 31859 -195706 -229528 134158 204069 -13097 63643 174778
96 174778 -92012 -157850 129007 79140 -163608 47208 242635 -68967 -245134 25155
106 25155 75197 -130479 -17291 129110 -114374 -162934 196747 233659 -68614 -75817 37455
117 37455 -88426 -88570 132577 90030 -97882 28972 142855 -89072 -176714 15147 -3146
128 -3146 -98007 79943 135727 -98968 -80878 178846 107766 -116776 -11055 88704 -96861
139 -96861 -87094 144403 61165 -134744 -6963 70610 -147901 -174724 75892 119809 8265
150 8265 84043 108708 -77223 -65525 123699 46492 -121171 -39789 21422 -77193 -30776 91371
162 91371 -12288 -109856 37937 76757 -94779 -48191 147830 92168 -12602 67943 19320
173 19320 -172406 -104021 96767 28448 -97757 14765 71710 -54831 -24022 103250 14282
184 14282 -74167 36579 50470 -80031 -39866 93357 40902 -49123 -4446 -27597 -112954
195 -112954 -4713 129611 37706 -37370 44499 25866 -75991 -22316 50635 -35832 -63400
206 -63400 56130 41487 -80361 -13452 100282 19427 -49023 13553 -7249 -74779 14040
217 14040 106109 13488 -67715 -6361 -724 -62702 -4668 64640 7864 -5277 56868 12496
229 12496 -64337 -7774 49344 -14533 -46187 1682 -21351 -51876 41889 86245 -15092 -44707
241 -44707 23890 5183 -37057 27126 66165 -4908 -30046 15435 -23729 -81558 -9667 55598
253 55598 3545 -19423 16524 418 -15678 37385 51951 -15243 -39861 -2221 -9977 -25752
265 -25752 23286 36358 -14401 -15061 6861 -27543 -32064 35696 57488 4459 -17137 -2170 -27464
278 -27464 -35553 22292 31842 -25589 -25999 12550 3990 -3014 32460 39841 -1480 -19430 -7150
291 -7150 -20376 -23704 18410 28412 -11341 -26382 -19813 -19683 2757 36410 32505 3045 -3646
304 -3646 3145 -7519 -6746 16074 6951 -21947 -19925 -11432 -16310 708 30625 29502 -363 -16328
318 -16328 -8063 -2561 4199 20168 13620 -13873 -24811 -19339 -7253 6377 14052 16026 8633 -6336
332 -6336 -8080 3658 13562 15396 4616 -11438 -23814 -27106 -8166 14274 14333 8083 1352 -10675
346 -10675 -8850 7846 17649 16330 8295 -5639 -22422 -23252 -638 11262 4590 8052 4267 -18953
360 -18953 -14093 16518 21398 7065 5561 -45 -25330 -28969 5568 17170 -2663 1893 6317
373 6317 -17678 -13349 23083 28652 8383 5740 1972 -24631 -27571 6310 11379 -9497 -1411 -437
387 -437 -27464 -14751 27884 27395 6711 14190 10442 -22479 -16727 23131 11638 -22163 -6231
400 -6231 -2691 -36882 -20944 28987 22912 -3035 13303 15307 -20852 -12299 34099 20379 -16912
413 -16912 -1665 -1442 -37734 -19526 25813 7739 -17553 6506 10121 -21800 -3217 41713 17940
426 17940 -14898 9762 3962 -37316 -10088 36329 6629 -23797 3730 2113 -35582 -9947
438 -9947 38267 6504 -24598 11544 10448 -30894 226 45796 11386 -16445 13606 6568 -33234
451 -33234 -2992 39677 -3313 -35860 -221 -9283 -45122 -277 42900 614 -16475 26518
463 26518 16640 -23202 16646 54909 938 -27276 12605 -9389 -55809 -8808 30161 -20206
475 -20206 -34614 13731 3019 -30355 21901 64013 9611 -11927 29420 2990 -39537 9512
487 9512 37071 -24501 -40821 1997 -16462 -45313 14062 49164 -8467 -16205 34899 8243
499 8243 -27657 29183 48571 -20506 -29237 16275 -13024 -48368 10063 36310 -27530 -27573 28541
512 28541 -1824 -34106 30874 52196 -13719 -15474 25962 -11482 -41178 24408 43818 -28528
524 -28528 -30982 17978 -16372 -37547 31873 37938 -34876 -23360 31816 65 -23798 37620
536 37620 41187 -32203 -19056 32452 -12070 -37779 29606 30430 -40902 -26663 20067 -19297 -37153
549 -37153 32243 38889 -25399 -3236 44788 -4802 -26384 39642 33471 -37147 -22459 13359
561 13359 -29722 -35642 37944 28794 -47850 -26085 27183 -7081 -8349 57991 34569 -36931 -5176
574 -5176 36724 -17154 -37436 22557 11288 -47001 -9333 31767 -22661 -26393 46273 28617
586 28617 -36485 -5436 30179 -15569 -15796 47004 21275 -46199 -13733 18707 -33303 -26620 46358
599 46358 25772 -32910 -1004 23683 -22442 -12875 47305 11552 -54061 -10602 33159 -9439
611 -9439 -6513 39772 -1169 -49916 1714 31080 -22418 -19418 40581 17412 -33286 1594 15683
624 15683 -36926 -15731 50213 15366 -35530 6191 28186 -16403 -7174 35065 -8495 -52404
636 -52404 718 24224 -23390 -5055 46325 4013 -40884 784 17399 -17858 8003 52638
648 52638 2733 -44207 4339 23251 -25451 -15443 20186 -16300 -33442 23318 30151 -20640
660 -20640 -5505 37642 1208 -34696 3177 11514 -20142 13519 47881 -8792 -45836 -878
672 -878 12866 -18266 1528 30450 -8621 -26263 21659 18465 -29300 -6567 27883 -11249 -30552
685 -30552 12820 18628 -6813 18155 34463 -21196 -44350 6798 15924 -16668 4608 25172
697 25172 -13907 -21136 16173 2823 -30742 3307 36453 -80 -19038 14835 10792 -13184
709 -13184 12973 17762 -34416 -38637 13735 20132 -4535 11201 20365 -16192 -19917 14915 1780
722 1780 -22800 12510 31610 -8711 -20972 5316 -431 -14780 9173 13382 -23368 -16954 29319
735 29319 23310 -6712 5740 6723 -23882 -16980 11741 -1238 -14021 16966 25664 -14271 -23637
748 -23637 3818 1432 -5887 18324 14074 -19575 -8306 24659 10433 -14949 -4861 -907 -18402
761 -18402 -6561 18862 4831 -6754 17119 13432 -22638 -22705 2876 4835 3846 17666 7867 -19216
775 -19216 -8535 17656 3812 -14310 192 3794 -8573 2126 13967 -1732 -8432 7069
787 7069 2562 -22228 -15330 11784 14302 11018 16629 -766 -22173 -8396 10327 -48 -8865
800 -8865 1889 4486 -5330 -602 6526 -5394 -5359 11071 4435 -12318 -2861 13990 13352 6125 -149
815 -149 -14516 -24409 -7768 10698 3489 -1653 7024 4877 -2943 255 2090 -1494 2815 10352 3664
830 3664 -9605 -5331 7191 4280 -3251 -7874 -15811 -13187 4767 14413 9025 2210 1749 572 -4054
845 -4054 -3152 1395 2852 6789 8506 -1911 -10257 -6258 684 2733 -2607 -9463 -9110 -1861 8470
860 8470 12480 5387 -1825 -2961 -1838 -485 633 3433 8724 7606 -1299 -8188 -12400 -9314 704
875 704 5190 -302 -6532 -3409 5201 8569 6908 5100 -1795 -5373 496 2507 -1224 1633 6092
890 6092 -9 -9647 -12069 -7831 -3525 5846 14414 5091 -5586 1163 6243 1705 2203 3233 -3408
905 -3408 -7740 -1439 1281 -6018 -2243 7469 -707 -10495 -3537 2544 2603 11425 15399 837 -10455
920 -10455 -2729 2604 -4306 -2177 4713 -4353 -10211 1272 1789 -7028 1248 10309 184 -8005 2685
935 2685 8031 1663 7595 11755 -6302 -15698 -182 3192 -6171 302 6096 -6081 -11196 2073
949 2073 3461 -6352 3654 14336 -1015 -8206 7584 7873 -2517 5178 7619 -11030 -15436 2416
963 2416 4311 -7667 648 8028 -8716 -11085 7857 5923 -3821 9157 14306 -5073 -9493 7077
977 7077 4900 -7591 2289 6277 -14522 -14332 7743 4312 -7257 5401 9342 -9137 -7987 11833
991 11833 7222 -5138 7807 10732 -12433 -11937 8255 1183 -10211 4878 6664 -13000 -9497
1004 -9497 11254 4663 -6634 8828 11246 -11530 -7138 12867 2800 -8576 7859 6409 -16110
1017 -16110 -10858 9891 904 -10072 7139 7437 -15089 -5859 16223 3165 -6323 10846 8153
1030 8153 -13966 -5252 14239 312 -11535 6899 5200 -17853 -6880 12818 -3438 -9941 10988
1043 10988 7800 -14009 -2324 16933 2267 -6287 12824 5879 -19343 -5223 14776 -2928
1055 -2928 -10663 7872 598 -19466 -3235 15796 -1270 -8522 11983 5972 -14817 2446 18989
1068 18989 -2376 -8519 9867 698 -18306 -876 14699 -5443 -11053 10435 2035 -17966 1123
1081 1123 16191 -4430 -5167 15566 3006 -17680 666 15320 -4335 -7174 10762 -2568 -20826
1094 -20826 3796 17845 -5664 -8104 9980 -2456 -15527 7083 17340 -6127 -7739 12112
1106 12112 -991 -17442 4332 13173 -9776 -6158 12897 -1669 -15220 6155 13943 -7986
1118 -7986 -4866 13922 -1388 -16289 6375 12910 -8632 -3697 11450 -6690 -18344 5918 13874
1131 13874 -6291 -3359 11428 -5144 -14534 11587 14864 -10015 -4521 10887 -4708 -11978 9531
1144 9531 9258 -13154 -5615 11288 -5695 -13997 10160 10803 -9580 39 13272 -5709 -12199 10491
1158 10491 10509 -9257 -1588 10804 -8509 -14072 9776 8528 -11752 -1978 8995 -8245 -9647
1171 -9647 13527 10899 -9505 -1680 9053 -7532 -9120 13558 7192 -12784 -2096 8106 -8585
1184 -8585 -8648 11369 6416 -10782 1071 10622 -7104 -7844 12425 5877 -10507 1424 7181 -10208
1198 -10208 -8666 11535 5371 -10650 496 7260 -9190 -5440 15139 5785 -9959 1930 6343
1211 6343 -8829 -4713 12365 2891 -11409 284 6036 -9662 -5662 12058 2311 -9644 3452
1224 3452 6737 -8270 -2467 12603 2706 -9359 2142 5966 -8620 -3606 10974 21 -10414
1237 -10414 1942 2980 -10053 -2647 11760 2623 -7007 3443 4984 -7488 -4 12500 -100
1250 -100 -9092 2754 3318 -7915 -1085 7925 -2855 -9476 2913 3947 -7585 628 12289 956
1264 956 -6113 3775 1483 -7541 1316 9693 -1790 -8494 2376 2316 -6906 133 7874 -3048 -5909
1279 -5909 5374 2901 -5657 2397 9149 -1594 -7339 31 -1002 -6462 3269 9409 -2988 -6733
1293 -6733 3062 1607 -4264 1967 6380 -1593 -3239 4808 1235 -6150 972 6054 -3648 -6515 467
1308 467 -810 -2465 5269 7100 -3513 -6062 2119 1965 -3075 3175 5813 -1703 -1374 3312 -1955
1323 -1955 -6443 689 3913 -2450 -4876 423 -52 -1427 4687 3983 -4822 -4003 3428 2640 415 3785
1339 3785 3588 -984 -2343 -469 -3779 -5780 1229 4071 -1855 -2990 449 -46 1137 4045 1592
1354 1592 -3093 -1776 3760 3292 459 1188 235 -3560 -2858 -1527 -3651 -1346 3782 4294 -112 -2922
1370 -2922 -1466 221 1321 2814 565 -2570 -476 2821 1715 -57 -1482 -1912 -1585 -1556 -931 -488
1386 -488 1464 4065 2624 -1890 -4022 -2971 1144 3917 2652 102 -378 -420 823 668 -1711 -2585
1402 -2585 -1248 71 -103 -1370 493 3185 1969 411 -1227 -3712 -1198 4449 5046 1333 -1701
1417 -1701 -2010 -2492 -2399 -828 -1262 -2676 541 3581 168 -1238 2034 3076 929 415 -498 -2262 -585
1434 -585 4421 3659 -3116 -4294 -2131 -3568 -2092 1928 667 -704 2662 3949 -686 -2979 1559
1449 1559 2668 -844 353 1170 -2853 -702 4476 734 -5730 -3948 -109 -1306 -203 4024 2026
1464 2026 -1863 2037 3036 -3670 -3445 3459 3099 -708 784 639 -3416 -1647 3973 -896 -6996 -1794
1480 -1794 2808 -787 797 5014 557 -2803 1507 1744 -4440 -2276 5296 2653 -2992 -263 -285 -5385
1496 -5385 -1197 5120 -232 -4394 2156 4874 -645 258 3983 -1068 -5135 1208 1503 -5528 -1318
1511 -1318 5947 608 -4168 39 294 -3537 1702 7430 695 -3899 3455 3577 -3830 -1379 2668
1526 2668 -3117 -4843 2317 1249 -4712 111 6428 -225 -4608 1873 1589 -3019 3272 7083 -1667
1541 -1667 -4559 2338 952 -5052 -979 4018 -2457 -3381 4096 1386 -5508 1366 5923 -2323 -4332
1556 -4332 3305 1983 -2764 3163 5504 -3935 -5211 3725 877 -5663 663 4039 -3295 -2854 4009
1571 4009 -30 -5761 2192 6031 -2540 -3237 4436 760 -3876 3337 4007 -5446 -4495 3681 240 -4456
1587 -4456 2454 4925 -3757 -2815 4955 70 -4392 4073 4699 -4662 -3135 3931 -556 -4699 2147
1602 2147 2928 -5801 -2623 5838 319 -3889 4462 4540 -4074 -1803 4430 -1484 -4312 3983 3745 -5868
1618 -5868 -3122 4198 -1431 -3704 4551 3025 -5269 -1380 5125 -391 -3256 4307 2980 -5785 -1523
1633 -1523 5118 -1669 -3631 4059 1890 -5669 -783 4931 -1933 -3830 4197 2287 -5182 -322 4919
1648 4919 -2197 -2676 5193 2250 -5186 -474 3858 -2427 -2664 4564 1122 -5824 -385 4359 -2638
1663 -2638 -2358 5050 1133 -5645 1023 4607 -2003 -1672 4148 97 -5947 466 4530 -2718 -2058 4635
1679 4635 539 -4258 2212 3844 -3272 -1936 4992 358 -5252 571 2982 -3606 -1586 4749 -1114
1694 -1114 -5057 2242 4523 -1585 -71 5004 -363 -4804 1520 2994 -4259 -1433 4169 -1411 -5028
1709 -5028 1494 2673 -2970 -591 4430 -707 -4069 4192 4307 -3277 -917 3643 -1929 -3990 2350
1724 2350 1698 -3564 180 4384 -1523 -4835 1343 2103 -3051 801 4132 -1663 -3073 3868 2715
1739 2715 -3222 -715 2855 -1777 -3004 3078 1723 -3852 380 3265 -3049 -4417 2390 1859 -1931
1754 -1931 1192 3492 -1656 -2639 3642 1799 -3802 -74 3124 -1851 -1768 2625 427 -3496 631 2669
1770 2669 -2867 -2799 3089 2283 -1539 1628 2062 -3425 -2557 2933 571 -3284 683 2656 -1161 -1138 2482
1787 2482 94 -2977 1417 2515 -2772 -1406 2830 1337 -1784 754 676 -2838 -1240 3263 670
1802 670 -2525 1117 1746 -2247 -1250 1616 -275 -1939 1770 2371 -2065 -828 3214 711 -1652 671
1818 671 146 -2708 6 2980 -538 -2152 482 711 -2013 -1043 1939 149 -258 2946 1777 -1956
1834 -1956 -504 1822 -284 -1900 -238 -104 -2083 237 2136 -839 -2027 1032 516 -1173 420
1849 420 1922 622 -97 1430 624 -1952 -930 1178 -439 -890 670 -183 -1188 733 1210 -658
1865 -658 -1152 743 702 -736 321 1426 187 -335 723 -800 -1783 -79 1077 135 -579 366 -280
1882 -280 -457 133 1103 -517 -629 962 257 -119 398 452 -350 -575 -227 -619 -673 177 1058 257 -359 64
1902 64 -151 -12 1022 752 -111 -8 105 -113 -691 -329 -834 -476 -468 -167 -19 208 690 950 781 299 -210
1923 -210 149 303 480 192 -234 -739 -892 -695 -363 -655 -176 373 207 -57 485 755 223 737 487 38
1943 38 -477 -185 -168 -356 -594 -28 -454 -1002 122 598 -196 144 650 -205 -225 418 460 -183 59 645 -359
1964 -359 -676 19 -144 -911 -273 411 -327 -864 260 789 -372 -256 878 -67 -730 956 696 -833
1982 -833 -24 1137 -660 -1277 58 466 -624 290 702 -774 -702 1151 804 -707 127 942 -526 -492
2000 -492 715 576 -1148 -218 708 -780 -1188 1144 805 -317 1106 1016 -966 -824 910 368 -1321
2017 -1321 -46 1095 -781 -879 804 -173 -1395 368 1158 -886 -925 1482 718 -892 584 678 -1639
2034 -1639 -905 1856 287 -1178 374 649 -791 -479 692 -516 -1405 1063 1276 -1234 -630 1369
2050 1369 -191 -1332 598 489 -1527 -160 2085 96 -1626 690 841 -1372 -444 1277 -642 -1025
2066 -1025 1618 1029 -1485 -805 1325 -315 -1408 871 737 -1595 369 2056 -767 -1429 857 480
2082 480 -920 203 1420 -451 -798 1340 640 -2381 -520 1299 -776 -827 1258 312 -1326 744
2098 744 1535 -1198 -1402 1405 986 -989 450 1329 -1212 -852 1322 -471 -2431 -23 1768 -439
2114 -439 -344 1435 17 -1363 1290 1825 -1574 -924 1830 455 -1153 582 784 -1497 -861 1347 -360
2131 -360 -1950 1034 1814 -802 -534 1114 -509 -1250 1049 1449 -1661 -605 2245 93 -1944 537
2147 537 498 -1640 -170 1439 -726 -1436 1432 1477 -1771 -937 1251 -815 -667 2065 1050 -1663 -190
2164 -190 1597 -682 -1503 1001 557 -1487 255 1916 -862 -1477 1361 774 -2029 -169 1414 -873
2180 -873 -803 1711 483 -1944 -61 1194 -961 -1272 1507 562 -1217 567 1405 -1590 -1354 1709 655
2197 655 -1942 68 1497 -732 -676 1748 -186 -2164 432 1410 -714 -658 1415 388 -949 252
2213 252 950 -1789 -949 2043 366 -1618 590 1045 -1146 -358 1277 -458 -1749 768 1216 -1208
2229 -1208 -502 1729 -286 -1560 775 728 -1501 -204 1771 -182 -1611 630 714 -1383 -451 1303
2245 1303 -696 -1466 1111 941 -1581 -215 1337 -190 -1325 1010 570 -1481 -215 1777 -695 -1497
2261 -1497 597 454 -1480 221 1333 -240 -1069 881 609 -1764 123 1456 -706 -1024 911 122
2277 122 -1235 629 1473 -726 -1057 928 714 -1082 280 1397 -534 -722 1353 228 -1476 395
2293 395 1027 -690 -793 890 263 -1356 365 1154 -667 -636 1183 206 -1069 479 1079 -842 -550
2310 -550 768 -44 -1400 186 567 -1325 -842 876 158 -710 660 806 -734 -122 1174 365 -872
2327 -872 451 1152 -1096 -681 523 -738 -1070 185 548 -1066 -572 1340 234 -826 585 765 -999
2344 -999 56 1105 54 -717 519 253 -900 -372 431 -130 -736 525 360 -608 30 985 63 -568
2362 -568 444 221 -441 -126 620 -392 -343 502 9 -939 -177 361 -375 11 908 331 -835 95 218
2381 218 -325 -578 466 253 -550 220 366 -603 -252 427 -1 -422 -34 630 -159 -119 456 -88 -358 -19
2401 -19 211 -241 -90 197 132 -198 -78 234 -184 -210 591 135 -323 73 717 93 3 1 -201 -546 -96 227
2423 227 -188 -175 216 -30 -112 -192 80 -139 -278 449 -101 90 172 264 11 -163 -128 -271 224 383 297 78
2445 78 -78 -327 -144 -327 -619 -232 129 288 233 -58 -180 -158 424 116 -15 -319 189 105 241 -82 -145 -340
2467 -340 -73 -7 -77 -288 -305 407 85 -95 130 -352 -311 -308 443 -87 -263 366 443 -251 -112 -77 -187 -52 414
2490 414 300 -579 9 487 -83 -628 -102 -132 -258 287 618 39 -284 390 352 -249 -93 456 -106 88 557
2511 557 59 -695 -91 149 -430 -529 6 320 -118 502 373 -246 -561 268 229 -584 73 533 -38 -5 511
2532 511 -212 -900 230 234 -555 -256 541 468 -24 236 510 -596 -227 823 133 -579 310 344 -447 -112
2552 -112 633 -329 -749 446 767 -517 -370 579 -335 -767 701 284 -841 -166 1014 -76 -631 388
2570 388 427 -688 -103 758 -450 -675 919 855 -824 77 645 -75 -469 353 303 -753 28 858 -523
2589 -523 -564 680 330 -807 -60 756 -603 -335 723 365 -965 -214 812 -664 -639 871 -225 -1076
2607 -1076 378 983 -530 -983 439 424 -657 382 860 -599 -480 1031 259 -1040 261 834 -593
2624 -593 -468 922 -31 -977 540 789 -953 -212 1086 151 -783 445 760 -693 -408 1140 1
2641 1 -1162 588 529 -888 -303 872 -427 -949 584 1007 -936 -404 1039 -27 -1195 603 537 -1077
2659 -1077 -235 1243 -310 -982 964 647 -1072 -50 1000 -439 -1030 668 470 -1068 75 1236
2675 1236 -606 -1061 779 681 -1309 288 973 -561 -761 950 258 -1025 205 837 -602 -1076 1073
2692 1073 297 -1478 324 788 -939 -869 1078 147 -1593 227 1043 -947 -678 1147 339 -1004 390
2709 390 1166 -797 -873 869 236 -1393 181 751 -1062 -619 673 -181 -1478 426 1011 -638 -446
2726 -446 1304 7 -1034 690 694 -1180 -460 1222 -79 -1087 404 729 -1085 -460 1255 -85 -1202
2743 -1202 875 846 -780 -228 1157 -159 -1214 871 481 -1114 -369 1361 -161 -1278 770 482
2759 482 -1272 -306 1184 2 -991 884 508 -939 -204 1077 -294 -997 997 500 -1032 -75 1139
2776 1139 -213 -801 626 380 -813 184 1234 -582 -804 885 659 -1090 -2 611 -7 -462 971
2793 971 469 -1140 440 994 -678 -782 967 654 -1004 303 765 -964 -900 774 138 -925 -46
2810 -46 648 -440 -544 1016 215 -968 168 1030 -613 -480 842 199 -746 -8 725 -899 -778 825
2828 825 175 -734 164 945 -529 -200 617 -67 -769 249 867 -728 -504 842 76 -307 376 291 -855
2847 -855 -59 1054 -91 -619 454 711 -833 -256 605 -499 -661 596 726 -408 -76 550 -130 -742
2865 -742 141 259 -652 -98 766 -359 -562 324 292 -482 2 494 -237 -400 525 129 -869 -143 725 33
2885 33 -125 560 188 -334 185 692 -369 -534 343 421 -725 -86 409 -274 -38 438 150 -699 -45 463
2905 463 37 -156 516 284 -244 161 567 -563 -274 294 98 -355 133 296 -75 8 379 -120 -789 -216
2925 -216 244 -175 -166 257 228 -133 295 303 -238 -151 523 299 -337 17 -18 -65 76 209 -123 -63 240 53 -224
2948 -224 0 295 107 44 72 208 -340 96 41 -187 -88 86 26 -111 54 4 -39 44 -204 89 -91 -202 -13
2971 -13 -20 112 84 130 104 86 -169 132 -119 -150 -186 -252 -61 -135 -96 66 -103 52 87 -113 -376 -177 -28 154
2995 154 116 202 248 -144 -18 28 -162 -156 286 -91 -266 204 186 -393 -87 353 4 -134 206 179 -241 1 131
3018 131 -61 -395 482 -108 -270 -146 165 -151 -302 475 42 -190 -85 433 -131 -507 165 191 -91 -26 178
3039 178 -263 -572 408 325 -385 -190 398 -153 -17 397 -15 -609 191 297 -55 -401 259 124 -299 22
3059 22 140 -751 -423 204 204 -371 474 356 -478 -396 602 -4 -635 169 509 -299 -214 543 -66 -695 200 316
3081 316 -677 -259 614 154 -258 284 342 -418 -226 596 155 -300 221 383 -396 -388 371 -100 -1039 385 312
3102 312 -697 -128 628 -54 -576 475 386 -550 236 677 16 -596 628 566 -751 -133 538 -190 -346
3121 -346 587 343 -788 -67 647 -283 -790 204 359 -454 437 885 -391 -808 652 279 -1007 94
3139 94 492 -365 -635 880 -45 -1016 48 731 -636 -623 762 413 -564 314 784 -752 -454 967 49
3158 49 -863 131 610 -459 -264 772 54 -1086 204 649 -888 -446 453 340 -956 419 549 -871
3176 -871 -411 693 -21 -686 320 769 -674 -220 516 -316 -1240 579 697 -817 45 668 -109 -823
3194 -823 316 644 -829 -29 970 -88 -897 599 601 -896 -200 792 -191 -838 712 550 -831 -493
3212 -493 1039 -116 -708 754 464 -821 -131 1045 -117 -1046 601 346 -1070 -89 1049 -274 -797
3229 -797 977 485 -942 -256 726 -558 -559 791 557 -998 -213 891 -263 -1000 601 450 -905 204
3247 204 754 -353 -935 782 675 -950 120 832 -675 -677 709 43 -927 119 786 -791 -779 663
3265 663 249 -740 496 718 -649 -207 719 111 -823 316 636 -412 -440 808 282 -1099 212 500
3283 500 -723 -418 771 190 -833 375 499 -431 -354 950 -54 -918 533 536 -816 -445 554 100
3301 100 -709 192 490 -752 -451 707 -26 -859 651 549 -712 -109 714 -334 -636 402 407 -530 -84
3320 -84 355 -265 -551 556 494 -735 -100 468 -201 -335 575 396 -550 -79 709 -279 -666 376 280 -597
3340 -597 -136 979 -432 -769 327 297 -640 92 556 -497 -352 356 499 -774 -133 591 -406 -249 745
3359 745 120 -496 -14 372 -339 -509 410 22 -750 105 856 -288 -353 559 212 -450 68 711 -167 -348
3379 -348 507 308 -588 125 284 -599 -333 488 272 -368 19 70 -289 -323 513 -238 -534 427 357 -245 -291
3400 -291 220 -41 -381 81 446 -467 -124 371 221 -536 307 421 -462 38 371 -110 -406 141 274 -129
3420 -129 -205 50 25 -390 290 541 -148 169 179 -276 -366 -30 206 -198 4 700 -107 -516 222 191 -246 -93
3442 -93 106 122 40 217 289 -406 129 280 28 -191 218 235 29 -21 150 -117 -311 51 -274 15 -54 55
3464 55 6 261 231 -105 -260 211 -77 -153 -86 327 204 -254 -91 -4 -312 21 251 103 -79 113 174 -48
3486 -48 -164 37 -37 74 101 386 5 -461 -75 44 -25 213 -170 80 288 115 -76 73 -25 12 10 -193 -189
3509 -189 -144 24 233 279 33 -208 -299 230 61 -234 -110 -60 -25 61 199 43 -145 -334 262 92 -96 577
3531 577 433 239 -18 119 -105 -108 200 217 4 133 88 48 -154 -43 -165 -309 -105 4 -126 -50 17 209
3553 209 35 -132 230 -87 -143 299 205 -411 -7 287 -143 -301 -84 -12 -407 -162 348 47 -277 126 466
3574 466 -420 109 354 238 11 33 283 -483 -339 369 22 -292 209 4 -114 147 355 -378 -424 9 203
3595 203 -399 -224 273 -65 -170 325 -5 -511 -60 458 -187 7 86 104 -221 74 109 -270 -315 295 345 -581
3617 -581 -60 385 -6 -444 350 303 -246 135 276 -268 -343 192 250 -248 213 262 -241 -197 84 325 -325 17
3639 17 240 -472 -320 245 -29 -450 221 735 -291 -195 276 78 -355 319 546 -319 -148 648 75 -518
3659 -518 247 479 -368 -221 487 24 -649 129 316 -583 181 529 -41 -343 147 653 -521 -153 484 -88
3679 -88 -583 143 356 -504 -224 527 -193 -399 531 374 -539 -121 696 83 -581 377 410 -528 -338 343 -480
3700 -480 -599 396 41 -427 -66 312 -333 -482 190 272 -581 107 741 -247 -597 557 334 -279 143 672
3720 672 -295 -414 324 336 -557 23 511 -363 -535 434 385 -450 -53 694 -84 -116 598 227 -532 -195 583
3741 583 -341 -162 484 89 -321 79 731 -478 -566 448 -58 -570 157 486 -430 -156 739 10 -631 266
3761 266 310 -248 -335 443 225 -939 40 479 -595 -156 546 -27 -284 312 346 -243 -237 446 19 -533 213
3782 213 370 -622 50 690 -3 -364 308 389 -354 -357 435 99 -334 542 304 -757 -101 742 -25 -246 235
3803 235 318 -554 70 430 -478 -617 396 381 -392 -217 393 53 -463 169 241 -456 -216 768 -186 -590 408
3824 408 328 -211 157 504 -378 -77 160 103 -552 175 422 -418 -446 426 -68 -348 53 441 -29 -395 399
3845 399 9 -200 -98 294 -480 -279 351 -13 -687 411 339 -358 -187 328 -146 -291 556 527 -108 -68 468
3866 468 -203 -359 320 3 -265 15 446 51 -314 -65 480 -367 -33 327 -90 -122 356 403 -175 -205 259
3887 259 44 -230 281 549 -326 -18 561 46 -28 173 58 -120 9 356 104 -295 41 303 -236 -415
3907 -415 247 -38 -273 -4 234 -249 182 74 77 -188 544 355 -354 105 238 -162 -41 279 21 -211 -118
3928 -118 125 -160 -128 79 -98 -338 54 269 68 -61 590 18 -231 -21 209 327 -332 362 91 -426
3948 -426 111 269 -222 -383 -73 27 -114 -180 223 -39 -84 246 148 -87 -139 262 -76 122 66 -79 -210 -225
3970 -225 -90 65 -211 -226 -32 -38 -106 386 -184 -2 314 185 -121 -55 -105 159 53 67 -90 -264 171 404
3992 404 18 -86 234 79 -86 81 295 -165 -103 202 -93 -203 -25 209 59 -49 102 23 166 -127 109
4013 109 -20 1 104 -14 131 -20 340 -330 308 -110 74 -6 -50 80 4 296 41 72 -35 -171 216 140
4035 140 -44 152 205 -64 -158 79 -7 -180 -57 -5 -175 16 176 128 12 -273 140 121 -17 43 5 243 -184
4058 -184 -65 -32 -37 -7 30 -12 -122 -238 84 148 -60 201 110 -85 126 25 116 -104 373 -69 209 14 258
4081 258 -83 -9 -274 -236 287 -44 -85 -131 228 80 -58 -130 125 -157 -170 191 229 -202 -376 21 68 -90 -78
4104 -78 277 145 -157 -131 40 -341 155 127 -142 76 218 136 -10 52 1 -243 4 155 168 185 -10 270 -207
4127 -207 -103 119 269 -190 -199 437 -171 -403 390 39 -280 345 206 -267 -290 311 112 -324 199 76 -24
4148 -24 125 257 126 -504 141 127 -86 305 225 -52 -118 365 377 -184 -226 261 110 -110 55 53 -125 -36 70
4171 70 -216 -140 328 -30 -58 -204 320 -102 -7 391 43 -365 -66 170 -336 -313 173 17 -481 28 351 -84
4193 -84 97 -54 160 -79 -64 291 -112 -114 -56 -39 -504 -62 22 -205 -196 96 -151 -198 291 326 -419 -70 27 144
4217 144 -146 69 -12 -111 18 183 67 -160 -109 499 194 -290 104 93 -275 325 132 -86 -392 258 248 -266
4239 -266 44 150 31 -184 102 -152 83 -79 440 -170 64 124 31 -603 233 202 -133 -150 465 -168 -216 -101
4261 -101 43 -337 37 271 -91 -254 244 458 46 -27 -106 -157 24 148 155 -327 -163 393 -131 27 245 129
4283 129 -173 2 239 227 -391 353 120 60 -72 428 -379 -135 417 70 -305 -38 483 -122 -253 113 175
4304 175 -25 76 -14 -185 -149 91 -69 -245 49 442 88 -234 138 156 -122 507 116 57 -94 234 252 5
4326 5 165 82 -337 -8 271 3 62 -155 304 -270 -62 470 -14 -103 -79 -46 140 -89 334 55 -21 96 193
4349 193 -138 81 168 -326 -447 -164 226 -116 -86 71 -100 -302 196 -202 -288 -4 215 -145 -20 -105 379
4370 379 11 164 258 198 -18 376 500 13 -125 275 -262 -376 135 103 -134 -138 104 -209 -181 129 137 -155 -234
4393 -234 105 20 -415 -82 -39 183 -63 113 -30 -10 56 298 -300 -137 217 -438 -149 35 142 92 160 296
4415 296 211 54 -8 208 -82 213 76 -419 -119 84 109 -306 -134 323 -13 56 -33 247 -187 -10 -45 11
4437 11 -242 -131 21 -73 -37 -319 -20 9 198 264 -104 -5 132 27 -59 -14 -46 -34 1 293 -268 -163 -17 204
4461 204 14 -43 150 -149 -66 166 -19 -72 311 141 -147 -38 50 -295 -7 79 -72 180 -42 -43 -29 -69 -39
4484 -39 169 -213 61 152 123 -174 193 189 -128 -139 127 50 223 269 -12 -10 146 174 160 -125 206 -281 -102 66
4508 66 -124 -150 -206 424 253 -149 -30 330 -170 95 91 -78 115 -53 1 -123 -2 -181 8 37 165 284
4530 284 -69 126 162 2 -121 -78 47 -84 -158 -178 -104 -8 93 114 322 -72 -202 53 211 -8 64 -24 71
4553 71 -95 177 -47 238 127 -381 -143 140 134 66 128 -273 -30 217 -63 -27 -90 -82 0 29 102 64 4 164 300
4578 300 395 -124 -23 149 -125 -286 34 88 108 375 -200 0 253 67 74 -248 -40 -85 -70 81 -52 -32 -68
4601 -68 137 148 304 403 3 -97 -64 142 12 239 100 3 -145 -40 -170 141 102 -225 -5 79 149 -22 -27
4624 -27 15 47 128 205 -24 -89 12 -115 172 0 -147 11 103 42 234 236 -69 102 39 -82 -52 124 -2 -69
4648 -69 187 203 61 209 -95 58 -89 -20 -244 219 -235 -107 50 121 44 90 -6 -208 -57 -60 -313 171 -23
4671 -23 -7 -289 -98 0 -88 -92 2 203 -15 -90 -76 48 -35 -124 70 126 80 -13 330 142 104 -242 401 90 -35
4696 -35 195 326 -121 245 54 14 -181 -294 398 91 -47 -178 78 110 -230 -134 -105 -26 17 -42 96 -180 102
4719 102 -42 107 207 71 -17 3 -70 431 71 -18 1 116 61 245 69 276 -129 -96 -144 13 -20 29 -41 -28
4743 -28 208 -45 20 25 -9 276 -142 90 -14 59 17 168 -87 -16 145 -133 -327 148 88 198 -160 100 -170
4766 -170 -94 263 -304 35 -56 118 -70 -83 77 -26 -216 61 -15 74 -38 168 -122 -144 -83 -164 22 -10 12
4789 12 -327 -88 -128 101 148 -207 -209 -202 -13 79 241 141 122 -170 122 -201 -173 -32 -96 11 -168 -166 -230 160 201
4814 201 206 -45 -36 -63 -98 201 197 36 195 22 -188 17 131 -219 -203 9 174 -270 -209 180 86 127 70 -70
4838 -70 213 -107 -2 13 -128 -199 -3 19 -164 -311 -7 -102 -21 200 175 67 -250 -108 -46 18 125 112 -175
4861 -175 -181 118 68 212 89 56 -22 -244 267 197 106 118 174 89 -70 115 106 181 199 -271 82 -25 26 10 -203
4886 -203 48 -88 -53 147 -108 -231 -158 -8 30 -168 -33 53 -24 -218 -371 20 303 92 92 -102 194 -25
4908 -25 84 -14 122 -256 -165 217 112 -267 -105 53 21 27 -188 10 -1 57 -35 86 -102 -63 -22 76 246 178
4932 178 13 133 51 254 -110 77 244 -61 -43 -17 -57 -278 233 -76 18 -121 118 144 -64 78 -18 125
4954 125 13 -194 -158 -212 -128 137 -191 238 86 141 89 109 36 -44 -163 94 12 -359 67 -159 -197 107 68 -152
4978 -152 -207 -58 -105 -146 292 151 -19 62 -95 449 96 46 -115 -77 -62 80 144 40 11 8 37 182 -101 -120
5002 -120 -79 -105 -291 54 -170 148 -178 -56 -113 -6 -158 76 94 -64 -80 43 -92 95 -84 192 26 -51
5024 -51 177 -238 14 281 169 50 181 165 -78 -31 157 -180 20 -135 -38 70 -150 -42 -70 36 -194 24
5046 24 153 -22 30 -31 104 -181 -148 13 169 309 249 24 229 -56 89 293 -10 208 -44 -58 -94 182
5068 182 101 157 -38 -72 137 -163 63 83 55 -158 -8 91 124 105 21 84 173 -91 -325 -393 -4 313 -209 67
5092 67 151 75 178 65 -91 87 -199 -58 141 145 -159 99 126 151 19 -34 20 -38 293 150 -51 -50 83 140
5116 140 -210 -268 -96 138 66 69 127 -323 14 -196 6 -73 87 -54 -2 -127 20 112 165 -220 126 -8 41
5139 41 8 100 152 157 -238 -47 103 -261 -37 18 -129 78 -45 -156 -81 5 -261 136 160 -82 103 -15 -244
5162 -244 240 -19 -131 119 64 -26 -38 17 -199 144 57 -114 -146 162 -45 -181 -85 -51 -71 -220 -200 82 -149
5185 -149 -5 -69 59 -136 129 -12 -55 -53 204 -31 -139 169 174 69 153 114 106 156 -97 90 -243 -19 -17 69 -82
5210 -82 -368 147 63 -294 -54 -254 25 301 -384 -55 148 -83 -178 67 -112 22 72 -188 -264 -3 -312 247
5232 247 -51 -216 20 116 -298 85 -127 -71 -215 -201 81 109 107 -79 -212 -216 68 -161 -18 14 106 17 -116 -125
5256 -125 117 27 -59 -394 3 -134 285 -121 -123 289 139 -103 -120 213 87 125 158 101 242 34 -228 -277 39
5279 39 112 66 112 -75 81 258 0 1 122 1 81 25 30 -90 115 188 -204 -285 -96 -94 -109 153 142 -313 -224 -204
5305 -204 146 -51 165 104 -125 158 189 -3 -283 -58 37 -158 91 98 -4 42 399 284 119 -36 -120 20
5327 20 -385 -28 59 -275 -49 36 57 -122 65 107 57 25 -101 20 24 11 -350 -94 -97 9 26 98 21 -326 -112
5352 -112 -136 -36 10 7 155 131 -74 124 336 92 -310 142 -111 22 -108 232 139 110 -132 18 -272 16
5374 16 88 -249 -154 106 31 63 16 -134 112 -40 171 9 -121 -285 113 -128 22 -214 -69 40 -52 -37 179
5397 179 107 75 203 -168 -31 78 -85 130 -86 62 -153 157 -138 15 46 1 -87 -8 131 -73 -69 76 29
5420 29 184 105 151 233 -130 -72 -40 77 -70 89 -204 162 -218 40 -7 -103 -253 89 173 9 -75 -75 -145 77
5444 77 46 -230 -126 -117 -89 -231 -64 -37 260 344 314 -98 -42 -3 177 -220 -102 130 -85 -112 -11 183 -132 84
5468 84 229 -134 -225 -38 42 6 -22 -37 -225 -83 -13 267 55 -43 -86 -24 -265 -80 -232 20 101 198 -93 -152
5492 -152 -45 -41 -182 221 240 -188 -85 -27 114 6 103 138 16 -246 -237 -56 -81 142 82 -65 1 149 -78 -165
5516 -165 -282 234 -72 -211 172 -106 61 -38 118 -47 -13 -40 2 235 15 -284 -245 125 191 38 61 -13 227
5539 227 5 52 -68 120 -54 -49 -5 360 -224 243 166 -153 31 184 -132 -144 147 -113 147 128 69 -74 -152
5562 -152 -14 50 -150 -119 -120 1 -72 264 -316 84 65 126 -16 -35 -100 -6 36 -157 -235 52 82 248 5 96 396
5587 396 -135 37 -295 172 -196 -12 22 15 -152 -30 193 -26 42 16 43 -139 96 -188 48 42 -90 139 182
5610 182 -238 -161 44 92 27 198 -9 -127 16 58 -99 -10 -205 -179 164 -73 -93 -219 -62 -15 -25 170 16
5633 16 -11 -143 135 -71 -81 -167 -85 -49 -79 -18 105 -104 153 58 -134 59 -1 104 135 68 -83 57 17 60 252
5658 252 -226 0 45 -80 -203 -66 182 89 178 177 288 -27 -107 -245 103 -92 -74 -24 9 -49 171 23 -153
5681 -153 89 22 -217 -320 64 330 -29 -13 47 156 -127 231 -81 -28 112 44 -331 -75 -239 91 -174 -38
5703 -38 170 149 -37 161 -56 -212 275 -140 -34 -110 -110 54 -134 -183 -145 60 -242 269 346 -140 -399 -25 35
5726 35 4 425 170 -125 -55 -17 -108 -55 -190 -17 -231 229 64 190 -40 94 -37 -98 -117 -39 -374 63 75
5749 75 162 -244 56 -24 33 -166 -124 264 -214 -273 248 -19 -224 291 5 -191 143 168 91 -116 -104 4 -103
5772 -103 176 104 196 -127 -371 244 37 166 -47 -23 52 3 -56 -144 80 43 -55 6 80 -146 -91 -35 53 -111 -162
5797 -162 -299 -11 -15 230 129 -54 -99 191 45 -93 306 245 51 97 -42 55 -30 51 5 -263 -126 329 89
5820 89 -52 -60 119 -76 28 59 -141 -155 -112 51 85 39 157 -188 -113 -108 29 10 24 -62 16 -18 33 381 -78 209
5846 209 -35 52 -80 51 374 -60 -262 109 26 -278 214 99 -277 -72 -122 -27 186 120 -10 -48 -8 -4 75
5869 75 -91 116 -100 141 -58 189 281 -207 137 -53 -114 -191 163 -307 -240 35 -140 -79 25 148 -63 -379
5891 -379 237 -159 -323 -34 22 -245 119 119 193 -306 -418 68 -64 107 15 -135 96 34 -88 4 -160 48
5913 48 37 -52 -209 268 38 -317 44 40 -33 -373 29 117 -275 -166 149 -40 359 70 -7 -230 220 113 -188
5936 -188 11 180 -242 -242 195 23 296 95 22 -96 -113 -76 -124 -82 -173 292 1 -102 76 153 -197 71 153
5959 153 -19 51 73 64 -480 -127 33 -217 -155 -105 -59 -107 -86 -20 -193 109 149 -86 -126 241 129 458 -19 -91
5983 -91 58 -215 -88 34 -54 199 -379 56 -73 52 -170 -312 -20 82 56 204 113 387 2 -3 25 -125
6005 -125 194 44 191 -142 49 222 87 -135 172 68 -214 99 19 -250 150 -195 21 272 95 -150
6025 -150 239 127 19 -141 20 -42 -118 -105 93 78 -32 -90 -246 187 -42 126 388 219 -146 -63 -162 5
6047 5 -38 147 -133 36 49 470 -33 -154 193 -130 39 22 -97 -53 157 27 158 -92 78 67 166 -327 18
6070 18 99 -94 -41 -134 36 151 -5 87 -48 94 -65 8 6 184 183 -96 48 201 48 -85 -115 49 -36 -236
6094 -236 245 61 122 44 5 95 193 66 -73 -106 -143 356 178 319 70 82 64 58 -30 -89 -59 -224 -70 -41 -40 -6
6120 -6 -71 568 14 -344 -264 57 -70 62 19 -56 310 84 73 -37 -142 -48 5 -42 -184 -101 -83 -267 170 143
6144 143 -347 254 -70 -45 70 -45 75 -437 -59 -64 -87 -112 -158 35 331 -105 83 75 -67 56 342 -171 -218
6167 -218 -18 -366 -145 -25 10 -39 171 -137 239 -57 38 64 24 -337 364 -325 11 -177 127 52 288 -16
6189 -16 -221 64 79 69 48 74 -243 119 -14 -16 74 19 -76 -7 -88 40 -160 -109 -38 78 79 12 -26 70 -189 -26
6215 -26 319 -149 202 -47 268 -101 70 162 133 -24 -43 147 157 -36 -44 -147 253 -3 -182 -124 -90 272 157
6238 157 -23 163 30 -102 141 -78 -17 397 -23 82 -72 -30 9 -39 19 183 40 -7 -152 -233 235 -309
6260 -309 -10 -172 126 156 -302 -91 23 144 -242 47 126 -249 -154 -26 55 -111 129 -6 -178 198 -38
6281 -38 -123 -120 68 141 -14 -89 8 -191 -308 181 -304 -175 -64 39 -140 10 190 -20 -264 -62 36 -105 -15
6304 -15 123 -65 -168 292 -138 -148 208 -141 3 -43 66 -25 -123 6 363 72 -241 -152 149 -140 75 100
6326 100 -104 5 145 -8 -64 137 -152 -271 -151 15 55 -337 118 94 -22 -69 266 45 212 154 -151 -244
6348 -244 -300 278 -154 -155 -218 175 -217 -88 151 199 -317 -204 140 79 -100 -28 239 -7 42 25 -187 -103 -103 139
6372 139 -87 -6 57 -134 -145 -341 149 36 -6 41 -66 -364 -111 46 -128 -143 -22 111 51 -108 -31 246 82
6395 82 24 -162 -247 271 127 6 96 123 36 -49 111 -105 -124 -37 90 85 -128 -29 91 -14 -56 -80 -133 10 -36
6420 -36 -280 -312 -50 116 -102 153 258 52 24 102 105 -15 281 258 203 249 78 31 -205 -31 -36 6 240 -83
6444 -83 355 -58 304 -112 214 101 367 8 -177 55 -132 -204 1 29 301 -69 -19 115 -113 -170 -154 24
6466 24 2 116 -130 -16 -115 56 -357 -64 -17 -15 -78 78 166 -98 -17 -19 -61 57 -113 189 244 97 -235 142
6490 142 78 -73 -213 -75 -20 -65 -24 143 -77 278 -243 -29 -111 -36 -99 -195 169 24 -10 86 -71 -94 203 119
6514 119 29 36 -84 2 210 37 288 -124 127 -160 -4 160 83 258 -2 -111 109 156 -179 -157 -202 -139 189
6537 189 31 272 229 -100 74 -172 -353 308 -37 -86 141 -92 -85 169 -171 27 -21 152 89 -15 39 71 306
6560 306 1 80 -32 -175 -47 112 -34 -31 58 105 -57 36 11 -88 84 -248 116 -239 -231 23 69 147 -202 337
6584 337 -105 54 148 173 141 34 -36 95 -282 -183 172 -12 200 -41 119 -84 86 32 -36 168 60 194
6606 194 15 -76 112 25 -152 117 2 -27 38 71 -46 -186 -247 -23 106 -47 176 -14 113 -34 275 2
6628 2 -58 260 76 127 195 -30 182 180 201 -92 46 192 -130 -328 98 245 195 12 141 -155 150 136 -67
6651 -67 195 -28 -6 98 83 263 -137 -63 -232 -72 -127 37 182 243 9 -14 87 177 179 -133 -217 135 33 -4
6675 -4 212 -35 240 67 35 58 125 103 308 -35 -97 -266 163 65 71 75 132 -27 130 -241 246 183 20 -45 -15
6700 -15 143 202 54 143 -75 -37 -227 -23 388 -49 3 134 226 -149 -112 143 143 242 -65 41 79 -104 -100 -298
6724 -298 -257 179 51 238 55 116 201 -147 105 104 21 -64 -4 -143 47 21 121 -40 218 -28 -3 244 -9
6747 -9 -17 118 96 79 181 -165 112 -210 -233 116 23 -65 -21 -122 -14 -86 -49 -115 -31 204 126 -17 -111 -122 -119 63
6773 63 -90 455 -178 52 -71 -21 -31 -123 -196 -189 217 14 72 -99 56 41 11 0 -110 -10 142 157 174 -157
6797 -157 -241 118 39 -17 122 -53 -148 -177 -294 -179 -3 65 -125 -108 349 111 19 197 54 -234 177 8 -8
6820 -8 -22 111 222 -297 -53 168 -210 -204 149 331 13 -258 174 -118 -102 116 -67 59 0 86 -47 -79 -81 -78
6844 -78 227 117 26 -58 -127 205 -142 -354 186 40 -7 174 51 37 259 36 411 176 -209 194 170 70
6866 70 186 92 -56 -2 124 140 -493 -11 15 93 178 -66 -85 -89 30 82 31 178 81 306 -233 -62 40 -321
6890 -321 166 6 222 -144 -47 161 -192 169 146 47 -304 131 88 -198 -128 23 143 -366 13 -19 -113 -527
6912 -527 180 -168 -78 -80 -41 96 38 -29 -24 -96 -173 193 -178 -2 -53 22 10 57 -84 191 20 121 -13 148 24
6937 24 -19 161 -451 -161 -67 370 43 -30 -55 -25 83 -150 -56 98 155 -118 -107 -275 -162 44 23 -51 37 -169
6961 -169 -1 390 112 -92 -48 77 2 298 92 -179 -81 -162 -173 -35 -68 -91 -183 255 -344 -18 -90 40 59
6984 59 100 24 -162 -162 -100 -27 15 88 336 -25 85 -99 28 -24 -148 -216 -12 160 107 191 -122 -126 129 20 -42
7009 -42 90 -102 -71 -89 99 82 -105 -215 124 -150 -211 -9 -49 220 71 -82 276 -43 50 -22 11 102 -37
7032 -37 -238 123 135 4 -160 89 51 -153 -100 283 -91 -28 -85 -201 -45 -29 16 -26 -142 -65 -14 -77 -21 -10 -103
7057 -103 120 60 -67 -385 218 30 -34 91 220 218 57 -50 94 -128 -162 -7 -34 10 3 -151 -30 290 79
7080 79 156 -116 -342 147 11 -279 141 165 -22 -61 121 -19 82 264 87 -167 109 18 0 355 206 -13
7102 -13 -181 -87 -78 73 106 -234 85 -22 -135 -24 4 -67 69 132 -106 -120 119 180 -92 -67 -110 -17 102 55 123
7127 123 -145 35 -80 -336 11 -25 -37 71 127 131 313 185 -66 -91 -165 57 -187 92 -214 79 82 -70 -72 78
7151 78 210 -77 33 173 -19 24 -220 -224 136 41 -99 -103 8 95 97 266 -45 -60 14 85 -41 -116 -17 -89 199
7176 199 -192 120 43 107 7 172 148 -22 -14 -21 275 216 -122 -288 125 1 6 56 -31 -125 -94 -188 152 -85 -35
7201 -35 160 -5 -235 15 -52 -59 66 -8 17 250 -246 54 92 88 -208 160 -122 36 -273 42 -136 44 -116
7224 -116 -97 -219 -86 82 -7 -163 52 96 55 -117 63 71 -50 73 119 -41 54 -101 175 71 131 28 79
7247 79 -115 30 -249 -42 140 96 -154 42 -321 -158 82 -33 -44 83 13 165 -67 -64 -33 -34 67 264 -36
7270 -36 34 -135 55 93 -100 161 212 242 101 -38 79 -138 272 -216 27 52 -142 69 57 -117 -71 40 208
7293 208 17 -34 -110 2 -113 216 -92 -63 -44 -53 -8 158 10 -98 -149 -178 228 58 -29 -166 -112 157 -151 88
7317 88 -105 -152 172 -106 -10 -78 -310 148 96 -154 116 -71 -2 -36 177 126 264 -122 -206 -8 -311 -6 -130
7340 -130 -196 -29 -31 196 -30 30 54 186 -14 -40 -89 -261 -135 96 200 -40 17 133 79 180 123 75 -18 -42
7364 -42 161 -123 -55 27 -44 221 -54 -154 35 -161 -50 44 85 -133 -31 -88 142 16 138 -148 135 -133
7386 -133 -211 162 -5 -196 2 236 68 92 -181 81 -290 -51 248 -347 -228 -158 76 -18 462 -52 59
7407 59 116 22 128 -336 125 197 62 121 146 -44 13 115 15 -174 186 298 175 36 -218 73 -17 134 -38
7430 -38 -292 -76 44 -158 95 -246 152 -57 152 59 -163 -164 -8 41 64 -62 -171 55 -98 -99 -115 -7 -58
7453 -58 -106 -49 159 186 -147 -55 -267 -18 107 -77 -310 -42 -163 -79 226 348 348 -227 37 222 -59 266 89
7476 89 -55 -5 131 -13 245 -43 -28 98 -240 65 116 -130 -61 2 5 106 172 119 -267 92 -49 -221 16
7499 16 108 63 -15 -97 122 -42 -9 56 15 30 -206 -60 38 -60 -36 102 -14 -32 -80 -181 -67 45 -169 83 -72
7524 -72 147 47 -139 -40 38 -217 -55 64 -54 -20 -98 -17 -87 -42 -23 -205 -37 -233 101 -14 88 116 -125
7547 -125 -234 -176 69 -101 -143 13 -131 15 61 68 -146 -9 29 -113 7 -166 -144 178 -165 158 -94 -47 -187
7570 -187 -304 24 150 -21 233 334 -20 36 -195 7 229 -72 183 274 -145 -101 -292 89 256 -63 -86
7591 -86 64 -15 80 280 -12 187 -29 284 126 -246 -73 235 343 71 334 8 8 -187 91 -111 339 85
7613 85 -317 20 99 42 -22 -88 297 20 78 -105 66 -75 -212 -218 124 180 33 -96 -4 207 23 74 -52 255
7637 255 -8 -16 97 28 119 -29 48 -389 -1 209 96 217 -60 -120 -47 -168 -130 -57 -33 21 -176 -132 -30 -138
7661 -138 -112 -35 23 -65 -20 -37 42 -42 24 -220 224 -83 -311 -204 180 -198 -283 -17 -205 -31 -32 -224 110 -189
7685 -189 200 101 143 107 -200 -129 -28 326 -111 -150 -80 181 -19 1 70 263 -100 -65 -8 201 156 288 272 -218
7709 -218 77 22 -217 64 -88 -24 -299 120 -95 -277 -68 177 -123 -80 30 298 186 167 47 -74 -187
7730 -187 -76 25 -145 48 -139 -212 229 -69 -166 213 157 -33 187 82 176 -60 -206 30 -226 -10 119
7751 119 -210 -126 -51 -106 184 -91 -74 4 -259 65 -81 297 -225 -73 115 46 222 21 -33 30 22 200 61
7774 61 45 320 195 190 58 169 -23 57 74 -94 13 -179 -203 164 -245 -220 -6 -145 216 -202 199 101 -140
7797 -140 -106 -57 -18 101 -250 180 166 -134 -15 139 -145 -109 -28 126 61 158 -400 109 211 -310 5 333 35
7820 35 80 -155 114 -81 151 -75 -171 37 -62 -340 4 -91 -17 75 -116 229 11 32 -119 120 -204 -147 73
7843 73 -42 45 -25 -130 -179 -37 296 -50 163 479 -169 204 -92 278 31 -64 98 148 193 9 -5 -254 51
7866 51 230 -225 -146 144 175 -114 -46 -48 -88 4 -57 -1 -221 66 155 51 80 -187 -174 17 -181 -79 10 32 -83
7891 -83 -443 159 -109 341 -142 11 -62 35 -23 -204 52 114 -110 126 -12 -81 -22 -249 -51 -57 -330 49 2
7914 2 -89 -83 531 14 -30 61 280 53 154 241 -305 -157 45 -18 89 -99 153 -77 -309 -33 -189 -196 -69 -32
7938 -32 -78 -153 -74 -5 163 -141 -180 60 -32 89 12 -182 -289 -100 -107 -56 -136 285 -165 184 -148 130 -20 200
7962 200 -41 123 319 -68 -88 103 81 -148 102 -83 -17 23 29 102 74 -29 -92 139 125 155 221 97 -47 -154
7986 -154 97 41 -125 -122 -92 -266 189 -170 -138 -61 -64 -54 -332 39 -181 138 -50 -128 54 -160 10 73 271 -94
8010 -94 32 -31 42 139 -110 -72 170 -244 119 -377 -205 -134 84 199 1 -43 18 224 -191 -231 292 -134 162
8033 162 -139 -141 -16 -145 86 -243 -72 99 -108 -159 156 96 131 -172 224 76 179 -7 271 105 -87 -228
8055 -228 28 64 211 142 81 -59 -152 216 -3 72 -52 302 59 -54 92 63 -34 227 196 23 84 -24 -129
8078 -129 -32 71 52 -293 -104 78 45 75 -111 -82 98 -30 154 -76 -168 150 -91 223 -65 165 -43 -81
8100 -81 106 314 86 -77 129 -21 153 196 -137 72 117 -107 66 43 5 66 203 -82 -72 135 24 -61 171
8123 171 -55 -73 121 273 -72 21 -110 -132 84 -49 -200 65 -130 -12 427 -359 -120 40 153 -84 -41
8144 -41 94 36 -93 99 -35 -128 245 180 -85 52 54 -39 -72 287 181 -23 157 -234 -3 0 -14 -173 188 48
8168 48 -83 -65 -116 215 3 -39 59 -86 41 264 156 -207 -226 -59 28 447 252 22 -147 10 93 17 231
8191B31
##END NTUPLES=NMR FID
##END=
