##TITLE=1H_Ser 3514-ox
 DMSO
 8 sc, 
 9.4.2024
##JCAMPDX= 6.0         $$ Bruker NMR JCAMP-DX V2.0
##DATA TYPE= NMR FID
##DATA CLASS= NTUPLES
##ORIGIN= UXNMR, Bruker Analytische Messtechnik GmbH
##OWNER= root
$$ XWIN-NMR		Version 3.5
$$ Tue Apr  9 15:50:33 2024 Russian Standard Time (UT+4h)  she@DPX200
##.OBSERVE FREQUENCY= 200.1309
##.OBSERVE NUCLEUS= ^1H
##.DELAY= (6, 6)
##.ACQUISITION MODE= SIMULTANEOUS
##.ACQUISITION SCHEME= undefined
##.AVERAGES= 8
##.DIGITISER RES= 18
##SPECTROMETER/DATA SYSTEM= spect
##.PULSE SEQUENCE= zg30
##.SOLVENT NAME= CDCl3
##.SHIFT REFERENCE= (INTERNAL, CDCl3, 0, 15.7039)
##AUDIT TRAIL= $$ (NUMBER, WHEN, WHO, WHERE, WHAT)
$$ ##TITLE= Audit trail, XWIN-NMR		Version 3.5
$$ ##JCAMPDX= 5.01
$$ ##ORIGIN= Bruker BioSpin GmbH
$$ ##OWNER= she
$$ F:/spectra/data/she/nmr/H-F/1/audita.txt
$$ ##AUDIT TRAIL=  $$ (NUMBER, WHEN, WHO, WHERE, WHAT)
(   1,<2024-04-09 15:49:33.03 +0400>,<she>,<DPX200>,
      <created by zg, POWCHK disabled, PULCHK disabled
       configuration hash MD5:
       00 E9 B6 7A A2 85 ED C7 34 08 36 98 17 FE 4E 26
       data hash MD5: 16K
       4B 6A 4D CF 13 8B 51 30 C3 72 ED FE E7 1B 40 5D>)
$$ ##END=
$$ 
$$ hash MD5
$$ 79 8F 27 D4 15 EC A9 99 2E E1 A3 B1 6A E6 17 55
##$RELAX= 
##$RELAX= 
##$RELAX= 
##$RELAX= 
##$RELAX= 
##$RELAX= 
$$ Bruker specific parameters
$$ --------------------------
##$DU= <F:/spectra>
##$EXPNO= 1
##$NAME= <H-F>
##$PROCNO= 1
##$TYPE= <nmr>
##$USER= <she>
##$AMP= (0..31)
100 100 100 100 100 100 100 100 100 100 100 100 100 100 100 100 100 100 
100 100 100 100 100 100 100 100 100 100 100 100 100 100 
##$AQSEQ= 0
##$AQ_mod= 1
##$AUNM= <au_zg>
##$AUTOPOS= <>
##$BF1= 200.13
##$BF2= 200.13
##$BF3= 200.13
##$BF4= 200.13
##$BF5= 200.13
##$BF6= 200.13
##$BF7= 200.13
##$BF8= 200.13
##$BYTORDA= 1
##$CFDGTYP= 0
##$CFRGTYP= 5
##$CHEMSTR= <none>
##$CNST= (0..31)
1 1 145 1 1 1 1 1 1 1 1 1 1 1 1 1 1 1 1 1 1 1 1 1 1 1 1 1 1 1 1 1 
##$CPDPRG= <>
##$CPDPRG1= <>
##$CPDPRG2= <>
##$CPDPRG3= <>
##$CPDPRG4= <mlev>
##$CPDPRG5= <mlev>
##$CPDPRG6= <mlev>
##$CPDPRG7= <mlev>
##$CPDPRG8= <mlev>
##$CPDPRGB= <>
##$CPDPRGT= <>
##$D= (0..31)
0 1.2 0 0 0 0 0 0 0 0.06 0 0.03 0 0 0 0 0.0002 0 0 0 0 0 0 0 0 0 0 0 0 
0 0 0 
##$DATE= 1712663372
##$DBL= (0..7)
120 120 120 120 120 120 120 120 
##$DBP= (0..7)
150 150 150 150 150 150 150 150 
##$DBP07= 0
##$DBPNAM0= <>
##$DBPNAM1= <>
##$DBPNAM2= <>
##$DBPNAM3= <>
##$DBPNAM4= <>
##$DBPNAM5= <>
##$DBPNAM6= <>
##$DBPNAM7= <>
##$DBPOAL= (0..7)
0.5 0.5 0.5 0.5 0.5 0.5 0.5 0.5 
##$DBPOFFS= (0..7)
0 0 0 0 0 0 0 0 
##$DE= 6
##$DECBNUC= <off>
##$DECIM= 32
##$DECNUC= <off>
##$DECSTAT= 4
##$DIGMOD= 1
##$DIGTYP= 9
##$DL= (0..7)
0 120 120 120 120 120 120 120 
##$DP= (0..7)
150 150 150 150 150 150 150 150 
##$DP07= 0
##$DPNAME0= <>
##$DPNAME1= <>
##$DPNAME2= <>
##$DPNAME3= <>
##$DPNAME4= <>
##$DPNAME5= <>
##$DPNAME6= <>
##$DPNAME7= <>
##$DPOAL= (0..7)
0.5 0.5 0.5 0.5 0.5 0.5 0.5 0.5 
##$DPOFFS= (0..7)
0 0 0 0 0 0 0 0 
##$DQDMODE= 0
##$DR= 18
##$DS= 0
##$DSLIST= <SSSSSSSSSSSSSSS>
$$ [...]
##$SUBNAM2= <"">
##$SUBNAM3= <"">
##$SUBNAM4= <"">
##$SUBNAM5= <"">
##$SUBNAM6= <"">
##$SUBNAM7= <"">
##$SUBNAM8= <"">
##$SUBNAM9= <"">
##$SW= 18.0517689322627
##$SWIBOX= (0..15)
0 0 2 0 0 0 0 0 0 0 0 0 0 0 0 0 
##$SW_h= 3612.71676300578
##$TD= 16384
##$TD0= 1
##$TE= 0
##$TE2= 300
##$TE3= 300
##$TEG= 300
##$TL= (0..7)
0 120 120 120 120 120 120 120 
##$TP= (0..7)
150 150 150 150 150 150 150 150 
##$TP07= 0
##$TPNAME0= <>
##$TPNAME1= <>
##$TPNAME2= <>
##$TPNAME3= <>
##$TPNAME4= <>
##$TPNAME5= <>
##$TPNAME6= <>
##$TPNAME7= <>
##$TPOAL= (0..7)
0.5 0.5 0.5 0.5 0.5 0.5 0.5 0.5 
##$TPOFFS= (0..7)
0 0 0 0 0 0 0 0 
##$TUNHIN= 0
##$TUNHOUT= 0
##$TUNXOUT= 0
##$USERA1= <user>
##$USERA2= <user>
##$USERA3= <user>
##$USERA4= <user>
##$USERA5= <user>
##$V9= 5
##$VALIST= <valist>
##$VCLIST= <CCCCCCCCCCCCCCC>
##$VD= 0
##$VDLIST= <DDDDDDDDDDDDDDD>
##$VPLIST= <PPPPPPPPPPPPPPP>
##$VTLIST= <TTTTTTTTTTTTTTT>
##$WBST= 1024
##$WBSW= 4
##$XGAIN= (0..3)
0 0 0 0 
##$XL= 0
##$YL= 0
##$YMAX_a= 278848
##$YMIN_a= -283937
##$ZGOPTNS= <>
##$ZL1= 120
##$ZL2= 120
##$ZL3= 120
##$ZL4= 120
##$ABSF1= 10
##$ABSF2= 0
##$ABSG= 5
##$ABSL= 3
##$ALPHA= 0
##$AQORDER= 0
##$ASSFAC= 0
##$ASSFACI= 0
##$ASSFACX= 0
##$ASSWID= 0
##$AUNMP= <proc_1d>
##$AZFE= 0.1
##$AZFW= 0.1
##$BCFW= 1
##$BC_mod= 2
##$BYTORDP= 1
##$COROFFS= 0
##$CY= 11.3945322036743
##$DATMOD= 1
##$DC= 2
##$DFILT= <>
##$DTYPP= 0
##$F1P= 15.6554695791079
##$F2P= 12.8336369535428
##$FCOR= 0.5
##$FTSIZE= 0
##$FT_mod= 4
##$GAMMA= 1
##$GB= 0.15
##$INTBC= 1
##$INTSCL= 1
##$ISEN= 128
##$LB= 0.24
##$LEV0= 0
##$LPBIN= 0
##$MAXI= 10000
##$MC2= 0
##$MEAN= 0
##$ME_mod= 0
##$MI= 1.114404
##$NCOEF= 0
##$NC_proc= 0
##$NLEV= 6
##$NOISF1= 3.799351
##$NOISF2= 2.8
##$NSP= 1
##$NTH_PI= 0
##$NZP= 0
##$OFFSET= 15.70392
##$PC= 1
##$PHC0= -25382.93
##$PHC1= 14.58731
##$PH_mod= 1
##$PKNL= yes
##$PPARMOD= 0
##$PSCAL= 0
##$PSIGN= 0
##$REVERSE= no
##$SF= 200.130013532006
##$SI= 16384
##$SIGF1= 3
##$SIGF2= 2
##$SINO= 400
##$SIOLD= 16384
##$SREGLST= <1H.CDCl3>
##$SSB= 0
##$STSI= 0
##$STSR= 0
##$SW_p= 3612.71676300578
##$SYMM= 0
##$S_DEV= 0
##$TDeff= 0
##$TDoff= 0
##$TI= <>
##$TILT= no
##$TM1= 0
##$TM2= 0
##$TOPLEV= 0
##$USERP1= <user>
##$USERP2= <user>
##$USERP3= <user>
##$USERP4= <user>
##$USERP5= <user>
##$WDW= 1
##$XDIM= 8192
##$YMAX_p= 0
##$YMIN_p= 0
$$ End of Bruker specific parameters
$$ ---------------------------------
##NTUPLES= NMR FID
##VAR_NAME=  TIME,          FID/REAL,        FID/IMAG
##SYMBOL=    X,             R,               I
##VAR_TYPE=  INDEPENDENT,   DEPENDENT,       DEPENDENT
##VAR_FORM=  AFFN,          ASDF,            ASDF
##VAR_DIM=   8192,          8192,            8192
##UNITS=     SECONDS,       ARBITRARY UNITS, ARBITRARY UNITS
##FACTOR=    0.0002768,     1,               1
##FIRST=     0,             0,               0
##LAST=      2.2672688,     0,               0
##MIN=       0,             -283937,         0
##MAX=       2.2672688,     278848,          0
$$ Real data points
##PAGE= N=1
##DATA TABLE= (X++(R..R)), XYDATA
0@%%%%%%%%%%%%Qj6J6j6K4l2L2m0N6o4P2q8J04j20J44j68J92k24K56k88L28l76
34b00M24m73N29n94O66p44Q29r22J023j135J255j386J533j690J860k052K260k486
52a303K742l027L342l697M100m562N096n723O470p380Q519r987J1963j4782J9168
67A0939k6973M5021j62236m5973L74636O7261k44486k85619Q3617L06324J56337
78B78848k16930k85363L17K97907J90051j52415l02033m6488K55631K29055r9677
89A48903k86612j06262K14393K48323l6570k75287j48791J66766K62889J2236
99A99988k47022j82877J18795K60021O4743k13284k10776O4616K54957J10045
109B19206j76921k30586J7741K38729J46532j34407k36567l1251K12752J78278
$$ y = [0, 0, 0, 0, 0, 0, 0, 0, 0, 0, 0, 0, 0, 8, -8, 8, -8, 16, -16, 16, -24, 32, -32, 40, -48, 56, -64, 80, -88, 104, -120, 136, -152, 176, -200, 224, -249, 280, -314, 352, -392, 437, -485, 538, -597, 658, -728, 805, -885, 975, -1077, 1183, -1303, 1439, -1588, 1754, -1943, 2157, -2405, 2691, -3032, 3438, -3942, 4577, -5410, 6553, -8229, 10939, -16034, 28987, -133249, -179222, 195414, 262675, 18189, -267430, -183813, 122511, 278848, 61918, -223445, -223128, 74779, 264830, 112415, -189618, -236106, 19525, 248580, 148903, -137709, -243971, -29578, 218745, 182175, -93112, -241903, -75137, 187752, 199988, -47034, -229911, -111116, 148905, 213648, 364, -210412, -145796, 109161, 219206, 42285, -188301, -170560, 68169, 214701, 80294, -156273, -187524, 25228, 203506]
119B03506q7858k37832p5782J83617J99611m5225k26314j09830J46115K07568
129A57576J14k03673j41209J03380K11228M2966j79619j65069O4558K06098P7060
140A73410j49115j77575K4039J90901J08118j13852j85317j4561J73367J32515
150A61930q0780j85231m6652J50068J48845m5113j78195p9069J21986J63169q833
161A22125j68570j06618R4397J69734K2475j51630j25580O3229J67291N2818j29501
172A0170j41873L1025J62136P9916j05924j50669J778J48967J00047p7083j51064
183i2574k8525J29094J17371m7101j48923n5336J09635J29176k0233j40507p5624
194a23547Q6224J33342O963j26595r4166O0393J34778L2341j11620j08258L6530
$$ y = [203506, 115648, -122184, -197966, -14349, 185262, 140037, -86277, -196107, -49992, 157576, 157690, -45983, -187192, -83812, 127416, 170382, -9237, -174306, -109748, 96350, 173410, 24295, -153280, -129241, 61660, 169778, 55926, -129391, -143952, 29415, 161930, 81150, -104081, -150733, -665, 148180, 103067, -75128, -154197, -32211, 130958, 122125, -46445, -153063, -58666, 111068, 133543, -18087, -143667, -80438, 86853, 139671, 10170, -131703, -100678, 61458, 141374, 35450, -115219, -113441, 35526, 135573, 58490, -92574, -121099, 7995, 125366, 78265, -70658, -125994, -16359, 112817, 92584, -47923, -123547, -37323, 96019, 102982, -23613, -117779, -57386, 77392, 109733, -1887, -110145, -73615]
205g3615J31830N4321r2649j17442J0602J24017P5379p1623j24756j4245J14574
216A6393R2194n1081j26075l5311J00460J03815k7809j21952n6624Q2117J13002
227H9129m065j15190p4774O2869J16590J7603j02570q7514M0851J14437L8631
238I5997q6651r7966J8785J10072N6406p0639j03774j007J01424P0368n1464j04697
250f3146k1428Q8810Q2580l1195j03485m0062P5305R1222j2353r8911n5677N9902
262b8438R6776P217r1583p0522M2975J00061K5761q2108q1744K5649R8464M2013
274H4521o8647q8837O833R2974N7484n2863r3648j1799Q4966O9867l6322r3888
286d9359k8400P3094P8175j8405q9961m3641N9054Q3906r21q3711n6395M4028
$$ y = [-73615, 58215, 112536, 19887, -97555, -86953, 37064, 112443, 40820, -83936, -98181, 16393, 108587, 57506, -68569, -103880, -3420, 100395, 72586, -49366, -105990, -23873, 89129, 85064, -30126, -104900, -42031, 74559, 92162, -10408, -97922, -57071, 57366, 95997, 9346, -88620, -69835, 40237, 96643, 26004, -77770, -78777, 22647, 93015, 41551, -63146, -84574, 4236, 86816, 55621, -47864, -87926, -12621, 78601, 66248, -32663, -88340, -28438, 68338, 75555, -16028, -86550, -43575, 56486, 82247, 139, -81605, -55956, 42508, 84521, 15874, -72963, -66130, 26844, 84328, 31465, -62183, -73982, 10984, 80851, 44529, -49359, -77759, -4665, 73510, 55105, -34856, -78497, -19443, 64463, 63542, -20169, -76564, -32536]
298c2536Q5735J5365p3883o5950K7418Q4032L0875o1971p3402J1049Q0688M4497
310G1917m9748p8525m503P5023N6203l5978q0807j9921O6768O5922k1121q0144
322c4914l4014N6313P2451o144p6183m6317M3738P6183R031o9550n6924K9987
334c6343P7221K3342o0549o4696J5524P4561L5816m8991o8933R88O8632M6091
346F2663l6081p0206j2536O0718N4082k2870o9171k4990N1265O0037r403o5996
358b2488l6113M0550O3763L659o0838m5565K9195O5487J5977n4316n3263J7536
370c6416O5141K7309m5984n8805N216O2022L7606l5832o2230p220N7107M6576
382E4490k4914o3492j8793N0179N3146j3181o1650k9407M0653N6958j046n7019
$$ y = [-32536, 53199, 68564, -5319, -71269, -43851, 40181, 71056, 9085, -64317, -53268, 27420, 71917, 22169, -56356, -60859, 14164, 70367, 34389, -46418, -66339, 429, 66351, 45230, -34914, -68928, -12615, 59836, 53692, -22491, -68808, -25070, 51113, 60144, -9406, -66330, -36343, 40878, 64220, 3671, -61025, -45501, 29060, 64876, 15885, -53048, -52060, 16572, 62663, 26582, -43624, -56160, 4558, 58640, 35770, -33401, -58391, -7126, 52911, 43508, -22488, -58601, -18051, 45712, 49371, -11467, -57032, -27837, 37650, 53627, -689, -53952, -36416, 28725, 56034, 10050, -48755, -43539, 18483, 56089, 20257, -41973, -49193, 7914, 54490, 29576, -33916, -52709, -2530, 50616, 37435, -24215, -53622, -12969, 43989, 42943, -14076]
394a4076l8052L0238N8251J0093n0465m4537J9155N7212K0597m2403m9836P508
406c6315N4628L0200l3477n2879l037N0262L7520k3905n3545j3193M4091M3655
418D4005j3912n3387k2960L7593M8790m046n1375l1202K9691N1534O179m7002
430f092l8802K0002N2615J6243m1526m4726J0769N1773K4667l4285m7721J129
442c5954M7930L1995k5295m9222q986M2549L8064j6008m8564j7460L5863M1856
454C6768o391m5643k5281K7772M4389K989m2217l1943K0030M5252J1006l7090
466c59l6245J1695M3990J9025l0599m0409K608M2480K6706k4327m3473n528L9422
479D986L2522j6676m3717j3686L4036L7333q201m3104k1396K8461M0736n45m0706
$$ y = [-14076, -52128, -21890, 36361, 46454, -4011, -48548, -29393, 27819, 48416, 6013, -43823, -36315, 18313, 48513, 15036, -37843, -40880, 9382, 46902, 22997, -30548, -43741, 350, 44005, 30093, -23294, -46254, -8661, 40129, 36083, -15292, -46494, -16803, 34731, 40910, -6092, -44894, -24892, 27723, 43966, 2440, -42286, -31517, 20256, 44923, 10638, -37083, -35954, 11976, 43971, 18676, -30546, -39532, 3017, 41081, 25073, -23491, -40951, -5088, 36768, 30377, -15266, -40547, -12775, 31614, 34603, -7614, -39557, -19527, 25725, 36731, -359, -36604, -24909, 19081, 38106, 7507, -32902, -30294, 12186, 38892, 14565, -28908, -34436, 4986, 37508, 20832, -22885, -36571, -2535, 34798, 26597, -16507, -37903, -9442, 31294, 30749, -9957]
492i957k7257K1341M1519P809l5533l2445J2605M0958J5780k9768l5990M871L8744
505A2677K1661k3214l7256k881L4776K7025j5816l7920j0401L0622L1275r023
517B1525l6976j6299K5191L3442j645l4323k2472J8647L5667N927l1959k7885
529c1160J3098L6796J1942k8295l1086O632L5425J7983k2844l3938o80L3510K3627
542C1010j7279l5139o820K9953K7228j0579l4050j3239K4427L0151l421l2475
554a0233j8875J9304L1735K484k9392k2406J3470L1285Q509k5014k5890O877L0565
567A2419J4123k0784k8180J373K8658J8224j5589k8758m533K5618K2560j0177
579A4954l0016j0386K3232K6232n548k9847j4722J9385K7828J37k7390j9196J3970
$$ y = [-9957, -37214, -15873, 25646, 33455, -2078, -34523, -21918, 19040, 34820, 5052, -30938, -26067, 12677, 34338, 11124, -26132, -29013, 5763, 32788, 16972, -20948, -31349, -727, 30548, 21525, -15451, -31750, -6559, 26883, 25238, -9085, -31557, -12910, 22757, 28684, -3275, -31160, -18062, 18734, 30676, 2381, -28705, -22073, 13352, 31335, 8491, -25447, -26127, 7383, 31010, 13731, -21408, -28228, 1725, 28953, 18374, -15676, -28915, -4488, 25663, 22242, -10233, -29108, -9804, 21931, 24415, -4977, -27383, -13913, 17372, 25881, 867, -25023, -18146, 12419, 26542, 5758, -22422, -21049, 7609, 25833, 10244, -18514, -23047, 2571, 25131, 14954, -15062, -25448, -2216, 24016, 18468, -11379, -26101, -6716, 21112, 21249, -6141, -25337, -11367]
592a1367K8939N963k4923k3009R116K8963J0692k1163k5057L496K7159J5515j6141
605H183k6698k293K4967J9256j1666k6779o698K1535K1268o367k5246j1366J7081
618d823K3326q74k3964j5563J3313K4475L464k1851j8403Q901K4510Q274j8883
631A902k1589M154K4761J2728j6281k3714K22K3564J5771j2397k4097m492K0835
644A367J9079p629k4502r245J8250K1693l380k3768j2868J4556K2686J405k1435
657c791j6316R973K3075N888j8839j8521N984K2131R199j5265j9499J384K0272
670E675J2901j1247k0852l211J8753J6057p785k1191o724J6360J7874l863k0497
683g750j0390J3425J9803N1j9991j3686J0738K0906L555j8223j6013O888K0719
$$ y = [-11367, 17572, 23535, -1388, -24397, -15281, 13682, 24374, 3211, -21846, -18350, 8809, 24324, 8183, -18515, -20808, 4159, 23415, 11749, -15030, -21728, -193, 21075, 14708, -10538, -21904, -4823, 18503, 17629, -6335, -21898, -8585, 15890, 19354, -2497, -20900, -11999, 12511, 20785, 1902, -19687, -15533, 9228, 21956, 5675, -18039, -17817, 5747, 21518, 9121, -14976, -19468, 1367, 20446, 12817, -11685, -20930, -2680, 19013, 15633, -8135, -21003, -6447, 16239, 17644, -3791, -20107, -10134, 12941, 18829, -10, -18531, -12547, 9584, 18783, 3518, -15981, -14597, 5675, 18576, 7329, -13523, -16734, 2019, 18076, 10291, -10900, -17624, -1264, 16610, 12747, -7750, -18140, -4715, 15088, 15139, -4852, -18538, -7800, 13106, 16661, -1562, -17575, -10687, 10032]
696A0032P653j5372j8447K619K0391J1353j2637j9893j016J8914J3892q984j9812
709a1307m874J6157J6022m946j9270q279J3338J7223j329j7776j0950R808J7646
722A1463K728j5647j3721O117J8002O254j3769j5589L138J7565Q796j1356j6539
735a2558j12J6455J1575q538j7593l493J5282J3959n741j7812o512J3165J5551
748A3628k261j7087r610J0462J6900J091j6170j2054P870J7259L935j4279j3630
761a3946M617J6569O969j1469j4818J048J5359R511q589j5232k028J3556J1345
774A2892n513j5109n019J1623J3107k616j4916p562R721J4119o9j4019r528P335
788e554J4546K754j2666j1540M753J4933N531j1208j3203K139J4635P894r156
$$ y = [10032, 17685, 2313, -16134, -13515, 6876, 18229, 5592, -14301, -15317, 3597, 17489, 8505, -11307, -16181, -24, 15998, 11052, -8218, -16497, -3159, 14064, 12735, -5041, -15991, -6183, 11463, 14191, -1456, -15177, -9060, 8942, 15196, 1427, -14162, -11024, 6541, 15337, 3981, -12558, -12670, 3785, 15360, 6822, -10771, -14264, 1018, 14977, 9236, -8576, -15088, -1923, 13628, 11367, -5720, -15330, -4868, 12032, 13123, -3047, -15101, -7231, 10028, 13963, -316, -13946, -9329, 7240, 14209, 2740, -12078, -11030, 4329, 13840, 5251, -9981, -12009, 1547, 12892, 7379, -7730, -12749, -1126, 11981, 9365, -5551, -13113, -3392, 10727, 10658, -3361, -12889, -5554, 8992, 11746, -920, -12460, -7707, 7226, 12757, 1549, -11654, -9515, 5120, 13014, 3858]
801C858j4200o49J3762J0109o815j4756l307J2445J1781m254j4510n768J0240
814b064J2690j267j3340p985P571J3128J580j1829r741N028J3112M062j0217j1106
828a0378K483J2744O352q368j2044O9J2011Q164o316j2424k242J0805R701m130
842F427j2564m543R504J1140j909j2543o709Q013J2254L66j2022q620O089J2770
856G653K682j0855j0087L848J2603M825r138j1043J414J1899O782p032j1552j033
870i034J0672Q379m687j1510l356R043R595k312j1164n383P389J0416j83j0446
884b581o945N566J0693J855r328q272L529J0728L869q136r527J655J0771N720
898I597o874j0494l12J0313P430n201j1052k390R381Q757l357j0976m114Q034
$$ y = [3858, -10342, -10991, 2771, 12880, 6065, -8691, -11998, 447, 12228, 7974, -6536, -12304, -2064, 10626, 9359, -3981, -11966, -4395, 8733, 10313, -1516, -11257, -6229, 6883, 10945, 728, -10378, -7895, 4849, 11201, 2833, -9211, -9142, 2869, 11033, 4717, -7707, -9949, 856, 10557, 6427, -6137, -10680, -1176, 9964, 8055, -4488, -11197, -3184, 9070, 9436, -2586, -11206, -5117, 7653, 10335, -520, -10607, -6759, 5844, 10669, 1531, -9512, -8098, 3801, 10583, 3551, -8001, -9034, 1638, 10017, 5330, -6180, -9536, -493, 9102, 6790, -4374, -9757, -2368, 8048, 7865, -2581, -9526, -3960, 6733, 8588, -740, -9012, -5483, 5245, 9114, 978, -8549, -6894, 3877, 9597, 2723, -7771, -8083, 2230, 9660, 4459, -6593, -8983, 398, 9155, 5798, -5178, -9292, -1258]
912a258R558j323j0338n866O151J0140R37r456p492M196J0249K902q042q327K127
927e842R634M622o279q942K6Q918O103m737r295j647Q052P119l030r131l318O767
943i80Q111j167r010n065N629Q930M10q702o300M394R279J991p877p422K801R378
959D400L636o927q340J201R052M964n463q671o26Q127O318l625q873k500P106
974b21P350k038q606l804N726P622l36p640n050M034P871J473o908o236K674Q001
990C912K808n971o877J135P577M167m666p480m39P292N439l740p973j606O907
1005D85O247k558p992l015N900P152r69p869m448M868P716L95p306n366L487P674
1021D401J933o260o339J809P640L424n280o984N26P133M316l912o902j010O045
$$ y = [-1258, 8300, 6977, -3361, -9227, -3076, 7064, 8001, -1455, -8947, -4751, 5498, 8400, 358, -7969, -5842, 3792, 8414, 2135, -6807, -6781, 2137, 8240, 3503, -5792, -7439, 613, 7732, 4702, -4429, -7747, -980, 7131, 5964, -3046, -8111, -2482, 6448, 6858, -1844, -8144, -3750, 5529, 7520, -357, -7779, -4978, 4400, 8036, 1109, -7231, -6030, 3022, 7986, 2523, -6148, -6774, 1353, 7671, 4046, -4827, -7327, -221, 7129, 5091, -3515, -7319, -1593, 6029, 5693, -1947, -6997, -2963, 4908, 6381, -527, -6763, -4089, 3912, 6720, 749, -6128, -4993, 2584, 6751, 2085, -5395, -5834, 1458, 6897, 3157, -4816, -6422, 485, 6732, 4174, -3818, -6833, -933, 6219, 5250, -2619, -7067, -2199, 5517, 5912, -1394, -6760, -3273, 4401, 6334, 74, -6265, -4456, 3184, 6608, 1328, -5656, -5130, 2003, 6319, 2407, -4495, -5505, 540]
1036E40N323k262p001k606N283O209j076o906l552M363O528J71o362m625L201
1051b772O962J534o062n681K296P225K566n394o241J037O935L858m307o889m46
1066e379O687M976l333p218j526O016N614k037o908k872M867O330m57o679m133
1081f052L814O632P58n900m792K418O325K137m758n552R09O301L439m067o218
1096d606j08O078M234l095o314j334N357N135j830o496k622M842N888q94o473
1111b238l529M012O272L82o031m639K872O723J729n617n536J886O703K674m704
1126I59n871N15O125L850l375o219r87N577M778k267o221k008M668N190r29n789
1142b004l214L559N764M54n576m248K743O065J343n037m757J661N856K430m145
$$ y = [540, 5863, 3601, -3400, -6006, -723, 5486, 4410, -2496, -6048, -1685, 4843, 5014, -1348, -5973, -2772, 4190, 5724, -338, -6019, -3723, 3502, 6068, 674, -5567, -4530, 2405, 6263, 1956, -4933, -5379, 1308, 6284, 2951, -4267, -5793, 223, 5837, 3800, -3108, -5980, -1113, 5217, 4760, -1919, -6052, -2238, 4394, 5152, -748, -5540, -3122, 3203, 5340, 582, -4970, -4061, 2240, 5679, 1612, -4606, -4714, 1364, 5598, 2503, -3811, -5145, 212, 5347, 3517, -2979, -5601, -759, 5129, 4235, -2238, -5767, -1755, 4517, 4899, -1132, -5771, -2899, 3824, 5553, -64, -5600, -3714, 2989, 5663, 959, -4912, -4397, 1728, 5578, 2203, -4016, -5003, 574, 5352, 3085, -3136, -5144, -476, 4714, 3785, -2004, -5218, -1659, 4105, 4559, -1017, -5265, -2522, 3543, 4886, -151, -4908, -3247, 2609, 5039, 894]
1157H94n417M65N862L536l552n956m57N628M295k621o136j665N002N189j438o256
1173b627k798M370N712m70n871l519L265N714Q12n085m455J959N881K122m431
1188E79n141Q62N660L009l424n330l89N013L929k301n589j517M598M631j466n560
1204b436k313L888M967l90n237l308K980N490P32n110m207K326N798J597m679
1219I8m772J353N703K617l913n344K66N553L467l144n571o75M982M107j998n493
1235b764j912M119M858p16n401l011L338N220K60m944l632K337N196J315m259
1250Dm300J301N244K303l696m820L96N051L070k867n095o66M672L952k009n401
1266b861j656M390M611j312n491k398L805M996l67n230l293K980N356P41m834
$$ y = [894, -4523, -4058, 1804, 5340, 1788, -4168, -4625, 1003, 5298, 2677, -3459, -5124, -122, 5067, 3629, -2627, -5425, -1055, 4657, 4187, -1684, -5203, -1938, 3776, 4588, -497, -4952, -2993, 2888, 5010, 579, -4562, -3700, 1960, 4969, 1545, -3785, -4174, 839, 4768, 2467, -3122, -4639, -41, 4590, 3124, -2436, -4749, -861, 4106, 3716, -1521, -4829, -1849, 3641, 4373, -737, -4944, -2618, 3180, 4777, 98, -4674, -3321, 2382, 4999, 1086, -4258, -3992, 1561, 5028, 1884, -3687, -4362, 620, 4727, 2729, -2764, -4676, -557, 4301, 3585, -1816, -4827, -1489, 3731, 3991, -953, -4585, -2248, 2948, 4263, 4, -4296, -2995, 2249, 4552, 856, -3964, -3568, 1483, 4553, 1686, -3409, -4075, 597, 4549, 2540, -2861, -4517, -127, 4484, 3172, -2319, -4717, -912, 4084, 3717, -1513, -4806, -1826, 3530, 4271, -563]
1281e63m068K014N393J716m090m597Q39N161K783l206n054k71M870L616k365n156
1297b978j205M232M112j327m988k191L445M625k49m810l074K714M958O97m474
1312e13l764J871N063J606m030m380J055N173K449l572m866K95N031L166k823
1327A761n096p34M560L888j845n166j724L935M451q36n013k620L166M816K11m676
1343i22l448K259M995J199m120m015J298M846K088l343m348K45M501K915k493
1358A657m644p38M179L602j730m820j557L769M153r44m818k340L234M556j43m639
1374a223l051K567M796P07m273l664J757M857J606l735m174Q20M744K474l006
1389A202m570j48M435L237k193m730j093L933L787j249m599j951L177M141k62
$$ y = [-563, -4631, -2617, 2776, 4492, 402, -4195, -3356, 1805, 4588, 1382, -3672, -3943, 927, 4543, 2178, -2978, -4183, 49, 4161, 2834, -2154, -4345, -900, 3725, 3476, -1334, -4408, -1694, 3264, 3961, -513, -4277, -2406, 2657, 4263, 233, -4147, -3092, 2081, 4530, 958, -3908, -3613, 1418, 4584, 1761, -3335, -4069, 491, 4379, 2534, -2632, -4356, -421, 4030, 3194, -1819, -4439, -1273, 3543, 3754, -922, -4370, -2111, 2884, 4083, -37, -4052, -2754, 2092, 4180, 837, -3511, -3266, 1235, 4150, 1657, -2987, -3725, 454, 4056, 2326, -2494, -4051, -282, 3871, 2927, -1891, -4231, -997, 3559, 3416, -1223, -4274, -1707, 3089, 3796, -477, -4141, -2384, 2473, 4079, 344, -3830, -3010, 1734, 4208, 1202, -3368, -3516, 919, 4156, 1963, -2767, -3860, 73, 3860, 2611, -1988, -3939, -762, 3379, 3117]
1404C117m287k724K362M340O63l910l366J580M504J525l481l930Q02M499K270
1419C964k969m279N6M303K835k328m425o86L944L408j578m541j546L521L966q10
1435B835m514k299K916M281O9m193k985K094M444R87l752l560J267M405J746l142
1451E99l865L85M077K481k306m095n72L722L146j526m226j365L261L610p59m148
1467a581k087K725L974j8m003k691K195M173O32l729l149J538M177J382l223l669
1483c354P04M223K180k741m082k0M036K749k093m142q06L538L244j232m122j621
1499c539K994L684m40l947k281K295L836M38l484k914J423L929J310l034l392
1514c122P34L878J904k563l614M0L636K499j933l867p00L412L025j368l947j293
$$ y = [3117, -1170, -3894, -1532, 2808, 3471, -439, -3805, -2225, 2279, 3804, 323, -3607, -2805, 1694, 3964, 995, -3284, -3228, 1075, 3910, 1582, -2843, -3529, 415, 3823, 2245, -2296, -3842, -321, 3645, 2835, -1679, -3978, -1062, 3219, 3288, -905, -3890, -1796, 2648, 3635, -117, -3677, -2410, 1995, 3741, 599, -3266, -2881, 1196, 3677, 1371, -2724, -3296, 426, 3572, 2046, -2180, -3545, -284, 3326, 2567, -1581, -3668, -943, 3031, 3013, -990, -3681, -1486, 2687, 3319, -410, -3559, -2021, 2156, 3538, 315, -3354, -2650, 1573, 3753, 1012, -3070, -3090, 946, 3695, 1602, -2540, -3346, 192, 3436, 2204, -1918, -3539, -545, 3139, 2699, -1248, -3529, -1234, 2602, 3040, -444, -3358, -1935, 1994, 3304, 270, -3122, -2388, 1490, 3394, 831, -2783, -2743, 893, 3392, 1459, -2408, -3108, 304, 3329, 1961, -1986, -3279]
1530c279L003L335o71l794j983K435L720R4l709k619J942L935P08l388k976J249
1546a998L805J416k756l365L80L646K172k153l624l67L323K652j427l577j122
1561b995K764L092o40l553j817K342L414l6l381k272J778L460O64l013k773J104
1577a862L560J338k698l161N73L524J793k246l308o8L257K364j671l552p53L077
1593A67K855j156l587j290K617L064m32l282j911J911L287L83l034k498J338L390
1609A822R94k658k805O49L219J637k066l099r3L076K175j585l231o31K759K490
1625B653j002l158j232K317K879l61l175j784K009L143Q4l037k145J547L162O85
1641B585k689k581R17L249J311k376k899M05L118J719j853k976k85K766K232j183
$$ y = [-3279, -276, 3059, 2388, -1406, -3389, -954, 2766, 2860, -849, -3468, -1526, 2409, 3117, -271, -3247, -1998, 1807, 3223, 467, -2898, -2518, 1128, 3300, 1147, -2477, -2844, 479, 3131, 1704, -1873, -2995, -231, 2861, 2221, -1332, -3149, -807, 2607, 2571, -810, -3082, -1304, 2156, 2820, -193, -2966, -1862, 1698, 3036, 338, -2823, -2250, 1274, 3067, 821, -2487, -2555, 702, 3066, 1395, -2157, -2910, 167, 3022, 1866, -1721, -3011, -394, 2670, 2238, -1044, -2955, -1044, 2243, 2626, -408, -2906, -1568, 1822, 2816, 158, -2647, -1998, 1221, 2858, 792, -2307, -2400, 676, 2851, 1266, -1965, -2596, 163, 2653, 1651, -1507, -2739, -422, 2457, 2096, -1079, -2863, -854, 2289, 2373, -664, -2809, -1262, 1900, 2585, -104, -2685, -1768, 1481, 2792, 416, -2483, -2078, 1040, 2759, 906, -2070, -2355, 411, 2643, 1460]
1657A460l116r69K461K651o12l063j465J974K799L1k752j976J352K942O66k482
1673i9k382Q75K947J160k136k592L10K829J657j699k876k67K752K109j337k970
1689a719o64K479K337q28k876j198K043K635k41k840j712J696K839K52k583k069
1705b449J123K819Q72k164k446M81K778J435j793k642l2K564J802j254k645o37
1721b188K193K184o57k693j160J882K461k06k588j565J496K589L08k368j954J030
1737a236K696P76k190k218O65K649J107j843k356J59K496J574j384k608l75K347
1753B59J987r85k626q18K008K179m42k461j314J543K404J24k313j721J128K474
1769A426N90k011j976N75K377J121j612k243L3K307J531j254k381l54K119J783
$$ y = [1460, -1656, -2625, -164, 2487, 1875, -1188, -2653, -679, 2120, 2151, -601, -2577, -1225, 1717, 2383, -99, -2481, -1606, 1341, 2501, 365, -2227, -1917, 912, 2569, 870, -2006, -2273, 479, 2588, 1251, -1719, -2383, 96, 2433, 1605, -1271, -2469, -426, 2209, 1968, -872, -2584, -888, 1951, 2203, -380, -2449, -1326, 1493, 2365, 201, -2245, -1764, 1014, 2449, 656, -1986, -2018, 546, 2348, 1094, -1551, -2188, 5, 2189, 1532, -1161, -2321, -439, 2022, 1816, -772, -2337, -841, 1748, 2056, -312, -2266, -1236, 1460, 2236, 46, -2172, -1507, 1142, 2249, 406, -1950, -1791, 705, 2279, 895, -1713, -2088, 259, 2246, 1261, -1365, -2183, -175, 2004, 1562, -899, -2213, -670, 1734, 1858, -455, -2176, -1048, 1426, 2016, 5, -1971, -1396, 981, 2102, 490, -1753, -1720, 587, 2118, 864, -1517, -1871, 248, 2031]
1785B031q74k374p68J830K036m48k368j131J565K218p1k211j480J194K281M08
1801A838j994j826P56K363Q45j781k040L67K283J177j396k132j10K029J561r48
1817I92k219o19J787J856m93k174j021J426K031Jk008j422J023K143M19j847j689
1834a814P06K163P46j628j855L34K096J095j324k008o7J958J414j005k062m40
1850a691J786J662o57k097p89J557J877k79k066j138J284J990J11j888j398Q52
1866h84K011N39j594j678M09J964R67j272j883j0J855J280r41j958m05J683J551
1883A634n97j967p50J445J727k38j886j058J167J842J11j769j313Q65J913M44
1899A570j608j538N43J937P51j400j730K18J898J047j141j855j22J734J331p97
$$ y = [2031, 1157, -1217, -1985, -155, 1881, 1433, -935, -2066, -501, 1717, 1646, -565, -2045, -851, 1430, 1838, -156, -1982, -1226, 1137, 1982, 201, -1839, -1472, 811, 1988, 592, -1540, -1650, 379, 1940, 992, -1227, -1846, -59, 1797, 1304, -870, -1891, -465, 1566, 1567, -441, -1863, -840, 1303, 1722, -125, -1814, -1108, 1055, 1801, 173, -1682, -1348, 748, 1843, 519, -1489, -1556, 402, 1816, 811, -1251, -1691, 95, 1757, 1100, -997, -1786, -229, 1648, 1369, -697, -1835, -551, 1439, 1550, -338, -1736, -884, 1127, 1666, 72, -1606, -1197, 767, 1734, 462, -1421, -1431, 424, 1704, 763, -1195, -1600, 83, 1634, 1037, -930, -1680, -235, 1492, 1254, -632, -1690, -523, 1319, 1430, -339, -1652, -787, 1126, 1570, -38, -1576, -1033, 904, 1655, 255, -1475, -1257, 641, 1688, 547, -1308, -1430, 304, 1635, 838]
1915H38j871n06J477J535l85j807q62J177J694K1j717j205Q73J834L90j563j470
1932a547N62J825P16j333j597K07J730R84j042j694j34J613J258p81j780m30J474
1949C1J453m99j781p21J275J607j88j732j005J046J714J15j614j226P62J729M40
1966A406j399j408L96J687P89j130j586K7J614J084q35j681l21J436J334m97j702
1983g86o54J247J501k15j619q94R80J558R3j464j128O87J596M42j334j372M33
2000i29J659O85j175j483J50J582R10r42j555j22J467J143p16j594l90J320J289
2017A299m07j545p07J059J449m8j469j016Q10J560K55j342j183N13J529N44j130
2034A71j359J96J499Q40r31j473o5J395J014o60j472l64J202J219l80j493o58
$$ y = [838, -1033, -1539, -62, 1473, 1088, -719, -1581, -404, 1290, 1311, -406, -1611, -738, 1096, 1486, -77, -1547, -985, 840, 1556, 223, -1374, -1167, 563, 1547, 505, -1189, -1323, 290, 1548, 767, -1013, -1443, 31, 1484, 985, -796, -1517, -242, 1365, 1177, -555, -1560, -514, 1200, 1315, -299, -1525, -763, 966, 1406, 7, -1401, -1005, 682, 1471, 341, -1245, -1218, 396, 1480, 645, -1036, -1357, 79, 1413, 916, -786, -1440, -193, 1308, 1093, -526, -1420, -440, 1118, 1211, -253, -1381, -694, 902, 1344, 10, -1362, -929, 730, 1415, 240, -1243, -1093, 489, 1399, 457, -1098, -1220, 247, 1390, 674, -920, -1310, 10, 1299, 892, -653, -1360, -301, 1148, 1100, -369, -1385, -575, 985, 1240, -102, -1285, -772, 757, 1301, 171, -1188, -992, 507, 1347, 416, -1057, -1122, 273, 1287, 627, -845, -1209, -7, 1212, 832, -661, -1319]
2051a319J092J381j65j483q31R27J429N6j357r96O74J450L33j240j177M21J469
2068F64N85j030j293J09J390Q38p75j407j96J281J076n51j451m32J122J193k87
2085H36j350p00Q77J319M6j311r46O61J387K76j165j078M15J344N35r73j233J65
2103h95J344P67q56j346k1J315Q75o55j336k53J129J049m03j322n37R96J181j59
2121H73j311p10P96J250Q4j185r31N45J315L64j084j103L34J311N61q95j155M6
2139h95J190P93o27j243k41J091J008m42j274m10R66J064k13j220o15P85J177
2156H94K4j204q18O64J240J78j090r13M49J196L93r29j045K05J196O25q01j162
2174h98QJ163P68o02j163k45J010R44l45j200m69Q70J063j46j149o22O81J082
$$ y = [-1319, -227, 1154, 989, -494, -1325, -398, 1031, 1087, -270, -1266, -592, 858, 1191, -49, -1226, -805, 664, 1249, 219, -1074, -965, 425, 1263, 488, -919, -1115, 166, 1242, 691, -760, -1192, -70, 1123, 836, -514, -1214, -337, 982, 1028, -283, -1229, -568, 819, 1095, -70, -1148, -733, 611, 1146, 173, -1060, -895, 449, 1216, 360, -986, -1007, 308, 1183, 528, -808, -1061, 68, 1117, 714, -608, -1145, -149, 1032, 873, -438, -1148, -352, 898, 982, -203, -1134, -589, 726, 1090, 6, -1097, -763, 548, 1109, 214, -941, -895, 295, 1088, 461, -782, -1023, 68, 1076, 634, -640, -1050, -84, 980, 767, -453, -1068, -283, 894, 918, -286, -1104, -440, 800, 978, -112, -1025, -576, 620, 1013, 84, -961, -756, 440, 1065, 264, -898, -890, 273, 1041, 439, -724, -969, 41, 985, 640, -560, -1029, -159, 904, 758, -391, -1013, -332, 750]
2192G50J22j008q43M47J164L55r35r91K77J142N21p91j036N1J078O90o02j123
2210g32j45J018Q24m59j141k97R09R11k60j094n07P59J027m6j082o99O31J102
2228G19J36r95q06M20J088L58q41r28J70J069N58o96j013j8J005P17n03j060k43
2247h63Q90Q69k87j091m48P95R56j35j037n73O40J000N5r51p36M65J046K73q92
2266b4q73L12J069M14p77r33J09J033N87o20j009p8R66P38m70j042k53Q71Q38
2285H58k69j008m63P00R57l9r98o36N37J015J48q92p79L55J018L55p82r04J73
2304f54J021N12o53r71MR62O35m83r95j88Q56P99l19j029l81P92R08j71j017n11
2324h83O63R55Jr47o56M87J011J97q82q02L25J023L80p50r00J20R71N65n98r66
$$ y = [750, 872, -136, -979, -532, 632, 987, 52, -939, -662, 480, 1001, 210, -826, -775, 303, 993, 391, -732, -877, 141, 965, 506, -635, -932, -23, 888, 628, -466, -973, -214, 813, 767, -315, -1014, -383, 719, 855, -140, -946, -526, 562, 920, 79, -849, -679, 390, 948, 252, -761, -779, 226, 943, 440, -620, -863, 27, 896, 609, -482, -930, -135, 821, 686, -351, -924, -284, 716, 771, -180, -916, -451, 595, 868, -24, -897, -585, 484, 898, 121, -812, -703, 330, 917, 297, -712, -790, 176, 914, 444, -598, -851, 20, 858, 589, -419, -882, -182, 775, 736, -262, -898, -361, 654, 802, -90, -869, -514, 504, 859, 77, -827, -654, 367, 879, 226, -745, -741, 221, 856, 373, -622, -810, 46, 845, 526, -503, -884, -92, 816, 645, -372, -883, -220, 735, 736, -211, -867, -380, 631, 828, -54, -856, -531, 492, 872, 122, -778, -658, 313, 878, 280, -686]
2344f86q8R20P10m23j011k62Q13Q30k37r94m47O87R25n3r47o10N36R86J41q92
2364a02p45L86R97K98p73q70K15J018M69o96r45M6R76O15n53r74j36Q77P47l64
2384D86j010l37P83Q74j87r90n10O36R47L5r42o72M76J003K15q46q17L16J004
2403D64L93p11r08J10R63N82n92r60r1R02P15m17r98k80Q28Q32k43j037m36P23
2423a61R20o4j000n97N79R98Q8r12p29M07J008K95q20q42K34R96M77o76r49K1
2443g27R70O56n30j008j58Q90P76l53j017l33P52Q73j48r75n35O00R67M9r28o90
2463h69M52J010K43q52q40K90J031M10p47r30J18R97N78o06r87p0R34P07m39j016
2483e86k68Q45Q54k63j027m48P17R46n5r82o34N54J026J34r20p62L78J038L19
$$ y = [-686, -774, 146, 856, 433, -578, -840, -27, 803, 566, -428, -875, -188, 737, 684, -263, -873, -337, 649, 790, -102, -847, -461, 536, 834, 61, -809, -594, 424, 893, 197, -748, -702, 274, 889, 336, -638, -774, 103, 850, 486, -524, -861, -78, 796, 609, -381, -891, -255, 692, 727, -215, -887, -411, 592, 807, -39, -856, -540, 464, 857, 146, -762, -652, 311, 893, 301, -659, -750, 152, 867, 450, -548, -828, 0, 832, 589, -448, -884, -161, 759, 695, -305, -902, -323, 675, 763, -149, -878, -471, 537, 832, 12, -830, -596, 400, 877, 201, -748, -727, 243, 899, 369, -639, -797, 93, 869, 516, -501, -834, -82, 791, 643, -332, -867, -267, 700, 749, -179, -869, -417, 593, 836, -16, -856, -566, 465, 875, 128, -802, -684, 313, 891, 285, -702, -772, 162, 869, 430, -586, -854, -9, 845, 582, -445, -893, -176, 770, 715, -267, -901, -347, 679, 813, -107, -869, -491, 547, 866]
2502H66q02q70J88R94N13o41r58n5R65O86m81j027k41Q91Q31l05j047m08P58R36
2522G93j35j010n77O42J005M1r61o99M80J019K54q65q43K77J054M50p65r56J00
2541f96J021N98o08j007j00R38P63m21j058l17Q58Q81k49j035m86P10R53j6r74
2560b45o62N03J039J93r08q25L52J076L54q02r06J77J027N46o61j001j4R89P01
2579I33n10j060j99Q94Q27l24j041m20P73R45j17j053n83O49J028M5r96p29M90
2598d48J054K52q78q68K68J062M65p56r61Q0J026O24n85j017j39R31P90l92j077
2617e69l36Q51R31k36j071n00P35R80k8j011o59N35J046J75r36q27L95J065L56
2636H96q29r22J94J038N48o90j021j4J032O98n45j073j79R36Q18l47j060l92Q02
$$ y = [866, 64, -806, -618, 376, 889, 248, -710, -765, 200, 886, 405, -622, -863, 28, 859, 554, -493, -901, -143, 793, 658, -352, -929, -287, 718, 759, -202, -901, -421, 598, 852, -13, -856, -579, 475, 925, 160, -796, -696, 325, 923, 315, -692, -792, 146, 909, 488, -570, -887, -29, 852, 603, -432, -918, -208, 745, 729, -245, -907, -404, 635, 828, -80, -905, -553, 523, 877, 75, -831, -654, 373, 919, 258, -743, -757, 232, 933, 423, -637, -836, 58, 885, 561, -480, -900, -127, 818, 701, -352, -935, -286, 742, 787, -209, -938, -448, 606, 858, -20, -888, -620, 442, 907, 151, -810, -730, 296, 920, 335, -682, -821, 110, 900, 508, -569, -905, -54, 877, 641, -430, -930, -195, 785, 757, -254, -913, -378, 668, 843, -93, -920, -525, 540, 896, 67, -855, -661, 377, 925, 235, -786, -800, 232, 930, 385, -688, -867, 69, 887, 540, -520, -912, -110]
2655a10R39j29j061n71O53J030M4r85p31M81J061K56q83q80K80J093M66p81j002
2674h30J12J050O10o26j021j10R48P78m32j076l19Q87R09k61j105m79P60J014
2692H09o7j044o61N90J091J41r96q11M26J106L29q63r14K07J070N46p10j039N
2711g85J041P22n68j093j94R63Q41l63j099m07Q09R88j54j086n87O93J047J8j032
2730b46p30N16J092K47r34q77L02J133M61q26j008J34J104O00o62j058p2J015
2748A91P84m72j132k73R28R04l03j111m62P76J015q4j070o75N99J126J45j023
2766a37q32M39J129L26q95r28K11J104N43p31j048J7J070P13n74j112j88R84Q64
2785I55l77j123m02Q40R93j66j100n98P09J085J7j070p35N36J117K28r51r09L47
$$ y = [-110, 829, 700, -361, -932, -279, 751, 795, -190, -921, -440, 621, 877, -6, -886, -606, 487, 953, 172, -830, -718, 332, 942, 316, -705, -815, 133, 911, 479, -597, -916, -29, 880, 619, -486, -965, -205, 809, 742, -302, -963, -373, 718, 859, -137, -948, -522, 584, 913, 50, -864, -657, 413, 959, 249, -790, -785, 256, 978, 410, -683, -877, 86, 927, 564, -535, -942, -133, 855, 701, -385, -972, -279, 768, 786, -246, -976, -460, 632, 879, -55, -932, -630, 503, 964, 138, -870, -736, 368, 968, 306, -752, -824, 191, 975, 503, -629, -902, 26, 930, 627, -484, -946, -170, 845, 761, -309, -984, -385, 741, 886, -137, -969, -530, 599, 925, 30, -898, -687, 417, 960, 229, -819, -802, 268, 981, 407, -705, -893, 91, 955, 578, -545, -947, -107, 886, 720, -380, -978, -269, 816, 833, -237, -972, -436, 681, 909, -42, -951, -604]
2804f04J131M30q24j013J35J092O27o62j090r2J036Q01m84j130k97R34R19k81
2822F28j112m92P86J017o6j054o79N96J101J53j005q19M19J128L49q84r62K43
2840f53J095N37p39j056K7J070P05n89j097j88R78Q50l84j112l96Q40R84j81j088
2859c97n86O97J049M1j038p38N34J090K44r41q77L23J111M46q09r88J21J069O20
2878I71o40j054r7R91P80m57j093k95Q88R15k86j089m83P65J002p9j053o48O02
2897c60J062J38r76p95M13J087L22q54r07K08J072N24p08j015K0J024O87n48j048
2916f54j93R30Q28l50j084l83Q12R39j63j046n49O56J003L0r73p11M83J035K37
2935H47q77q55K96J062M29p62r57J08J030N85o04j013p7R47P35m44j037k66Q41
$$ y = [-604, 527, 957, 133, -880, -745, 347, 974, 312, -778, -870, 166, 967, 483, -647, -944, -10, 909, 628, -484, -976, -190, 827, 761, -293, -972, -376, 725, 878, -127, -946, -527, 601, 950, 66, -896, -653, 442, 979, 240, -816, -789, 281, 986, 397, -700, -888, 90, 940, 556, -556, -952, -112, 872, 691, -397, -983, -286, 763, 804, -234, -972, -438, 652, 896, -45, -922, -599, 512, 958, 149, -839, -718, 351, 971, 331, -723, -820, 171, 951, 494, -599, -894, -6, 909, 623, -466, -949, -184, 818, 739, -314, -962, -360, 702, 840, -136, -931, -518, 569, 891, 37, -870, -662, 410, 934, 226, -789, -769, 255, 942, 394, -654, -847, 83, 911, 561, -523, -906, -94, 845, 682, -364, -913, -257, 746, 776, -197, -908, -425, 610, 847, -30, -885, -589, 473, 902, 140, -817, -709, 321, 906, 302, -711, -788, 159, 894, 450, -587, -853, -12]
2954a2Q63k65j028m49P19R53o4j008o15N84J002J27r34p46M02J015L13q08q59
2973h10J93J018M81o74r48J3R59O49n14j015j70Q82P82l49j012l58P70Q86j62
2992F21r82n06O05R47L7r17o84M82R85K11q33p73K87R79L97p28q69R1R61N57n74
3013B94r49q4R00O85m26r56k66P90Q01k41r68m25O61Q93m3r32n80N14R44J32q50
3034a06p21L65R62L03p61q18K02R58M42o22q78J0Q84O07m67r40j73Q21P36l25
3054D79r46l23P00Q24j41r20m93N62R04M5q87o17M28R26J94p80p27K61R22L72
3074G83o58q28P5R00N27n28q79r1Q16O67l62r11k55P25P70k21q96m20O26Q30m8
3095F22q54n49M69Q72J49p84o79L00R01L08p00p67J54Q82M47n84q33KQ25N81m34
$$ y = [-12, 851, 586, -442, -891, -172, 781, 717, -291, -906, -322, 680, 807, -127, -873, -471, 544, 857, 49, -810, -617, 401, 882, 208, -740, -727, 232, 881, 367, -648, -818, 64, 846, 497, -515, -873, -103, 783, 621, -361, -867, -262, 685, 722, -195, -879, -397, 588, 799, -34, -807, -520, 459, 856, 128, -741, -650, 311, 868, 294, -655, -739, 161, 846, 420, -536, -802, -12, 789, 548, -420, -845, -184, 709, 666, -266, -846, -332, 612, 744, -106, -827, -462, 500, 803, 42, -776, -574, 384, 826, 204, -674, -664, 220, 827, 360, -580, -753, 68, 804, 479, -467, -790, -90, 734, 593, -327, -820, -258, 646, 691, -196, -813, -385, 541, 735, -45, -772, -511, 411, 783, 125, -703, -628, 272, 799, 271, -608, -699, 117, 784, 422, -489, -744, -19, 751, 530, -366, -786, -160, 670, 622, -232, -781, -312, 560, 709, -75, -754, -454, 447, 755, 55, -712, -558, 324, 771, 187, -646, -644, 181, 762, 328]
3116C28q69j80P60O84k70q70l36O51P75j05q30m88M97Q54O3p96o14L83Q52K29
3136G18p16p05K20Q45L83n95p83M9Q12N11m64q27j16P56O15l13q27k76O59P18
3156F64j52q55l97N61P83j4q02n06M13Q15J45p07o39K70Q27L08o24p12J14P88
3176B80M35m86p74n6P52N56l59q14j92O73O62k22q11l37N56P17n7p67m65M35P78
3197E04R3p02n79L07P97K25o27o46J62P73L77n15p35J5P59M88m16p54j23O67N90
3218F60k76p47k78N79O81j32p58l85M71P29Pp00n11L48P53J64o34n98K03P65L01
3239F42n55o65P7P18M16m15p18o6O65N42l07p39k00N88O22j73p24l36M99O84l4
3260E21p00m48L82P36Q5o46n42K79P15K14n54o01J02P02L73m61o80rO80M77l60
$$ y = [328, -541, -721, 39, 723, 453, -417, -753, -102, 673, 568, -262, -750, -253, 601, 664, -132, -746, -363, 489, 718, 2, -703, -483, 362, 745, 150, -633, -584, 228, 739, 275, -552, -668, 88, 703, 390, -437, -713, -54, 664, 512, -343, -740, -179, 604, 590, -212, -718, -305, 510, 655, -52, -691, -421, 406, 714, 90, -622, -508, 280, 715, 229, -545, -601, 151, 707, 348, -466, -658, 15, 677, 455, -356, -693, -137, 580, 523, -244, -709, -274, 504, 597, -105, -684, -377, 420, 645, 18, -628, -466, 307, 684, 169, -566, -551, 208, 696, 280, -474, -597, 70, 660, 384, -363, -641, -62, 619, 487, -271, -656, -185, 544, 551, -149, -660, -312, 441, 605, -29, -627, -424, 341, 642, 87, -578, -501, 217, 633, 218, -500, -566, 99, 641, 334, -405, -605, -17, 605, 432, -292, -628, -129, 555, 521, -179, -627, -245, 491, 576, -70, -612, -333, 382, 596, 42, -559, -457, 245, 618, 157, -523, -532, 148, 625, 265]
3281B65p21j25N98N54k10p02k67N19O29p6o99l66M11O60M8o27m92L01P01J89n67
3302B3n81J66P00L02m87o36M9O65M10l70o84r4O23N01k68o90k08N33N88j43o69
3323b70l28M44O24No24m39L30O64J23n73n24K35O59K38n10n77J10O49L50m02o30
3344d46l3N99M52k83o62j58N51N32j81o55k82M77N78o4o25l79L79O30N3n81m65
3365e63K64O28J88m91n46J28O32K97m22n75J7O03L79l15o17r1N36M84k26o25k03
3386e18M80N41j14o06l08L74N80K3n70m01K74N93J36n13m99J94O09K37m46n39
3406d73O1O00L31l64n79m6N54M17k50o01j27M65M90j39n96k53M14N47l2n66l69
3427e16L32N73Q2n25m34K21N77J83m58n03J19N73K79l84n40J3N31L72k88n61j14
$$ y = [265, -456, -581, 17, 571, 361, -341, -608, -89, 540, 464, -235, -601, -190, 470, 518, -109, -601, -300, 401, 590, 23, -558, -392, 308, 610, 123, -513, -464, 201, 611, 241, -443, -537, 86, 587, 319, -371, -579, -46, 542, 399, -270, -598, -154, 470, 475, -149, -588, -258, 406, 529, -44, -568, -333, 326, 564, 54, -523, -413, 236, 586, 184, -446, -479, 120, 572, 289, -373, -531, 20, 552, 371, -284, -566, -89, 489, 425, -200, -579, -200, 430, 483, -98, -563, -299, 329, 517, 26, -520, -392, 240, 537, 115, -460, -443, 160, 539, 224, -393, -484, 52, 536, 310, -315, -518, -38, 503, 389, -217, -525, -151, 429, 452, -118, -519, -245, 348, 484, -29, -528, -334, 275, 512, 66, -473, -412, 188, 519, 155, -424, -470, 84, 501, 251, -350, -477, -12, 478, 339, -257, -510, -96, 451, 419, -147, -516, -184, 389, 471, -54, -488, -267, 310, 493, 35, -468, -349, 224, 503, 119, -421, -408, 123, 495, 207, -354, -468]
3448d68M87M52j75n78k25M32M98o8n56k92L29N63J5n10l88K33N85J27m55m57J52
3469b99N47K42l84n21L6N44L33l06n52o1M97L88k15n44j75M46M65j24n34k63L56
3490a24M99jn05l50K71N30R4m52m23J72N40K01l97m72P4N18K96l29n00j7M72L61
3512D58k33n17j25M26M33j50n04k14L58M57k3n16k87K73M99N8m53l89K01N10J54
3533D16m07m28J04M94K36l25m67J6M68L18k52m74q8M15L92j61m92j83L76M23o7
3554C14m88k37L00M56K4m53l32K14M87J13m04l88J23M75K03l32m34L1M44K83k58
3575A41m68m8M29L40j92m68j22L60L82q7m69k02L02M30nm38k81K24M57P6l84l44
3597c67J34M63J70l38m06O5M28K62k91m22rL97K98k05m38j03L61L45r4m49j89
$$ y = [-468, 19, 471, 296, -282, -507, -75, 423, 355, -201, -493, -164, 399, 414, -96, -484, -251, 334, 461, 6, -451, -299, 248, 490, 106, -415, -379, 165, 498, 192, -360, -421, 76, 464, 249, -295, -470, -24, 441, 317, -217, -480, -124, 375, 374, -131, -481, -210, 320, 414, -38, -461, -289, 251, 452, 55, -417, -343, 175, 471, 142, -358, -375, 97, 458, 225, -292, -417, 9, 442, 292, -212, -426, -68, 389, 366, -150, -437, -164, 335, 393, -60, -449, -248, 262, 416, 9, -419, -315, 179, 415, 90, -377, -361, 107, 425, 173, -301, -389, 26, 418, 257, -235, -418, -42, 381, 314, -174, -411, -111, 345, 369, -84, -416, -202, 285, 398, -6, -394, -271, 204, 407, 75, -359, -328, 116, 399, 141, -327, -375, 54, 394, 202, -266, -388, -28, 354, 267, -202, -404, -102, 328, 323, -115, -396, -172, 285, 361, -23, -367, -233, 230, 400, 62, -344, -279, 149, 411, 120, -302, -311, 86, 384, 179, -259, -362, -1, 344, 250, -199, -388]
3618c88K99M19l0m35k62K47M29M2l85l10J55M41J34l36l66Q3M28K16k83m14K5
3639b91L93K79k16m17q3L61L54j54m34j50L11L67n1m11k29K37M19K4l88l04J82
3660b01M15J09l35l27Q8M03J90k70l88K1L95K64k32l99m9L56L05j38m14j23L00
3681c0L58o7l93k04K38L77J8l56k73J61L85J07l18l36J02L92J77k87l51K2L64
3702H6K33k01l72o2L39K90j32l90j22K86L33n8l64k01K37L48J9l36k51J66L69
3723B17J00l11l06R8L73J43k43l35J0L47K24j91l50o2L19K72j32l66j15K67L06
3744B65n9l52j73K18L35J3l27k34J62L43Q4k86k73Q2L42J52k34l20L7L32K07k01
3766A13l31l8K95K60j16l52j18K64K96o1l31j81K27L09nk99k26J49L44O3k83k70
$$ y = [-388, -89, 330, 300, -135, -397, -150, 279, 321, -64, -374, -219, 222, 356, 20, -346, -263, 165, 381, 98, -316, -291, 102, 381, 165, -252, -335, 26, 380, 226, -208, -358, -47, 320, 269, -142, -371, -134, 285, 309, -79, -383, -201, 214, 323, -12, -339, -251, 152, 342, 72, -316, -295, 100, 364, 132, -267, -316, 40, 345, 207, -207, -330, -30, 328, 261, -132, -336, -98, 279, 297, -59, -332, -171, 214, 321, 3, -333, -231, 161, 338, 51, -300, -278, 86, 319, 118, -254, -316, 23, 313, 181, -209, -331, -45, 288, 230, -134, -335, -98, 250, 269, -67, -318, -152, 217, 317, 6, -300, -202, 171, 314, 71, -264, -254, 93, 317, 126, -224, -286, 33, 305, 173, -193, -308, -41, 265, 206, -146, -319, -101, 234, 247, -80, -314, -152, 191, 275, -11, -284, -202, 140, 292, 58, -262, -225, 107, 314, 113, -218, -256, 39, 299, 183, -169, -287, -23, 273, 212, -119, -300, -73, 236, 231, -68, -294, -145, 199, 262, -21, -291]
3788b91R3L37J29k37k98M1L16J84j90l10l6L07K35j22l32r1K59K71p1l11j60K28
3810d9K93jk97k20J57L26O0k76k56Q8L41J11k46k98N2L18J78j97l15k9K94K40
3832B74j41l31q2K59K70p0l21j58K38K94%l17k05J71L17P1k96k38J06L13J22k32
3854D4k95N1L19J73j96l24k8L13K32j44l36p9K59K83q4l41j54K35L10k6l16k03
3876c07J74L32N5l02k55J24L31J21k47l03N4L34J89k05l30j5L11K37j51l35r5
3897b83L00K67q5l38j46K29L04j2l31k16J89L35M5k85k81J33L33J33k61l14N5
3918b29L37J90k12l41j2L26K41j70l36p9K82K92q3l47j63K41L30j0l44k15J84
3939a18L53M4k98k76J28L52J15k63l26P7L40J75k30l19j8L24K40j61l60p7K87
$$ y = [-291, -198, 139, 268, 31, -267, -226, 90, 274, 84, -226, -262, 45, 280, 158, -174, -265, -6, 265, 194, -117, -277, -49, 244, 243, -54, -274, -117, 209, 269, -7, -263, -175, 166, 277, 31, -267, -215, 103, 281, 84, -231, -260, 34, 274, 133, -198, -280, -21, 249, 179, -142, -300, -62, 232, 232, -85, -290, -119, 198, 269, -27, -265, -159, 154, 276, 44, -251, -200, 119, 292, 96, -228, -256, 57, 289, 145, -191, -270, -11, 272, 188, -153, -307, -72, 238, 212, -104, -307, -133, 199, 254, -48, -303, -179, 152, 273, 26, -277, -223, 111, 300, 95, -235, -250, 61, 298, 147, -188, -283, 17, 284, 199, -139, -285, -56, 248, 236, -95, -311, -122, 213, 258, -27, -308, -175, 158, 291, 30, -284, -229, 108, 298, 86, -255, -267, 59, 300, 130, -206, -285, -3, 289, 206, -141, -304, -63, 267, 257, -87, -302, -118, 235, 279, -19, -295, -167, 185, 300, 37, -289, -212, 128, 303, 73, -246, -264, 60, 300, 139, -221, -298, -11]
3960a1K88q1l67j47K41L39k1l48k11K00L49M6l15k63J32L65J14k84k96M6L62J79
3982C17k25l40j0L39K42j85l54p7L04K90j12l63j44K59L24l4l57k09K20L51K7
4003B63l23k64J45L64J08k90l01Q3L57J68k42l31QL43K35j94l60n1L13K91j31
4024A91l64j31K70L24o1l50j93K18L54Ol33k44J44L82P7l14k80R4L64J43k56l35
4046b94L7L63K02k08l59l0L42K54j47l51j10K99L08q4l57j81K53L42ll55k40K06
4068a13L58N1l10l00J29L76J28k82l29N8L74J72k21l61j8L67K34j67l70r0L11
4089cL02j03l72j47K74L27k7l69k15K35L59L1l42k87J64L87J05k97l25R1L82J78
4111C48k65l61J6L65K32k11l66n6L30K83j36l78j26L00L17o7l67k02K46L51J9
$$ y = [-11, 277, 196, -171, -318, -77, 262, 241, -107, -318, -118, 231, 277, -38, -301, -169, 196, 310, 26, -270, -224, 138, 317, 92, -248, -258, 81, 323, 138, -216, -293, 11, 301, 189, -174, -318, -59, 265, 231, -126, -335, -115, 236, 263, -60, -324, -179, 185, 293, 3, -298, -215, 142, 310, 68, -263, -255, 88, 323, 129, -231, -282, 31, 322, 191, -173, -304, -34, 290, 229, -121, -314, -96, 258, 264, -69, -313, -169, 213, 290, -24, -304, -210, 154, 297, 41, -294, -257, 106, 308, 100, -259, -289, 53, 307, 160, -191, -301, -2, 306, 222, -135, -316, -63, 279, 276, -79, -319, -113, 245, 296, -14, -314, -185, 191, 319, 37, -292, -234, 140, 312, 91, -270, -288, 79, 313, 146, -224, -314, -3, 299, 196, -176, -323, -49, 278, 251, -118, -333, -98, 261, 292, -50, -337, -173, 214, 319, 22, -303, -212, 170, 348, 83, -278, -262, 103, 335, 124, -242, -298, 32, 315, 179, -199, -325, -25, 292, 225, -142, -344, -98, 253, 272]
4132B72l57k63J78L99O4l11k97J07L82J63k86l46N3L80K12k39l65l4L57K67j66
4153A70l72r5K96L13q7l88j60K68L39k7l58k41K04L76O3l41k88J45L78J11k91
4174A5l32P6L84J78k37l67LL77K27j88l69p2L25L05j14l89j46K92L45o3l73k06
4196c29K32L73J0l45k65J55L98R1l25l18R9L94J52k70l50K5L78K09k14l61n4L47
4218C2K83j53l81j07L08L26q0l72j87K62L51ql58k39J90L83N2l25k94J34L83J18
4240C18k79l26N9L67K00k39l68j9L67K44j81l73r1L19L01j17l72j49K82L29l1
4261B41l67k14K26L58L5l45k57J58L62J19l06l03P9L82J67k62l53L0L49K33j87
4282A45l78m7L23K82j46l81j26L03L23p1l70j94K39L48J0l39k55J79L71Q0l26
$$ y = [272, -85, -348, -170, 229, 293, -18, -315, -208, 174, 337, 51, -295, -242, 138, 350, 111, -254, -288, 69, 336, 170, -202, -297, -1, 312, 225, -163, -323, -55, 284, 257, -101, -342, -138, 238, 301, -40, -328, -183, 195, 306, 15, -317, -241, 143, 321, 84, -283, -280, 97, 324, 136, -233, -305, 20, 325, 211, -178, -324, -32, 313, 250, -123, -329, -97, 276, 286, -59, -324, -169, 229, 320, -5, -323, -224, 170, 322, 52, -298, -273, 105, 314, 100, -261, -315, 32, 315, 162, -219, -326, -18, 308, 228, -144, -331, -69, 282, 274, -84, -323, -133, 250, 302, -23, -317, -183, 200, 318, 39, -287, -228, 139, 339, 100, -268, -287, 80, 324, 143, -230, -321, -2, 299, 182, -190, -339, -57, 272, 241, -126, -340, -114, 244, 279, -66, -323, -165, 197, 316, 10, -293, -214, 168, 335, 73, -280, -250, 99, 332, 145, -233, -280, 43, 325, 179, -202, -328, -25, 298, 227, -143, -337, -98, 250, 260, -79, -334, -155, 216, 296, -30]
4303c0k92J03L89J51k70l40M7L55K10k05l61k9L35K64j57l72r1K98L09q7l70j72
4325c15K50L51k3l53k37J91L72M5l11k86J24L63J38k88l18N2L66J89k42l42jL40
4347F5K38j71l53q3L08L06j05l78j50K85L24l8l50j95J99L59K9l38k64J58L61
4368B07J01l04k95R2L57J60k55l21OL34K34j96l61n3L15K72j22l68j10K70L09
4389B72m8l61j79K22L43K0l31k36J66L52O6k81k83R8L61J37k67l17L3L52K02k21
4411A00l29l4L17K54j53l55r9K90K87q7l54j53K45L13rl39k05J77L45N2l08k56
4433c01J25L50J15k76k97P9L36J70k26l11j1L23K27j61l45o8K99K64j11l30j36
4454b85K52L03m9l32j95J99L34K9l24k41J50L47P5k75k82P4L52J55k28l31J9L41
$$ y = [-30, -322, -219, 170, 321, 51, -289, -242, 113, 323, 118, -243, -272, 63, 327, 170, -202, -293, 5, 314, 227, -143, -315, -65, 286, 263, -90, -327, -136, 236, 281, -30, -316, -192, 171, 309, 21, -297, -245, 121, 310, 68, -274, -275, 65, 303, 132, -221, -304, 4, 310, 205, -173, -323, -38, 286, 248, -102, -297, -98, 261, 290, -48, -312, -154, 207, 308, 4, -291, -199, 158, 318, 63, -258, -252, 82, 316, 120, -241, -294, 21, 293, 171, -197, -307, -37, 272, 224, -137, -316, -94, 249, 269, -62, -298, -132, 220, 286, 5, -278, -180, 181, 318, 51, -266, -233, 119, 321, 100, -229, -263, 54, 308, 155, -200, -299, -9, 278, 191, -163, -316, -71, 242, 233, -106, -311, -134, 211, 263, -45, -301, -176, 174, 289, 13, -284, -205, 131, 301, 75, -236, -247, 76, 303, 142, -203, -271, 28, 292, 181, -149, -285, -33, 270, 221, -111, -306, -107, 227, 256, -68, -309, -159, 188, 263, -12, -294, -220, 132, 287, 59, -272, -253, 88]
4476H8J97j63l36n7L04K56j26l34j06K61L09p6l27j80K17L25J1l30k31J76L32
4497B10O8k86k74R7L60J21k52l14M3L37J82k03l36k3L05K53j38l47r6K70K96o6
4519B07l51j63K36L27j6l16k16J80L36N9k95k67J21L44J14k55l04M8L43J71k08
4540I5l30j6L05K44j64l23r2K86K73r3l48j38K36L17k6l41j90J85L42L9l12k50
4562c01J35L35J16k72k79N7L47J54k04l24NL19K21j66l37p2K92K68j07l50j19
4583b82K44K93k7l28k06K00L22L6l12k38J33L46R0k77k81Q0L48J48k35l04J8L15
4605H3K05j73l19m7K92K58j22l37j06K55K86o3l18j70K09L15Ql07k35J63L22P8
4627B77k86k70J00L44J20k40l08L9L19J92j99l11m0L05K37j29l36r2K69K70o7
$$ y = [88, 285, 122, -214, -271, 33, 289, 163, -171, -277, -16, 293, 217, -110, -290, -73, 252, 263, -67, -298, -122, 210, 278, -8, -282, -185, 175, 296, 44, -270, -227, 110, 292, 89, -247, -270, 35, 288, 150, -197, -293, -23, 273, 207, -144, -307, -71, 256, 240, -76, -292, -112, 224, 283, -12, -279, -158, 186, 300, 45, -259, -211, 132, 303, 95, -235, -251, 54, 298, 134, -189, -281, 5, 278, 185, -163, -301, -65, 252, 226, -115, -305, -120, 222, 261, -51, -301, -166, 169, 285, 13, -266, -209, 138, 292, 88, -236, -231, 88, 309, 143, -194, -266, 26, 294, 187, -163, -282, -38, 255, 228, -100, -306, -106, 216, 252, -60, -298, -165, 181, 271, -6, -287, -207, 141, 289, 54, -250, -232, 83, 288, 115, -204, -251, 41, 299, 177, -160, -266, -11, 275, 212, -106, -276, -67, 248, 256, -51, -286, -123, 199, 277, -9, -279, -179, 165, 285, 45, -263, -224, 95, 287, 88, -223, -263, 42, 279, 150, -186, -278, -9, 261, 194]
4648A94l40j37K24L01%l22k10J83L16N4k91k40J09L35J04k49k87O7L13J72k13
4669H3l08lK90K19j57l21p5K80K63j00l31j32K44K95n3l01j76J84L13L2k88k40
4691b82J34L19J11k83k59P3L36J40k18k98QL19K04j80l22m0K79K39j04l41j12
4712b77K47K83n2l21j64J98L05K2l01k33J54L25P1k75k57R7L15J39k28k92K6L15
4734I7J89j78l08l9K99K23j22l21j00K54K84o3l35j59K30L02ll24j99J57L28M7
4756B59k84k47J01L11J35k43k86L4L31J59j91l09j2K97K21j47l23o8K70K56p8
4777A86l21j39K29K94k2l06j86J62L18M6k80k47J24L15J04k41k85N9L02J68k07
4798G3l07OK92K07j47l17o7K68K47j02l14j12K21K91l1l11j75J81L04L2k82k19
$$ y = [194, -146, -283, -59, 242, 242, -80, -290, -107, 209, 263, -28, -268, -159, 176, 280, 31, -256, -189, 124, 296, 83, -225, -228, 62, 281, 124, -197, -272, 8, 271, 171, -160, -292, -48, 247, 194, -107, -283, -99, 214, 246, -42, -282, -148, 171, 282, -1, -260, -187, 149, 289, 71, -227, -219, 100, 304, 124, -198, -238, 41, 280, 176, -165, -277, -30, 253, 201, -120, -284, -86, 219, 241, -60, -293, -139, 186, 257, -18, -275, -178, 137, 276, 48, -244, -218, 97, 286, 108, -200, -239, 60, 283, 161, -160, -260, -6, 278, 215, -120, -279, -49, 253, 250, -74, -273, -116, 212, 259, -25, -272, -171, 140, 275, 32, -254, -220, 111, 270, 79, -230, -242, 55, 276, 129, -194, -262, 8, 264, 186, -135, -274, -45, 249, 227, -79, -265, -103, 215, 261, -19, -266, -142, 173, 277, 36, -249, -190, 112, 280, 73, -234, -228, 64, 271, 124, -193, -260, 8, 255, 153, -161, -273, -52, 239, 208, -103, -278, -97, 207, 239, -43, -262]
4820b62J29L22Q0k56k58O2L12J53k17k91J9K93J93j64k92o0K67K41j21l14q6K21
4842b9K64l6l06j73J88L04Lk87k01J48K97P3k55k44Q7K89J29j99k87L3K89J80
4864B67j72k95k5K74K14j21k99p5K19K67o4k88j57J98K68Qk81j88J30K97M7k47
4886b3k24P8L04J04k23k54L8K87J61j77k89j2K74J91j11k86q0K35K61q5k85j30
4908b46K02K71j0k79j91J64K77N2k56k22J07K93R2k37k48N5K89J31j88k68nK58
4930D1K02j35k90o2K53K25q2k83j26K20K51k2k78j69J69K80L1k62j98J15K74R1
4952B45k23k41O4K83J31j88k63pK77J83j43k83n8K45K23r5k87j10K13K44m0k72
4974a02j51J75K58J9k54k01J19K82P3k13k28O1K75J25j88k55K1K57J77j33k86
$$ y = [-262, -133, 189, 269, 13, -245, -183, 129, 282, 65, -226, -207, 86, 279, 115, -177, -237, 30, 271, 150, -164, -250, -29, 235, 199, -107, -280, -92, 212, 215, -72, -273, -125, 172, 245, -10, -254, -167, 122, 251, 52, -235, -202, 87, 267, 95, -200, -225, 49, 263, 142, -157, -232, -13, 254, 190, -98, -255, -57, 211, 219, -62, -250, -120, 177, 224, -23, -247, -169, 135, 239, 16, -238, -200, 87, 248, 71, -218, -230, 44, 235, 124, -162, -242, -7, 254, 169, -116, -246, -44, 227, 217, -62, -253, -89, 188, 240, -16, -238, -131, 162, 254, 17, -231, -176, 113, 244, 56, -212, -217, 41, 243, 108, -182, -244, 9, 234, 152, -131, -257, -37, 214, 192, -86, -255, -86, 194, 225, -37, -235, -120, 154, 245, 22, -219, -155, 128, 259, 71, -192, -199, 78, 261, 118, -165, -223, 22, 245, 150, -137, -247, -34, 210, 170, -102, -253, -78, 180, 199, -55, -256, -137, 145, 218, 5, -223, -162, 113, 238, 50, -205, -184, 73, 250, 117, -169]
4995a69l1K28K10q4k88q6J96K49l6k65j60J76K55J1k55j90J19K74O7k31k28O5
5017a73K88J06j77k54K3K56J73j52k63m3K37K06r1k62r8K16K33m9k69j31J71K50
5039A97Rk46j83J26K56O8k27k06N4K70J13j88k47K8K48J49j38k62l4K34J90r0
5061A21k60r7K10K19m2k59j29J72K55Qk52j71J28K56O3k34k06Q4K51J18j98k32
5083a95L3K52J47j30k76k6K42J76r8k44q4K02K10o0k55j33J81K37nk41j60J18
5105a09K67L8k22j92Q1K55J01j97k26K9K59J39j60k37j7K49J81j12k65o7K16K04
5127B15p0k50j00J70K38l5k34j56J39K49L3k25j91P8K62Q0j97k19M2K54J30j66
5149D7k37RK40J59j26k43n4K16J99p1k65q4J82K30l5k32j47J47K43K3k37j78J19
$$ y = [-169, -200, 28, 238, 154, -134, -220, -24, 225, 189, -76, -236, -60, 195, 206, -49, -239, -120, 154, 221, -10, -238, -173, 115, 221, 44, -210, -187, 69, 242, 90, -173, -216, 21, 227, 136, -126, -224, -8, 225, 176, -93, -224, -53, 197, 206, -40, -223, -97, 159, 227, 0, -206, -152, 118, 231, 43, -204, -176, 72, 221, 83, -179, -213, 21, 211, 121, -139, -236, -26, 193, 151, -108, -237, -65, 190, 198, -54, -225, -97, 159, 222, -12, -218, -134, 117, 235, 37, -195, -162, 90, 237, 107, -169, -195, 47, 223, 125, -119, -203, -1, 209, 149, -106, -239, -58, 179, 174, -67, -227, -109, 158, 196, -26, -218, -137, 118, 219, 22, -204, -175, 84, 223, 63, -174, -191, 58, 239, 127, -138, -205, 11, 215, 145, -105, -205, -35, 203, 168, -66, -222, -83, 166, 199, -26, -217, -139, 123, 203, 6, -213, -171, 83, 213, 47, -190, -181, 59, 218, 92, -151, -205, 11, 210, 139, -126, -210, -28, 202, 167, -65, -212, -65, 178, 201, -36, -214, -95]
5172i5K33Q1k03k14N7K40J24j79k28J1K27J58j36k46l6K11J89q2k53q3J94K10
5194A80l1k51j36J72K31J7k42j55J15K54L8j86j94O8K48R9j91k04J1K39J43j51
5216G4k40l5K45J74j06k48q1K12K05o7k41j07J56K30qk36j49J20K46M2k10j91
5238b15R0K41R4j85k19M0K38J39j57k32qK21J68j05k53m8K00K08p7k42j08J73
5260c7K27k2k44j31J26K46J6k26j68R7K41O9j89k26O6K53J07j60k32LK44J51j21
5283I0k29n4K12J93r2k25r2J84K07k4k45j30J52K35J2k35j60J08K38N7k11j86
5305a95O6K47R2j70k30K3K51J20j34k45l0K28J66q7k43o4J94K06n3k50j07J77
5327c8K20j5k27j37J13K52L6k14j80P6K47R2j90k14L8K38J25j50k32j5K20J54
$$ y = [-95, 138, 219, 16, -198, -141, 99, 223, 44, -184, -173, 54, 212, 76, -170, -206, 5, 194, 112, -141, -224, -30, 180, 149, -102, -238, -66, 165, 182, -60, -215, -100, 154, 192, 6, -188, -120, 128, 227, 36, -168, -157, 82, 225, 74, -166, -201, 44, 218, 112, -136, -217, -5, 200, 133, -108, -215, -59, 171, 163, -73, -222, -102, 144, 186, -24, -215, -125, 116, 210, 25, -194, -154, 84, 223, 66, -166, -174, 47, 215, 110, -143, -191, 9, 217, 140, -102, -210, -37, 190, 168, -76, -207, -81, 165, 181, -45, -213, -116, 125, 194, 5, -221, -155, 98, 205, 45, -187, -184, 60, 211, 90, -139, -193, 19, 212, 120, -105, -197, -13, 194, 170, -75, -205, -53, 182, 194, -41, -201, -93, 145, 202, -9, -195, -129, 118, 210, 40, -190, -167, 84, 204, 70, -175, -205, 23, 189, 102, -141, -205, -11, 195, 142, -108, -215, -38, 182, 167, -60, -197, -84, 168, 204, -10, -190, -114, 133, 225, 35, -179, -141, 97, 222, 72, -160, -175, 45, 199]
5349A99j04k37o8K04J92n8k51j00J80K24l1k32j42J40K41K1k28j58R5K46O9j96
5371Fj97N6K38J06j58k22J0K29J57j32k34k3K03J77q5k46q7J94J99n1k30j11J42
5394e9K10J5k15j56J03K37M6j91j96O3K55Q5j74k11K7K44J22j30k32j1K04J78
5416B14r8k34p1K02J84n1k31j08J66K11k3k25j30J14K33K4k09j69Q9K42N6j82
5438Dj95M2K30J12j54k17MK12J46j05k21m4J95J85q3k12q3J71J99l2k24j16J36
5461e0K10Pk05j50R2K38N2j99j76P1K17Q8j63k10K1K18J36j38k24j6K00J67r3
5484I3k18n7J67J89n3k19r6J47K05ok13j33J22K12L1j81j70P8K24P4j70j85K6
5507a33K09J20j43j95qK08J32r8k19m2J73J70o8k14q4J52J96k7j92j30J17K15
$$ y = [199, 95, -142, -210, -6, 186, 128, -123, -223, -43, 181, 150, -82, -224, -84, 157, 178, -50, -208, -113, 133, 202, 6, -191, -135, 103, 209, 51, -171, -161, 68, 225, 93, -141, -164, 39, 216, 131, -115, -202, -8, 191, 140, -90, -201, -59, 151, 166, -49, -205, -102, 135, 181, -10, -206, -143, 112, 197, 23, -188, -161, 83, 205, 75, -157, -168, 36, 214, 116, -118, -189, 13, 197, 146, -85, -193, -27, 184, 161, -64, -194, -80, 153, 177, -32, -201, -112, 130, 186, 4, -191, -149, 81, 193, 39, -178, -174, 38, 184, 79, -142, -186, 9, 194, 111, -101, -184, -13, 186, 154, -70, -186, -50, 160, 167, -38, -188, -96, 142, 194, -5, -181, -110, 107, 195, 32, -178, -157, 61, 197, 59, -165, -181, 19, 186, 93, -125, -182, -15, 174, 121, -98, -194, -47, 158, 152, -61, -194, -72, 140, 171, -10, -180, -102, 122, 196, 26, -159, -133, 76, 196, 53, -142, -150, 58, 190, 92, -127, -169, 4, 174, 106, -108, -192, -40, 156, 129, -63, -193, -76, 139]
5529A39Qj75j69J05K08N5j77j70N1K13R4j43j89K3J94J20j06k14j8J93J50r0j97
5552i5p2J61J82l8k11j00J22J85Pj78j43R5K00M0j73j49N1K04P0j34j85K0J91
5575E0J12j16j89j7J87J38p9j90o2J64J62m0k05p7J33J80pj97j01R2J88K7j74
5598b1j27P1J76M9j35j71M3J75Q5j09j85OJ62J27q5j84k9J45J42l2j96o6J26J71
5622A38k1j65j09J00J82J9j72j15P6J88M3j58j48N5J64R1j33j63J3J73R9q8j72
5645a03l3J44J33n5j91n7J36J54l0j65r1J02J69J5j69j02N4J95K2j32j40M9J74
5668G9O1j11j59K2J71R9r6j66j5J56J11o4j74m6J40J34l8j64r5J16J59j0j58j17
5692a65R8J61L0j49j24N2J76M4j11j51J5J73Q1r1j46pJ41J05o1j59l7J25J34m6
$$ y = [139, 147, -28, -197, -92, 116, 171, -6, -176, -125, 88, 182, 39, -150, -127, 67, 187, 81, -133, -151, 42, 192, 102, -95, -167, -6, 176, 138, -73, -173, -51, 134, 141, -37, -180, -85, 115, 155, -18, -167, -116, 88, 158, 24, -161, -141, 50, 162, 46, -143, -160, 27, 165, 86, -104, -166, -2, 160, 120, -85, -162, -29, 151, 144, -53, -154, -62, 126, 153, -21, -148, -77, 99, 148, 13, -158, -115, 60, 145, 36, -149, -143, 19, 146, 61, -123, -152, -7, 135, 103, -93, -159, -33, 138, 117, -48, -157, -57, 125, 144, -28, -143, -67, 121, 164, 6, -142, -87, 77, 168, 35, -128, -115, 58, 157, 69, -103, -136, 8, 141, 86, -105, -162, -26, 128, 98, -67, -158, -56, 113, 128, -41, -143, -89, 106, 128, -4, -144, -95, 79, 140, 29, -130, -108, 63, 162, 66, -100, -115, 41, 152, 88, -86, -132, 8, 142, 104, -60, -155, -39, 120, 110, -48, -165, -67, 94, 124, -25, -149, -97, 79, 123, 12, -139, -124, 49, 130, 39, -107, -114, 27, 132, 71, -88, -125, 0, 134, 88]
5716H8j40o8R7J52j3j53r1P4J55K7j49j10N6J65M6j27j38L0J48P6r9j38oJ40R9
5741A21p0j50l7J40J15n4j49n7J18J24j1j47p2P8J50K0j41j01P1J43L0j16j19
5764a14L9J34P2r9j28jJ33R0q4j27l1J21J13o1j32m9J03J20k2j39p3R3J46qj33
5789c7q5N7J38L8j19j00M0J26O8j05j27K0J36Q1q9j32j2J31R6o3j33l9J06J11
5813A07l0j34o7R5J08Jj09r2O0J25L4j20r8M0J31N2r8j01J4J25O5q1j15jJ12R6
5839A19o5j18l2J10Q2k5j16n6R3J13j7j22o6O0J24J1j14r0M9J26L5j12q9J4J27
5864D1N7q2j19KJ16P3m8j18k5J02R6l4j19m4Q2J07j1j16o4P8J04J6j07p4M6J20
5890G9K3j04q3K6J08N7q6j08J5J02N9o8j10jQ9Q9n1j10k9Q1R9j2j18n8O8J07J1
$$ y = [88, -52, -120, -23, 129, 116, -37, -128, -54, 101, 128, -21, -131, -75, 90, 136, 9, -129, -99, 49, 125, 26, -112, -118, 22, 121, 51, -99, -136, 4, 119, 65, -84, -141, -23, 101, 90, -57, -129, -51, 99, 119, -22, -123, -52, 91, 121, 5, -114, -75, 59, 131, 32, -96, -97, 36, 126, 42, -85, -116, 5, 118, 57, -75, -124, -21, 99, 77, -62, -135, -42, 104, 96, -37, -122, -65, 73, 111, -8, -108, -68, 58, 126, 21, -106, -86, 50, 131, 42, -90, -102, 29, 125, 62, -71, -110, -4, 107, 77, -57, -124, -29, 79, 80, -29, -121, -61, 64, 98, -22, -120, -80, 51, 103, 5, -96, -82, 43, 108, 27, -88, -89, 23, 119, 54, -64, -96, 14, 96, 71, -45, -101, -8, 105, 88, -34, -100, -40, 84, 95, -19, -109, -60, 66, 101, -11, -100, -86, 41, 98, 16, -103, -101, 15, 88, 40, -78, -103, -1, 95, 61, -58, -102, -20, 87, 76, -40, -104, -26, 78, 94, -13, -87, -41, 79, 102, -2, -85, -59, 49, 106, 20, -88, -73, 29, 88, 20, -90, -91, -2, 87, 36, -74, -103, -22, 77, 65, -53, -111, -43, 64, 75]
5917G5r9p8N6J11J3q7q6L0J24M0q9q9J6R5O8o5j09KR0P7m2j18j8P7R2k9j01n6
5945a00P8J01j6j06o1N4J01J2r5p3M5J05M6q9q8K6R0O3o9j06OR8O5m0j07j9Q8
5972IQ8l3r9m2P2Q3kr5p3O1J01Pr3p7L7J06M0r8q3L1R6M0p2r4J6R8N2m9r5j4Q5
6003CP8l3j00l0P9Q5k3r2m8N6J08mr1n7M4R0K4q5q2L0J04L7q5q4PQ3P5n9r0k1
6033h1R4O2l7r8k8P9P6l3p2m7P4Q7j4r8m2N5R8J1q7n6K8R4J9p3p4K0R2L9n5j00
6063f7J0Q7O0n0r7k2P5P2k7q6k9O0Q4j9r5l8M8R6mq0o1L9Q5K8p5p3L2Q7L6n4q4
6094f2PQ5N3m4q7j6Q4N7l2q5j8O1P3k6q7l6O1P0Or1n7N4P7Rp7n2K5R3J8o3p0L
6126f7R6M8o3p0%P8M3l3p8j7P4O6k5p9k9N7P5j7p3m9M6Q5Nq4o2L9Q1K0n3q3J8
$$ y = [75, -24, -102, -46, 65, 78, -9, -95, -65, 59, 99, 10, -79, -63, 32, 100, 35, -74, -72, 18, 95, 53, -65, -83, -6, 86, 57, -44, -100, -22, 79, 63, -43, -104, -50, 51, 63, -32, -105, -60, 45, 91, 2, -86, -60, 30, 93, 24, -82, -76, 22, 87, 47, -60, -79, 9, 97, 64, -35, -77, -5, 78, 76, -19, -92, -31, 70, 77, -16, -93, -56, 50, 90, -8, -91, -60, 36, 76, 4, -90, -74, 24, 76, 27, -68, -82, 3, 81, 48, -52, -82, -3, 82, 59, -33, -81, -25, 83, 79, -12, -69, -25, 65, 89, 4, -78, -48, 56, 93, 8, -76, -69, 14, 89, 30, -60, -81, 13, 75, 38, -60, -88, -9, 67, 34, -38, -85, -11, 76, 62, -36, -78, -23, 75, 86, -1, -57, -29, 65, 84, 11, -63, -43, 49, 88, 33, -67, -57, 30, 90, 40, -57, -79, -4, 68, 41, -45, -74, -14, 70, 51, -44, -82, -34, 62, 58, -22, -83, -44, 41, 69, -6, -79, -47, 40, 76, 22, -62, -55, 30, 83, 39, -48, -64, 20, 77, 45, -40, -58, 3, 76, 50, -37, -73, -12, 58, 64, -27, -84, -30, 47, 56, -21, -73, -48, 45, 63, 0, -70, -67, 29, 77, 14, -56, -56, 22, 65, 32, -46, -63, 11, 77, 52, -27, -56, 1, 76, 59, -14, -63, -17, 68, 73, -11, -73, -34, 47, 67, 14, -69, -51]
6157e1P7M1n1r1J1Q3N6n6p1j3P4O3l3r0j7O0P8k0p4m5O4P0Op8o1L1R7J7p3o7K4
6188c9Q3L9o4q2J6P6M2m3r7NP8M9l0q3l1P5O3j1q1m5O5P6nq3m5N0P3J5p0o8L9
6219c3Q0K2p2n1MR5L2n1p8PP1O3m7q0k3P0P0l5p4m6O7P0qq3l6L7P4Lo4n8L1P0
6251B7L8p5n7J4P6N5o2p5LQ2M6m5p0j0P0N7k7q2k4N5P4qq7m4N9P2Mp1n9J8Q5K5
6283F4n7o9J2P6L1n9o8kQ6M7l4q5j4O7O8k2q8k5O3O7j2p7l7M7Q5Kp7n5M2Q0K1
6314G7o4p9M3P2K6n8p8J0Q0L0l3q2j1P6N4l8p7k7O2Q0k2p7m8N9P7lo7n4K4J03
6344E5Po4n2J1Q7L7o0p3KQ0N2n0o3k3O6O3l3p6l2O4P6k1q5m1N3Q3j3p3n8N1P0
6375D0J5p3n6J8R1K5o7n7JR0M4n2q3KQ4N2l0p8l0O0Q7k7p8m4M5Q7Mq7n1L6Q2K7
$$ y = [-51, 26, 67, 16, -75, -64, 19, 75, 19, -52, -65, 9, 72, 39, -51, -68, -8, 70, 50, -24, -69, -5, 65, 71, -7, -68, -37, 60, 77, 4, -63, -39, 44, 83, 19, -63, -47, 29, 71, 28, -69, -64, 14, 63, 33, -50, -81, -6, 57, 46, -35, -80, -15, 61, 56, -27, -72, -22, 51, 66, -4, -72, -33, 47, 69, -3, -54, -50, 45, 77, 26, -52, -45, 26, 89, 42, -38, -61, 9, 79, 44, -30, -76, -9, 61, 53, -30, -66, -29, 45, 48, -16, -74, -43, 27, 65, -10, -67, -53, 23, 78, 16, -59, -56, 26, 72, 27, -43, -53, 17, 74, 47, -35, -59, -4, 70, 62, -25, -69, -10, 62, 66, -5, -64, -46, 39, 64, 7, -62, -50, 26, 57, -2, -70, -72, 14, 61, 27, -58, -72, -5, 63, 41, -47, -72, -9, 58, 46, -31, -68, -21, 64, 66, -11, -66, -24, 56, 77, 13, -66, -23, 49, 75, 17, -61, -51, 29, 59, 26, -56, -67, 9, 63, 25, -52, -79, -17, 63, 41, -36, -84, -25, 52, 49, -18, -72, -48, 55, 62, -2, -54, -43, 44, 81, 21, -52, -50, 30, 82, 32, -31, -54, 12, 75, 42, -34, -66, -2, 74, 53, -32, -73, -20, 63, 50, -23, -81, -30, 40, 55, -18, -74, -56, 35, 60, -7, -64, -63, 27, 71, 19, -64, -62, 22, 74, 44, -34, -64, -4, 83, 56, -22, -66, -21, 66, 70, -17, -68, -32, 50, 77]
6407G7q2o5K6P7L6p5o6QR4L7n6q2qQ1O7l7q5l1Q6P5l7p8m4O2Q7pq2n7N2Q8J6p6
6439Ao7L0R6K1o3r0J8Q8M9o0q2rP7P7n0r0l1Q2P0j4j04m3P1P6mq8m8M5R6Qq4o8
6471i0M6R6K3p0p3J0J08L3n9q5%R4N1n1r6j7R0Q1l2j16m0Q7Q1kj17m8O1R5Mj00
6501c6o2N2R7J9q1q6L5J03L7p2r1K1R3O3o4r8kQ5P5m0j08l1R6R0l6r8m4O6J01
6530H4j0j08n8N0J11Or7o8K7J30J6r0r3L2J03N6q4j01OJ04P3n0j08k3R9Q8l8j15
6558e8l8P3J13k1j03o8P7J14Kj07p7N3J25J7j08q0J8J27M7r1j07J8J16N6o7j14
6584h3j4J16P1m2j20m0R0J13l9j12n0Q0J18kj18o9N8J28K1j13r8L9J30N1j10r5
6610i0J8J28N6p6j22mJ22P4n8j28l3J30Q3m8j23n2J05J17l0j29p3Q8J31j0j05
$$ y = [77, -5, -70, -44, 33, 69, -6, -72, -64, 30, 67, 11, -71, -79, 2, 69, 32, -53, -84, 2, 77, 40, -38, -82, -20, 67, 60, -22, -79, -27, 61, 77, 1, -66, -36, 60, 81, 18, -72, -54, 34, 83, 23, -59, -68, 9, 86, 36, -54, -85, -3, 67, 53, -51, -94, -23, 53, 49, -39, -87, -42, 54, 62, -22, -90, -44, 52, 75, 5, -68, -58, 50, 83, 24, -61, -61, 33, 84, 33, -63, -80, 10, 91, 59, -57, -97, -10, 71, 69, -48, -96, -35, 60, 64, -36, -98, -46, 51, 70, -11, -97, -62, 41, 78, 6, -85, -64, 29, 92, 28, -70, -72, 13, 88, 48, -60, -91, 5, 95, 59, -39, -83, -17, 84, 74, -34, -92, -42, 69, 75, -22, -90, -63, 67, 83, -7, -100, -68, 35, 91, 7, -94, -88, 16, 89, 39, -69, -92, 7, 95, 57, -58, -96, -23, 90, 69, -34, -102, -25, 89, 91, -16, -93, -40, 85, 102, -6, -86, -68, 59, 106, 15, -92, -74, 42, 98, 31, -83, -97, 19, 90, 48, -72, -112, -22, 91, 52, -60, -110, -30, 88, 86, -32, -101, -43, 85, 106, -7, -105, -66, 64, 115, 5, -90, -72, 56, 112, 36, -86, -90, 32, 106, 48, -80, -113, 17, 100, 52, -71, -123, -18, 99, 69, -60, -133, -45, 86, 76, -29]
6635b9q8N5J35L4j14r7L3J39M7r2j10MJ36O9q4j05k4J27J00o8j24m9J14R9k7j26
6661d5p5Q8J29pj23j00Q1J31L0j33r9N0J39M2j01j25K7J41O8j00j12JJ22Q9n7
6686F1j44k7J27R4k8j46n5J09J13j3j41o7R4J34Rj48r7O3J45K6j04j25M4J34N6
6711A14j10j18%J48P3p8j40pJ18J13n4j47l4J19J22l5j35q4J19J23%j42q4Q3J45
6736A09J5j34j10O0J41M3j21j19L8J41O7q8j55J0J42Q3p7j49j5J31J06m9j46n3
6760a30J02J34j4j43r1R0J53Qj35j00O4J57K2j17j08M5J43M4j04j17J1J35Q7p8
6784E8j62qJ35J03o4j48l5J20J21m9j34p9J10J41j9j41q1Q0J34K8j37j05O2J44
6808G4M9j16j28L2J55O7r1j40NJ33R5o6j53l2J32J14m8j47o0J13J25j8j38r1R3
$$ y = [-29, -117, -62, 73, 107, -7, -104, -71, 68, 115, 23, -87, -83, 53, 122, 38, -67, -91, 36, 136, 68, -56, -105, 9, 108, 81, -45, -120, -32, 97, 90, -33, -133, -52, 79, 109, -24, -123, -73, 66, 108, 7, -118, -91, 50, 118, 18, -94, -93, 29, 118, 61, -83, -110, 17, 111, 83, -63, -118, -9, 104, 91, -50, -117, -23, 111, 120, -28, -125, -62, 83, 109, 5, -120, -76, 58, 114, 4, -114, -114, 34, 107, 29, -111, -118, 0, 113, 59, -88, -122, -3, 119, 84, -51, -135, -16, 107, 107, -35, -119, -36, 109, 124, -10, -120, -60, 81, 124, 3, -116, -78, 63, 130, 42, -113, -103, 39, 122, 45, -104, -119, 12, 118, 69, -77, -130, -28, 106, 92, -51, -142, -52, 101, 109, -26, -126, -62, 95, 117, 0, -108, -63, 80, 124, 20, -97, -86, 49, 136, 58, -104, -112, 23, 126, 62, -86, -121, -1, 120, 71, -63, -142, -32, 109, 90, -51, -132, -52, 82, 110, -27, -132, -70, 74, 123, 7, -121, -89, 66, 133, 42, -98, -93, 40, 135, 69, -84, -116, 16, 130, 82, -65, -125, -12, 113, 95, -43, -134, -41]
6833d1J35Oj43r4O2J50L6j33j08M4J52M5j06j24J6J46P9r2j35j1J40J02n1j56
6857h1l3J22J16k9j53n6R8J34j5j32q9O7J51J4j23j15M6J52M4j23j20J8J54O6
6881A13r5j34MJ32J00p5j43j8J19J14o1j37m5J08J20j6j33q3J01J34Rj43r0P5
6905d4J32L1j27j03M8J35M2q9j32K6J34O8q3j34j2J25J00o1j40m4J21J17l8j37
6929f5o7J08J19qj32r2Q3J37J8j33r0O9J29M7j15j13M3J24N8r0j23NJ30P8p4j23
6955g7j9J07J11o2j33m7J17J15k5j34q4Q7J34J2j38q2O2J38K6j15j13L6J52N1
6979A19r4j24J2J36P8q4j23rJ30P6m5j41k7J08J07m2j31n5J04J16j9j33o6Q1J15
7004H9Pj23q9M1J42L6j11j14M6J25P2r9j17mJ28Q2o4j39j2J29Q9l9j37m1R3J20
$$ y = [-41, 94, 100, -43, -137, -75, 75, 111, -22, -130, -86, 66, 111, 5, -119, -103, 43, 122, 30, -105, -116, 24, 126, 75, -81, -114, 8, 124, 95, -58, -114, -16, 118, 103, -29, -118, -51, 100, 114, -9, -124, -78, 74, 118, -5, -125, -107, 47, 113, 18, -116, -112, 20, 120, 45, -98, -116, 3, 117, 56, -81, -126, -18, 102, 86, -47, -130, -29, 105, 114, -29, -119, -44, 88, 119, -8, -111, -63, 72, 114, 25, -107, -81, 53, 121, 38, -96, -108, 17, 117, 56, -84, -128, -7, 110, 72, -65, -132, -24, 95, 87, -45, -137, -54, 83, 101, -32, -122, -53, 76, 123, 8, -105, -62, 62, 120, 30, -93, -88, 42, 120, 46, -77, -96, 11, 122, 60, -73, -120, -3, 112, 87, -47, -131, -44, 90, 102, -36, -118, -56, 82, 108, -7, -120, -84, 68, 119, 25, -99, -87, 49, 127, 43, -80, -89, 41, 117, 72, -69, -96, 12, 119, 77, -54, -109, -5, 111, 92, -41, -107, -26, 89, 96, -27, -116, -75, 67, 103, -8, -122, -76, 49, 121, 22, -95, -99, 29, 111, 47, -92, -104, 25, 114, 75, -62, -103, -10, 110]
7030A10j6j26p4Q2J40kj41q4O5J32J9j02j17M7J27N5q7j36J7J23Q3p8j43qJ34
7055B0Q9n9j36l2J17J05l1j36n3R7J21lj39o5P7J27Nj08r7M6J17O2j15j16K7J44
7081F4N5p7j20j5J30Q0o7j28k0J10J03n8j22n6R2J19j0j27o8P1J33jj10q6N2J20
7107F4L1r3j13M0J19O3q5j15J2J21P6q1j13qR7R7n5j30m3J04J10k6j28n5P7J18
7133H4Pj42o9O5J27K3j04r0L4J08N3r1j07K3J22P9q6j17qJ26P6o1j15j9R6R5l3
7160G6j22n8R7J08j9j15o4O6J14Rj03q8M2J18K5q9r9L0J08M7p6j02PJ07P8p2j07
7187h2rR7R5m5j13l9R4R2k6r8o9Q4J12Pj18o9N5J23K2j20r5M7J17M1q6j04J9J04
7215C6P6q3j13oJ13Q4o4j21j6R3Q6k8j11m9Q4R3mr9p4O7J18K0j10q6M2J17M2q9
$$ y = [110, 94, -32, -106, -24, 116, 114, -27, -111, -46, 86, 105, 3, -114, -67, 60, 115, 28, -108, -91, 32, 115, 37, -106, -114, 20, 109, 50, -86, -118, -1, 104, 73, -63, -116, -19, 102, 99, -40, -105, -28, 99, 104, -4, -101, -55, 62, 124, 9, -107, -80, 64, 119, 42, -78, -93, 37, 117, 50, -78, -98, 12, 115, 57, -65, -121, -29, 90, 80, -47, -115, -44, 89, 88, -22, -108, -56, 64, 95, 2, -111, -71, 48, 111, 26, -89, -77, 44, 120, 39, -74, -82, 15, 112, 57, -73, -116, -12, 98, 72, -56, -111, -34, 84, 91, -51, -120, -55, 72, 95, -9, -99, -65, 43, 96, 5, -102, -79, 43, 122, 36, -81, -89, 37, 113, 52, -63, -82, 14, 109, 76, -46, -104, -7, 101, 82, -33, -97, -31, 83, 92, -11, -99, -57, 61, 86, -3, -102, -72, 36, 83, 7, -95, -88, 19, 97, 25, -82, -91, 6, 101, 56, -57, -96, -2, 90, 64, -34, -103, -19, 93, 100, -18, -87, -32, 91, 113, -7, -102, -55, 62, 103, 17, -87, -68, 36, 112, 29, -84, -90, 23, 107, 43, -78, -94, -1, 85, 57, -54, -103, -19, 74, 70, -29, -103, -36, 82, 102, -8, -94, -52, 65, 107, 18]
7243A8j12M7R5O6q5j14RJ09P4n7j18j9R5R4m7j11l8Q1R9k6j13o2Q1J09Jj10p1
7270a05O6J04J4q6q9L7J18L9q1r0OJ01Q1p4j07j6J20P4n7j17k8R5R6l3j19l8P3
7297a6J00j9r7o5N3J11J8j01q9L6J11M6q7r6K0J04N7p2j05MJ06P7n1j23lR2Q8
7324I9l3j15n2R6J07j2j11p2O9J17Lj12p7L7J22L0q8j02K3J16M9p5j14K0J00O6
7350I1n7j15k4J11Q6m8j12k6Q4R5j4j20m2P4J00%j12n3N7J09Mr0q8M7J08L6q3
7377A8j01K0J08O0p5j10qJ07P9o2j02l0R2Q0k6j11m8Q2J05j7j04o5O3J06K0r0
7403ip7L2J17L9r9r1K9J11M6p5j00J0R9P5o3j17mR1Q7m3j12k9P3R4k4j04o5P8
7431c1J05kj04o7M7R6K9q5q6L0R9N1p9r5J8J02O2o5j01j3R9Q0l6j09l9R7Q8k6
$$ y = [18, -94, -47, 48, 114, 29, -85, -76, 33, 107, 50, -68, -87, 8, 102, 55, -56, -94, -13, 86, 60, -53, -115, -34, 75, 76, -34, -105, -39, 65, 79, -7, -96, -59, 59, 98, 17, -73, -67, 34, 115, 41, -66, -82, 38, 112, 55, -62, -90, 5, 101, 68, -51, -89, -16, 84, 65, -32, -97, -44, 67, 85, -16, -105, -69, 42, 88, 1, -95, -75, 29, 86, 14, -91, -87, 19, 96, 45, -78, -81, 11, 99, 66, -49, -101, -5, 102, 90, -21, -93, -24, 93, 96, -16, -93, -56, 66, 96, 8, -94, -71, 45, 94, 19, -95, -75, 25, 91, 34, -81, -105, 6, 92, 44, -68, -94, -10, 85, 71, -49, -91, -17, 83, 83, -29, -82, -25, 84, 88, -2, -90, -43, 65, 101, 18, -83, -63, 45, 105, 30, -80, -88, 19, 98, 36, -66, -96, -4, 76, 50, -61, -109, -27, 78, 61, -43, -108, -45, 61, 81, -9, -86, -54, 63, 102, 3, -88, -59, 52, 98, 23, -77, -67, 32, 107, 44, -73, -77, 14, 101, 58, -54, -83, -10, 84, 60, -44, -109, -31, 74, 72, -32, -99, -52, 44, 73, -12, -98, -68, 31, 82, 3, -92, -74, 28, 90, 25, -76, -89, 10, 90, 54, -55, -94, 3, 91, 65]
7459F5j08l5O1R8kj03p4O4R6J0q4p6L5R4M0q9r1K3J02O1p0r5jR4O7n3j02j3P9
7488gR3k5j07l6Q1Q2nj01o2N5J10Kr1o9L3J06K8p7r3K9J00N0p3j00NJ02M6n3r1
7517f8j4Q6P5l9j05l2Q3R2k6r8m8P1R1jr4o1O1Q6J8q5o9K8R1N0p9q5RJ03N3o1
7547C2r7j1R6O1l5j00k1P2Q7k6j06m5O3R1qr6n1N3R1K3r6o9L3J08L4q4p9L0R5
7576D5M7p1r6PQ8P9o8q2j2Q6O1k8r7l6P3Q1%j04n5N1R5Kp9p4L6R6K9q4p0K3R8
7607D1K5m6j04PR7O1n3q6j6Q5P6l2r4l9P6Q5rj05n0P3Q3%r5n9M8Q3K8q7p5L4R6
7638D8L8o9j01J2J04M3n5r6j0R8P0l7j05j5O5Q3j9r1m8O4J02rq6o7N7R8J3q5p0
7667f8K2J16K6p1q7LR6M4m6r8%Q0O9m4r9j7P5P9k9j11k7O5Q5mj03m4N5Q8J8q7
$$ y = [65, -43, -78, -17, 81, 79, -24, -98, -34, 62, 72, -12, -88, -53, 41, 81, -8, -99, -76, 26, 87, 17, -78, -79, 15, 82, 29, -73, -86, -7, 86, 61, -46, -82, -1, 81, 76, -25, -87, -32, 78, 80, -11, -80, -47, 59, 87, 10, -83, -54, 46, 96, 23, -77, -72, 30, 76, 23, -68, -82, 4, 79, 40, -65, -97, -14, 78, 52, -46, -94, -23, 68, 67, -27, -88, -27, 59, 77, -8, -77, -49, 42, 92, 13, -72, -63, 40, 93, 32, -65, -76, 20, 81, 46, -54, -75, -3, 84, 58, -48, -93, -30, 61, 53, -43, -94, -41, 50, 73, -23, -92, -59, 49, 83, -1, -80, -50, 45, 92, 21, -75, -68, 20, 99, 31, -51, -63, 23, 84, 56, -41, -77, -4, 77, 77, -27, -82, -31, 64, 66, -13, -87, -51, 45, 74, -10, -80, -57, 41, 66, 20, -84, -77, 20, 81, 28, -58, -74, 11, 87, 55, -39, -78, -2, 83, 74, -31, -81, -8, 75, 75, -20, -79, -31, 52, 80, -7, -82, -48, 48, 86, 17, -84, -72, 32, 75, 20, -76, -86, 12, 82, 45, -60, -75, -10, 73, 54, -37, -85, -21, 81, 72, -14, -81, -24, 74, 87, 2, -68, -46, 70, 96, 25, -62, -59, 37, 81, 35, -63, -63, 17, 86, 42, -57, -74, 1, 80, 51, -60, -87, -22, 63, 59, -44, -88, -33, 55, 73, -14]
7697a4o5K5J03L3q0q5K9J02M0o1q9QQ2O2m5j00j9Q7P9l3r5n8Q6P4Pr8n1N7Q7O
7727G4j08n5M6R0J7q2o5J8R3N7p9p4qR1P0n9q0k2Q4P8m0j06j9P7P4rr0n3N8Q9
7757F7Lq7o6N1R5J2q3p2K4Q9N9q1q8jJ07M7n2q6j7Q6P7m3r7k9O9R7k4r6n6Q1Q2
7788F8J1r7n8N1R3J8q6p7L8R1L8q4p7J8Q8O5p3r0j0Q5P8n1r4l1Q1Q6k5j03n4P4
7818b7Q6Oj01o2N9J04J5r9o0L0J06L9r6p6K2R3P0q9q7J1R3P1n6r9k9Q9Q4l0j20
7847e3k5P3Q7j4j01n6O6R4Pj05o3M4J07J0o6r2K7R7N2p7q4kJ07O3o4j04j0J01
7875A9P2l5j10l3Q8J00k2j05o3R0P5J0j04p3N6R4K6r5p8K9J12M3r2r2J7J05O0
7902I4o8j09MR2R0n5j11k3R0R8l6j06n3Q2J00j2j09n8N7J12Qq7q6M7J13L9r3j08
$$ y = [-14, -79, -54, 49, 82, 2, -83, -54, 48, 88, 27, -62, -54, 28, 90, 45, -55, -74, 13, 92, 59, -36, -94, -8, 66, 73, -25, -76, -19, 68, 74, -34, -89, -43, 47, 64, -18, -83, -65, 28, 85, 6, -68, -76, 15, 85, 26, -54, -76, 8, 86, 46, -60, -79, -2, 72, 63, -27, -80, -22, 67, 70, -17, -83, -32, 63, 75, -8, -80, -56, 33, 92, 11, -77, -78, 29, 76, 24, -62, -79, 7, 84, 41, -56, -85, -16, 81, 57, -39, -95, -14, 68, 79, -18, -76, -25, 68, 86, 0, -77, -39, 52, 90, 6, -71, -53, 35, 100, 27, -63, -73, 12, 90, 39, -55, -86, -5, 81, 56, -47, -101, -27, 59, 65, -36, -98, -39, 65, 80, -19, -79, -49, 57, 96, 0, -76, -54, 39, 109, 20, -67, -56, 37, 108, 52, -47, -76, 13, 97, 67, -53, -78, -5, 82, 68, -33, -89, -23, 71, 78, -27, -90, -46, 61, 71, 5, -87, -60, 37, 89, 12, -72, -74, 33, 96, 32, -72, -82, 19, 91, 56, -54, -87, 1, 101, 79, -26, -89, 1, 76, 86, -18, -91, -35, 59, 85, -10, -88, -59, 53, 96, 4, -88, -71, 34, 94, 26, -83, -79, 13, 103, 48, -63, -86, 4, 102, 66, -40, -93, -11, 89, 77, -32, -90, -33, 79, 87, 0, -86, -39, 74, 113, 20, -88]
7930h8K6J11N7o6j19pJ08O9l9j18k3R3Q5m0j05n2Q0J06j9j01o2O9J10Nj02q0N3
7957d9J09L8r9p9K9J19L9q2j07MJ12P3n5j15j7R9Q6m7j19l4Q7J00k2j02p6P4J16
7984H2oj00p7N6J12K9j05q3K9J22M0q8r7J1J21N6o0j13j4J08Q3n4j11l3J02R4
8010A04k9j23m1Q3R8mj19o3N7J17K1j21q2M6J21M0j09j00K3J24O2r3j11J5J04
8035B0Q6o4j20j7J05R5l9j16m2R3J01j0j38m5O7J10Nj09q0O5J16K3j03j02L4J27
8061F2M2q8j06QJ25O1p7j17mJ19Q9o0j22k2P8J19k7j33n2Q4J19rj14p9O8J35Q
8088A07j16r2N5J18M6j07j03K6J27O4q7j16KJ23O8n9j38j6J10R9m8j33l5J06J01
8113A02k7j16o8R0J19j1j20p5N6J30K2j06q7M0J13N2r2j10J1J31P4q9j17j5J20
$$ y = [-88, -62, 49, 106, 40, -79, -86, 22, 91, 52, -66, -89, 4, 89, 49, -56, -108, -28, 78, 59, -42, -104, -35, 75, 80, -22, -102, -49, 60, 98, -1, -80, -51, 68, 107, 25, -82, -78, 34, 107, 52, -63, -80, 19, 105, 58, -61, -95, -8, 92, 70, -32, -108, -34, 82, 76, -24, -101, -45, 67, 96, -9, -92, -63, 59, 99, 11, -86, -75, 46, 102, 42, -71, -85, 23, 106, 52, -59, -92, 10, 104, 75, -48, -89, -6, 92, 88, -31, -94, -37, 80, 101, -20, -102, -56, 65, 105, -4, -104, -81, 43, 105, 12, -99, -84, 20, 106, 42, -78, -95, 10, 105, 66, -50, -92, 1, 102, 92, -46, -91, -24, 86, 91, -18, -98, -33, 83, 106, 3, -99, -65, 62, 104, 16, -90, -82, 43, 104, 27, -90, -94, 25, 114, 54, -68, -90, -12, 107, 80, -53, -105, -21, 98, 89, -25, -104, -36, 99, 107, -9, -101, -46, 72, 118, 11, -92, -66, 61, 125, 38, -78, -76, 47, 115, 56, -82, -98, 12, 111, 63, -70, -105, 1, 102, 75, -41, -109, -19, 100, 89, -31, -106, -50, 80, 102, -4, -91, -51, 62, 114, 22, -88, -77, 54, 128, 39, -78, -93, 27]
8138B7Q4m7j21m0J03J08l8j23n6R1J06%j30p4P3J18K4j30q0N1J35J4j00j02L0
8163g7J28O4q9j08kJ21P8o4j17l0J24Q0m1j11n7J05J06l3j13o4P8J19jj17q6M9
8189e8J35L1
$$ y = [27, 111, 64, -57, -97, 6, 114, 76, -47, -103, -12, 94, 94, -36, -110, -37, 81, 105, -25, -105, -54, 81, 95, -5, -107, -77, 51, 115, 26, -82, -84, 37, 115, 51, -66, -96, 28, 108, 67, -44, -101, 4, 110, 77, -36, -100, -22, 97, 96, -21, -107, -58, 77, 108]
8191A08
$$ Imaginary data points
##PAGE= N=2
##DATA TABLE= (X++(I..I)), XYDATA
0@%%%%%%%%%%%%%%%%%%%%Qj6J6j6J6j6J8k6L2l2L6m4M9n5O4p0Q0r4J02j12J28
41F8j44J61j79J97k18K43k68K94l25L60l95M34m79N27n81O43p11P85q72R74j088
62e74J222j383J571j789K024k155J354J2875K25242o980l24576j90768J73932
75a10005L17518L9858k78421k36399J16660L10295J01269k40244k61939N4673
85a86735K96549J47376j87867k75490m157K67125J90381j33129k78874o0647K35019
96I551K19318q1735k72073j04890J94434K36580k8348k51953j46700J48063K47969
107A70216K4743k29346j81959J02371K50010O9630j98849k05245N4812K40213
117I6596J11865j60358k21312O604K23809J46596j20784k26660l5873J97629J70249
$$ y = [0, 0, 0, 0, 0, 0, 0, 0, 0, 0, 0, 0, 0, 0, 0, 0, 0, 0, 0, 0, 0, 8, -8, 8, -8, 8, -8, 10, -16, 16, -16, 20, -24, 25, -30, 34, -36, 44, -50, 52, -60, 68, -76, 85, -94, 103, -115, 128, -140, 154, -171, 189, -206, 228, -251, 276, -305, 338, -373, 412, -460, 514, -574, 648, -735, 836, -953, 1071, -1084, 270, 13145, 238387, 231407, -93169, -283937, -110005, 207513, 247371, -31050, -267449, -150789, 159506, 260775, 20531, -241408, -186735, 109814, 257190, 69323, -206167, -210324, 56801, 247182, 114053, -164821, -225468, 9551, 228869, 147134, -124939, -229829, -35395, 201185, 172837, -79116, -225816, -77753, 170216, 194959, -34387, -216346, -113975, 136035, 205665, 6816, -198429, -143617, 96596, 208461, 48103, -173209, -166605, 57204, 203800, 83016, -143644, -179517, 18112, 188361]
128A88361p6867k19832p6082J63938J88240l2192k08154j10808J29538J97465
138A43607P382j88647j36231R1480J96581M5581j62180j56766N2396J90919P8705
149A62827j34993j69462J7649J78639J04699j03775j74388j8089J59985J28950
159A52042o9607j76500n2511J39282J47339l7488j71115p9605J14445J56768n302
170A17748j58401j03594Q5669J61520K5809j42372j22882N6423J59311N3317j19789
181A2759j34346K5442J49782P8286r3969j42027m457J37397R8016o8916j43499
192h5532l0030J20379J11745m1539j38350n4117R9531J22139j4750j31230p5214
203a16968P8484J27822R702j19639r1735N5071J28896L4630j04089j06337L0500
$$ y = [188361, 111494, -108338, -184420, -20482, 167758, 135566, -72588, -183396, -53858, 143607, 150989, -37658, -173889, -82409, 114172, 159753, -2427, -159193, -106797, 84122, 162827, 27834, -141628, -123979, 54660, 159359, 55584, -118804, -136893, 23092, 152042, 82435, -94065, -146576, -7294, 140045, 102557, -68558, -148163, -33718, 123050, 117748, -40653, -144247, -58578, 102942, 128751, -13621, -136503, -80080, 79231, 132548, 12759, -121587, -96145, 53637, 131923, 37954, -104073, -108530, 28867, 126883, 57967, -85532, -115562, 4817, 116562, 75023, -63327, -117444, -17913, 104226, 89476, -41754, -116968, -38484, 89338, 99040, -20599, -112334, -57263, 71633, 106263, 2174, -104163, -73663]
214g3663J27110N6703q7881j16416P758J20557P4571o8264j20597j5252J09092
225A3718R0376m5982j21270l7619R4346J01781k3649j16598n6648P6036J08014
236H2505p80j07282p2870N6317J10841K0012r6045q5244L6703J09046L8277q1212
248A0268r3529J5692J03198N5680o3798r9118m794R5133O9962m6506j01310k3282
260h2404Q4556Q1284k8120j00428m1289P1739R0750r094r6769n7310N7068R6012
272F5995R048q9042p0034M0188R7075K6931p7841q0386K1986R4972M3494o4241
284A8145q7177L753Q8788N7174m8570q9871j3656P9540O8037l2005q9190k9518
296g4550O7851P5689j4950q4898m3647N3693Q0080K062p7854n5689L8907Q2106
$$ y = [-73663, 53447, 110150, 22269, -94147, -86389, 34168, 108739, 40475, -80122, -95374, 13718, 104094, 58112, -63158, -100777, -6431, 95350, 71701, -44897, -101545, -25509, 82505, 81725, -25557, -98427, -42110, 68731, 88743, -7302, -92546, -55843, 53203, 91480, 10268, -83261, -67569, 35629, 91309, 27511, -71607, -76401, 18732, 88694, 42188, -59122, -82404, 2152, 83436, 55316, -45112, -86401, -14662, 76088, 66994, -29775, -87085, -30017, 65995, 75043, -13999, -84033, -43845, 53230, 80161, 2320, -78066, -56080, 38892, 82386, 18145, -69032, -65279, 23509, 80683, 32113, -57758, -71414, 8126, 76163, 44158, -45032, -74550, -6699, 68990, 54040, -30858, -74505, -20812, 59268, 61330, -16524, -72213, -33306, 48800]
308D8800J7828o9379o5479K4021Q1783L2431n9136p3097Q505P8648M5710m6808
320B3827p7726o922P2552N6812l3025p9217k1622O3912O5439j8562p7788l5092
332f7412N3085P1327l515p3191m6929M0221P4225J1219o5730n6178K6464P3499
344C7085K4136n5891o1956J2555O9606L5458m4283o5553j395O4021M5542l2142
356B7183o7310j4395N6833N3316j9654o6393k6193M7906N9103p008o3763l6930
368e7305L8212O3074N267n9159m5868K7215O4357J7354n2027n3297J5109O3617
380B6549K8723m3820n8735L344O0633L8283l3711o0971q708N4297M6116k1895
392C0105o0783k0120M6350N1536j0677n8093k9116L7278N4209P59n2892l7417
$$ y = [48800, 66628, -2751, -68230, -44209, 37574, 70005, 10869, -62228, -53723, 24925, 70635, 23827, -53899, -60821, 11731, 68543, 35518, -43699, -65321, -1409, 64030, 45468, -32320, -67412, -14327, 57000, 53485, -19706, -66635, -26414, 47811, 59030, -6700, -62878, -36414, 37085, 61221, 5330, -56626, -44071, 25535, 60993, 16710, -48843, -50238, 13783, 59325, 27183, -40127, -54522, 2311, 55627, 35973, -30420, -56613, -8707, 50396, 43388, -20375, -57305, -19093, 43981, 49248, -9911, -55779, -28564, 35793, 53147, 1120, -52177, -37068, 26549, 55272, 11452, -47283, -43939, 16694, 54977, 21266, -39705, -48413, 5884, 52000, 30105, -30678, -50798, -4448, 47088, 36411, -21682, -50798, -13520, 40689, 41448, -11444, -48861]
404d8861K6401N5529J2267m6843m4540J5940N5027K1769l9540m8530N827N2121
416A6567L0293l0872n1610m836M8340L8107k2233n3402j4533M3108M4120j2366
428C0683n2409k3980L5742M8870j926n0278l2602K7841N1352P242m5890l8441
440d3796J8816N0847J6630l8679m3284Q463M8943K5343l1233m6494r14M5078L1562
453D1282k2598m6532r943L9046L7089j2968m5936j8771L2941M1215m686m4015
465a3876k5369K5991M2821L862l9762l1534J7838M4141J2777l5545l7333R951
477b6038M4063K0273k9819m0664J429M1443K7327k2441m2920p044L8239L3140
489C6988j5567m3417j4156L3030L6543p132m0911k1556K5398L9195J993l7707
$$ y = [-48861, -22460, 33069, 45336, -1507, -46047, -30107, 24920, 46689, 7149, -41381, -35554, 16567, 46860, 15988, -35622, -40458, 7882, 45989, 23756, -29646, -44179, -1071, 43049, 30683, -21726, -45706, -9964, 38906, 36980, -13298, -45900, -18059, 33293, 40535, -5355, -43796, -24980, 25867, 42497, 3818, -39466, -31003, 17940, 43283, 12050, -34444, -35358, 9720, 41282, 18684, -27848, -37791, 1255, 38344, 25376, -20560, -39331, -6390, 34825, 30139, -13876, -39245, -13254, 29567, 33429, -6333, -37867, -20029, 24112, 36889, 1344, -35989, -26038, 18025, 38298, 8479, -32185, -30756, 10687, 38014, 15573, -27347, -34391, 3848, 36988, 21421, -21996, -36152, -3122, 33421, 26289, -14622, -36178, -10780, 28415, 30408, -7299]
501g299k7851J8405M0012Q980l3134l1341J0943L8298J5859k6827l4503K703L6338
514A0583K2315k0961l6478m053L3196K6679j4287l6161j1036K8343L0929o889
526B2180l6018j7973K3921L4302o16l4559k2903J8539L5486O233l0985k7773J1795
539a8371L6032J2921k7226l1402N596L4660J8048k1529l2481j424L1042K3247
551B9113j4573l3408q510K7520K7122q990l2774j3305K2936K8605k693k9866j8169
564b6992J6949K9998M002k7236k2692J1581L0273R083k3626k5139N944K9092J4415
577B5652j9098k7900K8K8346J9371j5352k9827m958K6085K2654j0136k9394j0405
590b4934K2039K5816m206k8776j5460J8228K7686P16k6744j8987J3079K7704O482
$$ y = [-7299, -35150, -16745, 23267, 32247, -887, -32228, -21285, 17013, 32872, 6045, -28458, -25755, 10583, 32898, 11937, -24541, -28594, 4602, 31281, 16994, -19167, -30203, -1860, 29069, 22180, -13838, -31811, -7890, 26412, 25796, -8763, -31666, -13127, 22359, 28592, -2393, -30166, -18371, 17661, 30582, 3356, -28046, -22450, 12210, 30258, 8729, -23752, -25176, 5866, 29113, 14540, -18868, -27378, 142, 27264, 18274, -14500, -27805, -4869, 23736, 21043, -8823, -26992, -10043, 19955, 23957, -3279, -25971, -14390, 15883, 24966, 1340, -23799, -17855, 11237, 25652, 6554, -21346, -21318, 7028, 26399, 11047, -18780, -23738, 2347, 25001, 14865, -14529, -24934, -2895, 22921, 18715, -10061, -25521, -7293, 20393, 21109, -5635, -24622, -11543, 16161, 22643]
603B2643k2896k2517P204K7558J1697j9470k4691K574K5831J4928j4954k4787
615a6880k621K2513J8429r496k5066p886J9739K1386n139k4696j1751J6393K2933
628A7858l85k3184j5876J2345K4661M484k1838j9325Q777K5087Q297j9052k1242
641a9393M129K3923J2640j5135k3308r03K2875J6495j1608k4255m976K0426J8883
654A9793o950k3399r504J6618K0997j984k2333j3187J3164K1748J760j9977j5316
667a8570Q942K1192O097j6760j7923M241K1026J0294j4064j9901M61K0013J3166
680A8214j0766k0475l432J8127J6051p179k1162p264J6366J8339l820k0813j0439
693a8253J3317J9590M76j9198j3965R581K0768M673j7651j6679O225K0656P905
$$ y = [22643, -253, -22770, -15566, 11992, 23689, 4219, -20472, -17898, 7933, 22861, 7907, -16880, -19501, 3012, 21441, 11945, -13121, -21007, -1268, 20118, 14979, -9717, -21468, -5075, 17858, 17473, -5711, -21587, -9242, 15419, 19903, -1935, -21260, -12483, 12604, 20901, 1849, -19393, -15264, 8659, 21299, 6164, -17144, -18047, 4828, 21323, 9715, -14540, -19516, 910, 19793, 12843, -10556, -20060, -3442, 17555, 15571, -6762, -19949, -6785, 14963, 16723, -3254, -18570, -9628, 11564, 17661, 901, -17022, -12781, 8245, 18539, 4475, -15426, -14965, 5048, 18214, 7448, -13027, -16459, 1668, 17719, 10540, -10622, -17886, -1520, 16819, 12999, -7814, -18253, -4936, 14654, 15130, -4068, -18033, -8452, 12316, 16989, -662, -17341, -11116, 9540, 17445]
706A7445j4836j7918K135J9097J1194j1113j8825j912J7371J3720p810j8754n166
719a5372J4741J5253l814j7720q726J1564J6871J33j6863j1673Q946J7658L052
732A4050j5404j3543O001J7599O207j3346j5499K744J7492R284j1188j6900m23
745a2926J6454J1761q189j7396l965J4664J4179m974j7626p010J2833J5614k128
758A1291j6791r346J0036J6031J292j4880j1680O606J6138M609j2749j3251L481
771i213J5381P127j0188j4086K71J4188R614p546j4858k669J3095J1592n146j5011
785g449n076J1389J2833k481j4531p587R289J4076L82j3880r945P094J4846L079
799A2039j2646j1792M486J4881N728j0966j3270J858J4540Q035q904j3993p88
$$ y = [17445, 2609, -15309, -13174, 5923, 17117, 6004, -12821, -14733, 2638, 16358, 8548, -10206, -15372, -631, 14622, 10808, -6912, -15638, -4074, 12797, 12930, -3933, -15606, -6660, 10998, 14050, -1354, -14897, -8896, 8703, 14910, 1564, -13935, -11191, 6301, 15585, 4397, -12503, -12926, 3528, 15289, 7100, -10296, -14261, 403, 14582, 9608, -8018, -15028, -2195, 13419, 11291, -5500, -14846, -4810, 11221, 12513, -2367, -14047, -7441, 8697, 13306, 557, -12694, -9213, 6168, 13295, 3107, -10979, -10708, 3480, 13094, 5548, -9310, -11979, 1116, 12708, 7562, -7449, -12525, -1136, 11697, 9216, -5315, -12902, -3613, 10463, 10845, -3035, -12980, -5886, 8960, 12039, -607, -12399, -7913, 6968, 12696, 1730, -11540, -9682, 4858, 12893, 3989, -10004, -10792]
812a0792J3169R847o071j3861l673J1069J1300l124j3340o088R015J2229n17j2444
826c281q030O775J2672K027j1208r783M406J2789M378r726j1018K140J2439O378
840A0958p990j1857j66J1749Q281o099j2557k556J0916J0070m038j2915m818R641
854a381J1439j808j2608o825P843J2128N12j1595q454N623J2187K865j0025r770
868i869L123J1823N108q146j0659O52J1005O957o091j1085j605R870Q373m053
882E403j1063l596Q468R398j888j0642n476O847J0187J77j0106p143N260J0789
896F615K088r411q564L520J1040M146q214r817J456J0874N976o785j0562m50J0140
911B052P312n009j0627k383Q832Q547k785j0410m481P204R417o25r742o087N358
$$ y = [-10792, 2377, 12224, 6153, -7708, -11381, -312, 10988, 7864, -5476, -11564, -2549, 9680, 9163, -3281, -11311, -4536, 8136, 10163, -1045, -10828, -6422, 6367, 10745, 1019, -9999, -7859, 4580, 10958, 2968, -8889, -9055, 2694, 10975, 4876, -7681, -10237, 679, 10749, 6711, -6204, -11022, -1381, 10058, 8250, -4358, -11183, -3340, 8788, 9300, -2295, -10749, -5126, 7061, 9926, -99, -9869, -6746, 5077, 10185, 2039, -8620, -7968, 3037, 9994, 3903, -7182, -8787, 1083, 9456, 5403, -5660, -9256, -788, 8610, 6722, -3920, -9396, -2549, 7638, 7815, -2291, -9434, -4174, 6615, 8703, -708, -9272, -5752, 5288, 9434, 1220, -8597, -7141, 3733, 9709, 2924, -7638, -8088, 2052, 9364, 4355, -6272, -8655, 177, 8724, 5939, -4471, -8952, -1748, 7669, 7044, -2698, -8785, -3427]
926c427R650J392q512p242L418R545L206p297q141J630R152M645n854q658k08
941f701Q466O154m210r147k050P865P450k839r415l519O967Q210j299r083m986
956h137N645Q952M99q633o430M303R307K040p799p316K608Q974L669o288q056
971f662O13Q478N243m792q468j030P581O152l177q191k564O261O929j423p892
986b942m054N121P542O9p389n142L721P685J677o504o255K231P904L136n925p132
1002f257J191P919M127n050p536k11P372N377l611p978j920O742O517k330q045
1017c693l110N785O982q57p450m369M339P409Q28o836n519L016P477K103n854
1032B51o038J499O982L439m493o588j39O580M629l413o935j311N959N326k185
$$ y = [-3427, 6223, 7615, -897, -8139, -4721, 4824, 8030, 733, -7408, -5778, 3374, 8019, 2165, -6493, -6701, 1765, 7919, 3709, -5438, -7488, 377, 7827, 4988, -4427, -7946, -979, 7231, 5932, -3151, -8137, -2492, 6460, 6959, -1674, -8104, -3801, 5506, 7546, -253, -7569, -4961, 4013, 7682, 1394, -6662, -6049, 2429, 7672, 2880, -5588, -6618, 963, 7115, 3938, -4253, -6817, -556, 6373, 4950, -2942, -6996, -1875, 5667, 5736, -1653, -6795, -3074, 4611, 6288, -216, -6471, -4240, 3664, 6800, 875, -6257, -5066, 2853, 6980, 1930, -5606, -5817, 1555, 6932, 3321, -4657, -6577, 165, 6682, 4352, -3693, -6803, -1018, 5964, 5107, -2343, -6712, -2373, 5036, 5864, -972, -6491, -3475, 4002, 6105, 251, -5787, -4288, 2694, 6133, 1640, -4948, -5087, 1493, 6122, 2709, -4226, -5537, 422, 5748, 3563]
1047C563o833k595N092O208q70o974l843M492O870R4o751m655L445O979J474n947
1063b51n688K026P213K933n314o527R16P080L819m320o702m27O333M883k872o889
1079c787j951N573N729j573o669l014M373N974r9n948m141L064O351J302n549
1094c65n088K136O504K280m850n612Q91O199L496l819o225m30O068M533l071o593
1110c946j365N614N167j963o513k664M703O037n81o539l892L980O546M62o114
1125a068m583K793O426J770n101n365J291O264L074m127n848Q5N774L889k970
1140B304n895j238N008M804j699o060k472M453N452p31n873l248L533N634M53
1155D425n315m228K456O026J645n034n059J690O178K515m414n539N40N922L629
$$ y = [3563, -3270, -5865, -773, 5435, 4565, -2409, -6252, -1760, 5110, 5204, -1547, -6202, -2757, 4222, 5696, -251, -5939, -3913, 3300, 6233, 919, -5608, -4692, 2388, 6207, 1887, -4815, -5242, 1091, 5974, 3102, -3787, -5738, -165, 5564, 3991, -2678, -5692, -1319, 4655, 4556, -1392, -5533, -2469, 3882, 5184, -365, -5453, -3317, 3187, 5467, 617, -4995, -4104, 2095, 5591, 1772, -4453, -4883, 1185, 5718, 2647, -3946, -5311, 303, 5470, 3507, -3006, -5670, -967, 5070, 4489, -2050, -5942, -1962, 4584, 5046, -1068, -5651, -2858, 3568, 5338, 237, -5128, -3837, 2427, 5501, 1374, -4474, -4389, 1385, 5274, 2304, -3591, -4829, 179, 4983, 3284, -2776, -5248, -795, 4657, 3926, -1947, -5195, -1662, 3972, 4425, -890, -5118, -2662, 3364, 5009, -25, -5084, -3394, 2784, 5299, 885, -4654, -4114, 1808, 5437]
1170E437l431o103p27N641M554k554o182j660M884M959j314n790k806L789N469
1185D166Q1n484l871K791N746J184m801m483J592N550K325l926n085M48N418L250
1201D901l249n389m48N017L870k245n424j573M390M682j210n653k622L975N315
1216D337m05n583l379L218N585O53n099m237K206N780J734m625m833J301N627
1231B280K578l744n135N8N134L608k593n446j207M628M390j619n392k113L852
1246g21M741n29n068l007K979N108N01m745l774K191N236J433m221m350J169N193
1262B136K451l563m990K09N228L308l036n362n58M954L923k241n431j577M357
1277a92M608j177n446k568L659N056j22n064l374K651N193J023m459m189J564
$$ y = [5437, 2006, -4097, -4824, 817, 5371, 2817, -3365, -5025, -141, 4818, 3504, -2286, -5092, -1303, 4166, 4247, -1237, -5108, -2317, 3429, 4613, -188, -4671, -3079, 2471, 4796, 870, -4215, -3767, 1651, 4901, 1652, -3737, -4185, 832, 4702, 2457, -2967, -4540, -150, 4532, 3322, -2331, -4953, -978, 4337, 3932, -1651, -5030, -1812, 3773, 4426, -673, -4910, -2704, 3076, 4810, 185, -4648, -3347, 2280, 4858, 1114, -4021, -3963, 1171, 4779, 2186, -3260, -4467, 161, 4551, 2932, -2460, -4573, -721, 4020, 3491, -1577, -4584, -1605, 3503, 4004, -741, -4515, -2324, 2912, 4345, 124, -4226, -3057, 2136, 4587, 1024, -3966, -3757, 1471, 4779, 1743, -3619, -4177, 777, 4700, 2459, -2972, -4549, -192, 4416, 3239, -2207, -4775, -1116, 3940, 3818, -1246, -4620, -1969, 3224, 4247, -212, -4401, -2837]
1292b837N271K069l829m674O01N019K861k947m875m69M509L615k002n026j491
1307d205M003M250j064n002k368L380M704j25m853l208K713N104P01m681l866
1322d517K075N260J516m167m378J114N132K479l393m842L3M866L304k558n058
1337c134r46M383L965j600n039j926L684M483n47m853k809K859M749M42m364l468
1353d121J899M759J424l747m031R69M680K295l131m470P0M555L055k500m793p50
1369c837M304L682j788m913j547L867M149r95m806k318L188M521o5m547l116K418
1385a803M768R06m139l782J532M829J812l574m240N97M607K582k755m458l76M117
1401F23L264j799m485j357L560L784r13m421k132K949M156o0m233k853K260M472
$$ y = [-2837, 2434, 4503, 674, -4000, -3399, 1620, 4481, 1534, -3341, -3810, 699, 4314, 2312, -2714, -4205, -202, 4048, 2984, -2018, -4386, -1006, 3698, 3573, -1280, -4488, -1775, 3329, 4030, -651, -4517, -2442, 2818, 4334, 167, -4211, -3097, 2035, 4514, 1121, -3721, -3688, 1178, 4482, 1924, -3134, -4080, 303, 4268, 2668, -2371, -4297, -613, 3870, 3323, -1530, -4339, -1480, 3269, 3711, -653, -4121, -2222, 2537, 3961, 214, -3817, -2848, 1832, 4127, 996, -3474, -3404, 1151, 4206, 1706, -3087, -3837, 467, 4149, 2361, -2552, -4099, -232, 3917, 2922, -1884, -4202, -1014, 3507, 3442, -1105, -4221, -1803, 2965, 3871, -268, -4050, -2518, 2311, 4123, 549, -3691, -3094, 1513, 4095, 1340, -3118, -3494, 623, 3887, 2088, -2397, -3754, -194, 3590, 2677, -1744, -3876, -927, 3229, 3169, -1064, -3917, -1657, 2815]
1417B815P90l947l487J586M575J495l546l879Q89M459K170k972m212M5M301K895
1433C977k278m501q11L925L518j491m536j665L351M000o05m378k415K705M231
1448C027K38l999k990J861M215J128l371l520Q99M170K019k792l963J09M017K640
1464C688k184m113o74L641L178j439m222j431L286L668q27m199k034K804L926
1479C068r1l983k681K133M177P47l691l307J447M293J492l233l688O54M093K199
1495C629k551l960j84L805K823j851m064r46L310L259r60l898j805K595L656m6
1511B812l710k550K030L894O10l451k933J411L861J287k965l364O43L854J994
1526C423k535l728K2L717K485j973l821o93L365L015j260l959j425L001L473o39
$$ y = [2815, 3605, -342, -3829, -2243, 2332, 3827, 281, -3598, -2709, 1750, 3920, 948, -3264, -3219, 1082, 3977, 1699, -2802, -3613, 312, 3830, 2339, -2197, -3862, -511, 3489, 2884, -1494, -3909, -1204, 3027, 3265, -734, -3724, -1863, 2352, 3480, 109, -3411, -2512, 1658, 3677, 885, -3078, -2969, 1048, 3688, 1504, -2609, -3283, 358, 3536, 2097, -2125, -3556, -270, 3398, 2571, -1628, -3662, -858, 3068, 2977, -1006, -3687, -1554, 2623, 3370, -321, -3628, -2181, 2112, 3604, 371, -3317, -2663, 1430, 3629, 1078, -2882, -3066, 739, 3562, 1711, -2353, -3299, 11, 3270, 2310, -1588, -3393, -798, 2858, 2812, -898, -3448, -1418, 2476, 3086, -365, -3298, -1887, 1974, 3261, 296, -3068, -2425, 1429, 3423, 888, -2840, -2818, 899, 3384, 1411, -2410, -3103, 262, 3277, 2017, -1942, -3367, -366, 3107, 2468]
1542B468l872j978K446L630J19l511k581J688L765R44l112l084R62L697J593k517
1558F57l303J39L374K270j799l551o62L140K800j273l630j183K762L043o14l432
1574a262j802K172L358J34l314k404J729L560O65l074k737J171L536J264k637
1589C59l136N09L524J902k246l407q6L279K340j600l400q14K769K789q18l397
1605a433j531K368L125k02l214k022J761L190N30k802k533J039L291J233k481
1620C19k899N27L205J643k008l003j14K921K159j420l205p66K744K636r97l295
1636a553j200K454K837m61l145j727J924L111J78k997k222J459L204P15k625k512
1652b560Q18L069J345k096k890J18K984J930j661l043m36K679K280j018k948j079
$$ y = [2468, -1404, -3382, -936, 2694, 2813, -698, -3279, -1591, 2174, 3118, 6, -3078, -2116, 1581, 3174, 657, -2646, -2507, 867, 3137, 1338, -2213, -2875, 265, 3065, 1792, -1838, -3021, -259, 2784, 2170, -1262, -3064, -892, 2466, 2600, -714, -3118, -1389, 2171, 2836, -238, -2975, -1804, 1732, 2996, 359, -2777, -2268, 1256, 3158, 912, -2495, -2581, 698, 3038, 1438, -1962, -2776, -7, 2782, 1964, -1433, -2964, -596, 2529, 2327, -887, -2909, -1148, 2042, 2572, -230, -2763, -1724, 1567, 2800, 319, -2580, -2053, 1152, 2795, 787, -2216, -2330, 591, 2750, 1330, -1875, -2641, 103, 2739, 1742, -1553, -2753, -299, 2538, 2077, -1068, -2795, -871, 2240, 2418, -579, -2801, -1342, 1862, 2577, -48, -2560, -1742, 1327, 2672, 576, -2314, -2196, 788, 2718, 1057, -1986, -2422, 257, 2537, 1519, -1429, -2508]
1668b508K173K644l60k914j630J799K844J31k721j983J342K880P09k411k403P61
1684a647K993J251k171k727L36K923J611j773k774j90K642K028j220k921p79K403
1700a5K416p60k903j239J972K612j06k670j779J431K794N08k452k177R45K784
1716A361R67k029k359L13K581J519j515k601k87K438J958j127k715p02K175K200
1732B177o38k635j212J807K486j32k586j613J516K590K43k395j865J076K593P44
1748B156k071k217N43K631J265j764k452O6K465J626j289k501m71K146J974p58
1764A349k514r85J845K224k87k372j375J367K321K98k122j795Q52K434Q05j904
1780A41k103N01K386J125j564k212O0K233J488j217k335l80K084J797q75k365
$$ y = [-2508, -335, 2309, 1949, -965, -2595, -796, 2048, 2179, -542, -2525, -1183, 1697, 2406, -5, -2408, -1647, 1346, 2597, 426, -2301, -1965, 958, 2569, 796, -1978, -2168, 474, 2502, 1282, -1639, -2418, -15, 2401, 1641, -1262, -2501, -529, 2083, 1977, -693, -2472, -1041, 1753, 2261, -191, -2368, -1423, 1361, 2328, 299, -2060, -1747, 834, 2353, 838, -1763, -2050, 388, 2346, 1219, -1496, -2198, -23, 2177, 1539, -1096, -2308, -501, 1985, 1853, -733, -2346, -830, 1760, 2003, -392, -2257, -1181, 1412, 2156, 85, -2132, -1589, 1042, 2307, 543, -1909, -1843, 622, 2248, 959, -1542, -2013, 133, 2107, 1349, -1165, -2150, -305, 1919, 1632, -740, -2115, -748, 1573, 1871, -251, -2046, -1194, 1240, 2045, 141, -1962, -1461, 925, 2050, 486, -1726, -1666, 567, 2055, 838, -1497, -1877, 207, 2004, 1129, -1236]
1796a236p44J830K011m27k280j176J476K205M7k185j545J127K295M51j949j783
1812a883O74K231R19j604k020J84K133J297j205k158k89J902J633p28k158p74
1828a846J623J912l20k139j122J374K055ok018j373J049K090M04j784j673O73
1844a101K118Q03j595j866L11K066J097j290j999p2J946J407r73k084m74J785
1860G9J654o07k071q39J473J819j44j932j198J076J957K81j733j498O65J985P06
1877A673j488j735K82J933J056j191j904p9J834J327r18j929m12J630J527n64
1893A042j911p55J390J702j91j886j068J139J863J15j797j326Q88J918M42j618
1909e3j545N44J903P63j330j702J36J791J100r89j793k71J606J384o30j831o32
$$ y = [-1236, -1980, -150, 1861, 1434, -846, -2022, -546, 1659, 1706, -479, -2024, -897, 1398, 1849, -100, -1883, -1209, 1022, 1941, 337, -1683, -1499, 634, 1931, 726, -1432, -1721, 181, 1814, 1086, -1072, -1846, -223, 1689, 1369, -770, -1892, -518, 1537, 1531, -487, -1860, -811, 1279, 1683, -101, -1774, -1101, 1017, 1820, 225, -1641, -1330, 736, 1833, 543, -1456, -1528, 418, 1825, 852, -1232, -1706, 79, 1733, 1126, -945, -1784, -311, 1508, 1364, -568, -1766, -690, 1267, 1548, -185, -1683, -1018, 967, 1673, 185, -1550, -1268, 665, 1721, 530, -1374, -1453, 381, 1708, 790, -1139, -1551, 79, 1606, 1042, -869, -1624, -234, 1468, 1277, -609, -1677, -538, 1325, 1440, -357, -1683, -795, 1123, 1565, -53, -1598, -1054, 849, 1612, 282, -1420, -1284, 507, 1607, 618, -1175, -1446, 160, 1544, 914, -917, -1549]
1926a549J385J601k59j802r80J122J746J02j675j249Q19J776M20j489j434N01
1942i65J767P06j266j599J76J717J006j029j728j45J637J257p80j799m38J496
1958A3J452n08j775o87J255J559j70j638r86R34J654K20j494j291O32J710N83
1975A463j322j483K97J663Q75j046j608q1J546J150p67j648l84J380J319m69j625
1992g40o62J159J470j47j580r53R31J615J39j501j158P09J628M10j327j328M25
2009i10J624O80j161j471J83J559Q89r25j499j58J381J152n70j572n29J221J369
2026A263k90j553p89J016J454Jj430r96P11J497L51j292j235M63J513N98j089
2043A93j344J60J430Q55q56j444j37J380J076o76j513l45J276J178m40j467n66
$$ y = [-1549, -164, 1437, 1178, -624, -1604, -482, 1264, 1366, -309, -1558, -739, 1037, 1457, -32, -1466, -965, 802, 1508, 242, -1357, -1181, 536, 1542, 513, -1215, -1360, 277, 1534, 754, -1045, -1483, 13, 1465, 957, -818, -1505, -250, 1309, 1139, -499, -1485, -551, 1103, 1323, -171, -1462, -830, 880, 1463, 141, -1342, -1045, 618, 1493, 447, -1161, -1242, 304, 1454, 687, -961, -1345, 35, 1354, 885, -740, -1402, -243, 1227, 1080, -500, -1453, -522, 1093, 1232, -269, -1427, -718, 910, 1320, -7, -1335, -910, 714, 1394, 233, -1238, -1055, 504, 1393, 468, -1031, -1189, 192, 1344, 774, -798, -1327, -106, 1263, 973, -580, -1369, -353, 1101, 1102, -328, -1324, -613, 884, 1235, -57, -1292, -829, 684, 1282, 193, -1151, -991, 439, 1294, 438, -1006, -1143, 237, 1313, 637, -876, -1221, 55, 1233, 793, -674, -1240]
2060a240J062J319j48j465q15Q93J420P6j341j009O26J414L92j130j212K89J435
2077E66O85r74j357O2J375Q76p61j369k13J192J082m47j388n24J038J237j92j356
2095d68p35Q44J301P4j249r38O13J376L10j188j095M45J406M65j032j179K11J314
2113D75O91q12j284p3J240R11o20j333k85J129J046l93j282n33R08J192p6j279
2131c78p91P46J291J32j176r12N00J251L91r43j095K04J235O61q17j193NJ179
2149B90Q14o44j220k17J081R57m29j271m29R90J083k58j224n91Q03J124qj131
2167b80p72N93J207K14j063r58M52J227L96r33j029J91J174O26p16j138q3J109
2185B17Q32n44j183k58R72R15l03j116n09P67J067m0j115p24O31J149J32j043
$$ y = [-1240, -178, 1141, 993, -472, -1287, -394, 1026, 1102, -239, -1248, -622, 792, 1184, 54, -1158, -869, 566, 1251, 277, -1080, -1018, 357, 1233, 472, -897, -1110, 82, 1164, 717, -671, -1195, -157, 1080, 888, -468, -1203, -359, 942, 1016, -233, -1171, -558, 818, 1128, -60, -1155, -710, 696, 1161, 129, -1050, -839, 475, 1166, 354, -930, -1003, 237, 1148, 528, -805, -1090, 39, 1085, 692, -590, -1123, -215, 977, 901, -378, -1169, -423, 868, 1000, -176, -1088, -588, 663, 1054, 111, -984, -780, 455, 1116, 299, -894, -889, 290, 1104, 460, -760, -977, 104, 1061, 632, -639, -1068, -78, 1005, 747, -477, -1068, -265, 859, 851, -280, -1052, -459, 748, 962, -101, -1059, -607, 620, 1016, 83, -946, -755, 419, 1045, 329, -809, -892, 217, 1049, 505, -678, -936, 36, 951, 648, -468, -977, -210, 857, 817, -298, -1022, -391, 758, 890, -153]
2203a53q32M49J134L38q97r65K53J130N23p90j043P9J080O75o25j080j39R83Q47
2222I67m27j129l49R02R65k52j118n05P47J006k2j020o96N24J081K05r45q42L57
2241e51J078L85p96r49J38J026O04o25j047j01J014P52m90j074k29Q93Q40l08
2259E60j039m20P63R41j04j034o02O56J024O2r84p18M65J047K54q71q62K87J070
2278D95M26p68r66J34J010N76o01r82j12R11P59m00j037l30Q23Q86k09j026m90
2297i01O60R73rr55o52M97J011J98q91q15L77J025L47p72q76J70R78N30o39r68
2317g12j6R67O76n24j019j78Q86P76l38j023l62P85Q96j63j033n16O39R77K1r39
2337b00o80M46J000K43q14q32K59J010M35p13r18Q2R80N86n64r77r9Q87P37l84
$$ y = [-153, -985, -536, 598, 936, 39, -926, -673, 457, 980, 190, -853, -774, 306, 981, 356, -724, -863, 120, 967, 540, -589, -938, -36, 929, 677, -441, -946, -199, 807, 785, -235, -931, -407, 674, 879, -66, -908, -551, 527, 912, 116, -833, -695, 331, 935, 310, -737, -838, 176, 928, 438, -636, -865, 28, 868, 560, -479, -899, -136, 805, 701, -333, -935, -279, 745, 807, -177, -895, -430, 617, 871, 0, -862, -575, 495, 921, 153, -813, -679, 331, 907, 306, -676, -788, 123, 882, 482, -555, -885, -62, 824, 615, -411, -901, -241, 732, 723, -232, -884, -387, 624, 822, -69, -884, -507, 518, 865, 93, -783, -613, 365, 895, 256, -712, -728, 239, 915, 391, -628, -806, 80, 856, 518, -505, -867, -82, 814, 651, -382, -898, -259, 718, 739, -200, -880, -434, 566, 809, -5, -837, -578, 432, 867, 154, -764, -682, 298, 884, 320, -657, -756, 131, 868, 484]
2357D84j002l00P90Q55k29r88m67O72R32m5r52o14N32R86J32r07p56L95J012L10
2377H40q09q61K29R88M76o56r53K7R46O52n17r90j53Q49P86l20j021l61P59R00
$$ y = [484, -518, -818, -28, 827, 598, -390, -857, -185, 747, 702, -250, -864, -332, 654, 786, -121, -877, -482, 530, 840, 31, -830, -601, 387, 863, 207, -746, -719, 227, 879, 362, -628, -781, 68, 854, 534, -487, -848, -89, 811]
$$ [...]
8191d5
##END NTUPLES=NMR FID
##END=
