##TITLE=1H_Ser 3514-Ox
 acet
 8 sc, 
 10.4.2024
##JCAMPDX= 6.0         $$ Bruker NMR JCAMP-DX V2.0
##DATA TYPE= NMR FID
##DATA CLASS= NTUPLES
##ORIGIN= UXNMR, Bruker Analytische Messtechnik GmbH
##OWNER= root
$$ XWIN-NMR		Version 3.5
$$ Wed Apr 10 16:31:55 2024 Russian Standard Time (UT+4h)  she@DPX200
##.OBSERVE FREQUENCY= 200.1309
##.OBSERVE NUCLEUS= ^1H
##.DELAY= (6, 6)
##.ACQUISITION MODE= SIMULTANEOUS
##.ACQUISITION SCHEME= undefined
##.AVERAGES= 8
##.DIGITISER RES= 18
##SPECTROMETER/DATA SYSTEM= spect
##.PULSE SEQUENCE= zg30
##.SOLVENT NAME= CDCl3
##.SHIFT REFERENCE= (INTERNAL, CDCl3, 0, 15.7039)
##AUDIT TRAIL= $$ (NUMBER, WHEN, WHO, WHERE, WHAT)
$$ ##TITLE= Audit trail, XWIN-NMR		Version 3.5
$$ ##JCAMPDX= 5.01
$$ ##ORIGIN= Bruker BioSpin GmbH
$$ ##OWNER= she
$$ F:/spectra/data/she/nmr/H-F/1/audita.txt
$$ ##AUDIT TRAIL=  $$ (NUMBER, WHEN, WHO, WHERE, WHAT)
(   1,<2024-04-10 16:30:45.09 +0400>,<she>,<DPX200>,
      <created by zg, POWCHK disabled, PULCHK disabled
       configuration hash MD5:
       00 E9 B6 7A A2 85 ED C7 34 08 36 98 17 FE 4E 26
       data hash MD5: 16K
       D9 5D AF B7 EA 63 AD A5 80 AF D7 87 70 96 58 56>)
$$ ##END=
$$ 
$$ hash MD5
$$ 8E 85 BC 83 82 6A 4E A7 DD 35 49 0C E7 55 FB 8B
##$RELAX= 
##$RELAX= 
##$RELAX= 
##$RELAX= 
##$RELAX= 
##$RELAX= 
$$ Bruker specific parameters
$$ --------------------------
##$DU= <F:/spectra>
##$EXPNO= 1
##$NAME= <H-F>
##$PROCNO= 1
##$TYPE= <nmr>
##$USER= <she>
##$AMP= (0..31)
100 100 100 100 100 100 100 100 100 100 100 100 100 100 100 100 100 100 
100 100 100 100 100 100 100 100 100 100 100 100 100 100 
##$AQSEQ= 0
##$AQ_mod= 1
##$AUNM= <au_zg>
##$AUTOPOS= <>
##$BF1= 200.13
##$BF2= 200.13
##$BF3= 200.13
##$BF4= 200.13
##$BF5= 200.13
##$BF6= 200.13
##$BF7= 200.13
##$BF8= 200.13
##$BYTORDA= 1
##$CFDGTYP= 0
##$CFRGTYP= 5
##$CHEMSTR= <none>
##$CNST= (0..31)
1 1 145 1 1 1 1 1 1 1 1 1 1 1 1 1 1 1 1 1 1 1 1 1 1 1 1 1 1 1 1 1 
##$CPDPRG= <>
##$CPDPRG1= <>
##$CPDPRG2= <>
##$CPDPRG3= <>
##$CPDPRG4= <mlev>
##$CPDPRG5= <mlev>
##$CPDPRG6= <mlev>
##$CPDPRG7= <mlev>
##$CPDPRG8= <mlev>
##$CPDPRGB= <>
##$CPDPRGT= <>
##$D= (0..31)
0 1.2 0 0 0 0 0 0 0 0.06 0 0.03 0 0 0 0 0.0002 0 0 0 0 0 0 0 0 0 0 0 0 
0 0 0 
##$DATE= 1712752244
##$DBL= (0..7)
120 120 120 120 120 120 120 120 
##$DBP= (0..7)
150 150 150 150 150 150 150 150 
##$DBP07= 0
##$DBPNAM0= <>
##$DBPNAM1= <>
##$DBPNAM2= <>
##$DBPNAM3= <>
##$DBPNAM4= <>
##$DBPNAM5= <>
##$DBPNAM6= <>
##$DBPNAM7= <>
##$DBPOAL= (0..7)
0.5 0.5 0.5 0.5 0.5 0.5 0.5 0.5 
##$DBPOFFS= (0..7)
0 0 0 0 0 0 0 0 
##$DE= 6
##$DECBNUC= <off>
##$DECIM= 32
##$DECNUC= <off>
##$DECSTAT= 4
##$DIGMOD= 1
##$DIGTYP= 9
##$DL= (0..7)
0 120 120 120 120 120 120 120 
##$DP= (0..7)
150 150 150 150 150 150 150 150 
##$DP07= 0
##$DPNAME0= <>
##$DPNAME1= <>
##$DPNAME2= <>
##$DPNAME3= <>
##$DPNAME4= <>
##$DPNAME5= <>
##$DPNAME6= <>
##$DPNAME7= <>
##$DPOAL= (0..7)
0.5 0.5 0.5 0.5 0.5 0.5 0.5 0.5 
##$DPOFFS= (0..7)
0 0 0 0 0 0 0 0 
##$DQDMODE= 0
##$DR= 18
##$DS= 0
##$DSLIST= <SSSSSSSSSSSSSSS>
$$ [...]
##$SUBNAM2= <"">
##$SUBNAM3= <"">
##$SUBNAM4= <"">
##$SUBNAM5= <"">
##$SUBNAM6= <"">
##$SUBNAM7= <"">
##$SUBNAM8= <"">
##$SUBNAM9= <"">
##$SW= 18.0517689322627
##$SWIBOX= (0..15)
0 0 2 0 0 0 0 0 0 0 0 0 0 0 0 0 
##$SW_h= 3612.71676300578
##$TD= 16384
##$TD0= 1
##$TE= 0
##$TE2= 300
##$TE3= 300
##$TEG= 300
##$TL= (0..7)
0 120 120 120 120 120 120 120 
##$TP= (0..7)
150 150 150 150 150 150 150 150 
##$TP07= 0
##$TPNAME0= <>
##$TPNAME1= <>
##$TPNAME2= <>
##$TPNAME3= <>
##$TPNAME4= <>
##$TPNAME5= <>
##$TPNAME6= <>
##$TPNAME7= <>
##$TPOAL= (0..7)
0.5 0.5 0.5 0.5 0.5 0.5 0.5 0.5 
##$TPOFFS= (0..7)
0 0 0 0 0 0 0 0 
##$TUNHIN= 0
##$TUNHOUT= 0
##$TUNXOUT= 0
##$USERA1= <user>
##$USERA2= <user>
##$USERA3= <user>
##$USERA4= <user>
##$USERA5= <user>
##$V9= 5
##$VALIST= <valist>
##$VCLIST= <CCCCCCCCCCCCCCC>
##$VD= 0
##$VDLIST= <DDDDDDDDDDDDDDD>
##$VPLIST= <PPPPPPPPPPPPPPP>
##$VTLIST= <TTTTTTTTTTTTTTT>
##$WBST= 1024
##$WBSW= 4
##$XGAIN= (0..3)
0 0 0 0 
##$XL= 0
##$YL= 0
##$YMAX_a= 250422
##$YMIN_a= -255847
##$ZGOPTNS= <>
##$ZL1= 120
##$ZL2= 120
##$ZL3= 120
##$ZL4= 120
##$ABSF1= 10
##$ABSF2= 0
##$ABSG= 5
##$ABSL= 3
##$ALPHA= 0
##$AQORDER= 0
##$ASSFAC= 0
##$ASSFACI= 0
##$ASSFACX= 0
##$ASSWID= 0
##$AUNMP= <proc_1d>
##$AZFE= 0.1
##$AZFW= 0.1
##$BCFW= 1
##$BC_mod= 2
##$BYTORDP= 1
##$COROFFS= 0
##$CY= 11.3945322036743
##$DATMOD= 1
##$DC= 2
##$DFILT= <>
##$DTYPP= 0
##$F1P= 15.6554695791079
##$F2P= 12.8336369535428
##$FCOR= 0.5
##$FTSIZE= 0
##$FT_mod= 4
##$GAMMA= 1
##$GB= 0.15
##$INTBC= 1
##$INTSCL= 1
##$ISEN= 128
##$LB= 0.24
##$LEV0= 0
##$LPBIN= 0
##$MAXI= 10000
##$MC2= 0
##$MEAN= 0
##$ME_mod= 0
##$MI= 1.114404
##$NCOEF= 0
##$NC_proc= 0
##$NLEV= 6
##$NOISF1= 3.799351
##$NOISF2= 2.8
##$NSP= 1
##$NTH_PI= 0
##$NZP= 0
##$OFFSET= 15.70392
##$PC= 1
##$PHC0= -25380.82
##$PHC1= 12.58731
##$PH_mod= 1
##$PKNL= yes
##$PPARMOD= 0
##$PSCAL= 0
##$PSIGN= 0
##$REVERSE= no
##$SF= 200.130013532006
##$SI= 16384
##$SIGF1= 3
##$SIGF2= 2
##$SINO= 400
##$SIOLD= 16384
##$SREGLST= <1H.CDCl3>
##$SSB= 0
##$STSI= 0
##$STSR= 0
##$SW_p= 3612.71676300578
##$SYMM= 0
##$S_DEV= 0
##$TDeff= 0
##$TDoff= 0
##$TI= <>
##$TILT= no
##$TM1= 0
##$TM2= 0
##$TOPLEV= 0
##$USERP1= <user>
##$USERP2= <user>
##$USERP3= <user>
##$USERP4= <user>
##$USERP5= <user>
##$WDW= 1
##$XDIM= 8192
##$YMAX_p= 0
##$YMIN_p= 0
$$ End of Bruker specific parameters
$$ ---------------------------------
##NTUPLES= NMR FID
##VAR_NAME=  TIME,          FID/REAL,        FID/IMAG
##SYMBOL=    X,             R,               I
##VAR_TYPE=  INDEPENDENT,   DEPENDENT,       DEPENDENT
##VAR_FORM=  AFFN,          ASDF,            ASDF
##VAR_DIM=   8192,          8192,            8192
##UNITS=     SECONDS,       ARBITRARY UNITS, ARBITRARY UNITS
##FACTOR=    0.0002768,     1,               1
##FIRST=     0,             0,               0
##LAST=      2.2672688,     0,               0
##MIN=       0,             -255847,         0
##MAX=       2.2672688,     250422,          0
$$ Real data points
##PAGE= N=1
##DATA TABLE= (X++(R..R)), XYDATA
0@%%%%%%%%%%%%Qj6J6j6K4l2L2m0M8n6P2q8R8j14J36j52J76k05K32k63L01l42
$$ 0 0 0 0 0 0 0 0 0 0 0 0 0 8 -8 8 -8 16 -16 16 -24 24 -32 40 -48 50 -64 72 -80 96 -109 123 -140 161 -181
34a81L84m36M92n49O14o87P66q50R43j046J156j276J410j556J716j890K081k295
$$ -181 203 -233 259 -290 324 -363 403 -447 496 -550 606 -670 740 -816 900 -990 1091 -1204
52a204K530k790L082l409L779m204M697n275N964o805P854r209J1034j3637J7689
$$ -1204 1326 -1464 1618 -1791 1988 -2216 2481 -2794 3170 -3635 4219 -4990 6044 -7593 10096
67A0096k4908M1643j50932n2910L41025Q6408j95759k77118K3021K55633J91304
$$ 10096 -14812 26831 -124101 -177011 164014 250422 54663 -222455 -199434 56199 247503
78B47503j28902k65627q8859K09994K33857k0279k57403j63045J25443K61806
$$ 247503 118601 -147026 -235885 -25891 207966 187687 -69716 -232761 -107318 154488
88A54488O1950k06966k18784M7620K44715J38005j39811k33381l9927J99451J83628
$$ 154488 216438 9472 -209312 -161692 83023 221028 81217 -152164 -192091 7360 190988
99A90988n6342k24202j09781J38734K15124K1938j97409j71337O9387K21354R6380
$$ 190988 134646 -89556 -199337 -60603 154521 176459 -20950 -192287 -122900 98454 194834
110A94834j48111k03678m517J97114J48896q3367k07640p1621J50418J82418j2199
$$ 194834 46723 -156955 -161472 35642 184538 101171 -106469 -178090 -27672 154746 142547
121A42547j88956j29428R0434J96357N7234j52882j71303K4239J88295J15756
$$ 142547 -46409 -175837 -85403 110954 168188 15306 -155997 -131758 56537 172293
131A72293j00365j88005l9621J55139J52263m0261j78325r1426J07494J69225
$$ 172293 71928 -116077 -155698 -559 151704 111443 -66882 -158308 -50814 118411
141A18411J9889j52035j33380N0322J69816P7596j10100j59167r487J50493J20541
$$ 118411 138300 -13735 -147115 -96793 73023 150619 40519 -118648 -128135 22358 142899
152A42899o0034j63070o0130J16801J44703r013j49060j00869P2202J52857M2468
$$ 142899 82865 -80205 -140335 -23534 121169 112156 -36904 -137773 -65571 87286 129754
163A29754j19354j31374J9893J45651Q9797p7668j47804l3214J22217J23369l0336
$$ 129754 10400 -120974 -101081 44570 134367 56699 -91105 -124319 -2102 121267 90931
174I0931j44309p5292Q7899J38655J4560j26445j07916M4619J39596O0496r2045
$$ 90931 -53378 -128670 -40771 97884 112444 -14001 -121917 -77298 62298 122794 30749
185C0749j28533n584J22829R7494m9032j33459n0713R4784J20342n083j22417
$$ 30749 -97784 -103368 19461 116955 67923 -65536 -116249 -21465 98877 93794 -28623
196b8623q4418N8957J26171L4250r9222j07232J7960J19110P1827o3103j18137
$$ -28623 -113041 -54084 72087 106337 7115 -100117 -82157 36953 108780 45677 -72460
207g2460k6641R6523R8509k2337j14572o2788O7744J12770J5785j00549q9665
$$ -72460 -99101 -2578 95931 73594 -40978 -103766 -36022 76748 92533 -8016 -97681
218i7681L3780J13718N0330p5452j05948m222J01822Q0714m0095j10105m2952
$$ -97681 -63901 49817 100147 24695 -81253 -85475 16347 97061 56966 -53139 -96091
229i6091P7053J00113k291j01559p2819M7841J08151L1965q4335r4039J4357J03759
$$ -96091 -19038 81075 78784 -22775 -95594 -47753 60398 92363 8028 -86011 -71654 32105
241C2105O2491n6145j03228k1399Q5695Q4991k1009r9411n3334N8456R6117J3268
$$ 32105 94596 38451 -64777 -86176 -481 84510 63501 -35910 -89244 -30788 65329 78597
253G8597q5472p6180K8832R6946M2706o4799r0156k527Q7226O7209l5926r2776
$$ 78597 -6875 -83055 -54223 42723 85429 20630 -69526 -72053 15173 82382 46456 -46320
265d6320l3679O6066Q2201m044q4160n8456M0227Q8077K5227o9223p6590J2297
$$ -46320 -79999 -13933 68268 64224 -19936 -78392 -38165 49912 75139 5916 -70674 -58377
277e8377Q5573N1177m7311q6055j6863P2990P1146j9341q4857m4178N0955Q1567
$$ -58377 27196 78373 31062 -54993 -71856 1134 72280 52939 -31918 -76096 -25141 56426
289E6426J0100p3337o4274K5503Q3007L6065n6257p7916j870P6220N8618l1909
$$ 56426 66526 -6811 -71085 -45582 37425 73490 17233 -60683 -62553 13667 72285 40376
301D0376q1732k9196N8988P2589m304p4753n1220L5739P7006K1713o0081o5885
$$ 40376 -41356 -70552 -11564 61025 56721 -18032 -69252 -33513 43493 65206 5125 -60760
313f0760J0823P3391M3693m0506p3574j4619O2071O0843j5994p2112l7956M2941
$$ -60760 -49937 23454 67147 26641 -46933 -61552 519 61362 45368 -26744 -64700 -21759
325b1759O9431R154o1904n4905K0765O9954L1015m6788o5710k025O4241M9971
$$ -21759 47672 56826 -5078 -59983 -39218 30736 61751 14963 -50747 -52772 11469 61440
337F1440k6808o9902k5613N0351O3056k948o4808m5338L0702O7897J9931n2804
$$ 61440 34632 -35270 -60883 -10532 52524 49576 -15232 -60570 -29868 38029 57960 5156
349E156n8996Q879O5346L9427l5973o5908j2985N5991N4547j4894o5119l3868
$$ 5156 -53840 -44961 20385 59812 23839 -42069 -55054 937 55484 40590 -24529 -58397
361e8397L8889O2272Q094n5241m8914J8284O1886K7668m1001n7833k031N6074
$$ -58397 -19508 42764 50858 -4383 -53297 -35013 26873 54541 13540 -44293 -46324 9750
373I750M3548k3420o0592k1739M3814N3993l105n5532l8287K6200N7302J6909
$$ 9750 53298 29878 -30714 -52453 -8639 45354 42249 -13283 -51570 -25370 31932 48841
385D8841m4061m9635O796N4496L3759k9521n5842j1804M7383M7157j2369n6395
$$ 48841 4780 -44855 -38059 16437 50196 20675 -35167 -46971 412 47569 35200 -21195
397b1195k9703L3839N4572P131m8526m3057J5957N4519K4871l5679n1560l026
$$ -21195 -50898 -17059 37513 44644 -3882 -46939 -30982 23537 48408 12729 -38831 -41857
409d1857M9333L9925j9624n4645k0945L9211N0091j900n1207l6166K3514N2912
$$ -41857 7476 47401 27777 -26868 -47813 -8602 41489 39589 -11618 -47784 -24270 28642
421B8642J6159l9658m5066N505M8387L0615k5133m9370j2124M0241M2407q416
$$ 28642 44801 5143 -39923 -34418 13969 44584 19451 -29919 -42043 -1802 40605 32189
433C2189m8677k7789K8006M8453P936m2288l9184J2689M7886K3005k9845m4583
$$ 32189 -16488 -44277 -16271 32182 40118 -2170 -41354 -28665 19221 42226 12381 -32202
445c2202l614M1399L4439j5650m6514j9431L2328M4196P76m3902l3522J9096M7540
$$ -32202 -35816 5583 40022 24372 -22142 -41573 -9245 34951 35727 -8175 -41697 -22601 24939
458B4939J5847l5627m1836M529M4553K8362k2750m4642j0766L5974L7546p656
$$ 24939 40786 5159 -36677 -32148 12405 40767 18017 -26625 -37391 -1417 36129 28473
470B8473m3344k5059K4641M3870Q328l7652l6355J0451M3590K1501k7086m0689
$$ 28473 -14871 -39930 -15289 28581 36909 -743 -37098 -26647 16943 38444 11358 -29331
482b9331l114L7457L0423j4140m0252j6216K7450L6769O70l6173k8175J4854L9549
$$ -29331 -32445 5012 35435 21295 -18957 -35173 -7723 29046 29716 -6457 -34632 -19778 19771
495A9771J4881k8558l6122J805L7231K5458j8207l8350j0028L0365L2157o185
$$ 19771 34652 6094 -30028 -28223 9008 34466 16259 -22091 -32119 -1754 30403 24218
507B4218l6378k1188K0294L6660P625l1157l1576P426L7532K0772k2253l7319
$$ 24218 -12160 -33348 -13054 23606 31231 74 -31502 -24076 13456 34228 11975 -25344
519b5344n104L3487K9391j1953l7737j5685K5742L4403J67l3724k5486J4059L5872
$$ -25344 -30448 3039 32430 20477 -17260 -32945 -7203 27200 27367 -6357 -31843 -17784 18088
532A8088J3278k5705l2773R60L3615K4227j5599l5670j0672K7521L0380n118l3487
$$ 18088 31366 5661 -27112 -26152 7463 31690 16091 -19579 -30251 -2730 27650 22532 -10955
545a0955j9132J8966L2699N573k8038k6681P326L1938J7159j8617l1192m813K7755
$$ -10955 -30087 -11121 21578 27151 -887 -27568 -20242 11696 28855 10238 -20954 -25767 1988
558A988K5500r184l2611j4747K1891L0734P30k9778k2303J3008L1421J0364k3377
$$ 1988 27488 18304 -14307 -29054 -7163 23571 24301 -5477 -27780 -14772 16649 27013 3636
571C636k7949J960K9366K0647j3447l0870r850K3585K7360l680l0354j8499J7013
$$ 3636 -24313 -22353 7013 27660 14213 -16657 -26507 -2922 24438 20758 -9596 -28095 -11082
584a1082L1036N891k6289k5070P130K9585J4936j7662k7836l656K4753K2543p429
$$ -11082 19954 25845 -444 -25514 -18384 11201 26137 8475 -19361 -23017 1736 24279 16850
597A6850k8208j3997J7753K7256K369k5609k1109J0238K8580J0742k0396k5644
$$ 16850 -11358 -25355 -7602 19654 22023 -3586 -24695 -14457 14123 24865 4469 -21175
609b1175R95K5801J8270j1507k6534q667J9742K3565j987k5341j7089J3000K7169
$$ -21175 -20180 5621 23891 12384 -14150 -22817 -3075 20490 18503 -6838 -23927 -10927 16242
622A6242O989k2466k3681N227K7589J4996j6409k6810l531K3716K1038p603k6382
$$ 16242 23231 765 -22916 -17689 9900 24896 8487 -18323 -21854 1862 22900 15297 -11085
635a1085j2317J6768K4865J989k3389j9539R082K6551J0499j9085k4692Q59K5184
$$ -11085 -23402 -6634 18231 20220 -3169 -22708 -13626 12925 23424 4339 -20353 -19494 5690
648E690J7625j1714k5662p401J9369K1339l002k3016j4282J1843K3126N779j8742
$$ 5690 23315 11601 -14061 -21462 -2093 19246 16244 -6772 -21054 -9211 13915 19694 952
661I52j9986L811K3038J3308j3327k3295l797K0414J8790o297k3024j0822J4451
$$ 952 -19034 -15223 7815 21123 7796 -15499 -19296 1118 19908 13611 -9413 -20235 -5784
674e784K1183J646j9589j6282P243K1868R290j5196k1102m95K1172J6436r157
$$ -5784 15399 17045 -2544 -18826 -11583 10285 19575 4379 -16723 -17218 3954 20390 11233
687A1233k3334q012J7412K0624k138k1918j3986J1180K2053N480j7596j8606L403
$$ 11233 -12101 -20113 -2701 17923 15785 -6133 -20119 -8939 13114 18594 998 -17608 -14205
700a4205K1129J2525j1845k1622m308J8626J8337m942k1912j1266J3256K0621
$$ -14205 6924 19449 7604 -14018 -18326 300 18637 13695 -8217 -19483 -6227 14394
712A4394K016j8632j5533O927K0339Q375j3812j8696m85J8213J4249p471j9944
$$ 14394 16410 -2222 -17755 -10828 9511 17886 4074 -14622 -15107 3106 17355 9884 -10060
725a0060p417J4588J8371r91j9153j3162R304J9803N265j5653j6561L355J8895
$$ -10060 -17477 -2889 15482 14491 -4662 -17824 -8520 11283 16548 895 -15666 -12311 6584
738F584J0661j0904j8881l390J6354J5855m370j9192j0044J1720J8771K146j7174
$$ 6584 17245 6341 -12540 -15930 424 16279 11909 -7283 -17327 -5607 13164 15310 -1864
751a864j4760O283J9231P874j3179j7435J04J7200J2653p483j8117o239J3279
$$ -1864 -16624 -10341 8890 16764 3585 -13850 -13746 3454 16107 8624 -9493 -15732 -2453
764b453J6295q31j6857j1948P755J7600N377j3425j5093K245J6590R904r157j6635
$$ -2453 13842 13011 -3846 -15794 -8039 9561 14938 1513 -13580 -11335 5255 15159 6002 -10633
778a0633l339J3946J3807l382j6178q830R435J5933K496j4137j3165M370J6491
$$ -10633 -13972 -26 13781 10399 -5779 -14609 -5174 10759 13255 -882 -14047 -9677 6814
791F814P908j0649j5702q79J5061J1865o364j6660n997J2185J5210o83j5640j1070
$$ 6814 14722 4073 -11629 -12508 2553 14418 8054 -8606 -14603 -2418 12792 12109 -3531 -14601
805a4601P215J6374M974j2613j4317K008J5788R688q571j5957l268J3375J3126
$$ -14601 -7386 8988 13962 1349 -12968 -10960 4828 14516 5945 -10012 -13280 95 13221
818A3221l537j5635q056R395J4983J923j3311j1824M246J4797O798r510j3735
$$ 13221 9684 -5951 -14007 -4612 10371 12294 -1017 -12841 -8595 6202 13000 3490 -10245
831a0245p62J3000J0373n243j4220n321J0220J2986m74j3311r499O076J3947M333
$$ -10245 -11007 1993 12366 7123 -7097 -12418 -2198 10788 10314 -2997 -12496 -6420 7527 11860
845A1860j0575j2079J586J3214Q199p144j3528k954J1319J1398k832j3501p215
$$ 11860 1285 -10794 -9208 4006 12205 5061 -8467 -11421 -102 11296 8464 -5037 -12252
858a2252Q227J3409J719j2182j0901M019J3832O306q971j2813n22J2265R495n209
$$ -12252 -4025 9384 11103 -1079 -11980 -7961 5871 12177 3206 -9607 -10129 2136 11631 6422
872F422j3329m732R723J2040n73j2346q707N673J2866L927r812j1219J423J2215
$$ 6422 -6907 -11639 -1916 10124 9551 -2795 -11502 -5829 7037 10964 1152 -10067 -8644 3571
886C571P663o403j2279k763J0067J0087k529j1856o249P166J1652J631j0451r612
$$ 3571 11234 4831 -7448 -10211 -144 9943 7414 -4442 -10691 -3525 8127 9758 -693 -10305
900a0305L162J1994N843p611j1459q02J0939Q804m554j2250m456Q957J1091o83
$$ -10305 -7143 4851 10694 3083 -8376 -9178 1761 10565 6011 -6239 -10695 -1738 9353 8670
914H670j1485p836N570J1959L384r446j0525J487J1705P365o172j1897k653R893
$$ 8670 -2815 -10651 -5081 6878 10262 816 -9709 -8222 3483 10848 4676 -7221 -9874 19
928A9R824k750j1792n869P396J1309J138j0229q759L385J1064M979p141j0270
$$ 19 9843 7093 -4699 -10568 -3172 8137 9275 -954 -9713 -6328 4736 9715 2574 -7696
942g696o71R751Q046l704j0842m338P599R881l55j0100p024M902J0574K992q180
$$ -7696 -8367 1384 9430 5726 -5116 -9454 -1855 8026 7671 -2429 -9453 -4551 6023 9015 835
957H35r108J224R876O263n060j0065k554Q245Q779j798j0269n787O161J0415J415
$$ 835 -8273 -7049 2827 9090 4030 -6035 -8589 -344 8435 6637 -3632 -9419 -3258 7157 8572
972H572r463q369L272J0687M673p013r790m07R288P417l630j0134m084P078R453
$$ 8572 -891 -9260 -5988 4699 9372 2359 -7431 -7838 1450 8867 5237 -4897 -8981 -1903 7550
987G550jr516p066M383J0316L134p999q977J299R736N928m993r444k196P507P769
$$ 7550 7549 -1967 -9033 -4650 5666 8800 801 -8176 -6877 2859 8787 3794 -5650 -7846 -339 7430
1003G430j563q921n210N047R175J823p949p795K280R503M639o147r089m96Q621
$$ 7430 5867 -3054 -8264 -3217 5958 7781 -168 -7963 -5683 3820 8459 2312 -6777 -7273 1348
1018A348O807l401r183l487O357Q225j45q347o177L819R242L073p157q535R56
$$ 1348 8155 4754 -4429 -7916 -1559 6666 6521 -1826 -8003 -4184 5058 8131 974 -7561 -6605
1033f605R278N867m989r374j871P832P472k162q869m485N296Q389J189p402o831
$$ -6605 2673 8540 3551 -5823 -7694 138 7610 5448 -3421 -7906 -2610 5779 6968 -434 -7265
1048g265K181Q565M280n437q443p93P897O603k951q637l346N929P476k84p469
$$ -7265 -5084 3481 7761 2324 -6119 -6912 985 7588 4637 -4000 -7346 -1417 6059 5775 -1694
1063a694n236L387P780K635n781p160K73P524N453l574q267k460O642P327j341
$$ -1694 -6930 -3543 4237 6872 1091 -6069 -5796 1728 7181 3607 -4660 -7120 -478 6849 5508
1078E508q284m665M765Q004J144o994o280K236P952L881n072p916r74P347O626
$$ 5508 -2776 -7441 -2676 5328 6472 -522 -6802 -4566 3386 7267 2195 -5721 -6695 652 7278
1093G278k493q560l791N887Q027j04q015n656L778Q226K315o250o876R25P430
$$ 7278 4785 -3775 -7566 -1679 6348 6244 -1771 -7427 -3649 4577 6892 642 -6234 -5309 2121
1108B121M805l719p708k209O107O913r67p694m705M244P736J365o649o046K144
$$ 2121 6926 3207 -4501 -6710 -603 6310 5343 -2351 -7056 -2812 4924 6289 -360 -6406 -4262
1123d262P427L345m807o865m63O399N412k190p153l275M738O976L77o874n447
$$ -4262 3165 6510 1703 -5162 -5625 774 6186 3996 -3157 -6432 -1694 5282 5659 -1215 -6662
1138f662K967P687K573n761o686Q39P159M385l772p141j688N784O135r70o928
$$ -6662 -3695 3992 6565 804 -5882 -5043 2116 6501 2729 -4412 -6100 -316 5819 4849 -2079
1153b079m387L644P195J725o021o214J562P368L797m554p032o56O329N311k200
$$ -2079 -6466 -2822 4373 6098 77 -6137 -4575 2793 6590 2036 -4996 -5652 677 5988 3788
1168C788o801l001M351O345N69n924n153K066O825L040m708o545l3O606M785l145
$$ 3788 -3013 -6014 -1663 4682 5251 -673 -5826 -3760 3065 6105 1397 -5148 -5181 1425 6210 3065
1184C065o999j969N443N956r39o540m018L391O570J638n365n721J168O746L836
$$ 3065 -3934 -5903 -460 5496 4557 -1983 -6001 -2610 3960 5598 233 -5488 -4320 2426 6262
1199F262m109o961r38O370N532k302p115k864M878O354p8o276m641K600O558K442
$$ 6262 2153 -4808 -5746 624 6156 3854 -3261 -6125 -1247 5107 5029 -1247 -5888 -3288 3270 5712
1215E712m616n963J69O140M400k951o683j957N254N818r09o322l740L382O086
$$ 5712 1096 -4867 -4698 1442 5842 2891 -3792 -5749 -495 5323 4414 -1908 -5648 -2266 3820
1230C820J219n013m955J128N783L332l228n803j182N018M972j433o164l099L963
$$ 3820 5039 26 -4929 -3801 1982 5314 2086 -3717 -4899 119 5091 3658 -2506 -5605 -1642
1245a642O065M90n665m643K170O129K394m263n540O5N619M215k458o180k216M650
$$ -1642 4423 4913 -752 -5395 -3225 2904 5298 1035 -4505 -4440 1179 5394 2936 -3244 -5460 -810
1261h10N747m44o181m123L241O503J543n349n406J260O192L333l561n914r15N174
$$ -810 4937 4493 -1688 -5811 -2570 3933 5476 127 -5279 -4019 2173 5506 1945 -3969 -4884 290
1277B90M824j507o039l102L782N979O95n481m734J983O141K491m242n564P9N507
$$ 290 5114 3607 -2432 -5534 -1752 4227 4922 -559 -5293 -3310 2831 5322 1080 -4484 -4405 1102
1293A102M015k386n724j936M223N114m08n483l753K752N901J662m701n147R10
$$ 1102 5117 2731 -2993 -4929 -706 4408 4000 -1483 -5236 -2484 3417 5079 378 -4769 -3859
1308c859N769L274l316n681q59N006M565j533n700k778L584N462N38n074m372
$$ -3859 1910 5184 1868 -3813 -4672 334 4899 3366 -2334 -5112 -1528 3934 4472 -602 -4974
1323d974J812N794K509l903n420j65N259M021k221n586j961M077M969l25n135
$$ -4974 -3162 2632 5141 1238 -4182 -4347 912 4933 2712 -2874 -4835 -758 4211 3886 -1249
1338a249l574K422N387J679m111m804M73N143L415k582n299j354M306M510r83
$$ -1249 -4823 -2401 2986 4665 554 -4250 -3777 1366 4781 2199 -3100 -4454 -148 4362 3379
1353C379n262k912L081N199Q54m571m217J402N258K506l453n106l72M890M050
$$ 3379 -1883 -4795 -1714 3485 4339 -232 -4449 -3047 2211 4717 1264 -3842 -4214 676 4726
1368D726j865n396k129L817M901k72n130l492K564N440J524m256m710O78N129
$$ 4726 2861 -2535 -4664 -847 4054 3782 -1348 -4840 -2276 3164 4688 432 -4278 -3600 1529
1383A529L127k779n140j041M380M310j128n139k729L012M929O83m368l891J471
$$ 1529 4656 1877 -3263 -4304 76 4386 3258 -1881 -4610 -1598 3331 4014 -354 -4245 -2774
1398b774M982K252l275m729l17M422L631j634m774j904L318M325j18m421l198
$$ -2774 2208 4460 1185 -3544 -3861 561 4192 2558 -2216 -4120 -802 3523 3405 -1016 -4214
1413d214K018M774J564l576m283M03M566K985k409m762j102L981M061r42m728
$$ -4214 -2196 2578 4142 566 -3717 -3314 1252 4237 1828 -2934 -4036 -55 4006 3064 -1664
1428a664k594K754M569O66m058l682J333M724K244l068m625m01M310L622j613
$$ -1664 -4258 -1504 3065 3731 -327 -4009 -2676 2048 4292 1224 -3401 -3802 508 4130 2517
1443B517m762j871L349M293j52m363l109J981M529J485l354l990K96M248K887
$$ 2517 -2245 -4116 -767 3526 3374 -989 -4098 -2117 2412 3897 543 -3447 -3151 1097 3984
1458C984k082m516j298L593L970o51m418k590K478M370P03l771l467J175M314
$$ 3984 1902 -2614 -3912 -319 3651 3000 -1418 -4008 -1530 2840 3543 -228 -3695 -2520 1794
1473A794K070k725m165m36L862L375j356m420j920L050M190m4m229l040K013M490
$$ 1794 3864 1139 -3026 -3462 400 3775 2419 -2001 -3921 -871 3319 3275 -954 -3994 -1981 2509
1489B509J266l442l792N83M140K517k208m168r94L438L644o56m165k494K331M178
$$ 2509 3775 333 -3459 -2876 1264 3781 1573 -2595 -3589 -151 3493 2837 -1328 -3822 -1491 2687
1505B687P21l650l353J217M196J874k688l843k58L520K888j224l778j699K530
$$ 2687 3408 -242 -3595 -2378 1818 3692 1004 -2839 -3097 423 3311 2087 -1691 -3390 -860
1520h60L656K35l547k933J420M003J496k929l598L54L810K393k003l849q96L082
$$ -860 2796 3031 -516 -3449 -2029 1974 3470 541 -3057 -2703 1107 3500 1497 -2352 -3248 -166
1536a66L233n68l627k215J944L736Q37l189l275Q80L992K023k543l886k59L610
$$ -166 3067 2499 -1128 -3343 -1399 2337 3174 -15 -3290 -2410 1582 3605 1062 -2824 -3083 527
1552E27K866j449l833j415K679L425j0l391k645J352L690J457k653l443J82L638
$$ 527 3393 1944 -1889 -3304 -625 2800 2790 -601 -3246 -1894 1796 3253 600 -2843 -2661 977
1568I77K475j910l858r30L119L169p00l526j917J985L332N89k895k838P06L476
$$ 977 3452 1542 -2316 -3246 -127 3042 2342 -1184 -3101 -1116 2216 2805 -90 -2928 -2222 1254
1584A254J939k050l512m96L227K799j292l747j396K738L346k11l361k274J519
$$ 1254 3193 1143 -2369 -2865 362 3161 1869 -1878 -3274 -536 2810 2599 -762 -3036 -1517
1599a517L348J008k529k976K88L273K266j640l587r87K884L080o39l555j871K150
$$ -1517 1831 2839 310 -2666 -2378 895 3161 1521 -2066 -3053 -169 2911 2272 -1283 -3154 -1004
1615a004L354L73k977k561R10L155J561j876l019m69K718K578q40l310j635K195
$$ -1004 2350 2723 -254 -2815 -1905 1250 2811 935 -2084 -2553 165 2743 1903 -1407 -3042 -847
1631h47L280J93l114k431J297L258J099k350k785K17K895K039j313l101j100K326
$$ -847 2433 2626 -488 -2919 -1622 1636 2735 385 -2400 -2183 712 2751 1438 -1663 -2763 -437
1647d37K930j76l171k128J673L418P47k905k811Q20L350J590k051l024k56K778
$$ -437 2493 2317 -854 -2982 -1309 2109 2856 -49 -2860 -2040 1310 2900 849 -2175 -2431 347
1663C47K326r74l106j443K054L112K71k988k494J178L360J209k446k940L36L093
$$ 347 2673 1699 -1407 -2850 -796 2316 2587 -401 -2895 -1717 1643 2852 406 -2534 -2198 895
1679H95J873j568k966p38K297K494l44k709j771J397K910P76k438k629N13L042
$$ 895 2768 1200 -1766 -2504 -207 2287 1943 -766 -2537 -1140 1770 2546 108 -2521 -2008 1034
1695A034J686j789k878k76K556K092r87k768j128J846K557K13k403k098Q21K767
$$ 1034 2720 931 -1947 -2223 333 2425 1438 -1330 -2458 -612 1945 2158 -245 -2343 -1522 1245
1711A245J233j946k735K1K805K023j304k927q39K226K376m17k616j544J401K621
$$ 1245 2478 532 -2203 -2182 623 2646 1342 -1585 -2424 -198 2178 1761 -855 -2399 -998 1623
1727A623P14k133k384K84K660J696j408k794n83K420K335p39k843j326J775K581
$$ 1623 2337 204 -2180 -1896 764 2460 1052 -1742 -2325 95 2430 1691 -1152 -2478 -703 1878
1743A878J88k369j939Q30K579J167j724k504j92K421K028r79k770j023K068K513
$$ 1878 2066 -303 -2242 -1412 1167 2334 610 -1894 -2086 335 2363 1384 -1386 -2409 -341 2172
1759B172k91k680j631J445K655N20k207k141N24K534J407j444k521m76K222K145
$$ 2172 1881 -799 -2430 -985 1670 2190 -17 -2158 -1634 900 2307 863 -1658 -2134 88 2233
1775B233o64k684j274J771K563Q6k456j869J045K573Q65j822k228Q6K248J642
$$ 2233 1569 -1115 -2389 -618 1945 2031 -425 -2294 -1249 1324 2189 367 -1861 -1775 473 2115
1791B115r22k433r03J750K246q4k348j634J161K500O54j987k104M00K337J367
$$ 2115 1193 -1240 -2143 -393 1853 1769 -579 -2213 -1052 1448 2102 115 -1989 -1589 748 2115
1807B115j254k281n08J862J961l79k286j355J310K387M36k104j997O62K503J144
$$ 2115 861 -1420 -1928 -66 1895 1516 -770 -2125 -815 1572 2008 -96 -2093 -1431 1072 2216
1823B216j658k338r0K234J767r03k399r39J697K206j5k276j678J047K493P85j922
$$ 2216 558 -1780 -1870 364 2131 1228 -1171 -2110 -413 1793 1778 -498 -2176 -1129 1364 2149 227
1840B27k211K94K419J482j334k411m95K023J998m87k318j279J336K273L50k000
$$ 227 -1984 -1690 729 2211 877 -1534 -2029 -6 1992 1505 -813 -2092 -756 1517 1867 -133
1856a33j841O18K351J136j524k241j72K102J693q24k282q49J604K065n3k090j510
$$ -133 -1974 -1356 995 2131 607 -1634 -1806 296 1989 1165 -1117 -1966 -362 1703 1650 -440 -1950
1873a950R30K172P17j658j938K29K137J371j136k230n51J818J862l76k131j190
$$ -1950 -1020 1152 1869 211 -1727 -1498 639 2010 874 -1356 -1907 -89 1773 1397 -734 -1924
1889a924J241K103L29j857j725N34K131J089j341k058k11J908J642o91k145r40
$$ -1924 -683 1420 1749 -108 -1833 -1299 832 1921 580 -1478 -1689 219 1861 1170 -975 -1915
1905a915J446K011Q2j924j550P73K100Q05j495j944P0J996J442r53k148o39J633
$$ -1915 -469 1542 1624 -300 -1850 -1077 1023 1828 333 -1611 -1541 455 1897 944 -1204 -1843 -210
1922b10J882k48k025j269J084K046M79j732j765M19K095J144j248k086k61J906
$$ -210 1672 1424 -601 -1870 -786 1260 1739 7 -1758 -1339 756 1900 652 -1434 -1695 211
1938B11J629o93k154q80J467J973L2j922j461Q05K040P34j519j867J21J994J383
$$ 211 1840 1147 -1007 -1887 -420 1553 1585 -337 -1798 -993 1047 1781 262 -1605 -1484 510 1893
1955A893r99k112n62J667J786l45j996j149J127J950L68j627j622L85J898J074
$$ 1893 894 -1218 -1780 -113 1673 1328 -668 -1817 -690 1260 1628 1 -1621 -1236 662 1736
1971A736j105j907l32J707J605n39k015r34J299J895J05j772j430O97J916P40
$$ 1736 631 -1276 -1608 99 1704 1165 -850 -1784 -485 1410 1515 -257 -1687 -990 926 1666
1987A666j328j731%J748J335p49j947p17J449J795j28j910j252J004J975M55j626
$$ 1666 338 -1393 -1393 355 1690 941 -1006 -1723 -274 1521 1393 -517 -1769 -765 1210 1665 39
2004C9j631L56J872J036j049j805l50J554J558l91j906j058J153J935K84j741
$$ 39 -1592 -1236 636 1672 623 -1182 -1532 22 1580 1189 -717 -1775 -622 1313 1597 -144
2020a44j541O29J964P93j336j762nJ717J294o80j798p10J263J682Lj724j322P84
$$ -144 -1685 -1056 908 1701 365 -1397 -1402 315 1609 929 -869 -1579 -316 1366 1369 -355 -1677 -893
2038h93J934O46j504j713K52J861J068j034j794k76J505J430m07j721r40J001
$$ -893 1041 1687 183 -1530 -1278 583 1651 617 -1177 -1453 52 1482 1075 -646 -1586 -585
2054e85J722L17j522j476M82J850Q63j249j768j7J705J257p45j743n45J252J474
$$ -585 1137 1454 -68 -1544 -1062 788 1651 402 -1366 -1383 322 1579 834 -909 -1454 -202 1272
2071A272j02j542j107O84J685O23j254j571P1J671J112q81j740l67J462J408l88
$$ 1272 1170 -372 -1479 -795 890 1513 259 -1312 -1241 430 1542 661 -1079 -1446 16 1424 1036
2088A036j627q49R25J519K61j306j276L18J584Q99r37j667k57J488J343n29j728
$$ 1036 -591 -1440 -515 1004 1265 -41 -1317 -999 585 1484 547 -1120 -1377 111 1454 925 -803
2105h03o74J245J513j06j556j046P05J554N16j127j410N6J489J092p17j679n05
$$ -803 -1477 -232 1281 1175 -381 -1427 -722 832 1348 221 -1189 -1133 356 1448 731 -948 -1453
2122a453J354J503k90j716r06J026J585J68j435j197M78J531P20r45j471k08J340
$$ -1453 -99 1404 1114 -602 -1508 -482 1103 1271 -164 -1361 -883 648 1368 423 -1048 -1256 84
2139H4J263m37j606p45J107J564j1j589j095P72J594M39j222j294J90J402Q76
$$ 84 1347 910 -696 -1441 -334 1230 1219 -370 -1465 -693 901 1340 118 -1176 -986 416 1292
2156A292p06j440m16J146J348j58j510r43Q50J563K33j381j234N05J546O42j016
$$ 1292 586 -854 -1270 -124 1224 1066 -444 -1387 -537 1026 1259 -122 -1356 -851 695 1337 321
2173C21j357o0J244J038m29j366o51R18J384J06j344j143N40J567N62j140j356
$$ 321 -1036 -1096 148 1186 757 -609 -1260 -342 1042 1148 -196 -1339 -799 768 1330 190 -1166
2190a166J55J419Q71p07j395l64J063J207r9j290r24O05J416M52j160j311K24
$$ -1166 -1011 408 1279 572 -823 -1187 -124 1083 984 -306 -1230 -625 791 1243 83 -1228 -1004
2207a004J530Q54q91j481j87J280J083m25j367o03Q74J300J18j207j082M05J409
$$ -1004 526 1380 489 -992 -1179 101 1184 759 -608 -1211 -337 963 1081 -126 -1208 -803 606
2224F06O57r72j384kJ422R97o98j486l78J142J198k11j298p67O94J292K83j061
$$ 606 1263 291 -1093 -1095 327 1324 626 -860 -1238 -96 1102 891 -407 -1174 -480 812 1095 34
2242C4j127K07J324P95p50j371k31J203J097m38j369n60Q97J223K7j156q83M37
$$ 34 -1093 -886 438 1233 483 -888 -1119 84 1181 743 -626 -1186 -289 934 961 -195 -1078 -641
2260f41J199N04q26j129n5J126R28m62j316m74R67J169j11j231p58O35J210K61
$$ -641 558 1062 236 -893 -948 178 1106 644 -672 -1146 -179 990 879 -352 -1110 -475 735 996
2278I96r68r95J91J144O98o08j191k84R94J039k30j257o85P86J252J28j129r60
$$ 996 28 -967 -776 368 1066 458 -733 -1017 -23 1016 786 -471 -1156 -370 882 1010 -119 -1079
2296a079M05J229M85q26j107j6J081Q98m34j225n10Q55J171j2j187q58N84J277
$$ -1079 -674 555 1040 214 -893 -909 172 1070 636 -589 -1099 -244 927 915 -272 -1130 -546 731
2314G31L47j023j071K08J201O87o60j159k22R80R70k39j182o54P07J196J72j079
$$ 731 1078 55 -1016 -808 393 1080 420 -739 -961 19 989 750 -432 -1086 -379 817 989 -90
2332i0r41L62J213N04q34j092J9J078P91m66j136l89Q03J017l4j051p61N03J140
$$ -90 -1031 -669 544 1048 214 -878 -859 219 1010 544 -592 -981 -178 839 805 -246 -1007 -504 636
2351F36L45q69j020J37J085O81n76j091k32R03R03k01j062o08N78J060K42q90
$$ 636 981 112 -908 -771 314 995 419 -672 -904 -1 902 701 -361 -969 -391 669 911 21
2369B1r13K25J066N81o56j083j43R76Q82l23j108n03P23J032M5r98q04L92J128
$$ 21 -892 -667 399 980 324 -759 -902 74 956 633 -475 -978 -255 777 822 -176 -980 -588 540
2388E40M33p81j022QJ035P58m90j109l33Q68R87j44j087o70N88J092K37r14r04
$$ 540 973 192 -830 -822 213 971 481 -628 -961 -93 894 750 -337 -1007 -419 673 910 -4 -908
2407i08K36J086N61o40j075j36R53Q40l07j077m93P13J008L9r67p73L99J053M21
$$ -908 -672 414 975 335 -740 -876 77 917 610 -467 -960 -247 761 800 -167 -940 -541 512 933
2426I33p54r67K1R73O96m45j045l00Q07Q95j28r69o22M89R93K55p96q56J82R66
$$ 933 179 -788 -767 206 902 457 -588 -888 -81 814 686 -283 -905 -416 577 832 36 -820 -638 328
2446C28N85n69j009j58Q52Q18k54r90m70O30R35P9q68p55L00R73M44o27r53o0
$$ 328 913 344 -665 -823 29 847 593 -397 -867 -237 698 777 -91 -846 -546 427 871 244 -709 -769
2466g69R16P40l76j033l75P48R20n6r55o45M60R75K89p66q63J01R58O42n00j015
$$ -769 147 887 511 -522 -897 -149 771 715 -240 -885 -425 550 839 73 -790 -689 269 911 411 -604
2486f04k61Q32Q81j97j021n44O20R96J21r36p69L23J005M58o63r37p6Q98P41l51
$$ -604 -865 -33 848 651 -370 -914 -294 702 823 -113 -882 -559 446 904 241 -696 -772 126 867 516
2506E16j020m09P34R68k5j003o76M83J018K55q08q55J61R72N72m98r76k33P81
$$ 516 -504 -913 -179 789 764 -239 -915 -432 586 841 33 -822 -661 311 883 385 -591 -824 -43
2525d3Q37j58r63n66N61J008J63q83q30K87J013M62o47r28l7Q49P09l13r43m32
$$ -43 794 636 -327 -893 -332 676 839 -44 -874 -587 426 888 241 -687 -724 125 834 521 -422 -854
2545h54O20R18P5q85p46L50J017L84p44r34P1R69O48m89r63k72P43Q23r2r06n89
$$ -854 -234 684 759 -126 -872 -522 495 879 135 -799 -728 241 889 400 -563 -835 -92 731 639 -267 -856
2566h56M64R59K66p84q79J65J006N61n90j001j13Q87P76l13r90m16O25Q98Q2q50
$$ -856 -392 567 833 49 -830 -665 341 902 312 -689 -802 85 861 548 -442 -858 -233 665 747 -103
2586a03p17K92R55M38o70r44k1R56P13m43j024k91P92Q39j36r31n64M99R11K33
$$ -103 -820 -528 427 865 195 -749 -770 186 899 456 -568 -859 -67 772 636 -295 -859 -360 551 784
2606G84p42p98J31R22N65n20r58j89Q43Q08k68r94m47O45Q95M7q61o63L42Q92
$$ 784 42 -756 -625 297 862 342 -616 -805 38 846 578 -416 -863 -218 677 724 -137 -800 -458 434
2626D34L51o08q27l3Q33O69l56r49l43O95Q71q0r38n71M95R33J76p50p46J69Q58
$$ 434 785 177 -650 -683 150 819 463 -486 -829 -134 737 657 -281 -852 -357 576 752 2 -744 -575 283
2647B83M89m65q70j89P43P81j80r33n21N72R38J09q65p06L34R31L61o62q23OQ20
$$ 283 772 307 -563 -752 -9 772 592 -341 -862 -290 648 757 -108 -814 -480 451 812 150 -673 -667 153
2668A53O17l27q86l43O27Q58rq93o66M40R71K81p90q14J87R20M90n46q84j39P64
$$ 153 770 443 -443 -786 -159 699 690 -203 -869 -429 542 823 33 -781 -594 326 816 270 -614 -753 11
2689A1P22j92q78m96N40R02J31q10p53K93R76M02o77q74J8Q80O12l96r01k69O55
$$ 11 733 541 -337 -833 -293 609 740 -70 -823 -530 446 848 171 -703 -685 195 807 411 -490 -759 -104
2710a04P87o0q28n93L84R08K92p05q30J27R05N49n26r24j32P89P15k40q65m13
$$ -104 683 623 -205 -798 -414 494 786 81 -749 -622 283 832 306 -618 -750 39 754 514 -351 -764
2730g64N08Q24J10p35o91K19Q73M43n58q58p9Q28O70l56q89l12O53P85m9q06n57
$$ -764 -256 568 678 -57 -748 -529 344 787 229 -629 -708 120 790 434 -455 -767 -114 671 622 -184 -741
2751g41L61Q18K88o15p59M8Q07N67l96r00k40P17P64j69q82m62N29Q39J01p41
$$ -741 -380 438 726 111 -648 -600 207 774 378 -522 -762 -45 719 550 -332 -794 -265 574 675 -66
2771f6o60K43Q22M12n15q19r6P44O66k60q78l69O26Q17k8q40n65L98Q55K23o57
$$ -66 -726 -483 339 751 236 -583 -679 65 731 471 -407 -776 -150 667 639 -201 -766 -368 487 710 53
2792E3p09J01P90N00m17q18j96O68O98j29q38m56N02Q20R1p61o21K66Q07L36n35
$$ 53 -656 -555 235 735 318 -500 -696 -28 670 541 -297 -753 -251 569 660 -101 -722 -456 351 687 152
2813A52p17l5P17N61k94p63l11N51P35k0p48n30L44P97K38o27o72J15P26M68m09
$$ 152 -565 -600 117 678 384 -379 -690 -139 596 576 -172 -702 -358 439 677 50 -622 -507 219 687 278
2834B78p34j77O17O26j34p31m24M21P57J36o72o25J90P87L78n19p48l4P09N59
$$ 278 -456 -633 -16 610 476 -255 -679 -258 499 635 -37 -662 -472 315 693 174 -574 -608 101 660
2854F60k85p61l05N44P14Jp23n17L11P75K50n85p10P9P83M76m13p69j70O48O44
$$ 660 375 -386 -691 -147 567 568 -155 -672 -361 414 664 79 -631 -552 231 707 294 -475 -645 3 647
2875F47j76p75l78M60P37R1o60o07K22P56L60n08p31j9O91N57k98p76k64N57O77
$$ 647 471 -304 -682 -222 515 606 -54 -661 -439 317 677 169 -562 -581 110 667 369 -407 -671 -114 563
2896E63m5p04m64L37P26K02n76o19P5O96M36l54p23j56O06N89j57o96l74M26O82
$$ 563 518 -186 -650 -313 413 615 39 -580 -505 191 627 273 -450 -606 0 589 432 -264 -638 -212 470
2917D70R2n92n56J81O97L27m40o67n9O15N31k20o94l05M66O58no39m74K70O93
$$ 470 562 -30 -586 -405 292 619 179 -488 -547 68 599 379 -315 -620 -154 504 499 -140 -614 -344 349
2938C49K44n13o27M9O67M33l08o96j82N46N83r4o87l93L83O82J34n68n66J53O88
$$ 349 593 80 -547 -498 169 602 294 -402 -584 -38 545 451 -236 -629 -246 436 570 2 -564 -411 277
2959B77L38m34o62o1O16N29k35o87k81M76O22j9o25m55K89O70K15n09o02O1O45
$$ 277 615 181 -481 -542 74 603 368 -319 -600 -124 498 479 -146 -601 -312 358 573 64 -538 -477 168
2980A68M23l37o70j43N51N59j56o35l43L93O11Q8n41m99J73O16K95m04o04n0N87
$$ 168 591 254 -416 -559 -8 551 395 -240 -583 -190 421 509 -32 -531 -358 258 553 149 -455 -505 82
3001H2M78k03o60k50M39N76k6n77m09K74O14J95m55n68L6N81M10k95o13j65M93
$$ 82 560 357 -303 -553 -114 462 436 -141 -550 -276 338 533 78 -490 -454 127 537 242 -371 -536 -43
3022d3N55r3o35l84L59O36J17n35m95J53O15L06l91o04o3N50M90j77o25l10M25
$$ -43 512 419 -216 -600 -241 395 512 -23 -518 -365 250 556 165 -439 -502 48 538 361 -264 -574 -149
3043a49O17L0o14m65K64O63K22m90n79M4O08M08k97o29j75M95N61p7o38l86L26
$$ -149 468 498 -116 -581 -317 346 568 78 -501 -457 151 559 262 -367 -542 -47 514 437 -201 -587 -261
3064b61O53J45n58n34J52O59L13m05o11n1N60M73j97n93k81L89N84M7n52m88K25
$$ -261 392 537 -21 -555 -403 256 569 164 -447 -498 62 535 338 -255 -536 -147 437 484 -68 -556 -331
3085c31O44K65m52o03K5N98M06k96o06j73M69N23o2n65l78K69N94J73m66n37Q1
$$ -331 313 578 126 -477 -452 146 552 256 -350 -523 -54 469 407 -158 -536 -267 327 500 34 -503 -422
3106d22O09L69l32o22j21N26N03j51o03k94L86N52O5m97m60J42N88L03l77n89
$$ -422 187 556 224 -398 -519 7 510 359 -244 -538 -152 400 465 -32 -492 -350 238 541 164 -425
3126d25m9N48M64k22o29k29M56N63m6n78l84K71N87J68m52n09N3N57L91k90o08
$$ -425 -474 74 538 316 -313 -542 -86 477 431 -147 -531 -260 327 495 43 -466 -413 144 535 245 -363
3147c63j67M90N40j10o28l15L75N96N6n38m57J99N70K47l51n40m6N07M44j85o04
$$ -363 -530 -40 500 390 -238 -553 -178 418 474 -64 -521 -322 248 495 144 -396 -442 65 509 324 -280
3168b80k64M28N64J2n98l97K74O03J52m64m98P7N54L34k76n63j42M39M96p5n77
$$ -280 -544 -116 448 460 -138 -535 -261 342 494 30 -468 -391 163 497 221 -342 -484 -45 451 376 -201
3189b01l45L37N97J04n34m86J79O00K58l82n43k3N05L99j61n47k57L78N28M9n31
$$ -201 -546 -209 388 492 -42 -528 -349 251 509 127 -416 -439 66 465 304 -243 -500 -122 406 455 -76
3210g6m41K17O04K15m48n38M9N78L56k74n74j47M41M79p3n30l53K77N89J56m88
$$ -76 -517 -300 304 519 71 -467 -418 160 516 242 -332 -479 -38 441 368 -162 -515 -238 351 507 19
3231A9n29J09N94L55l74n87p0N38M53j97n76k65L86N32O4n10m36J86N81K57m05
$$ 19 -510 -401 193 548 174 -413 -483 55 508 311 -265 -530 -144 388 452 -58 -494 -308 273 530 125
3252A25n77lN69M36k58o32j72M73N11q6n66l39K96N65J41m57n01P3N65L54l14
$$ 125 -452 -455 114 550 292 -340 -512 -39 472 386 -180 -519 -223 342 483 26 -475 -402 163 517 203
3273B03o00j03N23M81j61n94k82L82N51L5n11m12J90N49K23l55n23l3N13M22j85
$$ 203 -397 -500 23 504 343 -251 -533 -151 400 435 -76 -488 -298 251 474 119 -404 -437 76 498 313
3294C13n91k25M08N39l8n48l73K83N49J55m22m82N6N29L28k66n44j51M32M92p8
$$ 313 -278 -503 -95 444 406 -142 -515 -232 317 472 50 -432 -376 153 481 215 -329 -480 -48 444 366
3315C66n64l30L19N72R8n07m48J62N63K66l67n09m8M75M18j64n48k49L74N32J8
$$ 366 -198 -528 -209 363 461 -46 -494 -332 231 497 130 -379 -427 48 466 302 -246 -495 -121 411 429
3336D29n29m10K27N90J83m23n26O3N51L40k68n55j34M30M75q2n33l23K86N42J27
$$ 429 -100 -510 -283 307 490 67 -459 -396 155 495 227 -328 -462 -32 443 361 -172 -495 -209 333 460
3357D60m85m51J33N56K83l62n32l4M94M00j91n26k14L54N01J4m86l91K10N36K09
$$ 460 -25 -476 -343 213 496 134 -398 -432 62 462 271 -255 -469 -115 386 400 -86 -477 -267 269 478
3378D78l98m99L3N04L59k55n39j41M14M62p2n11k94K65N04J20m21m42P5N23K99
$$ 478 80 -419 -386 118 477 222 -317 -458 -44 418 346 -165 -459 -194 310 430 9 -433 -358 165 464
3399D64k77n40r7M69M16j23n34k64L42N10N8m82m00J71N23K28l51n00k0M85L95
$$ 464 187 -353 -450 19 435 312 -222 -486 -144 366 424 -58 -458 -287 236 464 113 -387 -407 78 473
3420D73j94n56j89L91M89k8n10l47K34N39J40m00m76O7N11L34k71n27j29M30M43
$$ 473 279 -277 -466 -75 414 386 -124 -471 -237 302 442 42 -434 -367 144 478 207 -320 -449 -19 424
3441D24q8n41k87L20N06P8m50m15J51N15K31l30m77l3M52L70j65n13k00L49M64
$$ 424 336 -205 -492 -172 334 412 -38 -453 -302 213 444 114 -363 -396 56 426 261 -252 -452 -103 361
3462C61jm49l45J95N02J65l69m40M1M45L24k27m90j17L67M18o3m71k79K38M88
$$ 361 360 -89 -434 -239 263 428 59 -381 -340 105 429 202 -288 -405 -38 380 317 -154 -433 -195 293
3483B93R7l92l99Q4M66K65k61m83n9M00L92j28m68k34K91M51M8m13l55J45M70
$$ 293 390 -2 -401 -317 149 414 153 -330 -389 11 403 275 -193 -427 -136 315 363 -50 -405 -260 210
3504B10K03l10m53j1M39L38j80m76j83L56M33l9m56l14K32M80J36l83m03O6M61
$$ 210 413 103 -350 -361 78 416 236 -240 -423 -67 366 327 -129 -443 -211 269 405 22 -381 -315 146
3525A46K57k47m57r3L89L87j07m50k53K71M64P0m22l54J42M72J88l09m24j2M08
$$ 146 403 156 -301 -394 -5 382 275 -175 -428 -157 307 377 -45 -399 -257 215 403 94 -330 -342 66
3546F6L19j55m41j72L05M17j5l99l27J77M63J56l52m08M4M37K80k22m47j04L52
$$ 66 385 230 -211 -383 -78 339 324 -75 -402 -225 238 394 42 -366 -322 115 395 173 -274 -378 -26
3567b6L70o1m13k59K18M15J21l62l75R0M29K66k84m28o5L86L63j31m41j98K75
$$ -26 344 283 -130 -389 -171 244 365 3 -372 -282 147 413 129 -299 -364 22 385 254 -187 -385 -110
3588a10M22K9l82l28J13M53K01k92m38k0M27L29j84m76j57L49L97k3m28k82J99
$$ -110 312 341 -41 -369 -256 197 398 106 -332 -352 75 404 220 -256 -413 -64 333 310 -118 -400 -201
3609b01M46J26l38l94L4M35K93k21m66j13L78L90q3m52k49K67M43O2l79l55J17
$$ -201 245 371 33 -361 -327 108 401 180 -286 -399 -21 369 286 -166 -415 -148 295 357 -22 -377 -260
3630b60M30K13k58m24n6L80L48j19m47k10K84M30K3m01l37J75M38J56l13l81L
$$ -260 170 383 125 -299 -355 25 373 254 -193 -403 -119 311 334 -67 -404 -229 209 365 52 -329 -326
3651c26L93K89j58m20j64L06M09j7m20l00K04M57J39l71l85O7M26K64k50m04q9
$$ -326 67 356 198 -222 -386 -80 329 312 -108 -408 -204 253 392 21 -364 -297 129 393 143 -261 -350
3672c50L48L43p0m16k34K14M43R4l79l72J06M57K09k80m25l2M04L15j53m33j69
$$ -350 -2 341 271 -145 -379 -165 278 372 -7 -379 -273 184 393 113 -312 -344 60 375 222 -211 -380
3693c80K88M03Ql97l09J52M42J70l04m26J7M33L04k15m57j05L53L75n9m27k49
$$ -380 -92 311 319 -78 -387 -235 207 377 73 -353 -336 97 401 186 -271 -376 -23 352 293 -134 -383
3714c83K19M27J02l60l60P2M43K40k50m52o0L87L64j38m50k07L07L99L3l95l30
$$ -383 -164 263 365 5 -355 -283 160 400 150 -302 -362 25 389 251 -199 -406 -99 300 333 -62 -392
3735c92J57M33J87l09m00j9M07L22j73m62j61L40M14k5m45k86K27M49J07l46l88
$$ -392 -235 198 385 76 -324 -343 64 386 213 -249 -410 -70 344 319 -126 -412 -185 264 371 25 -363
3756c63N9M33K80k26m55j19L81L88q2m61k59K72M75N3m22l67J38M50K21l01m37
$$ -363 -304 129 409 183 -272 -391 -10 378 296 -165 -424 -152 323 376 -46 -413 -275 175 396 95 -342
3777c42k5M01L54j43m75k12L26M61K8m72l50K03M92J65l71m30M3M75L03k31m72
$$ -342 -367 34 388 245 -230 -442 -116 345 373 -99 -449 -246 246 411 40 -390 -347 128 431 200 -272
3798b72j39L66M25n2m56l23K54M96J28m23m31R9N01K76l11m81o1M43L72j39m94
$$ -272 -411 -45 380 328 -128 -451 -197 299 427 4 -427 -328 173 449 138 -343 -404 39 411 272 -222
3819b22k38L18M58O2m42l74J62N10K24l77m73mM85L53k11n07j64L86M45m4m73
$$ -222 -460 -142 316 378 -64 -438 -276 234 458 81 -392 -396 89 442 231 -276 -440 -54 391 347 -126
3840a26l20K36M97J50l94m57P4M83L12k72n20r4M33M29j23n03k71L09M89O6m34
$$ -126 -446 -210 287 437 43 -414 -340 143 455 183 -337 -431 2 431 308 -195 -466 -157 332 398 -36
3861c6m02J36N11K41l36m90l2M63L94j83n31k07L75M84j5m94l44K36N15J66l97
$$ -36 -438 -302 209 450 114 -376 -408 55 449 266 -265 -472 -97 387 372 -122 -466 -230 285 451 54
3882E4m57L7N06L39k55n36j47M36M68j04n30l01L06N29Q8m63m29J47N32K57l46
$$ 54 -403 -366 140 479 224 -312 -459 -23 445 341 -189 -490 -184 345 433 -30 -459 -312 220 477 131
3903A31n17m2M79M02j72n37k32L74N26j2n08l90K36N60J70m03m95M4N24L47k71
$$ 131 -386 -428 51 453 281 -256 -488 -114 412 400 -108 -498 -262 298 468 65 -430 -386 138 485 214
3924B14n36j42M41M66q3n35l21K93N48J10m71m63J29N58K97l47n55n8M84M43j67
$$ 214 -322 -464 -23 443 360 -175 -496 -203 345 455 -16 -479 -350 208 505 158 -397 -455 29 472 305
3945C05n63k49L75N25L7n18m17K01N88K21m13n37L0N42L82k50n90j62M36N13m9
$$ 305 -258 -507 -132 393 430 -88 -505 -304 284 505 92 -445 -415 127 509 259 -331 -493 -57 456 407
3966D07n67l55K84N84J39m73m86R2N82L13l25n82j05N10M80j53n89k96L83N78
$$ 407 -160 -515 -231 353 492 19 -467 -375 207 520 195 -387 -492 18 498 345 -244 -540 -157 421
3986D21M2n33m60J96O02K42m08n58j0N68M26k51o02j96M38N43l4n65l96K85N97
$$ 421 463 -70 -530 -334 268 510 102 -456 -466 102 528 277 -325 -521 -83 460 426 -139 -535 -250 347
4007C47J63m69n35J02N80L48l17n84j26M91M94j25n98l04L59N68Q8n23m65J64
$$ 347 510 41 -494 -392 188 536 219 -365 -491 0 494 369 -229 -533 -174 394 482 -41 -506 -342
4027c42N81K72l75n66l3N41M26j98o00k46M17N52jn49m08K35O03K14m54n45N1
$$ -342 239 511 136 -430 -463 78 504 306 -294 -540 -123 429 428 -121 -529 -294 309 523 69 -476 -425
4048d25N77L81k95n92j63M89N12j01n80l45L36N88J15n23m85J30O10L07l73n90
$$ -425 152 533 238 -354 -517 -28 484 383 -197 -542 -206 382 497 -26 -511 -381 229 536 163 -427
4068d27o9N52M66j96o05k73M28N74Jn68m29K38O09K27m53n56M7N77L96k70o22
$$ -427 -496 56 522 326 -279 -552 -124 450 451 -117 -546 -308 301 528 75 -481 -434 143 539 269 -353
4089c53j72M70N56j01n98l54L27O11J22n20m87J30N97L16l77n79q9N43M79j81
$$ -353 -525 -55 501 400 -198 -552 -225 386 508 -12 -499 -369 228 544 167 -412 -501 42 521 340
4109C40o14k82M09N79L2n70m55K47O13K29m49n42QN71M03k45o22j77M51N48m7
$$ 340 -274 -556 -147 432 464 -106 -561 -314 299 528 79 -463 -455 116 519 274 -348 -525 -74 474 427
4130D27n92l96L10O22J52n03n34J11O19L40l58o02r7N23N00j48o05l17L66O11
$$ 427 -165 -561 -251 371 523 20 -514 -403 216 556 198 -404 -501 22 522 374 -231 -548 -182 429
4150D29N8n53m94K09O32K70m43n94lO03M35k63o22k17M63N61l4n87m17K85O43
$$ 429 487 -66 -560 -351 281 551 108 -486 -489 114 549 286 -336 -553 -90 471 437 -150 -567 -282 361
4171C61J88n01n63R2O25L74l45o43j18N32N17j39o12l25L80N90R2n45m98J59O35
$$ 361 549 48 -515 -423 202 576 231 -412 -530 2 519 380 -232 -557 -177 413 505 -40 -538 -379 256
4192B56L10m11o09n3N85M55k24o30k43M55N78l5n67m25K65O03K22m69n58M8N96
$$ 256 566 155 -454 -507 78 533 309 -321 -564 -109 469 434 -133 -558 -293 310 532 63 -495 -447 149
4213A49M16l06o32j69N23N43j09o11l65L64N96J08n20n17J51O12L16l66o11p8
$$ 149 565 259 -373 -542 -19 524 415 -196 -561 -197 399 507 -13 -530 -379 233 549 183 -428 -506
4233e06N51M88j88o35k85M37N98J6n84m48K51O31K23m73n61L5N87M15k75o26j96
$$ -506 45 533 345 -290 -575 -138 460 476 -108 -556 -305 326 549 76 -485 -450 137 552 277 -349 -545
4254e45M90N56p3o30l66L29O42J38n45n23J55O08L28l78o13p9N53M91j77o25k95
$$ -545 -55 501 428 -202 -568 -239 403 541 -4 -527 -372 236 564 186 -427 -506 47 538 361 -264 -559
4275e59M10O10L1n86m70K26O56K49m71n91J9O09M31k79o25k12M81N69o8o09l97
$$ -559 -149 461 492 -94 -564 -338 318 567 96 -495 -476 133 564 285 -340 -552 -71 498 430 -179 -576
4296e76L18O37J55n08n64J26O34L59l70o23r8N56M87j58o30l20M12O01O4n60m83
$$ -576 -258 379 534 26 -538 -412 222 581 211 -412 -510 46 533 375 -255 -575 -163 438 502 -58 -541
4317e41J86O61K71m47o14pN98M59k64o55k17M77N81m9o10m12L16O32J91n07n66
$$ -541 -355 306 577 130 -484 -491 107 566 302 -353 -570 -93 488 439 -171 -583 -267 365 556 49 -517
4338e17P6O36L89l52o42j35N57N42j56o46l43M02O38P1n59n12J85O54K83m10o25
$$ -517 -441 195 584 232 -410 -545 12 554 398 -248 -591 -189 449 520 -39 -551 -366 288 571 161 -464
4359d64m5O03M77k32o71k55M87N89j5o26m43K98O56K05n16n67N9O40M00l27o45
$$ -464 -509 94 571 339 -332 -587 -100 489 474 -152 -595 -297 359 564 48 -519 -460 180 580 253 -392
4380c92j61N34N58j31o44l56L89O49R1n75n19J86O53L00m17o25m2N85M93k25o55
$$ -392 -553 -19 539 408 -236 -592 -203 446 537 -38 -557 -371 282 582 165 -460 -502 83 576 351 -304
4401c04k72M58O15j1o13m66K83O63K13n01n97P0O40L92l16o53j51N24N51j12o46
$$ -304 -576 -118 497 486 -127 -593 -310 353 566 65 -532 -462 178 570 254 -399 -550 -26 525 413 -233
4422b33l65L67O44J17n62n24J61O59L24m17o27n6N90M88k10o62k73M43O12J2o20
$$ -233 -598 -231 413 530 -32 -556 -395 264 588 171 -456 -512 78 566 356 -306 -579 -136 476 488 -132
4443a32m53K50O89K18m98o09N7O46M17l24o66j79N47N70j03o62l79L74O61J21
$$ -132 -585 -335 354 572 74 -535 -478 168 585 261 -405 -584 -37 533 430 -232 -611 -237 424 545
4463E45n66n49J79O49L39m12o56o0O03N08k27o65k74M66O22jo16m76K70O65K32
$$ 545 -21 -570 -391 258 597 185 -471 -531 72 580 353 -312 -586 -120 502 501 -115 -591 -321 344 576
4484E76m94o07M8O44M22l13o68j92N41N79j05o48l85L63O52J39n75n53J56O79
$$ 576 82 -525 -477 167 589 276 -392 -584 -43 536 431 -217 -602 -239 413 552 -23 -576 -420 259
4504B59L38m07o60p5O00N21k16o71k86M58O33K7o32m98K75O78K55n07o16L1O48
$$ 259 597 190 -470 -545 55 576 360 -311 -597 -139 494 521 -111 -609 -334 344 599 92 -524 -493 155
4525A55M51l15o83j95N31N97r4o49m16L73O69J32n66n71J49O68L64m09o52r6N99
$$ 155 606 291 -392 -587 -56 541 447 -202 -618 -245 424 556 -10 -581 -432 236 600 191 -461 -557 42
4546D2N37k09o73l02M50O55K4o28m90K53O90K53n00o32L4O49M55l04o88k15N43
$$ 42 579 370 -303 -605 -155 500 524 -104 -594 -341 349 602 102 -530 -496 153 608 304 -384 -599 -56
4567e6O03r6o75l92L63O77J28n59n77J53O80L59m04o58r9N93N34j95o94l03M50
$$ -56 547 451 -224 -616 -253 424 552 -7 -584 -431 249 608 204 -454 -553 40 574 379 -315 -618 -168
4588a68O45L1o09m93K47O86K51m92o10J8O35M59k91o86k12N18O06o2o70m07L48
$$ -168 477 508 -101 -594 -347 339 590 98 -512 -494 141 600 309 -377 -589 -71 535 473 -197 -604 -256
4609b56O64J64n64n73J38O57L70l98o58j10N92N53j78o83l38M39O66M7o33n04
$$ -256 408 572 8 -565 -427 230 600 202 -456 -566 26 579 401 -282 -620 -181 485 532 -101 -605
4629f05K43O93K62m79o35J5O41M59k77o79k37N28O04o1o64m32L54O76J59n50n68
$$ -605 -362 331 593 114 -521 -506 135 594 317 -362 -599 -71 533 472 -192 -624 -270 406 565 15 -553
4650e53J17O73L72l90o70j04N86N43j80o77l26M20O58N4o08n20K34O86K81m79
$$ -553 -436 237 609 219 -451 -555 31 574 394 -283 -609 -189 469 523 -85 -605 -371 315 596 117
4670A17o48K1O42M72k98o75k17N14O05p3o42m21L28O63J90n53n82J13O78L90m04
$$ 117 -531 -510 132 604 306 -369 -586 -72 533 460 -182 -603 -275 388 578 25 -557 -444 234 624 220
4691B20o67j13N89N42j73o72l26M16O42O9o05n13K02O97K80m61o29j8O25M83k62
$$ 220 -447 -560 29 571 398 -274 -600 -184 458 527 -78 -591 -389 308 588 127 -502 -520 105 588 326
4712C26o96k36N11O09m3o52m24L22O70J90n43n74R1O67L94l67o78j36N80N63j56
$$ 326 -370 -606 -95 514 471 -181 -605 -283 387 577 34 -540 -449 218 612 245 -433 -569 11 574 418
4733D18o93l46M25O65P8o24n13K12O83L02m57o56j3O26M88k69o80k57N10O30n6
$$ 418 -275 -621 -196 469 547 -77 -590 -378 305 607 150 -506 -519 107 595 326 -354 -611 -101 529 473
4754D73o36m61L16O92J88n41n83J04O51M03l55o58j38N49N64j47o57l62L99O52
$$ 473 -163 -624 -308 384 572 31 -552 -448 203 606 251 -407 -545 4 568 421 -236 -598 -199 453
4774D53Q8o00n25K17O63L01m43o33k6O06M77k53o68k44M74O12j7o39m63L05O94
$$ 453 541 -59 -584 -367 296 597 154 -479 -505 101 578 325 -343 -587 -113 499 482 -157 -620 -315 379
4795C79J92n15o08R3O50M10l52o70j39N49N58j19o61l74M05O45J04n82n43J86
$$ 379 571 56 -552 -459 191 601 249 -421 -560 -11 547 428 -233 -607 -202 443 547 -35 -578 -392
4815c92O82L14m39o40n0O26M84k50o68k53M75O07lo33m67K90O68K15n13n99O8
$$ -392 290 604 165 -475 -525 101 585 335 -333 -586 -111 496 493 -140 -607 -317 351 566 53 -546 -478
4836d78O59M22l55o63j59N56N74j27o71l62L94O48R8n72n48J86O79L28m28o56
$$ -478 181 603 248 -415 -574 -18 556 429 -242 -604 -210 438 536 -36 -584 -398 281 609 181 -475
4856d75p1O32N14k40o86k85M88O24no32m60K78O75K32n15o04M5O48M26l13o78
$$ -475 -546 86 600 360 -326 -611 -123 501 496 -136 -596 -318 357 589 74 -530 -485 163 589 276 -402
4877d02j74N37N82j02o59l89L85O52J12n57n50J64O62L43m14o48p6N98N22k00
$$ -402 -576 -39 543 441 -218 -607 -222 430 542 -15 -565 -401 261 604 190 -458 -534 64 586 386
4897C86o87k99M66O23L6o33m98K73O79K41m93o12L4O43M42l15o74k00N30O05q6
$$ 386 -301 -600 -134 489 525 -108 -606 -333 346 587 94 -518 -484 159 601 286 -388 -588 -58 547 461
4918D61o79l92L59O76J39n76n62J53O66L58m06o39r5N80N29j94o52l09M25O39
$$ 461 -218 -610 -251 425 564 -12 -574 -421 245 603 197 -442 -537 43 572 378 -274 -583 -158 481
4938D81K9o05m85K44O68K64m85o23K5O38M48l09o66k05N11N97p3o48m19L46O72
$$ 481 510 -95 -580 -336 332 596 111 -512 -487 151 599 290 -376 -581 -70 527 454 -194 -613 -267 405
4959D05J54n68n63J46O67L54l90o57r5N92N36j95o63l28M44O39L0o03m99K46O79
$$ 405 559 -9 -572 -426 241 595 205 -452 -547 45 581 386 -277 -605 -161 478 508 -95 -594 -348 331
4980C31K67m75o22J7O30M59l01o71k16N10O04q5o39m12L39O61J74n49n74J16O60
$$ 331 598 123 -499 -482 148 607 306 -365 -581 -71 533 448 -191 -603 -264 397 571 22 -552 -436 224
5001B24L67l76o61j19N86N36j61o75l32M31O53N1o02n10K37O77K83m79o29KO27
$$ 224 591 215 -446 -565 21 557 396 -279 -611 -180 473 524 -78 -588 -351 326 609 130 -499 -497 130
5022A30M75k83o79k33N19O11o4o41m37L30O83J73n56n96J29O70L84l83o72j13
$$ 130 605 322 -357 -590 -71 540 476 -165 -602 -272 411 584 28 -568 -439 231 615 232 -440 -553
5042e53N62N52j58o71l38M16O56O2n93n19K11O82K83m49o32j6O28M71k62o80k26
$$ -553 9 561 403 -268 -606 -190 466 528 -65 -584 -373 309 592 143 -489 -505 123 594 332 -348 -574
5063e74M88O05l8o52m26L19O64J89n36n85R7O61L96l69o70j35N67N72j70o78l35
$$ -574 -86 519 481 -171 -597 -278 386 575 39 -546 -449 212 608 239 -431 -566 1 573 403 -275 -610
5084f10M11O61P5o09n18J96O88L06m64o34k5O27M76k50o76k44M88O30m5o49m35
$$ -610 -199 462 537 -72 -590 -394 294 600 136 -498 -523 104 580 330 -346 -590 -102 528 483 -166 -601
5105f01L14O68J86n15n88Q9O51M03l53o61j61N70N63j51o72l45L92O62Q1o00n28
$$ -601 -287 381 567 52 -536 -447 204 607 254 -407 -568 2 565 414 -258 -603 -211 451 532 -68 -596
5126e96K19O80K95m39o64j3O14M92k65o74k52M96O21k1o65m35L17O77J91n36n90
$$ -596 -377 303 598 159 -505 -518 96 588 323 -351 -603 -107 514 493 -172 -607 -290 387 578 42 -548
5147e48R6O60M16l78o78j36N79N54j41o66l67M04O63P4n89n28J90O80L08m56o33
$$ -548 -452 208 624 246 -432 -568 11 565 424 -242 -609 -205 458 532 -57 -585 -395 285 593 137 -496
5168d96k6O13M88k47o71k56M74O19j6o40m45K98O76K06n32n89R2O60M14l68o84
$$ -496 -522 91 579 332 -339 -595 -121 498 482 -158 -603 -305 371 577 45 -544 -452 208 622 254 -430
5189d30j33N79N57j42o83l56M02O69R1o09n32J96O90L17m65o49l5O26N07k58o95
$$ -430 -563 16 573 431 -252 -608 -206 463 554 -55 -587 -391 299 616 151 -498 -533 93 600 342 -353
5210c53k50M95O22k7o40m49K83O84K17n18o14Q8O55M14l60o75j44N71N57j37o65
$$ -353 -603 -108 514 487 -153 -602 -319 365 582 64 -550 -462 193 607 247 -428 -572 -1 556 419 -246
5231b46l46L92O56R1n95n26J85O82L15m38o49m1O06N17k51o94k72N07O12j7o33
$$ -246 -592 -200 456 547 -48 -574 -389 293 608 170 -479 -520 86 603 352 -342 -614 -107 505 488 -145
5252a45m60K99O71K14n26n89P6O46M20l45o82j61N64N69j39o54l60L99O56R6n92
$$ -145 -605 -306 365 579 53 -536 -460 186 606 261 -421 -582 -18 551 412 -242 -602 -203 453 549 -43
5273d3n20J83O70L02m23o26m8N92M96k29o71k71M70O27k3o29m47K85O70K18n32
$$ -43 -563 -380 290 592 169 -457 -505 87 583 354 -317 -588 -118 509 486 -143 -590 -305 365 583 51
5294E1n92P1O55M13l45o56j58N37N67j16o60l69L84O56J01n90n34J90O76L16m54
$$ 51 -541 -470 185 598 253 -403 -561 -24 543 427 -233 -602 -218 438 539 -51 -585 -395 281 597 143
5315A43o29k7N99N02k37o75k62M69O19j0o19m62K90O66K02n07n82P9O23L87l17
$$ 143 -486 -513 86 588 351 -324 -586 -117 502 492 -127 -589 -299 367 569 62 -520 -441 182 569 252
5336B52o60j52N44N40j23o35l53L77O23J13n53n22J56O71L07m15o35n0N92M97
$$ 252 -408 -560 -16 524 401 -234 -587 -210 413 526 -27 -549 -393 278 585 170 -465 -515 77 574
5356E74k30o68k50M59O09oo19m59K81O58K26n04n96N8O37M29l38o59j69N52N60
$$ 574 344 -324 -574 -115 494 488 -131 -590 -309 349 575 71 -525 -467 170 599 261 -398 -567 -15 545
5377E45j27o52l64L80O32J02n57n20J65O51L19m04o22o0N75M95k18o50k63M56
$$ 545 418 -234 -598 -218 414 516 -41 -561 -396 255 574 170 -452 -512 63 558 340 -310 -573 -117
5397a17N96Rn97m45K39O60K25m80n83M5O14M12l19o38j78N24N57j04o33l71L67
$$ -117 479 488 -109 -554 -315 345 570 90 -493 -448 166 578 259 -379 -557 -33 524 420 -213 -584 -217
5418b17O28J13n49n27J68O36L15l97o27o5N80M89j96o45k74M33O06Po00m42K61
$$ -217 411 524 -25 -552 -384 252 567 170 -457 -522 58 547 351 -294 -568 -135 471 478 -122 -564 -303
5439c03O39K10m61n68L9N99M05k91o23j72M87N49r4o08l63L23O17J34n14n22J35
$$ -303 336 546 85 -483 -444 155 560 269 -354 -526 -39 510 416 -192 -555 -232 385 519 5 -517 -382
5460c82O21L06l82n94p0N41M87j99o10k74M18N86K1n88m43K47O39K21m63n65L0
$$ -382 239 545 163 -431 -501 40 527 328 -282 -556 -138 448 469 -119 -562 -315 324 545 82 -483 -453
5481d53O01M08k92o24j75M96N46r6n99l58L26O13J23n11n30J44O13L15l61o09
$$ -453 148 556 264 -360 -535 -39 507 411 -188 -546 -220 393 516 5 -525 -381 232 547 186 -423
5501d23p0N42M77j79o18k75M12N69J0n40m46K34N97K35m40n52K7N79L92k74n88
$$ -423 -493 49 526 347 -271 -546 -134 435 445 -95 -541 -307 290 525 85 -467 -440 139 531 257 -331
5522c31j87M65N42q8n83l63L20N95J37n02n18J27O08L27l60o05p8N45M79j82o21
$$ -331 -518 -53 489 401 -182 -545 -225 370 507 5 -513 -386 222 549 189 -416 -494 51 530 348 -273
5543b73k70L88N95K3n57m34K09O07K33m31n58J8N61L99k49n93j86M53N35n7n77
$$ -273 -543 -155 440 463 -94 -528 -319 288 521 90 -468 -450 111 510 261 -332 -518 -65 470 413 -164
5564a64l65L01N82J38m76m90Q8N94L12l32n62j03N13M70j61n99k84L91N70L3n37
$$ -164 -529 -228 354 492 16 -474 -386 208 520 188 -374 -477 36 506 345 -254 -538 -147 423 456 -81
5585h1m49K04O05K45m19n63RN72L97k53n97j90M49N34n5n74l79L13N82J51m83
$$ -81 -530 -326 279 524 105 -458 -449 123 520 267 -330 -520 -71 463 408 -166 -545 -232 350 501 18
5606A8n08J04N90L22l31n77j02N06M77j45n82k88L66N41O0n02m49J73N82K44l87
$$ 18 -490 -386 204 526 195 -382 -484 22 499 354 -228 -516 -150 391 451 -51 -500 -327 255 499 112
5627A12n36k1N35M05k27n73j99M18N21k6n60l71K74N81J52m55n03Q0N74L33l08
$$ 112 -424 -445 90 495 268 -305 -504 -86 435 409 -151 -522 -248 333 485 30 -473 -393 181 514 206
5648B06n77j06M81M90j38n79k99L56N77M9n17m40J74N76K63l96n38j9N32M10k30
$$ 206 -371 -477 4 494 356 -223 -522 -166 411 460 -57 -497 -323 253 516 120 -418 -437 95 505 275
5669B75n61k24M15N21l2n39l67K57N63J62m38m96P8N60L20k98n55j16M70M68j13
$$ 275 -286 -510 -95 426 394 -145 -512 -255 308 470 32 -464 -386 174 494 196 -359 -475 -5 463 350
5690C50n63k94L32N72O1m99m41J58N83K49l82n46pN17M20k24n77k13M25N25l0
$$ 350 -213 -507 -175 397 458 -41 -482 -324 259 508 126 -420 -427 90 510 286 -291 -504 -79 446 416
5711D16n50l86K62N85J67m53n07P5N57L35k90n79j10M71M69j16n61l01L40N40
$$ 416 -134 -520 -258 327 494 41 -466 -391 166 501 211 -368 -478 -7 462 346 -215 -516 -176 364
5731C64P6m74m41J54N65K56l54n26n1N15M05k05n60k14L93N08jn29l63K35N44
$$ 364 440 -34 -475 -321 244 500 146 -380 -431 84 489 284 -276 -490 -97 411 410 -119 -482 -247 297
5752B97J80m28n09O3N52L51k88n78j21M73M82j19n66l08L43N54P6n01m66J73N79
$$ 297 477 49 -460 -397 155 506 218 -360 -481 -8 474 355 -211 -519 -176 378 454 -47 -513 -340 239
5773B39K53l71n27l7N14M20j97n69k36M14N29k4n19l80K47N51J75m15n01O0N21
$$ 239 492 121 -406 -443 71 491 294 -275 -511 -97 432 408 -111 -491 -244 307 482 67 -434 -374 147
5794A47L44k73n61j16M31M69q3n46l15L14N39J02m76m49J50N42K77l64n20n2M92
$$ 147 491 218 -343 -459 -28 441 358 -188 -503 -189 350 452 -24 -473 -323 219 496 132 -388 -440 52
5815E2M24j83n59k34L91N29Jn21l97K47N51J83m28m95O4N30L39k67n52j38M40
$$ 52 476 293 -266 -500 -109 420 421 -100 -497 -250 301 484 56 -439 -375 155 494 227 -325 -463 -23
5836b3M73r3n29l18L04N32R8m66m37J27N40K70l42n11n0M76M04j71n22k35L67
$$ -23 450 357 -172 -490 -186 346 444 -22 -459 -332 208 478 136 -375 -425 51 455 284 -238 -473 -106
5857a06M98J0m88l94K17N55J82m01m95M1N29L45k64n63j30M51M65j01n43l05K96
$$ -106 392 402 -86 -480 -263 292 474 73 -422 -381 148 493 229 -334 -464 -13 452 351 -192 -497 -201
5878b01N59R5m70m60J48N49K82l64n34m8M93M22j80n55k29L92M90J2n04l70K12
$$ -201 358 453 -17 -477 -329 220 502 138 -396 -444 49 471 291 -264 -493 -101 389 401 -103 -473 -261
5899b61N31J99l99m86L8N10L49k45n31j53M27M56q3n17l11L01N18Q9m38m37J15
$$ -261 270 469 70 -416 -378 132 481 236 -295 -448 -21 435 352 -165 -476 -175 343 432 -6 -443 -328
5920c28N25K76l08n36o5M86M13j65n49k31L66N06%m98l71K01N55K10m17m92M0
$$ -328 197 473 165 -371 -436 50 463 298 -251 -482 -116 390 390 -108 -479 -278 277 487 70 -422 -382
5941c82N10L50k56n36j57M42M58o6n19l18K76N42R5m42m32J14N24K65l10n16o1
$$ -382 128 478 222 -314 -471 -29 429 363 -156 -474 -198 344 439 -3 -435 -321 203 468 158 -358 -419
5962d19M50M09j43n22k44L39M98K8m85l78J84N43J83l68m78J8N00L48k37n29j47
$$ -419 31 440 297 -225 -469 -130 368 396 -89 -467 -283 260 443 75 -403 -385 115 463 226 -303 -450
5983d50M09M54n6n14l22K89N18J07m36m47J23N28K75l23n14n1M56M09j47n35k48
$$ -450 -41 413 357 -157 -479 -190 328 435 -1 -448 -325 203 478 155 -359 -410 46 455 308 -227 -475
6004d75L57M88K6m58l81J86N01J98l56m73JM91L34k09n03j67L76M46l6m88l13
$$ -475 -118 370 396 -62 -443 -257 244 442 86 -387 -386 105 439 230 -273 -440 -64 382 346 -142 -455
6025d55K54M99J23m07m25R0M92K77k93m84r1M49M10j37n05k46L39M70L9m60l94
$$ -455 -201 298 421 14 -411 -321 171 448 155 -329 -420 29 439 302 -203 -449 -110 360 399 -61 -455
6046d55J97N06K05l59m83J3M85L43k25n13j61L81M61n4m85l26K70M95J30m02m37
$$ -455 -258 248 453 94 -389 -376 109 452 227 -286 -447 -66 395 341 -144 -470 -200 295 425 23 -414
6067d14J00M80K79k78m84p6M11L99j10m97k51L12M60O0m34l82J62M85K13l39m62
$$ -414 -314 166 445 167 -317 -393 18 417 307 -190 -441 -129 331 391 -43 -425 -263 222 435 96 -366
6088c66JM53L32j92m94j65L70M48m1m69l17K43M90J21l89m36O6M93K80k61n00
$$ -366 -365 88 420 228 -266 -431 -61 387 346 -123 -440 -197 293 414 25 -411 -345 148 428 167 -333
6109c33q9M34M02j22m80k53L11M61P2m49l68J46M85K25l26m57l1M52L39j81m82
$$ -333 -422 12 414 292 -188 -441 -130 331 403 -46 -414 -268 217 442 116 -341 -372 80 419 238 -244
6130b44j80L41M44l0m33l30K16M76J43l60m28O1M49K91k30m75j27M06L96p6m84
$$ -244 -424 -83 361 331 -102 -432 -216 260 403 43 -385 -324 125 416 186 -289 -416 -10 386 310 -174
6151a74k56K80M67Q0m33l60J29M84K12l07m59l0M45L54j76m91j91L60M36j1m60
$$ -174 -430 -150 317 397 -36 -396 -267 217 429 122 -337 -367 78 432 256 -235 -426 -66 370 359 -101
6172a01l22K16M66J57l63m30M6M62K81k23m77j10L79L95q1m49k77K75M56P4l94
$$ -101 -423 -207 259 416 53 -377 -331 131 412 189 -288 -398 -19 376 295 -154 -431 -156 300 374 -20
6193b0l75J18M60K35k96m33m3M05L52j41m74j90L06M28J6m31l19J80M65J66l47
$$ -20 -395 -277 183 418 122 -311 -354 51 403 262 -212 -402 -96 332 348 -83 -402 -222 243 409 62
6214F2m28L4M60K86k19m82j18L70M09o9m70k59K52M60R3l90l97J05M75K45k85
$$ 62 -366 -332 128 414 195 -287 -405 -35 374 305 -165 -424 -172 288 381 -9 -406 -301 174 419 134
6235A34m63l7M00L59j30m62k00L00M26K1m08l27J63M39J78l21m22J4M24L05j90
$$ 134 -329 -366 34 393 263 -199 -399 -99 327 348 -60 -387 -224 215 393 72 -350 -336 88 393 203
6256B03m54j31L41L96m8m41k81K39M56R5l77l78Q4M56K51k79m33o4M03L52j34
$$ 203 -251 -382 -41 355 307 -134 -415 -176 280 375 -2 -380 -296 160 411 132 -301 -365 38 390 256
6277B56m61k10L10M23K9m22l25J70M50J81l14m19lM29K97j82m55j46L44M06m2
$$ 256 -205 -415 -105 318 347 -75 -400 -230 220 401 87 -332 -335 94 391 209 -246 -392 -48 358 316
6298C16m45k71K16M36J18l50l80O0M25K61k39m30q8L74L60j02m37k25K73M37M5
$$ 316 -129 -400 -184 252 370 20 -360 -300 125 386 147 -283 -371 3 363 261 -176 -401 -128 309 354
6319C54l99l49J43M63J76k98m23jM06L31j74m64j50L36M05l1m29k99K05M67J26
$$ 354 -45 -394 -251 212 388 90 -333 -334 72 403 229 -235 -385 -49 356 325 -104 -403 -198 269 395
6340C95l72l94P6M42K49k41m46q6L76L70j06m44k27K66M36N4l88l50J37M46J98
$$ 395 23 -371 -295 147 396 155 -291 -377 -1 369 263 -181 -408 -142 294 348 -40 -390 -253 193 391
6361C91k91m19j4L95L05j51m30j69L09M04j6m01l01J88M40J36l34m01O2M26K60
$$ 391 100 -319 -333 62 367 216 -214 -383 -74 330 314 -87 -388 -200 240 376 42 -359 -297 129 389
6382C89k35m34q1L62L81j19m40k23K55M33N3l84l52J27M60K04k95m37j8M23L05
$$ 389 154 -280 -361 1 382 263 -177 -400 -145 288 341 -43 -395 -268 192 396 101 -336 -354 69 374
6403C74j54m45j76L28M02j2m14k78J76M35J41l32l85L6M20K72k06m41j02L35L85
$$ 374 220 -225 -401 -73 329 317 -97 -375 -199 236 377 45 -340 -304 116 388 182 -259 -361 -26 359
6424C59q1m19k36K41M09O9l62l42J11M27K08k70m26l5L92L33j49m47j66K99M10
$$ 359 278 -141 -377 -136 273 342 -20 -362 -251 176 384 114 -312 -347 45 378 229 -218 -384 -85 325
6445C25pm07l05J81M50J46l33l99N2M15K80k20m27j11L46L77o9m34k52K51M24
$$ 325 318 -89 -394 -213 237 383 50 -349 -297 118 398 178 -249 -360 -14 363 294 -140 -392 -141 283
6466B83Q1l85l45R4M51K02k58m15m8L83L31j49m23j88K99L91K4m01l14J77M31
$$ 283 364 -21 -366 -272 179 381 123 -292 -340 43 374 225 -198 -386 -87 304 328 -73 -387 -210 221
6487B21J51l08l91K1M08K85k12m14j35L45L79o7m17k45K32M24Q1l60l59R6M49
$$ 221 372 64 -327 -306 102 387 175 -239 -374 -29 350 283 -134 -379 -147 277 358 -2 -361 -265 184
6508A84K08k68m25m8L95L33j45m31j83K94L92J4l99l04J70M26J52l04l86K2L91
$$ 184 392 124 -301 -349 46 379 234 -197 -380 -86 306 320 -79 -383 -213 213 365 61 -325 -303 88
6529H8K86j78m32j35L37L81n4m10k60K25M13R3l47l60Q4M28K25k50m18n5L73L25
$$ 88 374 196 -236 -371 -34 347 293 -117 -377 -152 261 354 7 -353 -269 159 384 134 -284 -339 34 359
6551C59j20m24j90K77M16Ml85l22J72M33J42k95m08J7M17K83k02m22j31L43L71
$$ 359 239 -185 -375 -98 318 322 -63 -385 -213 220 362 67 -341 -324 93 376 174 -248 -379 -36 335
6572C35n0m07k64K27M31Q1l50l47P8M22K22k38m11o3L63L27j07m20j97K73L86
$$ 335 285 -122 -386 -159 272 353 3 -344 -266 156 378 140 -271 -334 29 356 249 -171 -368 -95 291
6593B91L4l64l31J48M20J58k96l75JM04K74j67m29j33L11L77m2m12k58K16M27
$$ 291 325 -39 -370 -222 198 356 60 -315 -314 90 364 197 -232 -365 -54 323 281 -131 -389 -173 254
6614B54R7l43l65P8M24K38k48m22n0L57L40j21m19j99K82L97L6l80l22J52M25
$$ 254 351 8 -357 -279 145 383 135 -287 -337 20 360 239 -180 -379 -97 300 336 -44 -366 -214 211
6635B11J54k89l91kL94K92j84m18j30L15L60l4l79k76J97M12R6l11l63P2L96K39
$$ 211 365 76 -315 -317 77 369 185 -233 -363 -48 312 278 -101 -377 -180 232 328 17 -346 -274 122 361
6657C61k27m02p4L55L25r8m00k13K64L97L0l69l10J42M19J74k94l87LL86K84j67
$$ 361 134 -268 -342 13 338 240 -160 -373 -109 288 318 -51 -361 -219 200 374 80 -307 -304 82 366 199
6679A99m16j47L17L51j7m00k68K13M00J07l34l51O9M01K39k33l88q9L43L23q4
$$ 199 -217 -364 -47 304 287 -113 -381 -168 232 339 5 -346 -277 124 363 130 -258 -347 -4 319 235
6700B35l85k16K43L97M5l49l13J22M08J59k61l68k5L74K79j41l97j51K96L64k4
$$ 235 -150 -366 -123 274 319 -30 -343 -221 187 346 85 -283 -308 66 345 204 -193 -344 -48 316 292
6721B92l93k68K01L89J26l28l62O1M06K26k19l99p5L42L21p7m06k13K63L87M7
$$ 292 -101 -369 -168 221 347 19 -343 -282 124 350 131 -268 -343 -1 320 243 -163 -376 -113 274 321
6742C21l57l26J37L98J77k58l86oL59K81j28m15j44K83L65j9l56k71J60L97J15
$$ 321 -36 -362 -225 173 350 92 -294 -300 59 340 212 -203 -347 -64 301 282 -74 -345 -185 212 327
6763C27k89l47M4L70K41j89m10p4L10L22o1l92k03K14L89N9l42l16J03M08J80
$$ 327 38 -309 -265 105 346 157 -253 -327 -17 305 244 -148 -351 -137 252 311 -31 -347 -244 164 344
6784C44k46l95j6L65L00j55l97j53K85L67j4l60k78J80L91J19k83l59M2L74K42
$$ 344 98 -297 -313 52 352 197 -200 -353 -68 299 285 -75 -353 -173 218 337 54 -305 -263 111 353
6805C53j90l94r9L13L37p0l94k21K31L63R0l36l05R1L74J96k35l67l7L35K97j25
$$ 353 163 -231 -330 -17 320 250 -144 -365 -134 229 319 -17 -322 -231 143 339 104 -263 -300 35 332 207
6827B07l83j62K62L54Pl55k66J62L81J37k91l49L5L68K41j84l80j06L16L32o9
$$ 207 -176 -338 -76 278 285 -70 -336 -174 207 344 53 -296 -261 107 348 164 -216 -322 -6 326 257
6848B57l80k22K11L77P2l35l02Q6L80J85k30l76l0L43K95j31l66j74K47L66J3
$$ 257 -123 -345 -134 243 315 -20 -322 -236 144 329 99 -277 -307 36 331 200 -166 -340 -93 273 286
6869B86l45k76J55L66J52k84l46K2L55K49j62l79j02K76L26m3l50k22J89L57R2
$$ 286 -59 -335 -180 186 338 54 -292 -270 85 334 172 -207 -309 -33 293 250 -100 -322 -133 224 316
6890C16l11l18P8L84J93k40l56m6L25K90r8l93j67K58L45K6l46k69J41L84J42
$$ 316 5 -313 -235 149 342 102 -254 -300 25 315 217 -176 -343 -85 260 286 -60 -329 -188 196 338
6911C38k84l34KL67K49j70l67j14K88L30l7l68k18J85L74P4k98l07N5L64J97j99
$$ 338 54 -280 -278 89 338 168 -199 -313 -25 305 268 -100 -318 -133 241 315 17 -290 -235 129 326 127
6933A27l61o8L26L03j03l70j77K35L41M0l36k88J35L68J60k64l38oL48K58j69
$$ 127 -234 -302 24 327 224 -146 -323 -88 253 293 -43 -331 -196 172 332 68 -270 -276 72 330 161
6954A61l61j21K75L41l5l63k30J97L68Q7k94l26O7L68J99k05l66o0L10L08r5l71
$$ 161 -200 -321 -46 295 260 -103 -333 -136 232 319 25 -301 -234 134 333 128 -238 -298 12 320 225 -146
6976a46j87K28L62L4l26k86J12L71J61k50l43rL36K65j35l85j25K60L43l1l34
$$ -146 -333 -105 257 291 -35 -321 -209 162 323 73 -270 -279 57 322 187 -198 -323 -63 280 249 -85
6997h5k42J67L81R9k94l21N0L79K01j98l63p3L21K97r1l63j98K27L63L6l34k79
$$ -85 -327 -160 221 320 26 -295 -245 134 335 137 -226 -299 22 319 228 -135 -333 -106 257 293 -41 -320
7019c20J25L65J64k52l44l1L37K69j38l79j31K83L37k4l46k45J72L70R7k74l14
$$ -320 -195 170 334 82 -262 -293 44 313 175 -204 -335 -52 285 261 -85 -330 -158 212 309 35 -279
7040b79L4L53K21j92l51p9L07K92q5l37j96K07L48N5l23k80J06L57J72k42l51
$$ -279 -245 108 329 137 -214 -293 14 306 221 -116 -312 -105 243 298 -25 -305 -199 158 330 88 -263
7061b63k4L42K68j47l54j50K76L39l1l35k58J75L64J15k95l25M7L73K23k03l69
$$ -263 -287 55 323 176 -178 -328 -52 287 256 -79 -337 -162 202 317 22 -303 -256 117 340 137 -232
7082b32p5L07L10p1l62k04K25L52N3l20k88J09L59J77k42l54k1L19K80j25l79
$$ -232 -307 0 310 239 -123 -327 -102 250 303 -17 -305 -196 163 340 98 -256 -277 42 322 197 -182
7103a82j41K60L35j1l39k52J70L56J25k75l30M3L32K36j92l53r7K98L14n9l61
$$ -182 -323 -63 272 261 -78 -330 -160 196 321 46 -284 -241 91 327 135 -218 -315 -17 297 238 -123
7124a23k05K10L61N6l25k88J08L73J70k44l50k6L41K78j31l79j44K55L45j8l43
$$ -123 -328 -118 243 299 -26 -314 -206 167 337 93 -257 -283 58 336 205 -174 -318 -63 282 264 -79
7145g9k44J46L76J23k89l27L9L50K29j79l61q5K81L09m6l64k10K03L50P6k99l07
$$ -79 -323 -177 199 322 33 -294 -255 95 324 145 -216 -301 -20 289 243 -121 -331 -128 222 298 -1 -308
7167c08J02L59J73k27l51l7L24K80j15l67j53K62L37Jl34k67J60L68J12k78l30
$$ -308 -206 153 326 99 -252 -289 35 315 200 -167 -320 -58 279 280 -54 -321 -161 207 319 41 -289
7188b89L0L50K43j87l65j05L02L14o1l51k15K05L61N3l10k79Q7L69J65k13l45
$$ -289 -259 91 334 147 -218 -323 -21 293 232 -119 -334 -129 232 285 -25 -304 -217 152 317 104 -241
7209b41m8L30K75j05l75j51K39L40J8l37k60J46L64J13k53l30K7L43K26j61l63
$$ -241 -289 41 316 211 -164 -315 -76 264 282 -55 -315 -169 195 308 55 -275 -248 95 321 160 -203
7230b03r9K91L05n3l51k07J92L58O9l10l04Q8L64J75k11l57l0L27K76j23l61j57
$$ -203 -302 -11 294 241 -110 -317 -125 233 302 -8 -312 -224 140 315 104 -253 -283 44 320 197 -164 -321
7252c21K53L40Kl23k63J39L62J32k72l22J6L36K44j66l53j17K91L10n0l35k28
$$ -321 -68 272 274 -49 -312 -173 189 321 49 -273 -257 79 323 157 -196 -313 -22 288 238 -97 -325
7273c25J83L50Q5k98k83O3L50J98k35l24m5L07K81j12l59j61K35L47Ql22k54J29
$$ -325 -142 208 293 -5 -288 -225 125 323 88 -236 -281 26 307 195 -164 -325 -90 257 265 -57 -311 -182
7295a82L66J39k64l29J9L38K39j69l55j10K89L15n1l53k11K06L41O4k94k89O9
$$ -182 184 323 59 -270 -251 87 326 157 -198 -308 -19 296 245 -108 -319 -113 228 292 -2 -291 -222
7316b22L55J73k04l37m8L08K72r5l51j55K17L33K6l14k70J27L42J56k45l19kL32
$$ -222 133 306 102 -235 -283 25 297 202 -149 -304 -87 246 272 -42 -312 -185 157 313 68 -251 -253 79
7338G9K38j49l52j14K73L00l1l50j98J63L57P3k80k95P1L42J90k07l51l9L04K65
$$ 79 317 168 -184 -298 -25 275 244 -106 -304 -141 216 289 9 -286 -215 127 317 110 -241 -280 24 289
7360B89r1l45j65K14L36L3l30k43J22L53J42k57l17mL34K45j48l51j10K50L15
$$ 289 198 -147 -312 -98 238 271 -59 -302 -180 173 315 58 -259 -263 71 316 168 -183 -293 -43 272
7381B72k4l30k25J78L38Q2k67k92N0L33J93j82l48n7K81K87p7l42j78K09L33K8
$$ 272 248 -82 -307 -129 209 291 24 -268 -218 115 308 126 -222 -279 2 289 212 -130 -308 -99 234 262
7403B62k89k78J05L47J58k49l11j3L28K40j44l38j15K48L00j3l27k19J69L36R3
$$ 262 -27 -305 -200 147 305 56 -255 -268 60 300 156 -182 -297 -49 251 238 -89 -308 -139 197 290
7424B90k63l01O7L26J92j87l37n4K63K85q0l30j72K18L15M4k99k65J04L34J54
$$ 290 27 -274 -207 119 311 124 -213 -267 -4 281 201 -129 -301 -83 232 276 -23 -288 -184 150 304
7445C04k30l12j9K97K37j14l28j34K42L07j7l03k27J39L43Q8k53k81K8L22K08
$$ 304 74 -238 -257 40 277 163 -165 -299 -57 250 233 -70 -297 -158 185 273 20 -261 -233 89 297
7466B97j67l32p6K87K77q0l23j83K04L16M2k96k49R9L37J31k15l17j4L10K35j17
$$ 297 130 -202 -278 9 286 206 -117 -300 -96 220 262 -34 -283 -184 153 284 69 -248 -262 48 283 166
7488A66l21j51K40L15j6l07k21J38L25J08k44k87J7L18K06j53l35p1K54K84m9
$$ 166 -155 -306 -66 249 233 -74 -295 -157 168 276 32 -255 -238 80 286 133 -202 -273 -19 265 216
7509B16l28j84J86L12O8k71k66O8L24J75k06l20l0K97K42j00l29j39K16L02K2
$$ 216 -112 -296 -110 202 270 -1 -267 -199 125 300 94 -226 -256 41 283 183 -146 -285 -69 233 255
7530B55l19k28J27L32J11k48k86J7L19K00j58l15q7K60K75l8l11k00J63L29O1
$$ 255 -64 -292 -165 167 278 30 -256 -239 80 280 122 -193 -280 -20 255 217 -94 -294 -131 198 259
7551B59k63k60O1L28J71k02l03m7K84K58j03l24j47K13L05Ok74k40J12L27J18
$$ 259 -4 -264 -203 125 296 94 -209 -256 28 286 183 -141 -288 -75 230 236 -38 -278 -166 161 279
7572B79k26k94RK93K05j28l28j01K47K92l3l29j77J72L03R0k68k74O6L13J74j95
$$ 279 53 -241 -232 61 266 138 -190 -291 -44 248 215 -114 -291 -119 184 274 6 -268 -202 111 285 90
7594I0l04m5K83K54q4l18j50J89L14J8k82k45R6L31J30k15l07PK91K18j34l06
$$ 90 -214 -259 24 278 194 -124 -274 -85 229 247 -35 -280 -184 147 277 62 -245 -238 53 271 137 -169
7616a69j07K30K78k1k96k02J39L25R3k57k68M6L02J92j68l12o4K55K65p1l20j50
$$ -169 -276 -46 232 211 -85 -287 -148 177 270 13 -255 -209 93 285 117 -195 -259 -4 261 190 -130 -280
7638b80K01L01K6k68k48R8L15J33k21k85pK95K12j23l17j17K39K78j4l07j96J45
$$ -280 -79 222 248 -20 -268 -170 145 278 57 -228 -235 60 272 149 -168 -285 -46 232 218 -89 -285 -140
7660a40L12R4k50k82N2L00J85j68k94q9K81K52o2l02j71J89L01L5k71k45R4L16
$$ -140 172 266 16 -266 -214 86 271 103 -191 -280 1 253 191 -111 -282 -93 208 243 -28 -273 -179 137
7682A37J28j89l01j5K92K19j10l09j21K16K93k2l02k03J40L14Q2k34k71M0L01
$$ 137 265 76 -225 -240 52 271 161 -148 -269 -53 240 218 -84 -287 -147 167 249 15 -256 -216 85
7703H5J87j57l19o9K56K59o2l01j59J78L08M8k82k31Q8L11J34j92k98k7K82K26
$$ 85 272 115 -204 -273 -17 242 180 -121 -280 -102 206 254 -28 -259 -171 140 274 82 -216 -243 39 265
7725B65j02l11j10J95K96jk93k06J34K99J05k44k68K4K94J97j52l18p0K51K58
$$ 265 163 -148 -258 -63 233 232 -61 -267 -133 166 271 27 -241 -217 77 274 122 -196 -266 -15 243
7746B43n7k90j78J74L09M2k75k43R2L16J41j96l01j7K84K16r8l02j20K14K76o
$$ 243 186 -104 -282 -108 201 243 -32 -275 -183 133 274 78 -223 -240 44 260 162 -140 -260 -46 230 224
7768B24k74k16J25L03J03k28k85K9K93J97j60k95q6K49K56m4k99j71J64L02M9
$$ 224 -50 -266 -141 162 265 37 -248 -219 74 271 111 -184 -270 -21 235 191 -108 -279 -115 187 236
7789B36k55k55P7L12J42j72k95m3K77K27q9l06j25K00K98mk79k04J13L05R5k13
$$ 236 -19 -274 -197 115 257 85 -210 -253 24 251 162 -144 -269 -69 229 225 -54 -258 -145 160 255 42
7811D2k75J7K98J91j53l01o6K33K57n6k88j77J72K94M8k52k50P5L04J46j86k79
$$ 42 -233 -216 82 273 120 -181 -247 -14 243 187 -101 -278 -106 188 236 -16 -266 -191 113 259 73 -206
7833b06l2K49K44q9l11j26K06K88J4k81k23J13L12J10k25k66RK92J95j38k91r8
$$ -206 -238 11 255 166 -145 -271 -65 223 237 -44 -267 -154 158 268 43 -223 -214 78 273 135 -156 -254
7855b54K26K72k9k97j65J51K85N7k52k53P5K91J39j71k96k6K71K23q5k96j30J92
$$ -254 -28 244 215 -82 -247 -96 189 246 -6 -259 -184 107 246 75 -221 -247 24 247 162 -134 -264 -72
7877g2K83J3k70k13J12K99R2k05k55J2K68J99j33k87q7K21K68m2k70j90J46K99
$$ -72 211 224 -46 -259 -147 152 244 39 -216 -204 64 263 130 -157 -244 -23 245 203 -67 -257 -111 188
7899A88O2k44k45N3K99J52j66k91m6K63K22q7k89j41J90K73K6k62k06R4K92J27
$$ 188 250 6 -239 -186 113 265 99 -192 -238 25 247 160 -129 -270 -80 193 219 -43 -249 -155 137 264
7921B64k23k65J6K71J99j22l05p8K09K69l0k71j81J49K83O7k48k23N4K69J62j71
$$ 264 41 -224 -208 63 262 140 -165 -243 -34 235 205 -66 -247 -98 185 252 4 -219 -165 104 266 95
7943I5k90m6K61K28q3k77j37J81K62J0k50j95Q9K82J12j98k61lK77J91j17k88
$$ 95 -195 -241 20 248 165 -112 -249 -68 194 204 -46 -241 -152 130 242 44 -217 -220 57 248 131 -157
7965a57r6K19K51l1k68j72J51K70O8k26k46O6K72J52j58k74m6K36K33p4k74j50
$$ -157 -253 -34 217 186 -82 -254 -103 167 235 9 -237 -171 101 253 95 -179 -225 11 244 170 -104 -254
7987b54J89K67J2k57k12J03K85J03j93k62JK67J86j15k72q3K05K36j3k61j85J32
$$ -254 -65 202 214 -43 -255 -152 133 236 43 -219 -218 49 235 120 -152 -235 -30 206 193 -68 -253 -121
8009a21K82O8k22k35N2K57J57j52k59n0K37K13n9k63j53J75K65J6k41k09Q8K72
$$ -121 161 229 7 -228 -176 81 238 86 -173 -223 14 227 168 -95 -248 -73 192 208 -33 -242 -154 118
8031A18J27j92k55LK40J92j12k70r0J88K44j5k53j64J21K73O7k14k22M2K65J32
$$ 118 245 53 -202 -199 41 233 121 -149 -239 -51 193 178 -75 -239 -118 155 222 8 -214 -172 93 225
8053B25j39k61m4K26K20o8k58j39J70K54L6k41k08R7K54J07j70k57nK44J92j02
$$ 225 86 -175 -219 7 227 159 -99 -238 -68 186 222 -19 -227 -130 124 231 61 -196 -201 43 235 133
8075A33k66j07K01K40j7k46j76J27K41Q6k00k29K5K52J59j34k54n0K15K17o2k58
$$ 133 -133 -240 -39 201 184 -62 -238 -111 130 216 16 -213 -188 64 223 89 -165 -215 0 217 155 -103
8097a03j28J53K59J4k21j95Q8K58J17j82k48jK38J75q9k52j10J92K33j0k49j68
$$ -103 -231 -78 181 195 -26 -221 -133 125 242 60 -188 -189 49 224 135 -117 -227 -35 198 188 -61 -229
8119b29J10K66N6j78k30J5K58J57j45k46n9K05K31o1k43j25J38K44L8k14j99N8
$$ -229 -119 147 203 25 -205 -190 68 225 80 -166 -225 -20 211 150 -93 -218 -80 164 202 -12 -211 -153
8141a53K59J11j46k48k2K45J75q6k46j06J82K28pk34j79J11K51P5j91k26L3K32
$$ -153 106 217 71 -177 -199 46 221 135 -111 -217 -35 193 186 -48 -227 -116 135 210 19 -207 -174 58
8163E8J59j15k55n5K02K13n5k48j30J46K31N0k22j83N0K50J27j55k36k6K23J94
$$ 58 217 102 -153 -208 -6 207 152 -96 -226 -80 151 201 -21 -204 -154 96 223 68 -168 -194 29 223
8185B23q6k42j13J74K37p
$$ 223 137 -105 -218 -44 193 186
8191A86
$$ Imaginary data points
##PAGE= N=2
##DATA TABLE= (X++(I..I)), XYDATA
0@%%%%%%%%%%%%%%%%%%%%Qj6J6j6J6j6K0k7L1l2L6m4M8n4O2o8Q0r1R9j12J28j43
$$ 0 0 0 0 0 0 0 0 0 0 0 0 0 0 0 0 0 0 0 0 0 8 -8 8 -8 8 -8 12 -15 16 -16 20 -24 24 -30 32 -36 44 -47 52 -60 68 -75
42g5J59j76J94k16K41k64K88l19L52l87M29m74N19n72O34p00P76q64R62j078J217
$$ -75 84 -92 102 -114 127 -137 151 -168 184 -203 226 -248 271 -301 333 -367 409 -455 507 -571 646
63F46j382J581j825K108k348J928Q931K03314J2330k82750j98380J16532K90557
$$ 646 -736 845 -980 1128 -1220 708 9639 212953 225283 -57467 -255847 -139315 151242
76A51242R3834k07736k50847K0561K56576J74121j25281k62589p4548K06958K27096
$$ 151242 245076 37340 -213507 -192946 63630 237751 112470 -150119 -224667 -17709 209387
87B09387l3915k52269j53045J33753K50329N2346k04977k01797N2683K34212J21267
$$ 209387 175472 -76797 -229842 -96089 154240 206586 1609 -200188 -147505 86707 207974
98B07974j39589k21256k8324J96561J74741o2834k20924j03366J42404K10447
$$ 207974 68385 -152871 -181195 15366 190107 127273 -93651 -197017 -54613 155834
108A55834J5337j98266j62971P5932K16931Q4801j50886j93533N836J93611J36946
$$ 155834 171171 -27095 -190066 -114134 102797 187598 36712 -156821 -150985 42626 179572
119A79572q8268j99994o2459J50357J74706j7781j87339j23260R4543J94060N0861
$$ 179572 91304 -108690 -171149 -20792 153914 136133 -51206 -174466 -79923 114137 164998
130A64998j55100j65227L1261J85122J04229j05074j78076k6963J54491J40122
$$ 164998 9898 -155329 -124068 61054 165283 60209 -117867 -144830 9661 149783
140A49783m7619j73188q3052J08001J63129J5978j49544j27637N3593J67066P0570
$$ 149783 102164 -71024 -154076 -46075 117054 133032 -16512 -144149 -90556 76510 147080
151A47080j14037j54200p47J51198J11120o7016j57340m8938J18608J35488j6718
$$ 147080 33043 -121157 -121904 29294 140414 73398 -83942 -132880 -14272 121216 104498
162A04498j46812r3977P4841J50203L9291j19592j28750K2946J45064Q4074q2688
$$ 104498 -42314 -136291 -61450 88753 128044 8452 -120298 -97352 47712 131786 49098
173D9098j44292k3570J25854J15608l9234j42555o6398R1008J32578Q835j24262
$$ 49098 -95194 -118764 7090 122698 83464 -59091 -125489 -34481 98097 106932 -17330
184a7330j01839M6646J36316N6455r2846j25658j861J22819R2343n3438j30084
$$ -17330 -119169 -72523 63793 120248 27402 -98256 -100117 22702 115045 61607 -68477
195f8477m2118R7708J13024j3494j21502p6761O2497J22175L0036r7601j02728
$$ -68477 -110595 -12887 100137 86643 -34859 -111620 -49123 73052 103088 5487 -97241
206i7241J9204J15851O7651o4360j15301k1861R8450R4701k7808j14500n6609
$$ -97241 -78037 37814 105465 41105 -74196 -96057 2393 97094 69286 -45214 -101823
217a01823P1928J09048Q911j01700q4321L8176J12304M6394p6451j03399j918
$$ -101823 -29895 79153 88064 -13636 -97957 -59781 52523 98917 22466 -80933 -82851
228h2851J00974P7273m2758j08568l7784Q0459R7157q646j03454o7801N2938J06509
$$ -82851 18123 95396 52638 -55930 -93714 -13255 83902 75256 -28198 -95999 -43061 63448
240F3448K6306q5950q9650J8258J01901N7764n7382r9594j7578Q5145Q0626k4266
$$ 63448 89754 3804 -85846 -67588 34313 92077 34695 -64899 -82477 2668 83294 59028
252E9028r7764m8248O1271R3006P652q6736p1492L3355R5622L7844o6375q6702
$$ 59028 -38736 -86984 -25713 67293 74945 -11791 -83283 -49928 45694 83538 17163 -69539
264f9539P75Q5708O2874l7466q9554k9313O6865P8669q226q4685n4790M3857Q7386
$$ -69539 -68764 16944 79818 42352 -47202 -76515 -9650 69019 60793 -23892 -78682 -34825 52561
277E2561K1192p1372p4029J6191Q5669M7505m9826q4292j3497P3359O8013k1804
$$ 52561 73753 2381 -71648 -55457 30212 77717 27891 -56401 -69898 3461 71474 49670
289D9670q3356m0139N2972P9029N615p4896o1280K9359Q3193L2841n8246p5957
$$ 49670 -33686 -73825 -20853 58176 63791 -11105 -72385 -43026 40167 73008 14762 -61195
301f1195J126P5798N5051l3928p9389k5328N9531O9149p459p3808m7347L7922
$$ -61195 -60069 15729 70780 36852 -42537 -67865 -8334 60815 53356 -20452 -67799 -29877
313b9877P4940J7882o1138o3129J3888P3175M0793m2191p1961j2102O2054N8152
$$ -29877 45063 62945 1807 -61322 -47434 25741 66534 24343 -47618 -59720 2334 60486
325F0486j7917p0601l4528M4349O6985N382o2890n2085K4195P0175K8231m8947
$$ 60486 42569 -28032 -62560 -18211 48774 54156 -8734 -60819 -36624 33551 61782 12835
337A2835o4707M58O4673M7721k8820o8966k2748N1679O1241n601o5000m2724L2841
$$ 12835 -51872 -51414 13259 60980 32160 -36806 -59554 -7875 53366 47765 -17235 -59959 -27118
350b7118O6641J6397n4385n6482J2619O5929L6558l8306o4908j0701N5839N1981
$$ -27118 39523 55920 1535 -54947 -42328 23601 60159 21853 -43055 -53756 2083 54064
362E4064j6269o3049l0567L9658N9669M989n5586m6352K0711O1323K4830m2454
$$ 54064 37795 -25254 -55821 -16163 43506 48495 -7091 -53443 -32732 28591 53421 10967
374A0967n5899R36N6241M0727k5501n9352j9240M4070N1842m592n4373l5859K7205
$$ 10967 -44932 -43996 12245 52972 27471 -31881 -51121 -7051 44791 40199 -14174 -50033 -22828
387b2828N5824J4304m5375m8218R675N5780L1948l2125n5854r484M8500M5397
$$ -22828 32996 47300 1925 -46293 -36618 19162 51110 18985 -36869 -46353 2147 47544
399D7544j4381n5578k7047L4764N2695M924m8581m1280J7489N4305K3138l7136
$$ 47544 33163 -22415 -49462 -14698 37997 42921 -5660 -46940 -29451 24854 47992 10856
411A0856n0914o69N0602L8286k2169n4668j8562M0277M8172l783m9876l3236K4075
$$ 10856 -40058 -40727 9875 48161 25992 -28676 -47238 -6961 41211 37428 -12448 -45684 -21609
424b1609N0351J3690l9448m3027P056M8331K9348k6385m9265j0554M1352M1239
$$ -21609 28742 42432 2984 -40043 -32987 15344 44692 18307 -30958 -41512 -160 41079
436D1079j0575m8720k5409K9484M6782N496m1979l6555J4101M6507K0785l0537
$$ 41079 30504 -18216 -43625 -14141 32641 38137 -3842 -40397 -26296 20211 40996 10459
448A0459m3584k109M2319L3986j7290m7530j8283L4268M3965j531m4787l1345
$$ 10459 -33125 -35234 7085 41071 23781 -23749 -42032 -7764 36201 34670 -10117 -41462
460d1462K1186M6216J2822l6055l9130O679M3713K6213k3639m3941r713L6450
$$ -41462 -20276 25940 38762 2707 -36423 -29744 13969 40182 16543 -27398 -37111 -661
472f61L7120q651m3682k3793K6111M3135N930l8267l3918J2493M2009J8418k7331
$$ -661 36459 27808 -15874 -39667 -13556 29579 35509 -2758 -36676 -24183 17826 36244 8913
485H913l7834j043L6479K8445j4748l9687j5737K7600L6789K98l6489k7397J6227
$$ 8913 -28921 -29964 6515 34960 20212 -19475 -35212 -7612 29177 29475 -7014 -34411 -18184
498a8184L9307J2570k9953l4441M355L7090K2969j9469l6876q150L0459L1060
$$ -18184 21123 33693 3740 -30701 -26346 10744 33713 14244 -22632 -30782 -323 30737
510C0737p027l6705k1112K0990L7444P281l2190l1313R124L7975J8528k4405l6092
$$ 30737 23710 -12995 -34107 -13117 24327 31608 -582 -31895 -22771 15204 33732 9327 -26765
523b6765k059L4156K7074j3670l6712j3882K5744L3146m60l3344k4937J4363L5862
$$ -26765 -28824 5332 32406 18736 -17976 -31858 -6114 27032 26572 -6772 -31709 -17346 18516
536A8516J2667k6379l2199K584L3898K2033j7575l4420p652K8207K8071p011l2647
$$ 18516 31183 4804 -27395 -24811 9087 31120 13545 -20875 -28527 -320 27751 20740 -11907
549a1907j7421J9001L1574N213k7440k6178P492L1932J6512j9750l1228l063K9112
$$ -11907 -29328 -10327 21247 26460 -980 -27158 -19666 12266 28778 9028 -22200 -25263 3849
562C849K4280j1481l2530j2327K3161K9136j269k9574k0823J3490L0812J0034
$$ 3849 28129 16648 -15882 -28209 -5048 24088 22819 -6755 -27578 -14088 16724 26758
574B6758k3100k7710K120K9499K0106j4710l1167q136K5327K6585n910l0720j6582
$$ 26758 3658 -24052 -21932 7567 27673 12963 -18204 -26340 -1013 25572 19662 -11058 -27640
587b7640J8068K9559M271k5592k3325P367K8389J4266j7203k7269l477K4772K2161
$$ -27640 -9572 19987 24258 -1334 -24659 -17292 11097 25363 8160 -19109 -22586 2186 24347
600B4347q368k8573j2714J9281K6802M03k6264j9574J1477K7699R317k0172k4285
$$ 24347 15979 -12594 -25308 -6027 20775 21178 -5086 -24660 -13183 14516 23833 3661 -20624
613b0624J447K5005J7490j1620k6308q066K0636K3711l393k6762j6471J4977K7643
$$ -20624 -19177 5828 23318 11698 -14610 -22676 -2040 21671 18278 -8484 -24955 -9978 17665
626A7665N306k3616k2521O856K7181J3277j6888k5645k621K3284K0139p872k5960
$$ 17665 22971 -645 -23166 -16310 10871 24148 7260 -18385 -21006 2278 22417 14545 -11415
639a1415j1567J7487K4726O54k4632j8965J0759K6940R167j9745k3368K148K4184
$$ -11415 -22982 -5495 19231 19885 -4747 -23712 -12953 13987 23154 3409 -19959 -17811 6373
652F373J5542j2011k3966o164J8817K0280l183k2541j3895J2125K3092N031j9642
$$ 6373 21915 9904 -14062 -20226 -1409 18871 15688 -6853 -20748 -8623 14469 19500 -142
665a42j9700N180K3623J2273j4310k2574k589K0070J7264o857k1953r639J4511
$$ -142 -19842 -14662 8961 21234 6924 -15650 -18239 1831 19095 12238 -9715 -19354 -4843
678d843K0624J085k0039j6384P938K2749R062j6352k1385O67K1965J5471j0496
$$ -4843 15781 16866 -3173 -19557 -11619 11130 20192 3840 -17545 -16878 5087 20558 10062
691A0062k2958o490J7768J9454l012k1330j2984J1338K1428M886j7826j8434M079
$$ 10062 -12896 -19386 -1618 17836 14824 -6506 -19490 -8152 13276 18162 336 -18098 -14019
704a4019K1714J2249j2685k1695l474J8889J7218n977k1131r494J3690J9343Q44
$$ -14019 7695 19944 7259 -14436 -17910 979 18197 12220 -8911 -18405 -4715 14628 15472
717A5472j8375j4630P143J9933P953j3877j8451P3J8623J3911q388k0229o582
$$ 15472 -2903 -17533 -10390 9543 17496 3619 -14832 -14759 3864 17775 9387 -10842 -17424
730a7424J5266J7741k115j9033j1749J0221J9084L927j6054j5942M044J9018J0381
$$ -17424 -2158 15583 13468 -5565 -17314 -7093 11991 15918 -136 -16078 -12034 6984 17365
743A7365j1200j8899l063J6707J5549n142j9362r141J2566J8261R10j7402j3630
$$ 17365 6165 -12734 -15797 910 16459 11317 -8045 -17186 -4620 13641 14551 -2851 -16481
756a6481P141J8670O813j3319j6660O17J6946J2204p579j7882n996J3272J5938
$$ -16481 -9340 9330 16143 2824 -13836 -13219 3727 15931 8352 -9530 -15526 -2254 13684
769A3684j251j6702j1089Q358J7046M180j3796j4276L142J6481R242r366j6219
$$ 13684 12433 -4269 -15358 -7000 10046 14226 430 -13846 -10704 5777 15019 5653 -10566
782a0566k994J3811J3402l693j6175q436R967J5958J859j4632j2717N267J6562
$$ -10566 -13560 251 13653 9960 -6215 -14651 -4684 11274 13133 -1499 -14216 -8949 7613
795G613O870j1505j5324K05J5523J1401o971j6679n623J2355J4857j150j5592
$$ 7613 14483 2978 -12346 -12141 3382 14783 7812 -8867 -14490 -2135 12722 11572 -4020
808d020j0419P835J6160M107j3093j3798K863J5831Q869r106j5500k493J3442
$$ -4020 -14439 -6604 9556 13663 570 -13228 -10365 5466 14335 5229 -10271 -12764 678
821F78J2450l996j5262p455R467J4401J436j3075j1116M642J4347O012r809j3220
$$ 678 13128 9132 -6130 -13585 -4118 10283 11719 -1356 -12472 -7830 6517 12529 2720 -10500
835a0500j1J3199R891n766j4212m929J0407J2630r07j3176q821O566J3652L567
$$ -10500 -10511 2688 12579 6813 -7399 -12328 -1921 10709 9802 -3374 -12195 -5629 8023 11590
849A1590j0973j1737K193J3351P710p592j3360k273J1749J1096l537j3866o883
$$ 11590 617 -11120 -8927 4424 12134 4542 -8818 -11091 658 11754 8217 -5649 -12532
862a2532Q685J3356J299j2195j0248M546J3485N369r465j2352K03J2410R111n475
$$ -12532 -3847 9509 10808 -1387 -11635 -7089 6396 11765 2300 -10052 -9849 2561 11672 6197
876F197j3116m360R729J1607r83j2310q247O031J2683L465r913j0711J915J1982
$$ 6197 -6919 -11279 -1550 10057 9074 -3236 -11483 -5452 7231 10696 783 -9928 -8013 3969
890C969O834o822j1844k007J0287R734k923j1887o084P322J1585J400j0601r328
$$ 3969 10803 3981 -7863 -9870 417 10151 7228 -4659 -10743 -3421 8164 9564 -1037 -10365
904a0365L698J2113N225q300j1307L2J1346Q314n238j2169l820R249J0721j159
$$ -10365 -6667 5446 10671 2371 -8936 -8904 2442 10756 5518 -6651 -10471 -1222 9499 8340
918H340j1537p543N854J1971L161r643j0366J902J1758O737o785j1622j695J0284
$$ 8340 -3197 -10740 -4886 7085 10246 603 -9763 -7861 3897 10634 3849 -7773 -9468 816
932H16R250l376j1616n368P349J0752R20r802q270L436J0782M698p261j0174l26
$$ 816 10066 6690 -4926 -10294 -2945 7807 8727 -1075 -9345 -5909 4873 9571 2310 -7864 -8190
947h190R939P684m245j0741l615Q043R434j030j0131o527N111J0291K771q035
$$ -8190 1749 9433 5188 -5553 -9168 -1125 8309 7279 -2852 -9379 -4268 6023 8794 759
961G59q850J301R821O052n409j0215k078Q916Q724k589j0736n305O799J0227P87
$$ 759 -8091 -6790 3031 9083 3674 -6541 -8619 297 9021 6432 -4304 -9609 -2810 7417 8204
976H204r497p754L605J0318M246p016r545l08R250P320l749j0159l736P515R317
$$ 8204 -1293 -9047 -5442 4876 9122 2106 -7439 -7747 1503 8823 5074 -5085 -8821 -1306 8011
991H011p35r937o589M972J0125K617p848q279J466R088N337m925r059j997P599
$$ 8011 7276 -2661 -9250 -4278 5847 8464 616 -7663 -6197 2891 8228 3303 -5756 -7753 -154
1006a54P826j697r189n165N472R239J197q452p373L073R589M015o430q640j38
$$ -154 7672 5975 -3214 -8379 -2907 6332 7529 -923 -8296 -5223 4366 8381 1951 -6689 -6827
1021f827Q313O278l504q911l194O627Q327m23q867o252M337R562K640p673q185
$$ -6827 1486 7764 4260 -4651 -7845 -1218 7109 6686 -2181 -8433 -4096 5466 8106 433 -7752
1036g752J699R282N054n362q841j291P594O962k201q508m312N175Q311J124p575
$$ -7752 -6053 3229 8283 2921 -5920 -7211 383 7345 5144 -3364 -7676 -2501 5810 6934 -641
1051f41o873K516Q802M004n836q197k56P802N864l288q057k677N847P019m13p346
$$ -641 -7514 -4998 3804 7808 1972 -6225 -6481 1321 7185 3897 -4160 -6837 -990 6029 5616 -1730
1067a730n298L286P969K787n993p388O29Q005N227m296q397j795P027O830j898
$$ -1730 -7028 -3742 4227 7014 1021 -6367 -5738 2267 7494 3198 -5199 -6994 33 6863 4965
1082D965q066m011M948P663Q47p061o336K259Q275M083n322q189p06P741O352
$$ 4965 -3101 -7112 -2164 5499 6346 -715 -7051 -4792 3483 7566 2244 -5945 -6651 1090 7442
1097G442l195q599k984O326P473p49p796n000L834P739K117o018o757Q42P469
$$ 7442 4247 -4352 -7336 -1010 6463 5714 -2082 -7082 -3248 4491 6608 590 -6167 -5325 2144
1112B144M910l834p891k036O418O720j506p682m012M677P237O42o601n501K354
$$ 2144 7054 3220 -4671 -6707 -289 6431 4925 -2757 -6769 -2092 5145 5787 -814 -6315 -3961
1127c961P191L204m637o814o02O403N496k377p435l088N310P070k10p229m993
$$ -3961 3230 6434 1797 -5017 -5619 784 6280 3903 -3532 -6620 -1310 5760 5550 -1679 -6672
1142f672L496P422J916n866o196J144P032M238l672p125j866N701O238j012p088
$$ -6672 -3176 4246 6162 296 -5900 -4756 2276 6514 2842 -4283 -6149 -448 5790 4778 -2310
1157b310m228M108P292J181o438n890K048P218L283m544o510m54O024N023k088
$$ -2310 -6538 -2430 4862 6043 -395 -6285 -4237 2981 6264 1720 -4790 -5244 780 5803 3715
1172C715o664l099M327O493N53o176n129K498P010K535n260o339O55O747M321
$$ 3715 -2949 -6048 -1721 4772 5325 -851 -5980 -3482 3528 6063 803 -5536 -4881 1866 6187
1187F187l412o741j720N313N671r51o426l912L573O749J426n887n806J671P127
$$ 6187 2775 -3966 -5686 -373 5298 4347 -2079 -5991 -2418 4331 5757 -130 -5936 -4265 2862
1202B862L470m622o770k72O479M984k693o863k535M767O069l8n986m507K593O499
$$ 2862 6332 1710 -5060 -5332 1147 6131 3438 -3425 -5960 -1193 4876 4838 -1148 -5655 -3062 3437
1218C437K249m938n993N24O443M223l252o526j553N189N285j158n987l367L315
$$ 3437 5686 748 -5245 -4721 1722 5945 2693 -3833 -5386 -197 5088 3930 -2057 -5424 -2109
1233b109N832J212m843m942J094N839L284l492n970q77N468M914j887o320k765
$$ -2109 3723 4935 92 -4850 -3756 2083 5367 1875 -4095 -4972 496 5410 3523 -2797 -5562
1248e562M225N831J42n590m305K297O006K216m343n596J90N865M289k762o473
$$ -5562 -1337 4494 4636 -954 -5259 -2962 3044 5260 917 -4679 -4489 1376 5665 2903 -3570
1263c570k007N034N708q95o316l701L583O257J117n307n060J370N970L149l523
$$ -3570 -5577 -543 5165 4270 -2046 -5747 -2164 4093 5210 -97 -5157 -3787 2183 5332 1809
1278A809n809q15N298M841j737o252k954M022N937L64n514m324K288N874K061
$$ 1809 -4000 -4815 483 5324 3587 -2665 -5619 -1597 4340 4704 -810 -5134 -2846 3028 5089
1293E089m312n265K69N435L873k419n715j838M367N114o46n725l621L109N957
$$ 5089 777 -4488 -4219 1216 5089 2670 -3045 -4883 -516 4598 3952 -1773 -5394 -2285 3672
1308C672J317m895m889J248N688K894l494n475n94N056M455j677n740k725L692
$$ 3672 4989 94 -4795 -3547 2141 5035 1541 -3934 -4528 528 4983 3306 -2434 -5159 -1467
1323a467N479M21n175m245K045N749K228m052n232J16N205L774k321n426j761
$$ -1467 4012 4433 -742 -4987 -2942 2807 5035 983 -4249 -4133 1072 4846 2525 -2901 -4662
1338d662M068M809m23n145l495K478N404J593m156m696O44N146L151k856n232
$$ -4662 -594 4215 3792 -1353 -4848 -2370 3034 4627 471 -4225 -3581 1565 4716 1860 -3372
1353c372j026M495M374j221n277k735L224N138O02m694m121J656N367K366l622
$$ -3372 -4398 97 4471 3250 -2027 -4762 -1538 3600 4202 -492 -4613 -2957 2410 4776 1154
1368A154n075j19M987L790k217n401j776M124M802n58n195l324K687N313J298
$$ 1154 -3921 -4040 947 4737 2520 -2881 -4657 -533 4269 3711 -1484 -4808 -2121 3192 4490
1383D490m291m506Q98N132K917k902n048q51M383M090j312n058k485L163M816
$$ 4490 199 -4307 -3409 1723 4640 1738 -3310 -4161 222 4312 3000 -2058 -4543 -1380 3436
1398C436M93m394l757J557M895K086l315m537j23M401L415j808m702j696L428
$$ 3436 3929 -465 -4222 -2665 2230 4316 1001 -3536 -3659 742 4157 2349 -2353 -4049 -621
1413f21M254k89m504l117K209M800J402l755m182O56M643K773k651m693q45M047
$$ -621 3633 3344 -1160 -4277 -2068 2732 4134 379 -3803 -3147 1496 4269 1618 -3075 -3920 127
1429A27L876j135m682k372K882M537N10m214l670J468M811K181l221m531j63M349
$$ 127 4003 2868 -1814 -4186 -1304 3233 3743 -471 -4141 -2673 2138 4319 1098 -3433 -3596 753
1445G53L355j865m669j578L404M139k81m275k964J977M465J386l404l999M35M365
$$ 753 4108 2243 -2426 -4004 -600 3539 3258 -1017 -3981 -2004 2461 3847 443 -3556 -3121 1244
1461A244K823k265m533j056L716L740r39m367k271K666M195N01l814l375J246
$$ 1244 4067 1802 -2731 -3787 -71 3669 2730 -1637 -3908 -1242 2953 3454 -360 -3735 -2489
1476b489M327K064k822m203k96M032L273j661m520j637L364M048l84m263k729
$$ -2489 1838 3902 1080 -3123 -3419 613 3886 2225 -2295 -3932 -568 3480 3096 -1167 -3896
1491c896K164M281J048l437l627O50M133K522k211m228r86L500L586q72m213k196
$$ -3896 -1732 2549 3597 160 -3467 -2817 1316 3838 1627 -2601 -3587 -87 3499 2627 -1586 -3782
1507c782K612M074L87l712l109J298L970J711k557l618k49L433K886j246l888
$$ -3782 -1170 2904 3291 -421 -3530 -2232 1738 3449 892 -2726 -2975 458 3344 2098 -1790
1522a790j717K681L722K7l715k715J766L992J111l133l373N67L737K236j961l701
$$ -1790 -3507 -826 2896 2923 -792 -3507 -1741 2251 3362 229 -3144 -2577 1160 3396 1435 -2266
1538b266q84L020L225o13l752k218K208L890O05l495l163J235M028J684k747l613
$$ -2266 -3150 -130 3095 2482 -1270 -3488 -1280 2610 3215 -280 -3443 -2208 1820 3504 757 -2856
1554b856pL520K622j429l673j423K562L415L8l432k641J519L818J256k967l393
$$ -2856 -2863 657 3279 1850 -1823 -3246 -684 2731 2769 -663 -3304 -1785 2033 3289 322 -3071
1570c071N16L742K178k049l614o70K984K876p27l367j872J938L387O35k978k923
$$ -3071 -2555 1187 3365 1316 -2298 -2968 16 2892 2165 -1202 -3074 -1136 2251 2886 -92 -3015
1586c015Q80L651J769k445l520q6L446K546j555l588j109K646L035k85l195k165
$$ -3015 -2135 1516 3285 840 -2680 -2766 680 3226 1671 -1917 -3026 -380 2655 2370 -825 -2990
1602b990J498L376J070k635l109L71L463K195j926l605o65L055K839r01l388j585
$$ -2990 -1492 1884 2954 319 -2790 -2419 1044 3239 1313 -2292 -2957 98 2937 2036 -1352 -2937
1618b937K062L085L48k760k490P97L119J662j934l168m22K956K628j084l436j409
$$ -2937 -875 2210 2558 -202 -2692 -1895 1224 2886 952 -2216 -2638 318 2946 1862 -1574 -2983
1634b983K367L063r1l017k101J365L063J008k291k771J16K931K156j370l256j032
$$ -2983 -616 2447 2356 -661 -2762 -1397 1666 2674 383 -2388 -2272 659 2815 1445 -1811 -2843
1650b843K619K973n13l398j933J992L312M27k868k469R88L114J387k044k982k70
$$ -2843 -224 2749 2236 -1162 -3095 -1103 2209 2636 -232 -2701 -1713 1401 2788 744 -2238 -2508
1666b508K797K481r43l247j475K242L117j7l181k223J513L260Q92k469k612M26
$$ -2508 289 2770 1827 -1420 -2895 -653 2464 2447 -734 -2957 -1444 1816 2708 239 -2373 -1947
1682a947K802J697j465k820p58K282K580l11k882j877J552L002O08k584k418Q50
$$ -1947 855 2552 1087 -1733 -2491 -209 2371 2060 -822 -2699 -1147 1855 2463 -121 -2539 -1689
1698a689K965J290j900k655j38K447K004q64k651j193J757K643J95k591k173J045
$$ -1689 1276 2566 666 -1989 -2127 320 2324 1460 -1191 -2384 -627 2016 2211 -380 -2553 -1508
1714a508K967J120k175k637K68K749J718j455k712o27K169K308l59k565j666J295
$$ -1508 1459 2579 404 -2233 -1965 784 2502 1047 -1665 -2292 -123 2185 1826 -739 -2405 -1110
1730a110K686P61k210k424M81K820J582j697k785l44K457K116q48k666j139J727
$$ -1110 1576 2337 127 -2297 -1816 1004 2586 889 -1896 -2240 217 2333 1485 -1181 -2320 -593
1746e93K461J67k324j987Q18K661J214j818k588l0K583J880j263k777p26K235
$$ -593 1868 2035 -289 -2276 -1458 1203 2417 599 -1989 -2019 564 2444 1181 -1596 -2322 -87
1762h7K319m91k628j466J441K512M82k105k103N54K559J389j581k638l41K393
$$ -87 2232 1741 -887 -2353 -912 1600 2082 -23 -2126 -1572 987 2376 795 -1843 -2184 209
1778B09K090q61k669j037J878K361j26k404j701J041K462R05j692k186nK208J651
$$ 209 2299 1438 -1231 -2268 -390 1971 1845 -559 -2260 -1219 1243 2148 456 -1730 -1735 473 2124
1795B124j031k475q03J927K276k45k417j507J228K352N01j914j953M24K280J359
$$ 2124 1093 -1382 -2185 -258 2018 1773 -644 -2151 -923 1429 1930 16 -1937 -1513 767 2126
1811B126j215k342n58J908K009m73k379j273J531K426K17k253j895Q17K464J019
$$ 2126 911 -1431 -1989 -81 1928 1455 -924 -2197 -666 1760 1977 -276 -2171 -1354 1110 2129
1827B129j652k229j4K213J675r52k425r02J810K253j22k370j622J192K479O20
$$ 2129 477 -1752 -1766 447 2122 1170 -1255 -2157 -347 1906 1784 -586 -2208 -1016 1463 2083
1843B083k008k106M62K398J356j354k340m33J964J902n22k295j172J415K261K59
$$ 2083 75 -2031 -1569 829 2185 831 -1509 -1942 22 1924 1402 -893 -2065 -650 1611 1870
1859A870k082j826P13K357J011j557k134k6K088J566r05k244p66J620K008j01
$$ 1870 -212 -2038 -1325 1032 2043 486 -1648 -1674 414 1980 1075 -1169 -1935 -315 1693 1592
$$ [...]
8191a17
##END NTUPLES=NMR FID
##END=
