##TITLE=1H_Ser 3514-NEA
 CDCl3
 8 sc, 
 13.2.2024
##JCAMPDX= 6.0         $$ Bruker NMR JCAMP-DX V2.0
##DATA TYPE= NMR FID
##DATA CLASS= NTUPLES
##ORIGIN= UXNMR, Bruker Analytische Messtechnik GmbH
##OWNER= root
$$ XWIN-NMR		Version 3.5
$$ Tue Feb 13 14:55:35 2024 Russian Standard Time (UT+4h)  she@DPX200
##.OBSERVE FREQUENCY= 200.1313
##.OBSERVE NUCLEUS= ^1H
##.DELAY= (6, 6)
##.ACQUISITION MODE= SIMULTANEOUS
##.ACQUISITION SCHEME= undefined
##.AVERAGES= 8
##.DIGITISER RES= 18
##SPECTROMETER/DATA SYSTEM= spect
##.PULSE SEQUENCE= zg30
##.SOLVENT NAME= CDCl3
##.SHIFT REFERENCE= (INTERNAL, CDCl3, 0, 15.7039)
##AUDIT TRAIL= $$ (NUMBER, WHEN, WHO, WHERE, WHAT)
$$ ##TITLE= Audit trail, XWIN-NMR		Version 3.5
$$ ##JCAMPDX= 5.01
$$ ##ORIGIN= Bruker BioSpin GmbH
$$ ##OWNER= she
$$ F:/spectra/data/she/nmr/H-F/1/audita.txt
$$ ##AUDIT TRAIL=  $$ (NUMBER, WHEN, WHO, WHERE, WHAT)
(   1,<2024-02-13 14:54:24.79 +0400>,<she>,<DPX200>,
      <created by zg, POWCHK disabled, PULCHK disabled
       configuration hash MD5:
       00 E9 B6 7A A2 85 ED C7 34 08 36 98 17 FE 4E 26
       data hash MD5: 16K
       89 71 A7 FB E8 06 6E EA E5 0E 3B 32 8D 23 06 17>)
$$ ##END=
$$ 
$$ hash MD5
$$ 0A 86 C4 02 39 3F DE D4 CC 3E 9F 1C 39 B3 63 EE
##$RELAX= 
##$RELAX= 
##$RELAX= 
##$RELAX= 
##$RELAX= 
##$RELAX= 
$$ Bruker specific parameters
$$ --------------------------
##$DU= <F:/spectra>
##$EXPNO= 1
##$NAME= <H-F>
##$PROCNO= 1
##$TYPE= <nmr>
##$USER= <she>
##$AMP= (0..31)
100 100 100 100 100 100 100 100 100 100 100 100 100 100 100 100 100 100 
100 100 100 100 100 100 100 100 100 100 100 100 100 100 
##$AQSEQ= 0
##$AQ_mod= 1
##$AUNM= <au_zg>
##$AUTOPOS= <>
##$BF1= 200.13
##$BF2= 200.13
##$BF3= 200.13
##$BF4= 200.13
##$BF5= 200.13
##$BF6= 200.13
##$BF7= 200.13
##$BF8= 200.13
##$BYTORDA= 1
##$CFDGTYP= 0
##$CFRGTYP= 5
##$CHEMSTR= <none>
##$CNST= (0..31)
1 1 145 1 1 1 1 1 1 1 1 1 1 1 1 1 1 1 1 1 1 1 1 1 1 1 1 1 1 1 1 1 
##$CPDPRG= <>
##$CPDPRG1= <>
##$CPDPRG2= <>
##$CPDPRG3= <>
##$CPDPRG4= <mlev>
##$CPDPRG5= <mlev>
##$CPDPRG6= <mlev>
##$CPDPRG7= <mlev>
##$CPDPRG8= <mlev>
##$CPDPRGB= <>
##$CPDPRGT= <>
##$D= (0..31)
0 1.2 0 0 0 0 0 0 0 0.06 0 0.03 0 0 0 0 0.0002 0 0 0 0 0 0 0 0 0 0 0 0 
0 0 0 
##$DATE= 1707821664
##$DBL= (0..7)
120 120 120 120 120 120 120 120 
##$DBP= (0..7)
150 150 150 150 150 150 150 150 
##$DBP07= 0
##$DBPNAM0= <>
##$DBPNAM1= <>
##$DBPNAM2= <>
##$DBPNAM3= <>
##$DBPNAM4= <>
##$DBPNAM5= <>
##$DBPNAM6= <>
##$DBPNAM7= <>
##$DBPOAL= (0..7)
0.5 0.5 0.5 0.5 0.5 0.5 0.5 0.5 
##$DBPOFFS= (0..7)
0 0 0 0 0 0 0 0 
##$DE= 6
##$DECBNUC= <off>
##$DECIM= 32
##$DECNUC= <off>
##$DECSTAT= 4
##$DIGMOD= 1
##$DIGTYP= 9
##$DL= (0..7)
0 120 120 120 120 120 120 120 
##$DP= (0..7)
150 150 150 150 150 150 150 150 
##$DP07= 0
##$DPNAME0= <>
##$DPNAME1= <>
##$DPNAME2= <>
##$DPNAME3= <>
##$DPNAME4= <>
##$DPNAME5= <>
##$DPNAME6= <>
##$DPNAME7= <>
##$DPOAL= (0..7)
0.5 0.5 0.5 0.5 0.5 0.5 0.5 0.5 
##$DPOFFS= (0..7)
0 0 0 0 0 0 0 0 
##$DQDMODE= 0
##$DR= 18
##$DS= 0
##$DSLIST= <SSSSSSSSSSSSSSS>
$$ [...]
##$SUBNAM2= <"">
##$SUBNAM3= <"">
##$SUBNAM4= <"">
##$SUBNAM5= <"">
##$SUBNAM6= <"">
##$SUBNAM7= <"">
##$SUBNAM8= <"">
##$SUBNAM9= <"">
##$SW= 18.0517328524113
##$SWIBOX= (0..15)
0 0 2 0 0 0 0 0 0 0 0 0 0 0 0 0 
##$SW_h= 3612.71676300578
##$TD= 16384
##$TD0= 1
##$TE= 0
##$TE2= 300
##$TE3= 300
##$TEG= 300
##$TL= (0..7)
0 120 120 120 120 120 120 120 
##$TP= (0..7)
150 150 150 150 150 150 150 150 
##$TP07= 0
##$TPNAME0= <>
##$TPNAME1= <>
##$TPNAME2= <>
##$TPNAME3= <>
##$TPNAME4= <>
##$TPNAME5= <>
##$TPNAME6= <>
##$TPNAME7= <>
##$TPOAL= (0..7)
0.5 0.5 0.5 0.5 0.5 0.5 0.5 0.5 
##$TPOFFS= (0..7)
0 0 0 0 0 0 0 0 
##$TUNHIN= 0
##$TUNHOUT= 0
##$TUNXOUT= 0
##$USERA1= <user>
##$USERA2= <user>
##$USERA3= <user>
##$USERA4= <user>
##$USERA5= <user>
##$V9= 5
##$VALIST= <valist>
##$VCLIST= <CCCCCCCCCCCCCCC>
##$VD= 0
##$VDLIST= <DDDDDDDDDDDDDDD>
##$VPLIST= <PPPPPPPPPPPPPPP>
##$VTLIST= <TTTTTTTTTTTTTTT>
##$WBST= 1024
##$WBSW= 4
##$XGAIN= (0..3)
0 0 0 0 
##$XL= 0
##$YL= 0
##$YMAX_a= 82771
##$YMIN_a= -112496
##$ZGOPTNS= <>
##$ZL1= 120
##$ZL2= 120
##$ZL3= 120
##$ZL4= 120
##$ABSF1= 10
##$ABSF2= 0
##$ABSG= 5
##$ABSL= 3
##$ALPHA= 0
##$AQORDER= 0
##$ASSFAC= 0
##$ASSFACI= 0
##$ASSFACX= 0
##$ASSWID= 0
##$AUNMP= <proc_1d>
##$AZFE= 0.1
##$AZFW= 0.1
##$BCFW= 1
##$BC_mod= 2
##$BYTORDP= 1
##$COROFFS= 0
##$CY= 11.3945322036743
##$DATMOD= 1
##$DC= 2
##$DFILT= <>
##$DTYPP= 0
##$F1P= 15.7292609196834
##$F2P= 12.9074282941183
##$FCOR= 0.5
##$FTSIZE= 0
##$FT_mod= 4
##$GAMMA= 1
##$GB= 0.15
##$INTBC= 1
##$INTSCL= 1
##$ISEN= 128
##$LB= 0.24
##$LEV0= 0
##$LPBIN= 0
##$MAXI= 10000
##$MC2= 0
##$MEAN= 0
##$ME_mod= 0
##$MI= 1.114404
##$NCOEF= 0
##$NC_proc= 0
##$NLEV= 6
##$NOISF1= 3.799351
##$NOISF2= 2.8
##$NSP= 1
##$NTH_PI= 0
##$NZP= 0
##$OFFSET= 15.70392
##$PC= 1
##$PHC0= -24948.2
##$PHC1= 12.8527
##$PH_mod= 1
##$PKNL= yes
##$PPARMOD= 0
##$PSCAL= 0
##$PSIGN= 0
##$REVERSE= no
##$SF= 200.130013532006
##$SI= 16384
##$SIGF1= 3
##$SIGF2= 2
##$SINO= 400
##$SIOLD= 16384
##$SREGLST= <1H.CDCl3>
##$SSB= 0
##$STSI= 0
##$STSR= 0
##$SW_p= 3612.71676300578
##$SYMM= 0
##$S_DEV= 0
##$TDeff= 0
##$TDoff= 0
##$TI= <>
##$TILT= no
##$TM1= 0
##$TM2= 0
##$TOPLEV= 0
##$USERP1= <user>
##$USERP2= <user>
##$USERP3= <user>
##$USERP4= <user>
##$USERP5= <user>
##$WDW= 1
##$XDIM= 8192
##$YMAX_p= 0
##$YMIN_p= 0
$$ End of Bruker specific parameters
$$ ---------------------------------
##NTUPLES= NMR FID
##VAR_NAME=  TIME,          FID/REAL,        FID/IMAG
##SYMBOL=    X,             R,               I
##VAR_TYPE=  INDEPENDENT,   DEPENDENT,       DEPENDENT
##VAR_FORM=  AFFN,          ASDF,            ASDF
##VAR_DIM=   8192,          8192,            8192
##UNITS=     SECONDS,       ARBITRARY UNITS, ARBITRARY UNITS
##FACTOR=    0.0002768,     1,               1
##FIRST=     0,             0,               0
##LAST=      2.2672688,     0,               0
##MIN=       0,             -112496,         0
##MAX=       2.2672688,     82771,           0
$$ Real data points
##PAGE= N=1
##DATA TABLE= (X++(R..R)), XYDATA
0@%%%%%%%%%%%%%%%%%%%%JpJ4j6J6j6J6j6K0k8L2l2L6m2M7n4N9o6P4q2R1j00J12
43E9j23J34j47J62j79J99k20K43k69K93l22L60m01M46m98N61o38P31q48J000j206
64f63J498j944K699m188Q132l6521q1509J32004O3263q7365Q770P4550l7151m6847
78e272N6266J8016p6684m113L3274o2102j4094P3854l1341o2703N9693K5260q6324
91g6270N160J15767M654q7331L6546P0655n9697k0841Q0666k5647q4511L2704
103h145M9717l0952r734L3197k7037n0092K6860J1023n8072K6633P2854n1904
115a5652m5858P7298K4399o6932J1122O2638l2681m8754O6571M8719p2529k9433
127b1092M1005k7474l0800M1021N417l1057K1831K3684l6406j3305M3863j2629
$$ y = [0, 0, 0, 0, 0, 0, 0, 0, 0, 0, 0, 0, 0, 0, 0, 0, 0, 0, 0, 0, 0, 1, -6, 8, -8, 8, -8, 8, -8, 12, -16, 16, -16, 20, -22, 25, -29, 30, -36, 38, -44, 47, -53, 59, -64, 70, -77, 85, -94, 105, -115, 128, -141, 152, -170, 190, -211, 235, -263, 298, -340, 391, -457, 543, -663, 835, -1109, 1590, -2598, 5534, -30987, -112496, 19508, 82771, -4594, 4176, 78726, 41575, -5272, 50994, 69010, -7674, -11787, 21487, -40615, -54709, 19145, -12196, -74899, -15206, 10054, -76270, -71110, 44657, 49311, -38020, -1474, 69181, 9484, -11357, 69309, 43662, -40849, -8145, 41572, 10620, 886, 34083, 7046, -43046, -16186, -5163, -63235, -36602, 36252, -15652, -61510, 15788, 40187, -26745, -15623, 47015, 14334, -34420, 32151, 80870, 8341, -21092, 19913, -7561, -38361, 2660, 8077, -22980, -1149, 22535, -13871, -27176, 16687, 4058]
139D058n7563L8574N5328m8364j3111O8646j3577p2025J7648N3759j9333k8888
151a4848K9451P731l8252Q114K0859l3441l778L1372j9862r721M8909R254m7210
164a1422p01L8211k5949m2892M4897L6401n1488j2695M5765j0614k9917K0654
176B50J1894k4236k469K6311j737j5068J7078l605l3705J9034K9172k9521m608
189a1210L9277j0336l8919J5573L1363k8358l2005L0092J3913l5137R840L5774
201A9867j4841j6407J4220J713n058J0670L541j4676M54J8433j4844k1911K8682
214I843J0512m1465J073L7703j0288k7181J5382J8689k2202j8598K2911J0220
226F599j7288P158J3058p332P771P502j5870P65J3712j1293j8063J2727J8327
$$ y = [4058, -53505, -14931, 40397, -7967, -21078, 47568, 33991, -38034, -20386, 33373, 14040, -14848, 14603, 22334, -15918, -7804, 13055, -20386, -24164, 7208, -12654, -22375, 26534, 35788, -11422, -12123, 26088, 139, -42753, 2144, 38545, -12943, -25638, 20127, 9513, -20404, 250, 12144, -12092, -14561, 11750, 10013, -5055, 12023, 8418, -25287, -6253, 22919, -6602, -11210, 28067, 17731, -21188, -5615, 25748, -2610, -34615, -4523, 9390, -25747, -15907, 19867, 5026, -11381, 2839, 4552, -506, 10164, 13705, -971, -517, 17916, 3072, -18839, 9843, 20355, -21110, -20037, 17666, 7378, -19803, -4421, 14268, -7934, -26532, -3621, 6599, -10689, -3531, 9527, 2195, 9966, 17468, 1598, 2363, 16075, 4782, -13281, -554, 17773]
239A7773k2352k1107K7787Q958l1658M352K7099q154j4945J0331J1715o463q658
252e322M774P03k775R841k10o104J3896p71k1704M434J4255j2273j4610R720J1839
267E693j4553r889K2033M959k0904N521J5911m664l983M862L614j541p528k843
281c312K383K930K021p683n30J6113n902j9027J0320J2457j4506j1534J0768J2892
295G390j0050j0775J5939Q889j2035k091P726L199o79q452k21R391n461j0988
309h218J088Q282K377j0521n37J6301k691j5359N546J0019m726q279J41J0280
323C703L08j0595N111J0656l411n778k34N976K176j0967j534R544m499q507J694
338f357M658L467m698k699R917R57q879M87O038J723o900n719J0708M071j2348
$$ y = [17773, -4579, -25686, 2101, 11059, -20599, -16247, 10852, 2698, -12247, -1916, 9799, 3336, -5322, -548, 155, -2620, 7221, 7011, 907, 14803, 14032, -7672, -3238, 11017, -1256, -15866, -6146, 5693, -8860, -18749, 3284, 8243, -12661, -7140, 8771, 4107, 124, 4986, 8600, 7059, -469, -3312, -929, 2001, 4022, -3661, -4191, 11922, 6020, -13007, -2687, 9770, -4736, -16270, -5502, 7390, -2660, -13435, 2504, 11393, -642, -2733, 4993, 8192, 7513, -939, -1160, 8231, 2770, -8218, -7130, 1152, 3529, -6992, -7529, 8772, 6081, -9278, -3732, 6287, 1561, -6718, -6577, 3703, 4011, -6584, -1473, 9183, 5772, -6, -240, 5736, 7912, -3055, -4589, 4955, 456, -8051, -6357, -1699, 1768, -2930, -5629, 4288, 5245, -3634, -3147, 2891, 4614, -2286, -8005, 2703, 6774, -5574]
353e574K355J3231l119q477P27P292m42j1332J219P455n451n586J555J904O073
368A830j662p428Q007P223q066o189P740R367r713j2152J4516Q651j6301o04J4421
383I640j436r208j352M649J48o355j708J021r52L209m213m419J4386L987j4586
398g189M468J5280n858j1970P083J2315j0667j2792J3333N368j4841K841R608
411F979p064l121K611l060j665K577n25o209L133J0408p771p046J9281M720j8691
426e443O086J6745r644j3170R666Q895j4716r391J3714P7j2596O850M912q154
440f169L860K667q247K546J0029n399j0300J0474J3708j5382p457K4643J008k3812
454g831P677J7359j2546j3225Q663N713j1525l874Q057m194k640J1289m464p976
$$ y = [-5574, -3219, 10012, 6893, -1584, -857, 6435, 5993, -5339, -4120, 3335, -2116, -7702, -6147, -4243, 1830, 168, -7260, 747, 7970, -96, -6285, 1455, 10822, 1109, -11043, 3473, 12124, -4177, -4781, 9640, 8204, -1004, -2356, 2293, 2441, -3914, -5622, -4601, -5553, -2344, -6557, -10976, 3410, 7397, -7189, -2721, 12559, 6701, -5269, 1814, 14129, 3462, -9330, 4003, 9371, -5470, -2629, 6979, -85, -3206, -595, -3655, -5320, -2743, -3268, -9477, -6344, 4064, -3707, -10753, 8528, 13248, -5443, 643, 17388, 7744, -5426, 4240, 13135, -1581, -10972, 2742, 2819, -9777, -2927, 1985, -6169, -2309, 358, -7889, -5343, 4686, -713, -11013, -539, 13169, -2213, -9670, 14973, 15981, -7831, -154, 17205, 4659, -8566, 97, 5810, -5715, -9589, -1532, -5726, -8366, 2923, -1541, -9517]
468i517J6224J845j8607N677J7786j0160j5214J5058J3804j9856q276K3792j106
481A1450j9889Q478Q714j3549j905R310m066o971O417L523j0770M936J5337j1834
495h19p684K0916j813k1999J0085J6945j5539j4171J5498Q181j8218Q31K0915
508A3128q818j5154J3570L698j3097N190O306q612J63J0284n738j1897J3047J1522
522A3592k1314l874K6713o061k3009J3103J2891j9719q121J9548M508j6549L611
535d681J5419p633l945J0900r709r311J5030K74j6250Q216J4738j4411j5282J7062
549D17R702k2292J818K5310j1171j9773J7239J0385j5415k782J0160l702m584
562d688J2637N247j4211K864J0101j7443o351J9940n462j7827J3082J1742j8388
$$ y = [-9517, 6707, 8552, -10055, -4378, 13408, 3248, -11966, 3092, 16896, -2960, -11236, 12556, 11450, -8439, 39, 8753, -4796, -6701, 2609, -1457, -8428, -2011, 1512, -9258, -4322, 11015, -819, -8503, 12413, 10600, -11399, -1314, 15631, 92, -14079, 1419, 9600, -8618, -7787, 13128, 4310, -10844, 2726, 6424, -6673, -1483, 4823, -3789, -3626, 6658, 920, -10977, 2070, 13592, -7722, -11596, 15117, 9056, -13953, -850, 12041, -7678, -15799, 3749, 8257, -8292, -4681, 10738, 3105, -840, 10060, 351, -8960, 6070, 6344, -9906, -1690, 13048, -1363, -16645, 417, 10119, -12173, -10355, 14955, 3784, -15989, 1250, 11635, -3780, -6562, 3598, -104, -4688, 7949, 13196, -1015, 1849, 11950, -5493, -11844, 8096, 2634, -15193, -2111, 9631, -8757]
575h757p353K1867L533k2781N012K1573j0162p722J6594l453j6307O560Q816p617
589a97j535J0068m942j0376J2100M488k2623J163K0584j3472j5638K0578J2187
602A2385j7295m813J7148j599j4512J1851J3027j4779m925J2093n487n152R293
615G235o350j3851R086J1785j1393o993J8148O39k4303N150K0712j2498r863J7966
629E470L278j4625M082J4419m125j0441N516n28r821R851Q323j6517k622J3258
643E518r239j0818J3874P965j4647j679J8430j967j6704J0331J1631j8099n430
656a0834J6556L41o836O861K005j0118j594Q253m722p636Q917O35j3385R219J3694
671A1356j5053q721J4583K538j2485N318J7069n481j5245P125N328j2004J685
$$ y = [-8757, -16110, 5757, 9290, -13491, -8479, 13094, 2932, -4790, 11804, 8351, -7956, -1396, 7420, -197, -1732, 8336, 3394, -6982, 5118, 9606, -13017, -11854, 8730, -4742, -20380, 198, 12385, -4910, -9723, 7425, 5826, -8686, 3165, 16192, 1413, -3512, 8581, 3094, -2058, 7235, 885, -12966, -3880, 7905, -3488, -10481, 7667, 8306, -15997, -10847, 9865, -2633, -12496, 5470, 8748, -5877, -1795, 12624, 8499, -1942, 3574, 3046, -6775, 3076, 11399, -5118, -7740, 5518, -3721, -14539, -665, 7300, -7347, -9026, 9404, 7437, -9267, 1064, 12695, -5404, -10834, 5722, 6063, -773, 6088, 8093, -2025, -3619, 4634, -88, -7724, 1193, 1828, -11557, -2338, 11356, -3697, -12418, 2165, 4703, -7782, -2464, 14605, 9124, -6121, 1004, 6332, -5672, -3987]
684c987R479p394k546P893j708l451N678j62j3397j632J6787j399j3017J1392
698B536R509j6939m706J5012J090j0046K570P994m599n085O971j613r164L723
712b747J066p346Q612R792r072m924Q775K75j0734J503J1934n655j0498J1547
726B528P168j1796j57O747n357n003N777M420l051j201K225m994l284P721j717
741B6p288Q279N114r501K315J0816m042j1967J537Q713n347n833J0933L298j0363
756c310M76M525k379O64J120k757K91L464L44m484J529N791q174o926J1788N105
772G067r414J139P791l550p741J585N579l253m900N347K007j957L327j432l465
787a870L630p07m577L139M680k042n810K047N854o113n116P907J685o343K599
$$ y = [-3987, 5492, -1902, -4448, 3445, 1737, -1714, 3964, 3802, -9595, -11227, 5560, 4161, -8856, 2536, 12045, -4894, -9600, 5412, 6502, -3544, -974, 7020, 2421, -2664, 4307, 2694, -6470, -2747, -1681, -9027, -415, 9377, 305, -4619, 4156, 4431, -6303, -4800, 7134, 1479, -9019, 2528, 9696, -2100, -2257, 4490, -867, -5870, -93, 4327, 1276, 75, 2300, -2694, -5978, 1743, 26, -7262, 1017, 6131, -3370, -1055, 9761, 5719, -6248, -4711, 4002, -1345, -7178, 3755, 7053, -3310, -2834, 1691, -688, -24, 1096, -1661, -1370, 2094, 2438, -2046, -517, 5274, -2900, -9826, 1962, 7067, -2347, -1208, 6583, 3033, -4708, -3123, 2456, -797, -5697, -350, 1657, -300, 3027, 1595, -1870, 1760, 1053, -3524, -385, 4295, 2253, -3557, -1510, 4344, -1769, -6885, 1022, 2707, -3636, -1037]
802a037N310j509k998j747J047n22j097L023J146L9J646l285j040M809k770m978
818c963K996K765k394k581K880L955n436m548O054K318l836J756K958M77k045
833A356l802J969K558k877j496J900L267P94m609R0M780l670n070K370K956k16
849C00l067j91M985n51n038K177L330l97j541k14M049K62n779K76L391k534r06
866a448N87J424J992k801j188K899j160k337r22O58K683j088k707N188J564n429
882b085L64L735N46k316n07M087p10n335K062J753k806n8P83m79J667n69j802
899a670J776R88j989k650J032M829l178l696P081K709o986J08N383r7m212K38
915c34L863j051m702J993L37j989J915j509k581N274Q55n733J641N192j801o339
$$ y = [-1037, 4273, 2764, -234, -1981, -934, -1456, -2553, 470, 1616, 1655, 3301, 16, -1024, 3785, 1015, -3963, -967, 1798, -596, -3177, -297, 3658, -1778, -6326, -272, 2046, -1790, -34, 2924, 3401, 1356, -2446, -477, 2081, -796, -2292, -392, 2875, 3669, -940, -850, 3930, 260, -4810, -2440, 516, 300, -2767, -2958, 2027, 1476, -3562, -1385, 1945, 1548, 7, -207, 3842, 4104, -1675, -1399, 1992, -542, -1448, -861, 563, 2555, -246, -1434, 1465, 305, -2032, -2954, -2296, 387, -701, -3408, 1780, 3344, -2085, -1721, 2014, 2560, 244, -263, 3824, 3114, -2221, -159, 1594, -1212, -1270, -487, -966, 701, 132, -1670, 106, 1094, -895, -3545, -2513, 2316, -862, -4558, 2523, 5232, -1754, -1646, 3737, 3640, -572, -334, 3529, 2478, -2224, -231, 106, -1883, 32, -1477, -4058, 1216, 2071, -3662, -2021, 3171, 1370, -4969]
931d969K075P556l878n359P161K806o251P12L493j207j666K90j70j665J63J354
947D45l456n13N626l340m467O810K103o767J714N906j996n874L214N852n117l260
963c120P323j30o028L243J563l534N38J119k220j666K465N30n295K584O743o488
979b373l632R771J81q091L553O813l930n870M120M300n672j562O257k649l485
994b269M257j610l838M228P07n918R97N760k252o532N488P694q628l441J0716
1009E359m51p921L592M477m463k849L401N84m297J867L361n696Q22O209n895l506
1025e406Q129j51p782K278P114l232o199O202N350q235q92R210m616n452N935
1040B253J249n770P20K333k031k059M584L90o406M074N815p775j510R462k836
$$ y = [-4969, -2894, 4662, 784, -4575, 2586, 5392, -859, -147, 3346, 2139, 473, 763, 593, -1072, -909, 445, -3011, -3524, 2102, -1238, -5705, 1105, 3208, -3559, -1845, 4061, 2065, -3809, -595, 5257, 140, -3120, 4203, 4073, -1955, 1288, 2851, -683, -145, 974, -1246, -2912, -447, 83, -5212, -2628, 4115, -2373, -6005, 3766, 3947, -4144, -591, 6222, 2292, -3578, 542, 4842, -830, -2392, 3865, 1216, -2269, 1988, 378, -3460, 768, 1475, -4443, -3446, 2314, 62, -6470, -982, 6712, -1916, -5357, 5359, 4908, -3013, 579, 5056, 593, -2256, 1145, 1729, -2568, -701, 2660, -3036, -2214, 3995, -1900, -5406, 2723, 2572, -5210, -2932, 4182, 950, -5249, 953, 6303, -1932, -2824, 6386, 1770, -3682, 2253, 3502, -2268, -1548, 785, -1246, -3305, 1279, 1669, -4737, -663, 5152, -2623, -4133, 5329, 2493]
1055B493p763N026N642o527l602P852K432q878J037O819m755k391N143k441l994
1070c907M764P43n121J409N754l044n784P503M123j0264Q82J0045m884q096N730
1085a47M082n974j503N345j92m686L790K507o760J812N885n936j479P337k292
1100A789o677M568O091n738n590Q419K560r510J953P619o388l703N953q28m890
1115d372L145M492k825k753M859o71n684N595L398q614P81P793m327n743N633
1130G07L293o809k115Q343p87q261N320N383p598r89N671k132k061L622J39l453
1146a727K399M706m703m992P121N82r493L904P739p321m227O815K025n814m27
1161c413O251j644m590N241J410n207L487K454o610J70O139k105m177L927K778
$$ y = [2493, -5270, -244, 5398, -1129, -4731, 3121, 5553, -3325, -2288, 4531, -224, -2615, 2528, 87, -3907, 857, 1600, -3521, -2112, 3642, 598, -5186, 2317, 6440, -3824, -2942, 7103, 2219, -5877, -147, 3935, -2039, -3542, 1803, 1611, -3075, 715, 3222, -3538, -1726, 4159, -1777, -3256, 4081, 1789, -4888, -320, 5771, 33, -5557, 2862, 5422, -4088, -2135, 5484, -904, -4607, 1346, 518, -4372, -1227, 3265, 440, -2313, 2546, 1875, -3809, 1786, 5184, -3430, -2649, 5144, 817, -4926, 707, 4000, -2809, -4924, 3419, 2632, -5629, -309, 5074, -2524, -3513, 2158, 26, -2035, 1587, 1726, -1727, 672, 5378, 675, -4317, 2804, 3386, -6107, -2203, 5536, -1785, -6012, 803, 2828, -2986, -3413, 2838, 1194, -3396, 1845, 3255, -1952, 1535, 3989, -2621, -2451, 3688, 1583, -2594, 1333, 4111]
1176D111o835k459Q060j010q200M173N179n499r48O194k61l920J595K731k897
1191A4p45N492k304m834M422L83o573K761M568n269l375N925J843n559R8O604
1207C451l282o084O508K983m920J536M218k498j276J882k15l007P30K055m056
1222a975j171O440k727p451M675L569n158j30O217M66m986R20N258k209l405M182
1238B515l63l474L663J110l431J409J195m424k406L614J857m449j27N467l151
1253i95m715N796K628m716L79L906j41j243J504J775l264j966K782k233j321M377
1269B553j684l557K704R94l758m68K858l5l395J813N324k582k879M313m05l665
1285a869K400K200q22q18K82P0j647Q3P01l043j30L145j992j198N192l96m812
$$ y = [4111, -2724, -5183, 2877, 1867, -6333, -2160, 3019, -2480, -3428, 2766, 2505, -1415, 180, 2911, 14, -731, 4761, 2457, -2377, 2045, 2428, -4145, -1384, 3184, -2085, -5460, 465, 2308, -3251, -3153, 3451, 169, -5915, 593, 3576, -1344, 192, 4410, 1912, 636, 2518, 2303, -704, 26, 2081, -1975, -3146, 3294, 567, -6884, -2209, 1360, -3798, -3928, 2289, 2755, -2231, -1311, 3947, 1738, -1667, 2515, 2152, -1322, 2341, 3451, 20, 1429, 2624, -1800, -4206, -592, 1265, -3184, -3311, 2156, -995, -5710, 86, 2714, -2002, -1623, 2283, 2142, 899, 2403, 4178, 914, -1052, 1730, -503, -1824, 2553, 869, -2688, 16, 1010, -2748, -3216, -358, -393, -3788, -1975, 3349, 767, -2112, 2201, 1796, -1869, 531, 2731, 1909, 1091, 1373, 1443, -204, -121, 580, -2463, -2593, 552, -1440, -2638, 2554, 2158, -2654]
1302b654J34L093j28k209J414L842k631k453L151j26j164J62j003m90J652L12
1318I02q68QM61q83l128J612M006k297j675L662n8k224J55J153m74j695j41K192
1336G08k03j39J206j688n01J009j521O16K063j237l48K97P72m37k044P80J504
1353H37j750j87K614o68j047m29k98P02p89n87J962J87n46P86K6O57K1k203N15
1372a97J454j226M65P25k6o38k497J06J959q42j080J496P61j53q55p32K296m22
1390E94k550J584J857l49J95JL24r4k198J22P22o63O61j147O7J525j354k001K032
1409f72K14r40O08J630J126j587o46K253r93k270K397J2j084R13j25l07j48o56
1427b75m97q24L15J194j251L39K362j742j897K867L47k067Q62J872L32k113L65
$$ y = [-2654, -2520, 573, 445, -1764, -350, 3492, 861, -1592, 1559, 1433, 269, 431, -572, -1062, 590, 902, 34, 42, 503, -380, -3508, -1896, 2110, -187, -1862, 1800, 1742, -482, -327, 826, 352, -1343, -1484, 708, 505, 366, 1572, -116, -617, 392, -1129, -513, 1550, 313, -35, 262, 1034, 597, -1447, -667, 837, -913, -1100, 1514, 846, -201, -630, -928, -226, -1015, -1602, 360, 547, 1, 787, 813, 1470, 1491, -712, -197, 1257, 31, 496, 1221, 1195, 557, -1940, -1834, 125, -717, -1797, -301, 460, 307, -548, -1280, 1016, 594, -1956, -372, 1485, 1136, 1331, 1332, 1656, 1562, -636, -514, 208, -455, 206, -941, -874, 651, -703, -2704, -672, -458, -1398, -790, 840, 1966, 379, -267, 1986, 993, -1277, 1120, 1132, 48, 961, 836, 529, 381, -275, -772, -1596, -1281, -87, -1338, -999, 1363, -379, -2276, 591, 938, -1129, -267, 1605, 1937, -176, 189]
1444A89K315k123j834K092o32q87J635m64j161J720o71j862J04J776L52k697J625
1461e23L558l083k184L616M1k698P05J731j24j490M14J283j845J75J204k496M04
1478a312L051j558k014L032K90l090k09K884k51l096J586L184k968j148L430j272
1494E39k125J843O74j390K27J465p09k076J906J098l438R65L363l016j296L929
1510A959n89l438P59K567j541k261K844J973l697O32L359k486j225K871j007j767
1526a047J296R81j647o90K608p42m341K969L013m068o56M680j323l457J928K507
1542B011j745j870K926P00k996J389K212l406L12K861k990j891L484J57l594O15
1558a825L463j586l508L383K455m439R48M359k482k104K620M92k124K73J997j429
$$ y = [189, 2504, 381, -1453, 639, 7, -880, 755, 291, -870, 850, 179, -1683, -1579, 197, 549, -2148, -523, 3035, -48, -2232, 1384, 1425, -1273, -568, 1163, 1039, -451, -37, 1246, -599, -424, 780, -1716, -1312, 1739, 181, -1833, 1199, 1489, -1601, -1810, 1074, 823, -2273, -687, 2497, -471, -1619, 1811, 539, -1586, 257, 931, -459, -232, 1233, 524, -1552, 354, 1452, -1986, -1021, 2342, -674, -1970, 1959, 1370, -2068, -1309, 1258, -283, -2544, 300, 2273, -1424, -792, 2567, 81, -1144, 1727, 720, -1047, 249, 1230, -417, -1107, 1501, 759, -3582, -613, 2400, -1668, -2324, 2356, 1033, -2424, -496, 2011, 266, -1604, 1322, 2022, -974, 415, 2627, -779, -467, 2394, -596, -2487, 997, 1154, -2440, -1825, 1638, 52, -3456, -73, 2382, -2057, -1109, 3250, 768, -1336, 1284, 1776, -348, -75, 1922, 493]
1574D93k122L057k9m325K256K621l897o64L422q42k633K061K847k538k016M213
1590A904J012m579K203K861l382p48L069j564k242J378J097k322r14K962j226
1605d91l072M070J500n083J368M354k443k294K989K054l132n39L413r45l275K588
1621A062Q58l757J390J850l112n98K790n08k884J430L921l024k215M446J034m631
1637a948K155K798k942p82K390J49k671M16K112k008j616L301j172l264L020J582
1653A520l723O19K982j076k162K032K042k561o89L839j267l815K893J732l503
1668a137q1K678j560j406J480P71k201k3L114j759j932L499k1l482K078K601l032
1685d13j349K806J034l427J49L295k118k450K935k37k242J874J338j998K14K153
$$ y = [493, -1629, 1428, 1399, -2926, -670, 1951, -1946, -2610, 812, -30, -2663, -602, 2245, -293, -2309, 1904, 2916, -1663, 540, 3401, 19, -729, 2340, 776, -1466, -88, 1009, -1313, -2227, 735, -491, -3563, 507, 2007, -3076, -1708, 2646, 203, -2091, 898, 2952, -180, -719, 2694, 1749, -1526, 1062, 1920, -1837, -447, 1403, -1709, -2307, 483, -25, -2909, -1479, 2442, -582, -2797, 1649, 2683, -1948, 207, 3005, 63, -719, 1671, 1820, -851, -435, 1677, -331, -1947, 1354, 182, -3082, -62, 1520, -2203, -1584, 1398, 322, -1840, 192, 2234, -327, -1016, 2823, 1556, -2259, 634, 2366, -1137, -1218, 1460, -100, -1506, -26, 745, -1456, -1479, 1635, -124, -2056, 1443, 1422, -2060, 18, 2619, -413, -1762, 1044, 2078, -1349, -1200, 2095, -23, -2473, 462, 225, -2017, -143, 1195, -803, -589, 1564]
1701A564j045j644J652J806k920j232M272r96l738K042J867k910l34J942o09j311
1717a594Q68J886k111k73K863j500j201K594M33k686J078J903j680j588J425J197
1733A614l150l45L047k096j982L292K1k472Q30J674o51l18J231R62j633O51J894
1750B569k143q18K541j211k273J471J103k034o38J212L10k617N00K505j630q55
1766b008K765k53j017J228Q72j050M9J025l38j151R29R52k991k16K339j605j948
1783b418K046M03j703J96J256n9r38N18J444j160K02K334j325m63J803r13j340
1800a17P59K51o82j160J159L8k175M03J860j712m93J774k94o06R72J040m84o47
1818a14N58P70j248N17J100j408m0R61r78p56Q56p15q72K54J187K67j500O52J170
$$ y = [1564, 519, -1125, 527, 2333, -587, -1819, 2453, 1457, -2281, -239, 1628, -1282, -1616, 326, -283, -1594, -726, 1160, -951, -1224, 1639, 139, -1062, 1532, 1965, -721, 357, 2260, 580, -1008, 417, 1614, -1536, -1881, 1166, -930, -2912, 380, 401, -2071, -1241, 433, -218, -536, 695, 1657, 24, 675, 2569, 426, -392, 2149, 938, -1335, 136, 1239, -795, -1433, -221, 89, -2528, -2028, 477, -1153, -2008, 757, 504, -513, 715, 1587, 537, 586, 1611, 1273, 122, 1051, 2003, -988, -1204, 1135, -470, -2418, -372, 31, -1672, -1476, -220, -279, -1217, -699, 745, -415, -213, 2121, 796, 333, 2136, 1223, -117, 642, 893, 211, -949, 210, 248, -1927, -1524, 336, -1376, -1869, -95, -389, -995, -23, 1017, 533, -114, 444, 1214, -34, 483, 1583, 175, 135, 1096, 118, -638, 218, -497, -1369, -1115, 72, 339, -1161, -509, 661]
1837F61j304j44J698m82k31N91n27P33m24j26l11n63M21L39q04N90Q06j684m3
1856h04Q16q6k14k64P70L70q47L24R37q82k54O5m85N65N20o33K71K7o25j5l45
1877g89J010On67K90J017q63L47K52o90J4k10k57R10m56j02O25j064J11R4j92
1897e14M37l69j62R46r3j58N02o60k02O74l50M31L73n85j58j22m3K75j027Q6J111
1918C92p64l59J006Qj48n38j21N07J26j29R77l42l27J65o31p7O96q37l61Q09j6
1939C6k82m72Q85j3j267N3J585m45j57Q81l26l57M21n93K93j84L96K11q49L94
1959B10N34j438k95J136j042n6J090J53m71P3N56lq04K09J210j342J88J402p71
1978E39q54P75n31m76k7K79J62p13J083R7j367N70J112j304k17J714r0q19O39
$$ y = [661, -643, -787, 911, 429, 198, 789, 262, 995, 571, 445, 134, -429, -8, 331, -473, 117, 923, -761, -804, 12, -74, -288, -552, 218, 588, -259, 65, 1002, 120, -134, -69, -554, 11, 531, -102, 169, 196, -429, -444, -789, 221, 227, -340, -50, 967, 104, 451, 703, 13, 27, -183, -440, 470, 14, -88, 537, -527, -416, -322, -514, -77, -446, -608, 338, 245, 87, 589, -71, -273, 401, 51, 482, 855, 270, 112, -10, -53, 222, -805, -719, 392, -372, -731, 275, 283, 135, -403, -524, -17, 109, -20, 957, 615, 288, 453, -178, -255, 441, -396, -757, 52, 36, -246, -718, 167, 154, -1113, -1060, 525, 80, -77, 804, 478, 121, 542, -51, 242, 58, 454, 665, -184, 210, 744, -694, -989, 147, -895, -951, 139, 292, -179, -106, 450, 447, -357, -148, 1062, -280, -92, 1310, 539, -315, 460, -71, -547, -574, -295, -133, -846, 237, 334, -1033, -463, 649, -655, -872, 842, 752, -67, 572]
1997E72M79m82j251P80O35j615Q31R17j418L83J133j403p38R92L72j069L09J257
2015F84J13j701J179J075j819k50J569p83j59P28K73j006n37J032m75j449J703
2032A77P95k068R81J522j799l29J046L32j414L97J209m60j084J353K41k097Q26
2049c72J260j529m44J437L33j215R4J055p34j025J400J23j601J623J015k145p2
2066g97J479o39r74O08J555j381q64K010m86j956J613P32j585M20J484j238n12
2083e31J408p0j560kJ534q17j232J931M18k540R10J446j322p29J173K51o98K4
2101d06J727q25j373J863j86j956J370J323j709m26J199l6j451L34J104j137j141
2118a726K353l99j734J620J196j859N5J452m54p13N41J135j580n65J749o70j819
$$ y = [572, 1051, 569, -682, 98, 733, -882, -51, 866, -552, -169, 964, -439, -1177, -185, 187, -882, -573, 684, 797, -904, 275, 1350, -469, -719, 850, 67, -92, 636, 909, -97, -634, 398, -77, -1526, 177, 972, -1096, -115, 1407, -392, -721, 325, 657, -757, -360, 849, 389, -695, 658, 899, -1198, -372, 888, -641, -1085, 352, 685, -530, -436, 619, -115, -1140, 260, 383, -1218, 405, 1420, -725, -797, 682, 43, -931, -323, 1232, -149, -1013, 997, 511, -1445, 168, 900, -685, -265, 1219, -19, -531, 877, 807, -753, -755, 779, -38, -1270, 661, 1079, -1461, -551, 895, -427, -1156, 17, 268, -430, -406, 1321, 496, -877, 986, 800, -1156, 214, 1537, -172, -598, 601, 565, -886, -552, 552, -585, -1726, 627, 228, -1506, 114, 1310, -549, -494, 958, 504, -209, 332, 1467, -113, -678, 1071, 401, -1418]
2135a418J874O9j764O27J216p41j261J183Q76j599kK279q18j317J753K82j713
2152d74P81R36j238m02Q96K60j506P4J833j779j304K431l08j752J142J221j256
2169d45l0J067J60j268N14J450j322p07K352j255j518J646lj618n5J297l32j302
2187a369J065J151k078J51K042r36j198K246j50j324N12R88o95j188Q12J286j950
2204f35m2J705j354r93J841l63j177P13P10p50o45J165P80j752M09J904j740o09
2222h33J996n12j290O71O64r27j30O57O1j372M18J326j492n6J843j065r25J408
2240D42N08j532K10J075k79j026O13J084j733K10J293j260l38J187j32r93K5J255
2258F09l94j127J165R19j836K53J593j497k55J208k95j164R43L80n29p51J098
$$ y = [-1418, 456, 525, -1239, -612, 604, -137, -1398, -215, 661, -938, -940, 1339, 521, -796, 957, 1239, -474, 307, 1243, 5, -397, 499, 759, -747, -673, 1160, -619, -1923, 508, 200, -1552, -410, 811, -445, -475, 592, 752, -516, -2, 1448, 126, -581, 1771, 516, -1002, 644, 641, -977, -1032, 265, -67, -1369, -304, 847, -1231, -1080, 962, 26, -1172, 1074, 924, -400, 112, 1100, 405, -783, 29, 1315, -635, -677, 1028, -326, -1319, 522, 159, -1018, -305, 405, -345, -990, 175, 955, -797, -388, 1516, -224, -833, 1163, 651, -639, 32, 696, -231, -361, 296, 357, -1015, -597, 729, -763, -819, 1024, -41, -966, 442, 950, -582, -372, 703, 424, -602, 11, 1095, -638, -428, 865, -395, -733, 454, 322, -671, -646, 609, 215, -912, 253, 1172, -664, -411, 1182, -315, -570, 638, 343, -821, 122, 502, -27, -778, 320]
2275C20M08j667N36J234j226j57J511o00l63K79O68q17k32O78m3j368J108M82
2293G51j418j64J302p52n04O81L70o18j53Q06J62j284J288M72j369M43J073q49
2311B37m35P53k58n11P2M10k75q04M59N93j170Q20M80q83J47O90N0m90L05M23
2331F13n01n64R34K01j386Q66M19q26j88N60m26J71l42N36n6n78J001M7j045O04
2351D0N14n67K96N01p51O4k7K92r1n15K33n3n20O24m1p68P83J44m46N9L01P8k0
2374A30j73J74K25n95J019l41q93O22N7m72J02K3o6K4l60L48L42p65O26J3m23
2395c83P20r3l56O81k20q8Kk69J96J13o88N19k63m18M39Q7j00l9n24M39K97l71
2417c19M86J0l3R8rj69K62q9n2J63m51q3M17o08L22J48m24J06K97l58J08J16p5
$$ y = [320, 728, -939, -403, 831, -395, -552, 959, 359, -4, 275, 943, 126, -106, 572, 529, -839, 269, 751, -667, -831, 471, -281, -785, -104, 266, -352, -505, 301, 463, -821, 467, 939, -430, 13, 1086, 237, -198, 555, 297, -214, -142, 268, -7, -811, -352, 241, -929, -109, 371, -512, -365, 325, 375, -115, 190, 613, 112, -452, 482, 683, -703, 163, 582, -244, -432, 128, -298, -127, -469, 67, 11, -567, 434, 481, -564, 40, 554, -13, 283, 784, 33, 97, 70, 362, 271, -244, -11, -64, -584, 40, -1, -769, 14, 158, -288, -229, 72, 150, 130, -43, 131, 356, -239, 780, 439, -454, 168, 225, -247, -145, -122, -188, -164, -524, -176, 166, -599, 27, 40, -383, 337, 244, -112, 569, 349, 261, 263, -6, 190, 303, -385, 134, -129, -547, -108, -21, -121, -160, -684, -245, 52, -319, 167, 177, 144, 242, 233, 64, 326, 237, 185, 348, -103, -186, 231, -377, -55, 93, -331, -225, 72, -286, -178, -62, -137]
2440a37J77k44K57M00n11K47J24l93j29N94o94r4J58K88M1m55M97J17n25j99N49
2461F8k49L86K47p63M60J38j73J23o91M48L04n59K14M13o41J00J80l94M7J88K59
2482A05j9j6K77k94n47O17L35q61L23O31o63j46M11j83l2p70R05R1o34P81O6p62
2504c85K04N15m00k64O32N1k99j23P22k21r80Q00q9p46N94L48q41K43K45J25k64
2525a33j38L65J49n87Q89J50j220Q74J95n97O5P2j60j9j48P40p28n38J095k45
2545H1j027R00J21o61L88P92o07k10L98K49k45m31Q05j85r05Q12K94j245K93O69
2565B86l63l37L45O36p65k39R35m91l87Q56j66l18J73O81r46q3N60J41q81J0P37
2586C84o88o50J244l0r18O34K79q49J01N31qj28M82M58r91l60J223l88j009Q63
$$ y = [-137, 40, -204, 53, 453, -58, 189, 313, -80, -209, 385, -309, -403, -245, 43, 84, -371, 126, 243, -282, -481, 68, -181, 205, 452, -311, 149, 287, 114, 237, -454, -6, 298, -261, -47, 366, -275, -175, 5, -389, -342, -154, 105, 86, 70, 347, 53, -494, 123, 458, -403, -80, 551, -112, -258, 153, -30, -62, -832, 73, 164, -470, 311, 377, -385, -181, 334, -66, -330, 302, 353, 54, -69, 653, 432, -548, 252, 163, -583, 11, 359, -482, -239, 6, 131, -133, -271, 94, 243, -344, 545, 695, -525, 349, 544, -53, 12, 84, -76, -95, -243, 497, -231, -769, 326, 81, -946, -46, 75, -586, -198, 594, -13, -223, 175, 424, 179, -252, 553, 368, -537, 275, 569, -676, -383, 286, -77, -414, -69, 567, -198, -437, 498, 7, -380, 476, 310, -8, 165, 846, -100, -183, 377, 518, -363, -353, 384, -304, -954, 290, 260, -658, -24, 255, -594, -493, 38, 30, -98, 384, 842, -149, -509, 714, 326, -683, 180]
2606A80J13o53M0O56j92m85J71O16q88j12J087l83r77J521l58q10N81M14m72o77
2626f28P70L40q60KR06q61m35J110K00j134Q68L30n49m22O75J55q98J36Q95o55
2646e5l31J246n98j019R21L8m51o6O23j95o81K88R30r97l96J533l81j130J173
2665D52K13q61K53K40l17q01R86M72j152M15P74p78q93J521j81j103N83Q63m86
2684B00n57Q41K46j252L04R55q49j69R30k63p92N83K10o60k05L24L32r57N11R19
2704F51j024n8J088o76o61Q41M96p15K30L71k41q69O45M40p52l66J048p66l59
2723f77J047k91o54J84P10j90n27N74P21j142L7J109q72l75R76k41q09K13N78
2742C71l86n11N16N6r71P11O97q90j36J087l9q06L91N15n17l91P31J29q76M54
$$ y = [180, 293, -360, -320, 336, 144, -341, -170, 446, -442, -554, 533, 150, -827, 694, 336, -474, 107, 521, 49, -628, 142, 482, -378, -376, 530, -331, -766, 344, 544, -590, 278, 608, 59, -363, 312, 467, -431, -295, 600, -55, -386, 860, 262, -757, 164, 202, -249, -315, 308, 113, -568, -280, 650, -347, -743, 790, 409, -721, 452, 665, -196, 57, 297, -20, -821, 165, 637, -515, -100, 674, -104, -997, 524, 343, -760, -177, 686, 200, -357, 484, 730, -522, -218, 737, -112, -281, 649, 386, -406, 177, 387, -273, -478, -154, 178, -779, -268, 651, -373, -431, 657, -19, -680, 161, 657, -58, 172, 543, 302, -567, 78, 518, -234, -600, 448, -318, -677, 370, 79, -575, -391, 319, 129, -398, 176, 897, -245, -208, 901, 29, -346, 630, 389, -420, -207, 371, -15, -526, -10, 46, -925, -214, 483, -407, -543, 544, 505, -301, 90, 605, 88, -303, 428, 557, -319, 135]
2762A35N10j060p0R36q21j45L93j11j50q0O29j53o76Q61O73j188O3R72n29m06
2782b17K16L18n96l81Q97j61p38M94L30q52L25O83n75j49N74J27p21N64M06n20
2802B4l85L56N85j044M84N11m21m65M69j36k67k0O76m64l02P82L99j001M81J25
2822C87o42M44J93j29j96j46M30l35l15N40K3r03O78J85p18K94K80p7j37o0M68
2843B64k50j91L96Q1m10L73r0p93M02M56k66K9j5K44m39j66O24j35o24O08J28
2864B26o33P12mk69o9M29j45k92l29O35k60k80M04j23p19O30K95o33N28K4m0L6
2886A23k15N23m44j39K78L7r3K51m06j69K53K05j86l61P0L00m55j20O03j71k85
2907d01P60M9k90J22j52o1K38j77MJ68m55K85j51k26M80o63J54K93l68P5L08j32
$$ y = [135, 645, -415, -485, 451, -370, -515, -122, -233, -383, -463, 166, 13, -663, 198, 871, -317, -254, 718, 189, -217, -1, 317, -279, -660, 237, 76, -662, -168, 162, -690, -365, 318, -257, -406, 168, 295, -426, 138, 544, 24, -361, -5, 580, -464, 20, 531, 110, -355, 114, -22, -289, -309, 367, -97, -399, 383, 782, -219, 262, 387, -255, 189, 382, 253, 57, -89, 341, 6, -309, 231, 254, -649, 29, 214, -504, -210, 70, -7, -144, -204, 264, 14, -177, 219, 300, -110, 263, 173, -620, -218, 238, -28, 1, -14, 230, -209, -375, 249, 114, -510, 98, 226, -407, 305, 301, 32, -37, 392, 247, -45, -374, 261, 1, -279, 125, 2, -717, -87, 208, -425, 103, 127, 87, 123, -92, 431, -13, -152, 126, 163, 70, 321, -85, -254, -1, 204, 18, -343, -273, 27, -428, -548, 55, -116, -401, 359, 408, 118, 240, 88, 27, 265, 88, 92, 260, -195, 90, -61, -287, 193, -470, -316, -23, -391, -316, -8, -140]
2929a40K34j62mM84j47k48K12l02L73k35q5p8L29k57j01J36o10L86J82q4J51l90
2951c56K36J88k67K49K96j34J32Q8m51K01rj93J22j1j03Q0m87O34l07j74K29n9
2973i6k60J13K37j31K55j6J31p3j02M38l41j09M32n73j02K45J99m07j07J46N8
2994f3J1l97M93K0k54M41l56q6L22P4l66K18P8k61k20K43L26n22K5N33l36j09
3016a86L75j67l31M05J39j56j01o6K58j82r9K80j29j07K05k30o8p7K85j75L8J66
3038G7L4l66o7O17l18m03P36J03m82K41j51k01J2k3J03k06l1P87o67k28Q02l67
3060Bm01N39J98l48k1J74J99m36n4L59l07m4K91j65m14O23m2o42O01R3l55j27
3082b77N24o4m48q0J004m30l93O29m3n52K95L41m44j93J63M73p17l34Q59k58n42
$$ y = [-140, 94, -68, -72, 412, 265, 17, 229, -73, 300, 65, -20, -98, 231, -26, -127, 9, -601, -215, -33, -117, 34, -356, -120, 68, -199, 50, 346, 212, 344, 432, -19, 182, 173, -20, 102, 91, -12, 68, -419, 215, -92, -266, -37, -96, -356, -243, -6, -137, 118, 102, 233, 160, 58, 496, 155, 46, 478, -95, -197, 48, 247, -160, -267, -121, -63, -52, -449, 44, 64, -190, 251, -105, -191, 131, 205, -161, 57, 135, -126, -346, -103, 223, -299, -274, 259, -77, -186, 189, 22, -309, 96, 235, 79, -22, -88, 170, -12, -111, 169, 40, -67, 138, -92, -160, -237, 48, -127, -89, 77, 111, -255, -322, 295, -23, -426, 310, 413, -69, 172, 21, -180, -168, -191, -88, -294, -325, 462, -205, -433, 369, 2, -399, 140, 338, -10, -31, 143, 342, -94, -148, 211, -96, -140, 151, -14, -428, 195, 153, -489, 112, 205, -150, -277, 247, 183, -265, -345, 659, 229, -164, 465, 422, -130, 165, 506, 62, -131, 32, 505, -212, -546, 313, 55, -487]
3103d87N95j54k20J46L01l38K08K09J26n83R9Q78m71m96O85m03l85K20J53j84
3123a01j02K40k7m27J39M56m70m1P06m29k58L94K9Rl90P41k39p41M13N20p36J55
3145a59M24o24k97Q64l00l14N14M8q6n92P77R2m56K8N45n98k02N46Q9p82N32J73
3167B22m39J09J21Q8n95L80L67p51L23N03l76j29M00K06n39J7K54K06p75N21L78
3188D91j171L09M97l21l18P78j43r5r8K51j60k26L68J48p01L39O11p43l27R42
3208D31j03k89l83O57k99m93O56p3o64O23L88n07M1L68l44k18L85O5l40k43N17
3229A75q1l41L47M9n05N0L48Om27L91Q1k55j47L61L41q58O79K24n81Q0M98l68
3251F7j44r9J16J91l44K26Q1o04P78P6n63J84M99n27P9p8L56j26m14P41l07o70
$$ y = [-487, 108, -46, -266, -120, 181, -157, 51, 260, 386, -197, -98, 780, 309, -187, 498, 95, -290, -70, 83, -101, -203, 37, 10, -417, -278, 178, -292, -333, 373, -56, -314, 80, 109, 118, -272, 469, 230, -511, -98, 422, -314, -159, 265, -359, -656, 208, -92, -406, 108, 156, 70, -522, 255, 347, -109, -81, 464, -134, -336, 210, 299, -483, 49, 222, -217, -108, 13, 101, -494, -114, 253, -498, -175, 328, -48, -177, 223, 429, -110, -93, 161, 367, -408, 113, 491, -680, -371, 126, -195, -513, 265, 122, 27, -71, 180, 20, -206, 162, 310, -391, -52, 559, -184, -511, 431, 328, 39, -344, 313, 14, -479, 177, 104, -560, 63, 451, -56, -15, 353, 9, -209, 176, 241, -99, -342, 175, 94, -247, 100, 149, -356, -306, 42, 48, -379, 12, 93, -162, -309, 52, 393, -465, 214, 438, -143, -63, 435, 67, -77, -176, -60, 131, -213, 13, 94, -510, 268, 344, -219, -35, 464, -63, 16, -62, 294, 168, -246, 495, 188, -482]
3273d82M82Rk71L85K33p43J75J65N3n81J62P27k51m02O97L4n26K33Q0k71J64N41
3295F13l48m57N2N8j62J13J64m6l18K65M59p19K91J95o2l61M91N8k82K3L37P8
3317D42p29L98Q0l13J93N9k58r5mL87l36j61O10o53J96L79j90p9J00K72m58K16
3339E6O5J66k69k89M19j62k2J81l4n10L35N1k25J20K32j59k42J90J86P5m32P28
3361D60j69m86K53P0k27L31l89J67lj30J59l05O9L34k13j11L79R7m34p1N16k48
3383D9k49K48K48m11N4J37j42j48K00R6j98j22L62l87K27K11j68J89r0Q7k69N5
3405b1K15k60k7K28j85j54J69j30K00m7l56L53o2j23J51J87k01K08k26J82q8Q0
3427I3j83J71K18j40j6k90M87m77J53J26k34k16K78j41M12k36J0N9n2k45M39k83
$$ y = [-482, 0, 9, -262, 123, 356, -387, -212, -47, 6, -575, -413, 314, 63, -339, 358, 392, -134, 99, 179, -92, 72, 613, 265, -192, -140, -82, -244, -131, 33, -13, -331, -66, 393, -326, -35, 160, 98, -263, 228, 286, 4, 27, 364, 442, -287, 111, 191, -122, 71, 130, -128, -223, -227, 160, -176, -337, 273, -380, -184, 195, 5, -74, 26, 298, -160, 56, 121, 287, 18, -271, 148, -14, -36, 145, 111, -399, -64, -13, -238, -118, 114, -45, -287, -97, 89, 164, -268, 460, 291, -195, 58, 128, -99, 232, -157, 10, 7, -123, 36, -269, -200, 134, -79, -190, 189, 286, -148, -219, 297, 49, -200, 48, 296, -115, -61, 76, -66, -214, -14, 82, -116, -238, 124, -263, -36, 175, 7, 196, 106, 193, -76, -21, 194, -66, -93, 135, -50, -204, -35, -165, 35, -12, -368, -15, -77, -200, -49, 138, -63, 145, -81, 101, 13, 93, -90, 81, 299, 159, 143, -147, 340, -137, 16, 142, -92, -308, -30, -171, 241, 5, 15, 74, 22, -223, 216, -67]
3449f7K28K01k70j7J49j03j23R5m11J35J22j55J20j78J24K23M0O3l8k66L44j49
3471F7N5j51R4O3j11Q0k2K35l77j37o4N5N4l9J7K07Ql5L0M0n4m04M25l3k36J3
3497b20M14o7k99L43l32J34J16j27n2K26l19Km3M0L51O1l02L96j48j51k16L87
3519A94L0k17k2J66j79m6p0m7q2K29k46Q7K72j5l37Q7L50PK8k06P49r26p9L45
3543G2p8l84M98j7j91R1q6L23n51K21R8l4j88M33k24k4p1K55j89K41p5j31j0k5
3567d6L34j22l32N21n34n0K07l6l08J56M20r3J6j70Q6l14L51L76n82J17M10l83
3589B4m76N63l5k86P6K52L8m94M1K71j96L4N26n36R3Q1L21k42j02J58K83m82r
3612i7K67l84m9K89j29j03P3M70m06j8K07q5r2K09L8j12m5J26j63j92K12N6k86
$$ y = [-67, 161, 362, 92, 75, 224, 121, -2, 93, -318, -183, -61, -216, -96, -274, -150, 73, 113, 176, 138, -128, 216, 67, 122, -29, 65, 128, 17, 97, 75, 310, -67, -204, -268, -213, -159, -198, -181, 26, 34, -1, 29, 69, 15, -389, 36, 3, -233, -220, 194, 127, -172, 171, -161, -27, 89, -38, -90, 136, -183, -181, -224, -184, 167, 228, -74, 322, 174, 23, -193, 194, 224, 7, -15, 151, -28, -74, -144, -191, -273, -44, -290, -203, 69, 54, -283, -196, 154, 161, 189, -17, 732, -194, -273, 72, -6, -390, 108, 91, -100, -9, -95, 228, -323, -102, -4, -38, -226, 207, -17, -41, -112, 143, -46, 195, 120, -11, -21, -46, 288, 166, -166, 355, -179, -229, -22, -58, -366, -210, 210, 117, 133, -37, 49, -265, 86, 462, -120, -3, 407, 24, -452, 111, 76, -210, -134, 118, 156, -338, -297, -26, -222, -188, 338, -198, -105, -24, 297, 55, -47, 111, 394, -88, -97, 170, -214, -263, 26, -103, -206, -133, 337, -69, -87, 120, 35, -57, 152, 190, 78, 33, 159, -4, -196, 16, 72, -214]
3635b14J9L02Q3n87O01j41l79L45M64n47j79N36l05J9p4L20k03k97M10j20j33
3656h0J2R7k67K4M37l54M5J7L85l98PL66j57n00O01o6j13k15J40k23q6O00l29
3679e7j45Q3J75k14k15O47j59j92Q1K15k42j95J93N33o58Q0N92l05l10J71J31
3700B09m52j6L42k35J70Jp2j93J02K63k79l30O49q7k51J28L32l63j27M54k39q7
3722h1K10J77m80j37M74L0p36O78j51k14J36K39k41K5L07j07j78J97J68l84j67
3743b35K91K42l73J50P4j46J7JJ7m43L08N5k38j7M38k3l27J35J74j06l15L94k43
3766a70K8K8J75k23Q4L76k26j31N5J59l01M8K76j86k91M06j77N6j08L66o9n35
3788c60L37J55j24l9J82j63k90K49L71n66M04k49K69n08N27j84n0K85k10m6j80
$$ y = [-214, -195, 107, 190, -397, 204, 63, -316, 29, 493, -54, -233, 303, -2, 17, -57, 263, 60, -237, 173, 53, -80, -68, 29, -238, -214, 223, -131, -86, -69, 316, -82, -75, 291, 134, -366, 235, 169, 56, -159, -19, -242, -328, 272, -57, -202, -119, 56, -158, -373, 274, 115, -77, 4, 219, -23, -218, -25, 508, -150, -70, 522, 217, -93, 78, 209, -243, -259, 83, -152, 18, 19, -53, -246, -144, 119, -160, -490, 159, 72, -179, -51, 281, -82, -209, 245, 6, -81, 129, 306, -174, -311, 163, 193, -543, 135, -16, -230, -94, 145, -96, -71, 236, 129, -49, 148, 316, -68, -235, 56, 298, -75, 75, 149, 3, 20, 21, 38, -405, -97, -42, -280, -297, 141, 118, -209, -74, 100, -6, -321, 73, -170, -142, -114, 61, -162, -78, 298, 72, -59, -4, 155, -146, -98, 178, -8, -299, 107, -70, -14, -122, 244, 175, -360, -23, 132, 8, -31, 151, -12, -302, -53, 318, -248, 156, -93, 176, -332, 195, 11, -39, 246, 36, -10, -190]
3809a90J71K63m67J79J56j50j12J04K24k97J18L01m48J55J71k69J5j29L35k42
3829a12L85k3m53j9M65l75j54J90L64k75j66K71L1o0l33N68m39N1J75l8l03J01
3851a49K30J73k97o8j8J02j37K56m1j82L05l38j02L29j22K48m80N01m2m98L82
3872E2on3o2M00m40J67p5J00J29l93J41j18K0r8N1p4Q3M44k06k55L04R2l84K03
3896B2Q9j54n7N4M7R1N9k30M1K0j04R2k50L05l29J15m9J94N1M6j74J72M4J2j25
3921a8L7j95n4J82j21L39k90K86l01k8L87m34K4K63k09J70J56J15l77n5m4L24
3943A57JL7o3l29K97J42l10M6R2k24L68j89k67K56k02O7J88j69R9R6mj62J94l7
3967H4j39L01k34Q4l01J61Q1p2K19j12k17J85o9j30M08r6j01J3l06L79O4r6l5
$$ y = [-190, -19, 244, -223, -44, 112, -38, -150, -46, 178, -119, -1, 300, -148, 7, 178, -91, -76, -205, 130, -112, 273, 250, -203, -222, 243, -132, -286, -96, 268, -7, -173, 98, 129, 69, -264, 304, -135, -84, 91, 53, -250, -149, 81, 254, -43, -111, -129, -27, -164, 92, 51, -131, 174, -164, -266, 63, -59, 189, -291, 210, 168, -330, 52, 46, -7, -69, 331, -109, 58, -17, 83, 212, -181, -40, -158, -138, -236, -185, -259, -176, 268, 62, -193, 111, 203, -181, 22, 111, -43, -100, -46, 1, 92, 151, -79, -38, -18, -122, -30, -280, 25, -304, -189, -238, -44, 7, 53, -121, 51, 95, 107, -18, 19, -176, -230, -48, -169, 170, -120, 166, -135, -163, 224, -210, -186, 77, -132, 38, 194, 309, -68, -123, -167, 157, 158, 195, 132, -197, 100, 242, -68, -22, 70, -154, 214, 25, -242, 14, -188, -121, 67, -102, -3, 93, 89, -73, 121, 84, -55, 246, 12, 96, -205, -44, 37, -35, 184, 72, -145, 40, -29, -159, 249, 153, 52, 65, -241, 138, 202, 106, 71]
3990G1K0K8k05K20j8j85P9j27J74j16q5K04j81J01j74J95n0K45m29L36Ok81J63
4013ik33L11O9j67K56k15l3K3k49K65rj86J16J24M6K0l31K58j01r8J88j68J46
4036B3J98k41L5o1l3Jj36N1P4k7K02j69R1Q0J38J21l97p7K44j17q9J48j94J%J18
4062a6j62J37l7L6o0J31J39k47K04j0j63k28L63j75P8L0j06J56k21J22L71n60
4084b18J48J35k63K21P9J12k29j06J27Q1k10K57j26k9K01J13k83R5J28l86R4r3
4106a52K68o4P0j38M7j23K00j47p4N9R6m7MR8J6q6k55N18n06J44K75L1j91k51
4130b08M37j74k7K8O9k6k18J42N1l24M34K72m22j41K15J08o08J77M01M5l06J33
4152E8j97K0L89j45k83l6J71J50J8j86J27P7j36j63NJ38J7k23J2M35k2l86j03
$$ y = [71, 91, 119, -86, 134, 116, -69, 10, -117, 57, -59, -144, 60, -121, -20, -194, 1, -49, 196, -233, 103, 109, -172, -9, -242, 69, 138, -29, 227, 12, -21, 2, -247, 18, 9, -177, -61, 63, 109, 129, -202, 56, -45, -143, 45, -123, 23, 221, -20, 15, -46, -79, -78, -214, -163, -89, -116, 86, -83, 8, 88, 226, 347, -50, -127, 117, 0, -89, 59, -135, -134, -134, -16, -178, -41, -78, -42, -102, 29, 168, -79, 125, 115, -48, -276, 87, -88, -10, 20, -86, 70, -151, -29, 342, -218, -70, 65, -198, 23, 102, 214, -15, -121, 6, 87, -123, 134, 8, -21, 180, 293, 10, 105, 233, -153, -59, -152, 116, 52, 122, -16, 31, -92, 108, -39, -113, -54, 42, -5, -1, 97, 113, 27, -228, 290, -216, -72, 203, 234, 43, -208, 229, 55, 28, 56, 125, 99, -119, 23, 74, -250, 184, 456, 34, -107, 108, 216, -392, -215, 186, 231, -75, 58, -139, -119, 270, 125, -158, -194, -23, 127, 145, -41, 86, 163, 27, -136, -131, 7, 24, -199, -187, 248, 226, -160, -263]
4175b63N30l98J61R4o1O7j99K95j87m34N53l17o8K82J03k77j70J93J61l87J85
4196a37K17n3l18K65K37k27j7J05J45j86%J09Ll10L33j26q9K65l63j92K66j7O3
4219b7L17m72J80KN1k0k35j78K00J76N4j78L23l43J5P4j61O0L7L04n04J01L61
4242A37K5l73J88K06j17O8j15J97m76K89O6l15j1O58m33j21J34Q1n2j04j6J51
4264F7l57K90J87j12q3k35M3J7J85R7mj97J45m1j27pK20k71j27J08l5L9K46o2
4288a4l7J08n9KJ21n1j56p6J73J74j87j0K87k82j54Q0Qj53PK36Rk49L20J04m02
4313b01R1J86L9k64P1L50K8m64K25p4o5N9J13r1K10m4k26j58K14Mk21J84P3j10
4337g1r8K91j85J11NK16n76P9N12k04K3j44j15L72k75m7J72k10k3J70k28M40k97
$$ y = [-263, 267, -131, 30, 124, 63, 130, -69, 226, 39, -395, 158, -159, -227, 55, 158, -119, -289, -96, 65, -322, -137, 80, 27, -291, -26, 211, -16, -33, 72, 217, 31, 31, 140, 143, -167, 166, 40, -49, 216, -147, -339, -73, -90, -27, 290, -182, -2, 0, 51, 31, -204, -382, -182, -6, 48, -130, 193, -150, -135, -61, -222, -162, -125, 179, -325, -224, 137, 162, -211, -23, 183, 66, 134, 19, 216, -260, 29, 95, -220, -231, 427, -6, -127, 7, 88, 36, -68, -84, 67, -290, 0, 187, 75, -8, -243, -200, -183, 2, 99, 95, -102, 43, 2, -125, -132, 88, -183, -310, -202, -237, -198, 48, -14, -51, 57, -2, 0, 121, 70, -86, -162, 11, 185, -2, -12, 275, -7, -161, -81, -73, -226, -219, 17, 26, -223, 97, 201, -201, -110, 76, 115, -149, -78, 272, 300, -164, 61, -13, -78, -19, 94, 3, 213, 169, -57, -215, -1, 3, -218, -34, 39, -71, -169, 122, -63, 48, 53, 269, -307, -228, 284, 80, 103, -41, -156, 216, -59, -106, 66, -144, -167, 3, -225, 215, -82]
4360h2J00J96k12J04l95J42M2K71j82K2m5m1J58j91L65k83j39J82j23J84k9J06
4382A50o03N10K97l41l9J92j52k68K73k81J20L8J68k3k23n2K71j22J62or5J36
4404A12j43J55o7n4m6J40l9J5K4l7p4J10r8l3P0J09j32q6j27L18k41k53O79k61
4428D1m5K01j32J02k9m47K45K06n2l5m9k5j16J00k0L06l35k3O1M06k99k34O1K01
4452H9l0p1P2m9N6j74L25Nl64K86j59m3J32j55k44K71k3k5M1J14L5k41K44n5J9
4477E6l0m5j91K0L93k38Q9j56J58j28j13L2K42Kj69q1K41k54M51j15m37L91k1
4500I7l82N04k73N7MR4Q6k77K7qJ45J48j17J23j46k29j2J19O2J2j34N7k85O07
4524B79j84o4L6m0O5q8L9j59K37l5j08Q8k17J28q9K08r0L4p1K09p1j81K4K1R5
$$ y = [-82, 18, 214, 2, 106, -289, -147, -105, 166, -16, 6, -39, -80, 78, -113, 252, -31, -170, 12, -111, 73, 44, 150, -453, 57, 354, 13, -26, 166, 14, -254, 19, -262, -142, -104, 64, 41, -182, -234, 37, -85, 77, 71, -24, 112, -31, 124, 57, 3, -43, 97, 58, 73, 97, 60, -14, 96, -2, -35, 35, 144, 12, -74, -201, 117, -124, -377, 302, 41, -4, 197, 65, 167, 138, -309, -64, 142, 90, 55, 6, -19, -135, -35, -55, 251, -84, -107, -46, 360, 61, -173, -112, 89, 59, -12, 60, 11, 67, -107, 218, 223, -141, 145, -14, -57, 75, -80, -324, -53, -76, -101, -60, 54, 89, -152, 92, 37, 56, 26, -19, -210, -190, 203, -35, 54, -102, 56, -72, -185, -153, 89, 91, -78, -159, 82, -172, 279, 164, -273, 118, 97, -285, 219, -54, 3, 7, 101, 187, -90, -63, -71, 74, 222, 105, 228, 82, -147, -159, -40, 22, 34, -100, -43, -328, 279, 95, 31, 67, 27, 92, 4, 43, -116, 121, 86, -22, 66, -151, -23, -112, 96, 6, 40, -31, 178, 107, -74, -50, -29, 66]
4549F6K32l97k1R7k94K91Q7l59K49j36J01K72k29L8j28J37o7J07j60J01J14l52
4571b51K23J4M3j47k4k5L85l88J91O0j91J21pQ2j60P9J33p2k84M00j29k38O1O6
4595e8j22J96J13J06l85%J9O2JK23o4r2J27j51K6j55L60k06L29l21o0m7O7K52
4619B20k00q5q9J07k5J64j05J85j17J85k42K10l45j0K79l50K00j30L14k87L20
4640A99j83qk9m5L3r2J80j58r3K29k65Q8O3J60j00Q4P2k50lP5R8j18K59Q6m70
4665a88R1l3q4J7K02j2qj7o7K62j65J57l7j92j60J08L76k00q6J41j44j07J77n3
4689b2J38k41K54k43j67M89j81k48J98K22k96k5K07j15J21o0k14J39J65j86k25
4710b90L91p3k47K13J74j5n9j65J16j3p6J52j57jPl9Mk0Q7J93j48j19J23j48L1
$$ y = [66, 298, -99, -120, -23, -317, -26, 61, -298, -49, -185, -84, 188, -41, -3, -131, 6, -61, 46, -114, -13, 101, -251, -28, -14, 29, -118, -142, -167, 218, -170, 21, 81, -110, 11, 4, 86, -74, 5, 138, 66, -218, 182, 53, -185, -124, -58, -180, 16, 129, 235, -150, -150, -131, -69, -68, 155, 91, -1, 126, -25, 1, -154, 206, 0, 329, 8, -52, -99, -32, 220, 20, -65, -154, -47, -72, 92, -13, 172, 55, 240, -2, 208, -137, -147, 132, -218, -18, -148, 166, -121, 199, 16, 8, -21, -66, -33, -125, 55, -103, -196, 33, -232, -144, -81, 79, -21, 63, 135, -115, -118, -43, 55, -63, 196, 282, -188, -97, -130, -214, -197, 5, -7, -15, -32, -99, 163, -2, 155, 118, -74, -234, -126, 250, 50, -36, 105, -39, -146, 31, -22, 116, -125, 129, -114, -281, 208, 27, -221, -23, 199, -97, -122, 85, -30, 91, 31, -183, -44, 121, -65, -290, 101, 28, -219, -6, 168, 153, 94, -71, 45, 32, -44, 108, -49, -50, -43, -82, -78, -98, -11, 182, 34, -85, 38, -110, -79]
4735g9l2J62J02k07K02l9n13M70l0j68M2K95nk83J96nk38J29j30N1J21J44l28
4758a43j3J13J71l46K49O9n2r8L11l05q8K12K3j39j08L96n39MpJ46K78l1j80O7
4782a0k42K45l5K2j00K42l7j24K16m6o1j32J58j73L39K3j55Rk68N1K8L4j30K70
4806A24j47j94Q8K91k84M9L4j05O6J10J09j13m3P3j91J16J30K8k24JK4kK85p3
4830A52k64R8J54o8j7R3Rn7k51J79j01o6J91Nl8J1r0K18l50J83J06j8j43l1J81
4855H6K3J07m33K33M8J01j27m9K3l1k5j27L23k33n4o3J50k4J88j17K59m78L28
4878A08J49n16L07K6j49ok2P8n9j27L26j38n2J31m05N21j36j51J62j05K8J03p3
4901@j23P2J90j64k23L83k02J49j76p7J07N8N8j72J76k01K80k54L37k2j51k9J7
$$ y = [-79, -111, 51, 153, -54, 148, 109, -404, 66, 36, -132, -90, 205, 200, -83, 113, 108, -130, -1, -131, -80, 41, 185, -143, -156, -43, 128, -218, 31, 100, 48, -50, 261, -44, -132, 80, 103, -36, -144, 252, -287, -283, -290, -144, 134, 103, -77, -10, -252, -7, -42, -20, -120, 122, 85, -39, 177, 131, 70, -62, 96, -77, 262, 285, 130, 139, -129, -78, -50, -16, -146, 124, -23, -217, -129, 162, -122, -73, -39, -144, -78, 32, 141, 28, -15, 58, -133, -17, 113, 141, -83, -82, -58, -60, 225, 152, -112, -14, 140, 72, 55, 148, 157, 100, -151, 28, -73, -139, 52, 57, 19, 30, -60, 158, -192, -9, 97, 79, -64, -95, 86, 109, 216, -217, 16, 64, 165, 38, -11, 12, -19, -44, -171, 152, -81, -135, -198, -48, -72, 116, -1, 258, -220, 108, 257, -259, 48, 74, -75, -81, -103, -25, -84, -211, 115, -23, -75, 56, -349, 172, 36, -115, 47, -58, -30, 73, 0, -123, -51, 139, -25, -248, 135, -67, 82, -94, -171, -64, -6, 52, -120, 56, -145, 135, -119, 218, 196, 45, 16, 33]
4924C3q9j67L28k4l26K2J87K58J8k39l0J40j76o0J04K10O3k38J31j59k09J95K09
4947A81p4Q7m36L41q7L66j07l85K45l27M27l09K3L33o2n0o5K7rk55J58J75m92
4970b95N7L6M31l59n2K73j8j13l9J61m0L5L0k32J31K3R0l20K05j59M36q4m58N42
4994B81k84Q1R7k73J64%m4n1K42M5m38K93j91K13l40L04k0o4j17K3K07l70K23
5017a9J18o5k8k1q5q3q5M73K35m02j07MO9j01K10M2j58O3L1j14j4J53j37k3k0
5042f4m0M26l87j29P5lm9P1j31L15L5J9k83J74J62j75K46m06K53J7j53m1J15k4
5066B3j08r1K09j07J54k36J41j50L25k16N9L6j90m5m3L03k9Q0p1j0o4k4m6j46
5090b46K87j18K35k08M2K10k44R5j08J23k23J72M9k84L83l4k35n4L47l82j08N17
$$ y = [33, -56, -223, 105, 81, -245, -223, -36, 222, 240, 1, -29, 111, -65, -125, -21, 189, 252, 14, 145, -14, -223, -28, 181, 107, 194, -242, 99, 12, 378, 271, -114, 131, -196, 231, -78, -55, 278, 216, 166, 101, 128, 119, -136, 22, 197, -295, -238, -202, 229, -130, -182, 91, 73, -40, -79, 82, 42, 77, 107, -125, 6, 29, 119, -201, 4, -155, 281, 197, -261, 281, -3, 78, 175, -98, 66, 66, 22, -29, 213, 258, -180, 113, -78, 135, -205, 99, 79, 15, -102, -79, 128, -242, -19, 99, 34, 6, -15, -100, -183, -268, 205, 440, 38, -69, -65, 4, -97, 113, 155, -3, 60, 91, -23, -37, 116, -21, -44, -64, -104, 322, -65, -194, -119, -122, -171, -100, -231, 84, 119, 138, -145, 29, 191, 16, 262, -144, 109, 126, -27, -68, 47, 23, -85, -176, 33, -74, 80, -156, -15, -165, 160, -56, 3, 39, -151, -196, -239, 64, 35, 115, 44, 34, -30, -54, -100, -246, 41, -77, 158, -50, -8, 202, -42, 53, -55, 68, -155, 17, 66, -218, 165, 131, -104, -158, 189, -193, -301, 216]
5112B16k22o2P6J13j38j17M6Q9j84J92J5p6m1J26n1R0P1j45J06j73N%O1q8J08
5137A7L14l65m5O2N9q9J49Q2r2N1l4j70q7J33p4J37r2k14J40J05k4K37m08j98
5161d06N23M1m70L50j47L52j41k48K22j03j44L88m30K22M1R9r8k58K96j01J5M3
5183D6q9P4Mj41k8J29K74l08r2K04k90M34j82K55k55J45k22J59j05j01J80k36
5205a45L99k56r6o5J50K0J40l39L55j70R1o2K6j73J11J48o1j79J73j79L7M8J08
5228H1j9J1k2j1k09K37k2k84J30L5J06j15N2o1K19l2j6l6l1j33KJ57j24K01m15
5253b99J99J96j47L3j5j45J05L1K88j99R9l11M22l18m0j12L75j48R3k30J38m8
5275c3J09J46l63R1L5J6k65L63l7mP2j4k91J19K5J4M0j47J60r2J56N1j28J49j71
$$ y = [216, -6, -68, 8, 121, -17, -134, -88, 1, -183, 9, 24, -52, -93, 33, -18, 72, 143, -2, 104, -69, -64, -64, -3, -91, 17, 331, -34, -79, -17, 42, -47, 102, 184, 92, 143, 109, -61, -148, -15, -89, 48, -44, -258, -118, -13, -37, 200, -208, -406, 117, 158, -312, 38, -109, 243, 102, -146, 76, -27, -171, 217, -213, 9, 50, 149, 51, -207, 89, -12, 3, 46, -43, 31, 35, -106, -134, -5, 269, -39, -131, 73, -217, 217, 35, 290, 35, 180, -42, 117, 12, -89, 91, -145, 254, -2, -98, -163, -13, 7, 147, -192, 163, -7, 84, 22, 48, -125, -14, 134, 73, -106, 67, -112, -75, -27, 81, 62, 73, 51, 40, -169, 68, 46, -238, -108, -73, 33, -82, -30, -91, 128, 96, 80, 44, 13, -120, -118, 39, -85, 116, -299, -100, 96, -51, -18, -33, -178, -73, -42, 246, 47, 146, -165, 257, -61, -101, -213, 162, 14, 107, -123, 15, -33, 76, 222, -141, -50, -15, 1, -264, 99, 62, 58, 130, 116, -175, -56, -31, -17, 23, -124, 36, -56, 100, 151, 23, 172, 1]
5300Aj59J59J13j33m2J61L2k53J67K4r5k54L60j55J49R4j75R0K18l66Q2N8p8K4
5324B2M0j41J95j01o3j8J30n7O4J48p6m74M2K96kj32K26Lj21o6J74O4k1m1r2j04
5350a05J23P2j11jJ61Q1l09m4J40P5j61L8K98n27N71l54J00k04l16M88k31J39
5372g7MJ20j89J11M4j47K1Q3j31R1J20L1l55L72J03j54Jlk94K83kj15M13m01J69
5397I8j85J46P8N2k75j8K05k13K29k6O8k2n6m7J4L2j03J14k67K97k18J51J98j05
5421A47mj26J5N7q4R8p3K38l72o2J50j8K57k12k67N43k2l47Q1J57j42k7j65J93
5445A5o8Jk3j05N20l94J27p5r4Q4j5o5L8q0L20k46M3L5M8Q7j29K18l83J70J26
5470A55j21k74J55J79k28L22m36O03m15J11l30L53n0p9K81p5n2l98P4N7J34J45
$$ y = [1, -158, 1, 114, -19, -61, 100, 132, -121, 46, 70, -25, -279, 81, -74, 75, 169, -6, 84, 302, -64, 18, 76, -2, 22, 62, -79, 116, 15, -48, -66, 64, 7, 71, 219, 143, -331, -289, 7, 5, -127, 99, 102, -19, -85, 89, 153, 132, 91, -1, -105, 18, 90, -21, -22, 139, 220, -89, -133, 7, 82, -79, -41, 257, -270, 301, -53, 47, -157, -473, 15, -216, -77, -73, 47, -142, -31, 13, -134, -113, -30, -161, -70, 50, 81, -274, 98, 201, 47, 48, 45, -249, 34, 32, -83, 330, -71, 98, -87, 59, 137, 189, -86, -104, 101, -112, 117, 91, 159, 137, 81, 34, 48, 80, -23, 91, -176, 121, -97, 54, 252, 147, 143, 17, 32, 89, 5, 103, 30, 268, -104, -166, -16, -34, 223, 11, -256, 287, 265, -82, -1, 156, 14, -13, -178, 15, -53, -52, -75, -180, 340, -54, 73, -2, -96, -12, -27, -92, -54, -134, 186, -60, -17, 18, 66, 153, 24, 242, -141, 29, 155, 34, -240, -85, 94, -134, 188, -248, 355, -60, 51, -279, 74, 24, -55, 226, 151, 99, -299, -225, -168, -34, 111]
5492A11j6j48K62k56j01J77oj18P0K4jk92K49R%n4j05L56j3k38K30j07J22m18
5516b63K20M3J03p2j33pJ71L06l26Lk25Q4Q5pL7O5k56R3k26O63k99J91k89J24
5540H5o9pm1J82m25J90k0q7J78K02p3j88M5O0j85J83n8k91K90R9L1j71K16m8n2
5565D6j6P4k29K47J15l14M7J1O1M2n4jq8K35jN0k77NJ98k77Q8ML78m60L10k28
5591c4J68k64LM93k09q1J16l50J3P2q5P6Q0or1J18j48J51l09L06k07J51J10o7
5615Fl0j79K79N5j46l2K22p4j27k09J86N9N2j2j56K60M6l6k0K2Lo0k23K91k33
5640e6k10L75p2R4rJ05l57J38J8P9k09j00K59j31M1j52J85O3l8j43Q3K1J43j58
5664c1O5K74n32M09k5k32L4J19l33K44j57J22r7LK15k71K61n9K35j82p1j09J23
$$ y = [111, 95, -53, 209, -47, -148, 29, 23, -95, -25, -1, -2, -294, -45, -36, -36, -90, -195, 161, 148, -90, 140, 33, 155, -263, -43, 0, 103, 31, -102, -109, 62, 368, 42, 45, -180, -96, -11, -18, 19, 84, -172, -79, -305, 358, 59, 250, -39, 85, 16, 9, -32, 150, -275, -85, -105, -192, -14, 188, 115, -73, -28, 32, -153, 30, -28, -319, -29, 70, 101, -70, 146, 98, 46, 30, 104, -125, 122, 237, -77, -30, -19, 42, 84, 30, 29, -59, 176, 175, 225, -52, -47, 151, -126, -38, -34, 344, -116, 194, -34, 134, -130, -127, 366, 157, 76, 192, -158, -145, -73, -158, -82, -2, -8, -99, 19, -129, 22, -287, 19, -188, -37, 73, 6, -24, -203, 76, 131, -15, -47, 175, 101, -26, -235, -49, 10, 62, 50, -106, 154, 200, 164, 144, 166, 169, 109, -114, 177, -56, -266, 109, 37, 131, 122, 227, -130, 8, 26, 105, -104, -204, 55, -76, -35, -187, -2, 61, 23, -120, -37, -16, 127, -31, 34, 308, -224, 185, 160, -72, -38, 81, -252, -8, -165, -43, -140, -137, 78, -193, 68, 9, 244, 62, -9, -118, 5]
5687El75L55l9K19L2k82N4k9L5J51j32k53L89j36J05j1p2j32R4L6Q5l18R6kK96
5712A71l52K9J53j05J57k5J16l80K3M5q3N9J14J35J84R0k09l30J89O4k76K68J09
5735A46j42J16m1oj20r7K35n2n1L6N9p7K4j92J03o5j14K07M1J41L6k01Pl6M9J12
5761A18q3k9K56k16l3J70k26K47p4j34J0J5r3J05j78l1K49N1l78K35J20j95q3
5784a77J61j51R4J77K16l73M0k11K23n8Q5k7k44L23n3j06J74k2l32K55j98K26
5806B2l21J25J31rl0R9L5n1k45J76j41L2J32J0J73n3L3R4k76NJ2J33J96l35L0
5831b3p0k5L2jj6R9k8l2J32k98M75m64L08l9Q6k40R4j20J83q9k68M80k61J25l4
5856Fj8J65m64J22O60m58l5j5m4m7%K61m2j25J21j78J68N4k24L9j10K20OJ84r6
$$ y = [5, -370, -15, -54, 165, 197, -85, -31, -60, -25, 126, -6, -259, 130, -6, 99, 88, 16, -116, -22, 14, 99, -219, -123, -125, 171, -181, -152, 1, -104, 53, 28, 144, -236, -213, -168, -251, -192, -78, 57, 241, 331, 122, -208, -19, 45, -231, 37, 146, 4, 120, 79, 73, -47, -144, 91, 39, -12, 24, 83, 6, 30, -162, -59, -124, -238, -31, 10, 151, 187, -14, -7, -43, 6, 118, 35, 6, 262, 46, 13, 183, -43, 204, 130, -4, 6, 21, -72, 33, -145, -176, 73, 124, -254, -19, 101, -94, -177, -16, -167, -73, 104, 320, -53, -13, -224, -1, -59, 26, -1, -245, 78, 25, -81, 93, 71, -261, -6, -204, 22, -299, -174, -43, -52, -82, 17, 52, 1, -244, -68, -209, -177, -45, -35, 138, 85, 118, 212, -64, -59, -47, 86, 282, -53, -23, -93, -118, -86, -87, -103, -4, -32, -64, 68, -230, 245, -219, 89, 50, 136, -104, -10, -130, 53, -36, -304, 176, -85, 40, 6, -12, 153, -311, -189, 471, 13, -22, -37, -81, -128, -128, 133, 91, -34, 87, -91, 77, 131, -93, -54, -164, 56, 62, 246, 150]
5881A50j90J03J04j41j37J27K80k14j97K1N7j90J94J60j03k23J46n8p4K35J03
5902A53Q7j20m09J39R1J66k61K83j20r1J18j34p2J26L7p3K50j16n4k33J43PJ85
5925A02j48J6j35O0K09j11j68K31J0l05J63k09L36r6o5K29j58O2m6J37j90N2k5
5948d9M8J42l9k72J04K41m0j23j58J04m6J96j36J95m04J57L97k75K3k1O1M2j25
5971B2k29K41O6k27M0L60j79j6P1j52J04K5j86j00k43J95Q4J50O8j76K17j49J90
5994A76j62k02J20K10l00J62m0J53L1J2O1l52K17k2l9m2k80L07l5K95k61J42k18
6017f7l0k1K81Oq4j31o8J20m2k90L23P5k8J02rj43j10P9r4P5R4J53k43J09n1j
6043EJ61n15L53J04k94L75l32J65r9J10k45P1J92k9j2r6J99k46J69j43o5J22K0
$$ y = [150, -40, 63, 167, 26, -111, 16, 296, 82, -115, -94, -37, -227, -33, 127, 24, -199, -53, -111, -185, 50, 153, 240, 120, -289, -150, -59, 107, -154, 129, 9, -82, 36, -98, -170, -44, -7, -80, 170, 54, 0, -233, -90, -83, 102, -46, -30, -165, -105, 104, -7, -175, 56, 66, -239, -76, -285, 51, -45, -110, 119, -39, 23, -23, 114, -76, -24, -49, -1, 141, 102, -170, -66, 175, 135, 12, -146, -42, -88, 108, -28, 167, -237, -80, 317, 42, 65, 44, 105, 147, 22, -207, 34, 100, -127, -87, 273, 94, 78, 149, -3, 101, 126, -60, -160, -403, -208, -124, 26, 94, -82, 135, -14, 176, 14, -188, -68, 142, -158, 4, -36, 117, 148, 160, 221, -131, 86, 64, 25, -17, -297, 10, -25, 270, 9, 151, -67, -97, -118, 163, 169, 85, -46, -114, 6, -36, -326, -3, 72, 44, 146, 137, -6, -116, -37, -131, -56, 38, 191, -52, 57, 6, 5, 166, -349, 4, 108, -186, 189, -143, 22, -77, 33, -212, -141, 51, 22, 10, -86, 113, -133, 36, -107, -172, -50, -30]
6066c0J16j4O2p5j9j61L43j85k99J35L34j65p9J40k04J23k02J28oK68j25K9j52
6089c8n0J47j04Q0M5k30O4N3nJ19j71p2O2Q0J2r9J82j29j34J22J47M5j40Q0O8
6114A34j22l5J41j67P2j21K92lK8p1j87q3M8Q6p1p2J42j5k12o2L69l6k07J09K27
6139A84l01j00J63r7L49l82K9L66j16k94K14j91K36p6r2O6j50K19k3l7P2k3j78
6162a62K79k45J12j60J96J24j98l4J74j00J55R9j18k21o8K25m9j44J47J94k13
6183gkJ30j61n4K38j48R0K8j96J1q9J88p0J57k8r0L7r3N9m4K63m11L36q4j80K39
6209A19J9l7j24J2K0j16K38j83k2K54l06L53L3j56p7K1n2K33j28j91M66m76J05
6232Er3K1l2Q0J73k71L96k70m7j52M00k95N7o1K44k28N4J11j25N4J00p7m3l6K9
$$ y = [-30, 86, 72, 134, 59, 40, -121, 222, 37, -262, -127, 207, 42, -37, 103, -101, 22, -180, -52, -58, 210, 85, 114, -38, -88, 59, -45, 35, 80, -150, -86, -33, -38, 81, -90, -162, -100, -20, -8, -107, 75, -54, -188, -66, 81, 126, -14, 66, 134, 12, -23, 118, -49, 23, -98, 194, 191, 219, 148, -39, -122, -74, 12, -59, -131, 11, -4, -216, -278, 91, 55, -152, -43, 184, -117, -217, -54, -151, 198, -184, -155, 211, 95, -199, 15, -176, 60, -16, -108, -42, -192, 27, 4, -33, 39, 16, -162, 117, -128, -16, -176, 20, 144, -54, -88, 86, -14, 141, 240, 122, -99, -167, 58, 9, -135, 12, 206, -7, -9, 121, -40, -94, 144, -4, 86, 114, -82, -71, -160, 28, -42, 115, 87, -3, 34, -59, 0, -44, 219, -192, 144, 60, -120, 119, 138, 101, -23, -11, 9, -107, 131, -52, -74, 180, -126, 227, 260, 104, 27, 48, -4, 229, 101, -90, 376, -100, 5, -88, -67, -99, -19, 154, -117, 279, 9, -38, -190, 210, -85, -28, -89, 155, -73, -19, 92, -33, 21, 121, 44, 1, -35, -6]
6257fJ49kq3n4r9J99j32jL23l88M3K28j02j07Q4P5j63J86lo0j99R5p3j27L30l00
6283a87L17j89k08L93k72mJ98k12R3J03J17j32l0r8Q8n8J31QK00k30l8K57l15
6306f8O8P4J9RJ13k68j43K51j96J08K05l34j0K63j14%K14r2k48J58K1K5L2j93
6330a06L5j20p8L39m13K82N9J1m9j31L3K73N0m18L74M1m6j34jj07L20o4L4j81
6354Cj85K36J6O7M1j43L6j30l0KM6j1J47l54J95J52j38L03l45J80J11j11r6n4
6378f2J82l6l4NK21m19m7J38M6K9M5j28k6K75j61K7j79J3J03k09K87Kl00K39N4
6403F5j54K66j74O9J0q8o1k6J48j04lR5m8k30M88j92Q1k66J76kj25K31l92k0K63
6428GL29m21J48j94Q6J26k04J05j93K44q1P2l5J11j7j18Ll4J45Pr2J41j75K52
$$ y = [-6, 143, 141, 58, 4, -95, 104, -28, -29, 294, -94, -51, 177, 75, -32, 52, 127, -36, 150, 147, 87, -112, -17, -90, -217, 113, -187, 130, -59, -267, 126, -146, -150, 48, -164, -71, 32, 149, 17, -13, -111, -23, -81, 50, 58, 258, 28, -10, 247, -68, 0, 74, 93, 102, 215, -53, -196, 55, -141, -33, 172, -162, -172, 91, -23, -23, 191, 99, -149, 9, 30, 55, 87, -106, -71, -191, -269, 70, -343, -61, -2, 9, -40, -171, -138, 135, 185, -233, 141, 182, 136, 2, 1, -106, 214, 150, 184, 3, -182, 54, 70, 137, 178, 35, 71, -59, -89, -87, -41, -52, 95, -259, -64, 88, -50, 253, -92, 88, 199, 88, -8, -62, 120, 84, 50, 55, 276, -143, -190, -52, -6, 23, 68, -60, -86, 189, 28, 55, -124, -111, -8, -217, 70, 72, -228, 11, 65, -89, 177, 3, 72, 82, -6, -67, -93, 55, -49, -52, 43, -5, -235, 253, 61, 142, -124, 52, 50, -75, 156, -236, -256, 7, 336, -85, 63, -131, -45, 81, -123, -18, -211, 33, -48, 24, -11, 100, 83, -35, -32, -66, 79, 86, -6, 135, -40, 212]
6452B12k03R2j98k0o8K46j35K79%k42O5j1j09Q7r8K19j44j78J79N4j21J76q2Q7
6476H7M9l40M74l53J27k4j8k16J80J19L0j78K64j42j69K05k61J91J2o1J52j49
6498b1j10J53J13j1l46K14PR5O7j67k08J52K98j52J62l46M7pP0j08J3o6J56K69
6522B74k24j14r6L19m67J95L4J53Pk86J45J55k53M2j0m7M63n15R7J9N2Q9j48K77
6546A61k35k32M39j05o6P8P9j69K2J71J0R8j27m14J05M51l1m0k96OK28j88O3J25
6570A33k43R8R3P6l12J14K18r7K04n86Q0L79k48l0J17J91l38K2K91j15j82n3J00
6593h8K22m1j09K41r7l35P4k54M58j60K6K22k28j40l5K56k84M06k29j26K17J13
6615A09J11k52j89K47J36j01k18K75j71j82N2K51j84K6j2K32l3r7N0k81K22K7
$$ y = [212, 9, 101, -97, -117, -185, 61, -74, 205, 205, -37, 28, 17, -92, -5, -103, 116, -28, -206, -27, 27, -94, 82, 0, 87, 136, -204, 270, -83, 44, 20, 2, -214, -34, 85, 115, -63, 201, 59, -110, 95, -166, 25, 37, -24, 128, -21, -131, 22, 135, 124, -222, -8, -1, 94, 161, -6, -214, -62, 236, 84, 246, -100, -53, -60, 10, -98, -85, -151, 5, 274, 50, -64, -160, 159, -308, -113, -79, 74, 81, -205, -60, 95, -158, -116, -126, -173, 290, -225, -128, -109, -57, 32, -116, 161, -74, -306, 133, 28, -38, 40, 119, -50, -28, 143, 153, 251, 124, -290, -185, 266, 235, 195, -101, -95, 133, -55, 8, 133, -110, -12, 81, 157, -155, -41, 177, 80, 284, -302, -222, 157, -91, -121, -4, 187, -151, -129, 162, 47, -135, -188, -88, 134, 93, -16, 225, 128, -207, -133, -387, 71, -89, -63, 159, -69, -209, -244, 12, -272, 134, -95, -221, -4, 109, 220, -32, -221, 26, 162, 61, -157, 118, -53, -235, -183, 68, -116, -90, -102, 130, 97, 0, 50, -231, -9, 18]
6637A8m4j34K59p0J9j1R4j84q7m7Q5j8K33J1j51J82k19M6l7L5J76m04R6M6L2k17
6663b91K81Q6k47K72j8j49R2J88j81r1K25L9k07p0R5J43j54K93l47j50J99p5J13
6686D6N5q5j91J2N5P7K5j86J30P6O5j03j08p2K76J48m01K01n6m6L78j68j82k31
6710b85L70L6Rj06j79L00k32K28l33K27j41J45K77n64J57K55k35R8MJ13j98L17
6732B63l09j32p1L26r6j89k9J72Q4M4j17o2Q1k2K93j94k06n4M54l65J95K70k78
6755E8j14k84L31K4n3k93L20O1j12j79K35J19o5k08q5L21J49k08j91L96k87J31
6777F6k19J37l91L86j16J32J35j21j22O6l4J90j50j88L42j03J63k31P5k04Q6O1
6799d0M0L09j52j7k01K96j73J30j56o5J6N7j08j72M09k90L22k46J30k59Q4J83
$$ y = [18, -26, -160, 99, 29, 48, 37, 131, -53, -140, -187, -102, -120, 113, 124, -27, 155, -64, -18, -55, -20, 156, -248, -152, -106, -74, -291, -10, 76, -171, 101, 83, -66, 26, 214, 33, -58, 167, 206, -1, -71, 24, 167, 13, 306, -41, -191, 8, -67, 46, 101, 16, -175, -163, -108, -31, -6, -192, -62, 14, 79, -24, -132, -204, 72, 220, -181, 20, -36, -82, 296, 128, -54, -285, 85, 121, 130, 24, -155, 145, -87, 141, -192, 35, -106, 39, 316, -248, -91, 164, -71, 27, 31, 144, -54, 263, -46, -178, -249, 77, -19, -208, -237, -65, 19, 63, -54, -116, -35, -57, 236, 42, -164, -218, 236, -129, 66, 336, 58, -56, -340, -9, 15, -38, -331, -11, 50, -62, -241, -6, 113, 48, -160, -245, 76, 225, 17, -174, 222, -65, 66, -153, -16, -407, -21, -137, -5, 130, 9, -113, -47, -81, 109, -41, -229, 113, 10, 173, -58, 17, -187, -101, -40, 0, 309, 157, 140, -61, 235, 62, 192, 36, -29, -13, 44, -64, -236, 173, -117, 205, -41, 89, -170, -86, 97]
6821I7p2j16K52k54R8j91K2J26m5Pj75M0J11L4K00k1j7k66K33l22J69J15k60J93
6845d2n0K13j96M6k26M09ml06P3J55k14L37k38q8K88l5l0q0J01j44O0j73J84M
6869D4L0k53J17o1j4J69L8j66j10O8J4p9J19k0Q7K19n9k27J65j38R0k88L58K3
6893A26l58J48J94oqN3k77J31k9j27J72r4L8N7M5j21n0O3k25N39k45j15O9L7o5
6918d8J34j06O7J8j78J57O2r8k26J40L50l34J4M8l73L24o8J57j60Q0J86k14J32
6941F4j13J12l1j47J75j41J82N4k39J04j33J95j90Q2J72n12M17j62K87p8K4j36
6963a4o4J95j24j51J28O3L9q3j18J28r1m4n5J20K74r6L6j99J78j74j88J36K61
6986A57j04j34K39j00j16K11k61J5K04k88J96m2L5j07k2J73K5o2K45l57O8K80
$$ y = [97, 25, -91, 161, -93, 5, -186, -164, -38, -83, -76, -251, -211, -100, -66, 134, 113, 96, -170, 63, -259, -90, 25, -235, -42, -92, 121, -75, -29, -255, 154, 150, -156, -83, 72, -142, 195, -43, -131, 157, 122, 92, 12, 113, -31, 29, -144, 40, 44, 74, -179, -62, -123, -137, 32, 70, -96, -206, -138, -124, -203, -84, -104, -17, 202, 143, -84, 81, -57, 33, -255, 103, 126, -232, -84, 110, 104, 96, 149, -128, 3, -26, -153, 19, -75, -37, 20, 65, -56, -106, -43, -268, 271, 26, -89, -20, 17, -48, 86, -20, 47, 65, -113, 44, 106, 8, -218, -78, 272, -62, -48, 0, -373, -49, -117, 40, -120, -40, 146, -68, 64, -49, 63, 32, -115, 60, -81, 101, 155, -84, 20, -113, 82, -108, -26, 146, -366, 51, -111, 176, 98, 122, -14, -78, 117, -7, -158, -30, 33, 72, -11, -129, -1, -92, -136, -191, -71, 203, 107, 143, -56, 122, -52, -240, -104, 157, 53, -81, 158, 58, -58, 153, -108, -93, 111, -177, 19, -23, 12, -95, -117, 56, 81, 19, 264, -93, -25, 255]
7008B55l17J81k6k41m8K40J23P5o6k0j91K29m44L42j36j30J99J95k99J89j35j28
7030a53K31j05k5Q2J29j01Kj45j5J11o6L51j96k23K03J7P1P8m84O9J35O2O1j24
7054c5K2R1rk55K00j55J88p7j7K2J38J17j22j14k56J17pJ64J1L2k8l0o5o7L80
7079B45m23J90m6l0J50l08K54k75J20K63l67K75o2Q6P1Lk33Kj1K31j22p7J20l87
7103c31L25P1q0J49k74J31q3J13j76L2J88O6J15k00j90J52j2m1K87l06J60k28
7125a32J88q1M4k03L6J01K59l51L4J33j3k53L35o5J9j33j6j26P9K49k2n3l3R7
7149I3k05K18p6n7K39p7j55J36j16R6Lr2l0l1O1n2k37K40P5k73J51k0J49k5J20
7174A35p0k07N3k4K93Ql47L13j19J39l60J73p4J71q7j39J05l19M75j16J75k82
$$ y = [255, -62, 119, 93, -148, -196, 44, 167, 242, 176, 156, -35, 194, -250, 92, -44, -174, 25, 220, -79, 110, -25, -153, 78, -27, -52, 30, 159, 58, 60, -85, -100, 11, -55, 296, 100, -123, 80, 97, 168, 246, -238, -169, -34, 28, 89, -35, -13, 78, 69, -186, 14, -141, 47, -30, -47, -25, 113, 230, 108, -6, -262, -145, -152, 12, 23, 55, 27, -3, -68, -135, 245, -178, 12, -34, -64, 86, -222, 32, -243, -123, 140, -227, 48, -14, 72, 143, 146, -87, -85, -96, 135, 13, -64, 56, -331, -6, 65, -15, 134, -140, -9, -92, 21, -155, -123, 65, 131, 246, 46, -144, 8, -4, -45, 242, -64, 96, -132, 56, -25, 19, -184, -148, -47, 212, -139, -105, 28, 15, -238, 97, 32, 51, -82, -98, -224, -145, 104, 82, 29, -4, 93, -112, 106, 30, -27, 212, 135, -20, 116, 0, 96, 99, 7, -23, -54, 7, -45, -282, -42, 33, -240, -89, -109, 40, 15, 135, 65, -142, -89, -113, 180, 188, -159, 154, 35, 174, -186, -13, -87, 84, -3, -142, -37, -356, 119, 3, 178, -104]
7196a04J10j88j9J79r8k7PK03k41J74Kj27J85j67J23rp1J38j0k53O9J76l23J70
7220a01N5L50p2k03J28j50j52o1L33j30p1m5J24o5O5N3j32J93L6K0l98J97o4L0
7244f0R7Pj28K1m3K15j12k58L58j36J94k99J34l5Pj22j96N6L04r7l1M3k1Q4L3
7269A5J78MJ22l92K46j46J76j54K2k13J28n3l2J21j41K55k66P7q9o1K81K0j89
7292i1J45j83L56j58j55O6nO0j2J8J24Q4k29RK20l03m1MK35j88o2J42O8k02M58
7317C60m37J92k37J48j0k38L04k20J13J35k98M03j87q2J72j8o6m61L10m1klJ62
7340an5J73k19J1J38k31J67n6J02J84j57p4LL1j70L8J65N1Nj55K40l41m2J85L2
7365B4k3j42J81J81p5k52j14J43lJ28K87m13J5M1K9j63J23M6k03K41k27L43l45
$$ y = [-104, 6, -182, -201, -22, -120, -147, -140, 63, -178, -4, -2, -129, 56, -111, 12, 3, -68, 70, 60, -193, -124, 52, -271, -101, -46, 304, 232, 29, 157, 7, -145, -206, 127, -3, -74, -119, 5, -60, 5, 58, -74, 119, 155, 175, -223, -26, -90, -60, 37, 44, -84, -63, -106, 109, -3, -261, 97, -39, 155, -144, -10, -45, -38, -160, -356, -300, 4, -93, -124, -81, -102, -18, 15, 193, 197, 319, -73, 173, 27, 203, 49, 71, -142, -14, -67, -99, 22, -119, 136, -130, -53, -142, -203, 78, 98, -91, 54, -129, 227, 69, -86, -20, -25, 35, 23, 41, 165, 249, 20, 29, 249, -54, -95, -91, 144, -44, -106, 36, 104, -98, 360, -77, 115, -122, 26, 16, -222, 82, -138, -25, 110, -188, 215, 28, -54, 118, 100, 34, -427, -117, -158, -160, -163, -1, -56, 117, -102, -91, 47, -184, -17, -73, 29, 213, 56, -18, -15, 16, -154, -116, 49, 100, 105, -50, 190, -151, -193, -8, 24, 1, -141, 40, 221, 146, -106, -220, -77, -80, 48, 335, -78, -63, -22, 7, -156, -33, 13, -190, 51, -176, 167, -178]
7388a78K66o3o7Q4k26L19k34R2J74o8j27K98j81j72P6k8Q7m6n8L88n33Q27p58
7411a28m3O9J24m9J02k15L9J2K26N1k97K72j33j0J42k85Q3k64L56q3J67k99J96
7434C3n9j4n2J61J27n5q7k0J69k0j61J7r2K52l90k9P7J29qOQ0j24k2J00j22L4
7460g0K98k30R9l46J67J74kj9p7j44L1PQJ8Q6n9K45k09j61L23j75k36L30q3r6
7485a21m7l0M6K17Q0LK19l11j3J65j64j53J80J28k01k55K08j16L93k8M9l90J86
7508D5j47K23Q4l78J31P8l2p3K31o2j04j73J99j21j7J81k64J81L4J11Rj19K3K14
7532B54k30j23M1k30L55J8l3j03nK90j35O9j76j0j73j7L20k60L34k03k47J49j08
7555b23J95p3j49L59j80P6l2J16j60n1J21N3n4j3ML2r5k1j07J73O5q5P3j50J44
$$ y = [-178, 88, 25, -42, 42, -184, 135, -99, -7, 167, 99, -28, 270, 89, -83, -7, -35, 52, 6, -52, 336, -197, 630, -128, -171, -102, 22, -27, 75, -140, -101, -89, 137, 188, -109, 163, 30, 20, 162, -123, -40, -304, 52, -31, 136, -163, 33, -26, -40, -92, 69, 196, 141, 54, 34, 203, 183, 22, 39, -53, 199, -191, -220, -143, -14, -22, -16, 64, -60, -82, 18, -104, -70, 228, -2, 97, -249, -82, 92, 90, 71, -6, -150, -119, -112, -104, -86, 0, -59, 186, -23, -184, 139, -36, -272, 58, -25, -121, -168, -198, -152, 65, 145, 148, 367, 56, 43, 208, 44, -109, 71, 199, -2, -257, -49, -165, 228, 200, 249, -141, 45, -102, 121, 205, -173, -42, 36, 4, -69, 162, 100, -4, -177, 22, -99, -116, 65, -199, -18, 16, 127, 136, 17, 40, 254, 24, -99, -58, -288, 67, 85, 52, -51, -56, 234, 99, 168, -8, -18, -191, -208, 112, -148, 186, -17, -264, -115, -223, -28, -101, -250, 109, -71, 5, -27, 89, -71, -122, -1, 52, -2, -15, -11, 21, -74, -95, -202, -29, 36, -49, 24, -126, 18]
7580A8J3k67J29K69j32O7j51J54q5N7k3qj05J70p6r4q5J40q5o9R2K17m8j09k36
7605b47N3R7J29J12j43J99k99J40j08j6J03K63m47J44p1J51m49M54j10p0J94J79
7627B58l15J60l1j7j8J1K19n4k40m9J50p9K18l73O8R3J37l07K8J53lm25N49o4
7651F9j85J89J92m20O3K03j64j8J71k80J78N4k3L5r9j01O2P9k35K92r5j1M7K6
7675B9L4o2J03nk20K45l29R4K24j07j97K09J4J00k45k22L02J82J06K0k52r3j04
7698a74J67K47k60k81K60R6L2j22J61J92l96J46o7j26J51j79J36p9O7L07m31J53
7720@L8O8j87K57m5NJ2j62K49l04l2RR9l9q4J28M1k7j66J38j93K38j37O8K00n8
7746A16N5p9k73L8K60J0J50k04M2j58P0k54P8J53P6r3k5q5L5m2L15k43J61m8M6
$$ y = [18, 31, -236, -107, 162, 30, 97, -54, 100, 15, 72, 49, 41, -64, 106, 30, -64, -149, -9, -94, -163, -71, 146, 98, -11, -247, -194, -97, 32, 144, 1, 200, -99, 41, -67, -83, 20, 283, -164, -20, -91, 60, -389, 65, -45, -115, 79, 258, -57, 103, 72, 55, 37, 48, 267, 213, -27, -76, 74, -5, 213, -160, -92, 1, 138, -169, -141, 12, 9, -416, 133, 69, -116, 73, 265, -155, -92, 111, -53, -71, 100, -180, -2, 52, 29, 64, -35, -136, -74, 5, -230, 62, -33, -44, 3, 29, 63, 1, 104, 99, -121, 124, -205, -111, 113, 6, -191, 18, 32, 132, -113, -335, -33, 149, 255, 275, 23, -70, -174, -7, 240, -20, -301, -41, 55, 87, -35, 126, 318, -78, 68, 1, -125, 26, -153, -17, -96, -29, 278, -153, 0, 38, 106, -81, 176, 131, 136, 148, -14, 235, -69, -101, -92, 7, -32, -116, 12, 53, 26, -140, -2, -195, 43, -94, -26, 174, 116, 171, 92, -181, -143, 117, 127, 277, 73, 115, -43, 27, -227, -149, 4, 80, -13, -38, -123, -88, -130, 185, -58, 103, 55, 101]
7771A01j35M3M2p4J51q9j01J01J17J0l22K02r9J7K01Q0l25q2L31k34J53N8L9j46
7795C9k9R4L9j2j82j38M2L94k75j53N0K08L7m9j14l8J82j67J17J64k60L26j39
7818A36p9Q9k96K35p0J51j87p5N7r2K85l48J14P0j80KM96j61j44J23k61M9j0J0
7842h6K04j66o1K91k82k0M4l52M00N7M4p8o9K54j24j87J13NJ09m1j4j49n1J96
7866C7L7j50J95p8j8j3j33K12J10k24O5J24j29O2j0k3j18j8O5L3j64J83J45k53
7890f3J85n0j14n7J26J63J07l98N3m1P5p3r7K25J9P9k42J15J25o8j69q5N22m62
7914a25J15j15N2N9qp4l9J47J69j52q2K70l07L28j19k48R8L5l9Q8j55Rj07K85
7938H5q4r3K10K2k31J76l41J64n1J18K11l00N8K16J11l31j11L27j15J75j69n9
$$ y = [101, -34, 9, 51, -23, 128, 39, -62, 39, 156, 166, -156, 46, -53, -36, 165, 245, -80, -162, 169, -65, 88, 146, 185, 39, 10, 104, 143, 131, -51, -189, -147, 247, -28, -181, -131, 77, 114, 65, -49, -87, 95, -72, 45, 209, -51, 275, 136, 57, 146, -150, 85, 15, 166, -21, -96, -39, -131, 154, -194, -80, -10, -190, -188, 308, 147, 3, 126, -135, -86, -96, -86, 118, -48, -109, 182, -100, -120, -76, -428, -28, 29, 73, -5, -74, 180, 56, -131, -18, -13, 96, 55, 41, -108, -159, 37, 74, -76, 119, 41, 23, 10, -123, 89, 199, -25, 40, 164, 35, 97, 87, 64, -54, -72, -7, 26, -138, 45, 190, -63, 122, 72, -42, -99, 27, 190, 297, -101, -48, -89, -14, -87, -184, 41, 60, 139, -103, 12, 137, 69, -100, -185, 337, -125, -10, -125, -73, -14, -22, -96, -135, 12, 181, 29, -53, 217, -90, 238, 119, -129, -31, 4, -35, 53, -102, -93, -200, 85, 1, -92, 118, 140, -91, 85, -256, -92, -143, -25, 186, -114, -56, 160, 271, -60, -171, 156, 41, 216, 47, -12]
7960a2k12K40q0L08l02L9L8J19p8j31J71l01M68j38l07J13J77k49K21m6j72J01
7982c3J03j78j92K64O0K12l09K39n84M20n3j20K02m3QJ19m04K02M9J73k57J24
8004BK1RM9Jj80m8L41j55rn9k66M45m1k77P8J27n4k6J47q0r6J08L2k49K72J23
8030B15k07k28J90J46r4OQ6k53J92k9J72m60L45r2k06J39K46j6J39k81j06OK77
8053A87k81J52j00j68K28J2j0o4J28j98K49n11K60L5p0L24k27J27r1J23j03J16
8075A18j27J41k14l4K24j09k1n0K55j23j07N6M2k93M25k0j30j11Q8j81J55J55
8097A39j82p3LJ64k00O7O5q7J90j93J63k55L49J98n45P9J19k21K49r3J12o1p0
8120h3Q0N4j6J5j6j2q4n9N5N1L5j96M27m42j9K26j25j02K16Nj31K26j22Q2j93
$$ y = [-12, -224, 16, -64, 244, -58, -19, 19, 138, 60, -71, 100, -201, 267, 129, -178, -65, 112, -137, 84, 38, -134, -33, 70, -108, -300, -36, 24, 236, -73, 166, -418, 2, -51, -171, 31, -12, -4, 115, -289, -87, -38, 135, -122, 2, 23, 32, 81, 82, -98, -146, 195, 40, 31, -28, -294, 151, 110, -167, -89, 38, -16, -42, 105, 25, -71, 37, 69, -180, 92, 215, 8, -220, -30, 116, 22, 28, 114, -139, 53, 24, 196, -264, 81, -11, -217, -78, 168, 152, 291, 10, -96, -90, 187, -94, 58, -42, -210, 18, 30, 20, -44, 84, -114, 135, -376, -116, -81, -151, 173, -54, 73, -18, 105, 2, 118, -9, 132, -82, -116, 108, -1, -22, -72, 183, 60, -47, 9, 51, -242, 183, 163, 33, -78, 10, -171, -16, 139, -43, -116, -113, 51, -149, -82, -17, -104, 86, -107, 56, -199, 150, 348, -197, -118, 1, -220, 29, -64, 48, -13, -83, -3, 51, 35, 50, 34, 22, -62, -121, -66, -15, 20, -176, 251, -191, -210, 16, -109, -211, 5, 10, -121, 105, -17, 65, -128]
8145a28R8q6lJ25R0j97J08PR3k72P3L9r7K38j52OJ85M2j94K9j13K89j13L0M3k16
8171g6J38R2l32K11j7K4mJ7j98l8J05j86R6J20Q6n%m3k6J5
$$ y = [-128, -30, -116, -119, 6, 96, -101, 7, 14, 107, -165, -92, -53, -150, 88, -64, -58, 127, 169, -25, 4, -109, 180, 67, 97, 140, -76, 62, 154, -178, 33, 16, 40, 36, 53, -145, -183, -78, -264, -168, -48, 38, 33, 33, -10, -36, -21]
8191b1
$$ Imaginary data points
##PAGE= N=2
##DATA TABLE= (X++(I..I)), XYDATA
0@%%%%%%%%%%%%Mj2J6j6J6k4L2l2M0m8N6o7P5q8J04j20J42j66J91k16K41k74L14
35A68l54L96m45M99n59O24o92P66q51R43j041J149j268J398j539J695j869K058
53A078k269K507k773L074l419L819m284M838n511O347p425Q868j0909J4041j9522
68a1540L1879j14160J5235J40837j02841O971P4232k0765p0679O0716M2583m6502
80E966m243O5083l7563k9145O2459j3102q4126L5681K7492q3648j3524J07014
92C8344J828j04105O567P3313n4133m1166Q8635J8221o7103M4207O9700l7416
104C6892l4488L1166p027l9607K6552K7215n3833m755N8852m6257o5093O5865
116d518L4557p3927l845O9063j6886n1595N2409N0414p0950l6445O7565R395l1337
$$ y = [0, 0, 0, 0, 0, 0, 0, 0, 0, 0, 0, 0, 0, 4, -8, 8, -8, 8, -16, 16, -16, 24, -24, 32, -35, 40, -48, 56, -64, 78, -88, 103, -113, 128, -146, 168, -186, 210, -235, 264, -295, 329, -363, 403, -448, 495, -546, 603, -665, 733, -806, 889, -980, 1078, -1191, 1316, -1457, 1617, -1802, 2017, -2267, 2571, -2940, 3407, -4018, 4850, -6059, 7982, -11540, 20339, -93821, -78586, 62251, -40590, -33619, 40613, 19848, -50831, 9885, 52468, 5966, 1723, 66806, 29243, 98, 62557, 49455, -34671, 1010, 28502, -55146, -68670, 38344, 40172, -63933, -57366, 15947, -38186, -79352, 9283, 27504, -39599, 4608, 74308, 36892, 2404, 33570, 26543, -13064, 13488, 40703, -13130, -17885, 40967, -5290, -70383, -4518, 30039, -43888, -47733, 21330, 4444, -47151, 5258, 55672, -15278, -51723, 15842, 25237, -6100]
129f100L6868J1683m5652L625K5262k9053j8416L6741n394n8783K1071N9786m0462
142h824l0346O5176K10p1095J8739O5274j6801m0705K3464J7895l5186Q02L2198
155B0801k2932j5291L1626j1324k1695L7177J0591m7323n330L9993j4708m2516
167d0931L6299M4348m4613k1492N2852q90m2531J3297J7063k4671o259K6905J251
180A0628k1734Q299N802k7089J2160L5126k2823j4313L8489j524l8517J1873L1425
193B7802k5416l4787K8137K6123l0822r17L5760j7858l1204J2819P679q569Q380
206b873O418j0553o03J7548n418j9731K3185J9142l4463l609M1967p837l5694
219a2521R566J7255k2323k1290K2555J7057j9653p78J6553r421k571Q902j1156
$$ y = [-6100, 30768, 42451, -3201, 424, 25686, -3367, -21783, 14958, 9564, -49219, -28148, 31638, -8824, -39170, 26006, 26216, -44879, -26140, 39134, 22333, -18372, 5092, 22987, -12199, -11397, 20801, -2131, -17422, 14204, 2880, -18815, 18362, 28953, -18370, -23700, 16293, 1585, -40931, -4632, 39716, -4897, -26389, 26463, 25573, -16958, -3661, 13402, -11269, -17528, 9377, 10628, -11106, -2807, 2995, -24094, -11934, 23192, 369, -13944, 24545, 23021, -15496, -3623, 27802, 2386, -32401, -4264, 21859, -8963, -9880, 25880, 8022, -23182, -10363, -2684, -11253, -2873, 3545, -7008, -7611, 9937, 4519, -15212, 7973, 27115, -7348, -10957, 31010, 23173, -12521, -2955, 14300, -8023, -29313, -6758, 10299, -9354, -10132, 6421, -3000, -5571, 3331, -7825]
232g825o88J8119m200j3681J2238J8199j7586k0361K4802J5737l1654l027K7838
245A7911j0145k3479P484J0348r422j0105O851P371j487P521M145q127P940M252
259A1058j8011L857J9149r647j5287R803J1662j2659j2054J7745P169k3805n02
272a1522J8262o547r700N040L213j881m474J086P842M225J570l909j702J1971
286A3474k882j9709P529J4511j4976j2982J2062J1202r662j1926J3154J0287j4382
299d300n087J0819K010k938m696j13R900k024j0143M756R727P88q473k600J2581
314A0207j626j8002L068J1616o854q375J968R285J968r962L400J1624m716p644
328d043K220N348J950q372k298J0504j702q910M136O447O31m223m377O829J169
$$ y = [-7825, -8513, 9606, 5406, -8275, 3963, 22162, 4576, -15785, 9017, 24754, -6900, -9927, 17911, 7766, -15713, -8229, 2119, -7303, -17408, -10557, -3186, -4673, 2848, 6993, -1134, 6806, 11058, -6953, -3096, 16053, 6406, -8881, 922, 12584, -75, -12129, 5616, 12785, -11020, -11522, 6740, 193, -9507, -4467, -1254, -3135, -7609, -6523, 1319, 5544, 7114, 3205, 1503, 13474, 10592, -9117, -1588, 12923, -2053, -15035, -2973, 8229, -1433, -13359, -205, 10082, -4300, -9387, 1432, 3442, 504, -4192, -4305, 5595, 3571, -6572, -1816, 7911, 8699, 226, -2374, 10207, 8581, -9421, -6353, 5263, -1591, -9966, -7998, 1287, 3255, -6707, -3307, 8317, 3601, -4043, -1823, 3525, 5475, -2897, -5195, 5309, 3607, -5303, -1167, 5280, 5911, 1688, -2689, 4140, 5309]
343E309j1117p01O619mn860l564Q783O651j0955j54J4138k616j0661K284P722
358E874l60r208L14R929l747p193M445K988J908j687q346L905O912r975p015P872
374c384P241p816j0239J3329J2236j4395l033J6941q95j1377O88O212N39n899
388A48j954K973o78L74j879m601Q478M249j6548l31J4929n627j3168P219J2986
403F570o992j1480J4039J1463j3492j20J2947n668o796M282j896l331J167j623
417i30n129K56P646n101r121J3703P071j9952J578J8808p459j3251J1289J2041
431A1449j0193q479J4799N974j3896L441Q194r686k163M401r177j244P431n211
445d360r941P777J3070j0870j0037K1408N888k4049M157K2265j0047j3971J1462
$$ y = [5309, -5808, -6509, 110, 106, -5754, -9318, -535, 6116, -4839, -4993, 9145, 6529, -4132, -1848, 5874, 5514, -3694, -3380, 6549, 2802, -4391, 54, 3042, 4950, 3263, -5083, -1178, 5734, -4241, -11256, -3384, 3857, -3959, -14198, -869, 11367, -3028, -6061, 10880, 9985, -1392, -704, 5508, 6047, 148, -1806, 1167, 489, 863, -1016, -5617, 2861, 7110, -9438, -9769, 5160, -467, -13635, -6416, 6570, -422, -11902, 2137, 13600, 108, -12, 12935, 7267, 471, 4753, 2857, -474, 693, -930, -6059, -5803, 1843, -3258, -12379, 1324, 8395, -11557, -9979, 8829, 1370, -11881, -592, 11449, 1256, -7223, 7576, 13550, -346, 3095, 11289, 1603, -560, 3841, -5336, -6580, 851, -4360, -14301, -6524, 6546, -4324, -14361, 7047, 12935, -11114, -6957, 15308, 5261, -8710, 2752]
458B752Q925j0076n486R226q89o624P294j362j1530R547L689j9416J190J8635
472E875p352j5189J4415J6475j5840j0484K3186M282k2990N512J4285j1742n285
485d852J1025k477r266L976M542q526N78J4128p805j2314J6083K715k2191O185
499h199K0167j1830j4352J6398J2251j6465m289J9332o055j9471J1958R483j4359
512e431Q14R550p738l291R662j980j0438J0223J2929j6728q813K4678j998k7356
526a5917J0084J8396j7106r815J9906O155j8626j415J6746n645j0201J0544k215
539H91j0871J3583N171j5948M610J6104j0757j4704J5812J2336k0546n621K2840
552A2900q200k3960J4813J5187j7426n979J3373j09o076R614O349j3319l64J3004
$$ y = [2752, 11677, 1601, -3885, 5341, 4452, -2172, 5122, 3760, -7770, 1777, 5466, -13950, -12760, 5875, -1477, -16666, -2251, 14224, -1616, -12100, 11086, 15368, -7622, -2110, 12175, 433, -4852, 6173, 3696, -5570, -1594, 2948, -5578, -5000, 9128, 1323, -10991, 5092, 7807, -14384, -8199, 11968, 138, -14214, 2184, 14435, -2030, -6319, 13013, 6958, -12513, -555, 8928, -5431, -4617, 4933, -2805, -6096, 3566, 1586, -8852, 1371, 14300, -2428, -11241, 13437, 11439, -15917, -5833, 12563, -4543, -14358, 5548, 11703, -6923, -8338, 8408, 2763, -7438, 3106, 891, -9980, 3603, 8774, -7174, -2564, 13540, 2783, -11921, 3891, 16227, -4319, -9940, 12900, 4700, -19260, -4447, 10740, -6686, -12665, 708, 599, -5477, 4137, 10486, -2833, -3197, 9807]
566I807j0222q903J9488R7j9526R124J4760j6282j0281J8613M412k4569m99K2960
580H979p727j4684J4976K172j7011O914J4163o326l221J0327k46j0111P952P151
594A3308j9351m169K1027p750j8942J7565J3671k0235r827J6369R16j5591P189
607e820J5986j2419q768J6216J33q715Q120n52j0832R208J3528j0003j0608J2231
621G705J703k3837L61K3037r400j5159J7086O097j6136R62J5036m136j1724O040
635b365O977o813N964J0131j4430o945J4682l737j2298J2235R014j5030o172J4882
649F095j059j8991N514J4982j3740p002J9986L687j1457L718M382q530j291R781
663F075r37q979O477M211j2760L483J3400j3462j1550J5269N788j3196J344J4832
$$ y = [9807, -415, -9318, 10170, 10267, -9259, -135, 14625, -1657, -11938, 6675, 11087, -13482, -13981, 8979, 1252, -13432, 1544, 3716, -13295, -6381, 7782, 1456, -1765, 8562, 8316, -1795, 6157, 13308, -6043, -10212, 10815, 3065, -15877, 1688, 15359, -4876, -14703, 1666, 2582, -13009, -5820, 10166, -2253, -11021, 5195, 5328, -3387, 4733, 4181, -6651, 2557, 16085, 6082, -4526, 7705, 9408, -14429, -14068, 8969, -431, -15590, 1496, 7593, -8543, -7581, 7455, 3319, -8405, -2365, 4612, -2201, 3763, 13894, -536, -7481, 7201, 3464, -8834, 3401, 12415, -2615, -8787, 6095, 5036, -13955, -8441, 6541, -7199, -14201, 5785, 9472, -1985, 1733, 6115, -2415, -3706, 6075, 5138, -3841, 2636, 6847, -5913, -2430, 10970, -2492, -14042, 1227, 7015, -6181, -4837, 9995]
677I995n683j7303P078J1975r059q96J1796m662n942Q098J93o314K927P40j0206
692g263j847J5275O06j5320O024J1390j4556o878J7537L030j2073J014Q876l252
706B563o378O060J832r343K536N987n869M200R052r508q570Q211K120j0107M17
721f797J1950k783j1370R586J0050j2211l911R376k784n740O115M875m381l390
735a415K115k469l807O406J551p899N926O920r366j122J0071m328j1939K663J1032
750D339k503o522Q761M902j1882j620O907j730j450J713j889l08K917o6m162j23
766b716N558m599o205J1053P054j0815k076P636l342p842K046O928j833m842M409
781D14L724l950O56j16m328L004J720m048K632M813k745n514J667O164l439n886
$$ y = [9995, 4312, -12991, -5913, 6062, -2997, -3893, 7903, 3241, -2701, 5397, 5590, -724, 2203, 2943, -7263, -9110, 6165, 6771, -8549, -2525, 8865, -5691, -12569, 4968, 7998, -4075, -3061, 5815, 2563, -3815, 2245, 4077, -5266, -2730, 3257, -2612, 1588, 10640, 1132, -7438, 773, 2893, -7214, -6797, 5153, 2370, -9000, 586, 10636, -1575, -5486, 3890, 1106, -4634, 1481, 6356, 1975, -1415, 700, -1769, -5576, 830, 2381, -5518, 408, 7328, -2038, -3160, 6911, 2583, -9356, -6693, 4339, 1836, -4686, 4075, 8977, -2905, -4525, 2382, 652, -798, 915, -974, -1282, 1635, 1569, -2593, -2716, 2842, -1757, -7962, 3091, 10145, -670, -2746, 4890, 1548, -6294, -4248, 2680, 847, -3995, 414, 4138, 188, 844, 728, -3600, -596, 1124, -2924, -292, 4521, 1776, -3738, -2071, 4093, 654, -5232]
797e232P150L871p397N10N060l018m724m47K199J193r65K713J413j450P34j871
813b61j822M361m54n060L188L607k627k492J940L012m197m680N889L494m896L4
829i64K410r42k474k501K095L944k087j094K942K176K78l686j414M743k128n246
845c948L057L811j531k516j010M134l86n860J692M590j208k300J58K306M75m900
861c436K16M848p40j626K100J139J158k073k205K273k39l233K6Q66J988p36l026
878b700L111J982n414m64M773j42k452m81L324J92m705J671M080k403m95K302
894B179l94O10l7k712R58N77k361k214J029M020j670m899N231L523p509n45O461
911B247l50l931L95M209m28m049J732L036k381J058N7k694L600J470o197l74M708
$$ y = [-5232, 1918, 5789, -1608, -1098, 3962, 944, -3780, -4227, -2028, -835, -1800, 913, 2326, 876, 1610, -261, -2083, 2278, 1824, -3236, -48, 3559, 932, -1560, 380, 3392, -805, -5485, 404, 3898, -998, -964, 1446, 504, -1970, -4471, -2376, 1568, -519, -1613, 1329, 3505, 3783, 97, -1317, 3426, 1298, -3948, -891, 2920, 1389, -1127, -2137, 1997, 1611, -4249, -2557, 2033, 825, -1475, -1317, 989, 1464, -3436, -3220, 1628, 888, -738, 1362, 2501, 3659, 1586, -619, 1654, 1415, -1818, -1792, -926, 1062, 326, -2700, 411, 2393, -3021, -3485, 1288, 1146, -1306, -1787, 1537, 1729, -2976, -1305, 2775, 372, -123, 2179, 1785, 2395, 2358, -354, 604, 1181, -1180, -3394, -2365, 1655, -15, -4914, 317, 3840, -3669, -4214, 2247, 1897, -2034, -1639, 2570, 2142, -1907, -175, 2861, 480, 1538, 1595, -1099, 2501, 3971, -2226, -2600, 2108]
928B108k216n745J330P394k527o394O270M489o990l61N181q94k017J018O21m95
944G72j09J295j360j690M767j665o140N409K908p839l72N637j676n877K504O129
960B693l154m197O983K056o752K437L865l586O0K474j974j520J748P00l743L32
976a578N789m763n774Q159J912r352J671P290l771n436M086N626m004k650O324
991C529M1m923M069P77n186L379J353n695J79N053j375o527L614P374p471n798
1007g607R933J599r272K989O164l857l164M104J851l127L49M099l467j913N794
1022D475l714n256O520J331q806J160P600k472o433M796O020p119k758R074j884
1037B534p418N975L448n948l77M399j757k399L297J420o028J462O532o458m534
$$ y = [2108, -108, -5853, -4523, 2871, 344, -6050, 220, 4709, -2281, -2642, 2539, 1645, -372, 646, 1267, 772, 663, 1958, 598, -1092, 3675, 2010, -4130, 1279, 4187, -3652, -4024, 1613, -63, -5940, -3436, 2693, -461, -4658, 2325, 4381, -2371, 66, 3931, 345, 405, 2879, 905, -615, 1133, 1833, -1910, -1578, 4211, -552, -6326, 1833, 3745, -5607, -3936, 3354, -417, -5853, -1767, 3859, -145, -2795, 3529, 3570, -1353, 2716, 3493, -1693, 1686, 3039, -2656, -2477, 2576, 1201, -5326, -1712, 5662, -1809, -7607, 2326, 3925, -5347, -2358, 3806, -51, -3215, 889, 2740, -387, -38, 4061, 594, -1319, 4475, 761, -4495, 2025, 3356, -5450, -4290, 3310, 838, -5595, -799, 5221, -1898, -4656, 4418, 2534, -4884, 1091, 4539, -1409, -1786, 2613, 856, -1543, 1754, 3174, -2854, -1392, 5140, -1318, -5852]
1052e852Q982j015q747M721O797n643m195P206L579q515q21Q417l346m762N505
1067B311n37n170L974J527m608J06N593k218n621N244N033r303j765J1148l128
1082B586r209N870N973n629k736N468J190n722J753L691n761l31O635m599l957
1097d778O936m66o453L629O674m766n894P120M075r234j15Q754m624o081O548
1112A325J482n682J659M900l048l958L753J242n423L133N022p385j422R397k639
1127B356o589N064M668o385k930P358N59q639K901O759o930l611O905n63l700
1142b777L046J130l116J233M546l524n089O182K977q448J735Q848n901o038O773
1157A577K930p067j273N995q93n757L452L741n525J133L883m956m74P337o69m847
$$ y = [-5852, 3130, 2115, -6632, -1911, 4886, -757, -4952, 2254, 5833, -2682, -3503, 4914, 1568, -3194, 2311, 1774, -3396, 578, 2105, -2503, -2397, 3196, 978, -4643, 601, 5634, -3669, -5434, 5714, 2586, -6623, -753, 5220, -409, -3145, 2323, 3513, -2209, -456, 3235, -2526, -2857, 3778, -821, -4778, 2158, 1692, -4761, -1132, 5542, 776, -5118, 2002, 6077, -3157, -3272, 5482, 858, -5223, 1325, 2807, -2875, -1216, 3684, 636, -3322, 431, 1673, -3750, -617, 4405, -2980, -4402, 4995, 2356, -4233, 831, 5499, -886, -3816, 3542, 4101, -4538, -1637, 5122, -1808, -5419, 1486, 923, -2777, 269, 1399, -1717, -484, 4062, 538, -4551, 1631, 4608, -3840, -2105, 6743, 842, -5196, 1577, 4507, -2560, -3833, 2162, 1269, -4488, -1036, 2705, -2820, -1687, 2196, -2760, -3234, 4103, 3434, -1413]
1173a413K851L363n424l116P165O82r243K497P178n688l102N681K4n360J331L676
1189A102k095j145M968k68n601L819L100n538J574N996m684l796N078K021o286
1204a755k086N718k205o684N279M997n942o68N381k051k210K993R72j987Q42K801
1220C395k153j921N207j211p644L576N004n592j930N255j81o246N7N053j158m241
1236d730L832K349l550K801L104k810M2K224l125j435L799J938m485k012M874
1251B816k133o121M259L660n701q32M474k15j987P51K227k198j546L575M37j484
1267a8L702L33m916K185K013l925j385K583Kl498Q32M461k156m711L560J270l814
1284c482K037L570r15j435Q81N48m75k93J036j628q38L707j020k645L332k82n337
$$ y = [-1413, 1438, 4801, -623, -3739, 3426, 4108, -5135, -2638, 4540, -1148, -4250, 1431, 1455, -3905, -2574, 1102, -993, -2138, 2830, 2562, -3039, 780, 3880, -1658, -84, 5912, 1228, -2568, 2510, 4531, -1755, -3841, 1877, -328, -7012, -1733, 3264, -2678, -3346, 2035, -16, -2226, 767, 1739, -248, 594, 3395, 1242, -679, 4528, 3317, -4327, -751, 4253, -1339, -3269, 1986, 1805, -4441, -4384, 669, -489, -4730, -898, 1451, -2099, 702, 3806, 996, 1038, 3262, 137, -1298, 2501, 4439, -46, -2058, 2816, 683, -5438, -1179, 2481, -3220, -4052, 422, 207, -1780, -1029, 1198, -1000, -2546, 1029, 1466, -18, 3684, 4017, -899, 1286, 3299, -626, -2011, 572, 574, -2924, -2092, 2369, 213, -4498, -938, 332, -3482, -1445, 2125, 1210, -225, 656, 1204, 729, 436, 1472, -156, -994, 2713, 1693, -952, 2380, 2098, -3239]
1301c239l23L511K16k307O95L490j808l251L559R81k452P11L76l00J626K21j529
1318A77l58L77l65k156J331M128k182k588K948K11l064K68J223N7j252P8K399
1335A232K34j460O69r11j149J603q23j99J667k30j396Q36K99k72j064k3K393m92
1353I14j300K727k30k661k65oO79l02o14J303M78j729M19M45L5j03j358O48K389
1372A469p49l22J242k41p64j320n6K540l62j828J053N58j305j327n99J601L5k579
1390b954J533K588r49o03L08N91K75j553O34J748J5o18J6o26J051j064k404J963
1408d9J102k534M55J224M5j540j196K020M35j951J927J388j116Q55O03r72Mk81
1426D19p29M91o7P43m82j101J695j096k659K433J073k682P52K224l38j951K50
$$ y = [-3239, -3562, -51, 165, -2142, -1447, 2043, 235, -3016, 543, 1524, -928, -217, 159, -141, 1485, 1706, 177, -181, 196, -169, -2325, -994, 3134, 952, -1636, 1312, 1523, -1541, -1273, -50, 7, -1245, -1167, 1232, 1466, 6, 675, -236, -1385, 218, -605, -804, 863, 633, -763, 73, 372, 100, -964, -987, 1406, 914, -386, 2341, 2111, -550, -815, -821, -142, -444, -1058, 245, 723, -1006, -587, -142, -107, -210, -1568, -920, 1469, 720, 398, 1640, 1399, 635, -685, -741, 1799, 1437, -391, 662, 1220, -85, -1412, -2011, -410, -375, -2954, -1421, 1167, 218, -385, -77, 514, 789, -764, -130, 1618, 1633, 1015, 1031, 405, 1456, 392, -2012, -49, 1053, -1481, -1026, 198, 243, -1297, -2493, -473, -38, -1989, -62, 1326, 210, 1065, 1668, 696, 700, 419, -310, 181, 114, 857, 375, -726, 969, -127, -2786, -353, 720, -1962, -1210, 1014, 676, -1275, -1025]
1443a025K308q08k080K278Q20j527J157M39j607N60J19j892O0J603M51k343K58
1460a229L202k218k960L491J375l195O16K330m83j663M24J471j485p43J846r11
1476a32o09K880j110k961K580O82l133j47K882K04k660Q39L104k655k139L476
1492A101k52k863J903J230j293n28J608k44j764O71K135k670J72L294j740k389
1508a629L331j07l796R11K583q90k799K239K285l448o63L849j536k445K811J1
1524G07j895J226J306j485o04J926J08l394J832L681l759k223M488o13m527J684
1540a542K839j787j972K664J205k819R33K547k215q32L181j637k451L579P36l623
1556a194m2L152j060l748K290K990m230j004M554j689l104K928J421k587O62K315
$$ y = [-1025, 1283, 475, -1605, 673, 1493, -34, 1123, 1562, -45, 515, 634, -1258, -1198, 405, 856, -1487, -1229, 1973, -245, -3205, 286, 1661, -1534, -918, 1412, 929, -734, -310, 1161, -324, -1067, 779, -132, -741, 2139, 1029, -1932, 648, 1330, -1803, -1950, 932, 1136, -1524, -685, 2419, -236, -2375, 1101, 849, -2014, -111, 1119, -174, -702, 906, 662, -1102, -431, 1704, -966, -794, 2500, 760, -1629, 1702, 1595, -2201, -1290, 1293, 403, -2396, -157, 2128, -1320, -1983, 1866, 330, -2115, 696, 707, -1188, 38, 1344, -141, -745, 1181, 1289, -2105, -273, 3408, -351, -2574, 1914, 1301, -3226, -1542, 1297, -490, -2462, 202, 1407, -1412, -479, 2068, -147, -979, 2202, 565, -1886, 1693, 2429, -1194, -1236, 1916, 856, -2892, -602, 2388, -1842, -2846, 1708, 19, -3085, -157, 1264, -1323, -661, 1654]
1572A654o47j881K315J373l756P07L494l473k232M036o13l460J323K445k126k486
1588c327L306J832m202R29M041k866j356L773o07k206J523J575k045j009K284
1603A645k90l389K049K153m940r2M701j800l352K598K395k625j222L393J17l061
1619a720K535K015l471K62L144k517j196K716l80l156O85L099k217l393L546J785
1635A737m673L92M340k133j564L186M71k529O39K366q20k668K940K12l617J685
1651c6K221l675o64L406j151k749J888K264k350j404L545n5l873K423K978l201
1667d33n57K917p13j923J087R94k233o20K866j205l011L295Q21l600J207L558
1683B450k686j752K957J198k725p99L559j108k775J958J149l083J155J673k049
$$ y = [1654, 1007, -874, 1441, 2814, -942, -235, 3259, -214, -2446, 1590, 977, -2483, -1160, 1285, -841, -3327, -21, 1811, -2391, -1462, 2579, -287, -1643, 2130, 1523, -683, 840, 2415, 370, -639, 1645, 1355, -2034, 15, 2168, -2772, -2864, 1837, 37, -3315, -717, 1678, -947, -2169, 1224, 1341, -1720, 815, 2830, -641, -379, 2765, 248, -948, 1768, 1388, -1768, -1083, 2016, -201, -3594, -48, 1737, -2936, -2544, 1796, -337, -1901, 1285, 1756, -773, -134, 2232, 1412, -1256, 1684, 1896, -1721, -36, 2185, -1490, -2154, 1252, 101, -2648, -760, 1504, -846, -2250, 1295, 1240, -2633, -210, 2768, -433, -990, 1927, 1214, -709, 378, 1372, -861, -1481, 1385, 180, -2831, 464, 1285, -2315, -1108, 2450, -236, -1988, 969, 2167, -558, -1357, 2202, 1094, -1681, 277, 1426, -1657, -502, 1171, -878]
1698h78n54K097m00j872J439K269k646j687L928M17m109K168K633k728j389K293
1714I81r5j973M09J718j677j764K831q20k033K039J589k606O41K555j500j141
1730h46J923J602k646r55L234j054k911K410R28l261K08J802j578q12J099Q56
1746aj127m04K458q94j535L007J47k232K036J245j962q66J514J99k611j7K475
1763A432j709k138K266J27k340J339R93j364M46J090J90p40J105J222j869k24
1779a74K581p73k311J990O28k408l35J260k86j790KR69j038k11K116m45j277J995
1797D93k60r18J442R54p64o85J071M84j826l1J607j469j540J704k96j185P51J98
1815b70o79n48O24R03m98j74J639q34l40J528n50q13J055l47p71P1Q24J38j720
$$ y = [-878, -1432, 665, 265, -1607, -168, 2101, -545, -2232, 1696, 2113, -1996, 172, 2805, 77, -1312, 981, 886, -1087, -678, 1040, -637, -2401, 430, -390, -2423, -384, 1205, -1401, -760, 1795, 295, -846, 1077, 2679, 33, -922, 2312, 1258, -1653, 757, 1685, -1576, -1368, 434, -1144, -1956, -857, -1, -1128, -1532, 926, 32, -1503, 1504, 1651, -581, 1455, 2700, 738, -128, 1386, 1585, -1026, -1043, 1432, -277, -2415, -149, -22, -2362, -1023, -30, -1394, -948, 142, 332, -408, 697, 1919, 50, -174, 2407, 1634, -677, 1313, 1941, -467, -802, 458, 172, -1618, -1616, -647, -1685, -1896, 220, -225, -1502, 493, 233, -685, 757, 1711, 947, 262, 1333, 1817, -9, -40, 1567, 98, -1442, 262, -34, -1219, -468, -270, -949, -1497, -873, 30, -468, -642, 997, 163, -177, 1351, 801, -12, 1043, 696, -75, -4, 820, 958, -762]
1834g62j9J265j062j021J862m44n99O99K01o6J15k83R5j49Q4J161r41O5J257j669
1854b11q98J429l03q13M30L5N69n51o1Q21m42p22P57n20P02O01n30m7K0m01q6
1875b21J3O7O80j151L71P63o40m82N70j67J8N0K99O06k12l19K79n98m17O25n83
1896d49M82K03n83N20p7q56L57j32j73P27J7L4Q79q04j75J24q3N04n89j13Q96
1917G09m32r85J136j67p71q3M7N5M24j07N84mp73M77k20j30J170n75p82J197Q2
1938H52q95j17j71P57j063n21J697k97q64R76k18j076O99Q8k22M86L55K16k35
1957D47j94P27j193n21J407n38p84J226np71k87J61R2r13N19J148q27J07J393
1976A194q03p53Q95k68n28M67K31L89r62M79K24j395r3J565j232r87K167m29q71
$$ y = [-762, -781, 484, -578, -1599, 263, -181, -780, -81, 120, 54, 169, -114, -19, -168, -84, 1077, 136, 201, 1458, -211, -1109, 320, 17, -796, -366, -331, 238, -313, -374, 447, 5, -717, 40, -480, 222, 823, 293, 246, 266, -135, -221, -208, -141, 539, -612, -241, 522, -118, -600, -30, -197, -179, -129, 170, 776, 564, 245, 524, -74, -491, 134, -449, 33, 236, -347, 173, 96, -760, -403, -535, -708, 19, 36, 70, 949, 145, -30, 94, 11, 515, -74, -187, 709, 277, -708, 428, 261, -510, -593, -546, -491, -67, -174, 410, 406, -367, 110, -110, -240, 930, 355, -427, 770, 852, -43, -160, -331, 426, -637, -1158, 539, 242, -622, 354, 136, -940, -241, -153, -375, 111, 466, 682, 447, 253, 980, -213, -734, 673, 135, -649, 577, 572, -199, -486, -325, -233, -1146, -627, 521, -306, -199, 1194, 391, -362, 533, 265, -263, 204, 435, 824, -138, 341, 565, -830, -923, 642, -590, -1577, 590, 161, -710]
1995g10N60N32k00j158J058P59j131L14J249q51q25J328o91j424J132K81o03l55
2013g35J196j56j564N42J589j522m65J807l27o04P67M72j268J8M58J18j291J227
2031B62J338k012j00J551j331j013J470K19r57m6J228n0j511J136R64j973J3K223
2049A411j463p10J855n34j114L23N42o43o92J393M22j644O36J532j566o88J757
2066H17o83j242J064J162j030j178J627J70j885P30J519j912L26J573q56j018
2082h16J147O16j702j99K333m93j864J386J183k667M16J658j111j084R68Q80j300
2099f49p7J331m31j809K005L89j776O61K064j714p81J818p0j478L9J337q18j457
2117a416J845N33k576J041J195j683r2J601j01j191N42J486j281q18J952p1j963
$$ y = [-710, -150, 382, 182, -976, 82, 841, -290, 24, 1273, 422, -403, 925, 234, -1190, -58, 223, -380, -735, 461, 305, -1259, -717, 872, -650, -1115, 692, 365, -239, 528, 1000, -268, -250, 208, 326, -965, 262, 1600, -412, -512, 1039, -292, -1305, 165, 384, -573, -619, 609, 559, -952, 184, 1148, -825, -812, 1411, -52, -762, 1093, 559, -555, -232, 310, -333, -1025, 368, 790, -854, -218, 1314, -252, -940, 817, 134, -1108, -44, 1118, 88, -1090, 537, 707, -1178, -448, 1071, -841, -515, 1058, 202, -816, 331, 947, -755, -954, 1379, 886, -978, 408, 1591, -1076, -660, 998, -113, -1197, -229, 651, -649, -726, 605, 174, -1635, 370, 759, -1017, -356, 1708, -6, -787, 1031, 961, -517, -478, 859, 41, -1416, 429, 962, -1614, -573, 622, -1061, -1153, 448, 347, -844, -302, 1184, -97, -915, 1037, 966, -997]
2134i97J647N73j870M09J470j051j224P06O55j171m22J887l97j979J516J182j938
2151a004K03J644j046j06J241Q8j019j25J612j430j506K216M24k500O97J543j532
2168f00j150J749M23j545M09J548r51j029J913K23j720J008J093j458j45J339
2184A107m60j292M68J055j378q07J790l22j869J637Q15j645K98J216l45r93Q92
2201A67J041j268n91J954q08j209J303K6j720J090N60o65q60R49N73j662J00J941
2219I21r92q99J616K86j576O26J052j140k65R25j0r99J19J526j491o02J793o63
2237B27j387J294M69p54l93Q25M37j237l0J409q97r57K263j069j275J505J47j182
2255f05K4J331q95p69P47R07j290q8J414q95p00J275P5q89M34N19k17q19P04N06
$$ y = [-997, 650, 1223, -647, -238, 1232, 181, -1043, -337, 318, -853, -1275, 612, 215, -1764, -248, 934, -1004, -801, 843, -203, -309, 932, 1020, 1, -124, 1488, 58, -1448, 768, 1192, -1308, -611, 932, -600, -1750, -1, 422, -1123, -714, 834, -117, -1146, 767, 990, -730, 278, 1371, -87, -232, 1107, 647, -645, -177, 878, -500, -1307, 483, 161, -1708, -71, 744, -901, -603, 613, 268, -725, 167, 1208, -60, -651, 1303, 495, -714, 589, 615, -1105, -15, 545, -120, -980, -31, 542, -1120, -1020, 921, -71, -970, 646, 932, -644, -18, 1034, -106, -371, 554, 544, -455, -336, 1190, -301, -903, 890, 227, -1160, 134, 603, -151, -544, 281, 718, -519, -549, 860, -37, -994, 1269, 200, -1075, 430, 577, -605, -581, 750, -145, -914, -167, 740, -550, -638, 776, -119, -819, 456, 531, -358, 76, 595, 378, -441, 263, 769]
2275G69j351j55J444j063p27J318k12r55R03K85l58l74P51L11r39L02J015r03
2293F1o56J564m83r46L62M97n56l30N53n5n55L54O51j170K87R82n56l43J163l8
2313G86p32nL14J28o24K30N71j138m3R70p99n11R00j9m14L3O46l90o6M56L93j142
2335d56K86J011n54k43O80n10k27J62o8m05k07L58M75j146O17N30q80j22J104
2354D05m03l27O83j50J27k93L99ko00K41O27r47l6M35n05J3K34k57M85m41J43
2375a69M49n51L49M36p65K50M67l40j22N43k26o7l68p6N03r01K32K17j43n7M28
2396H9l97L29k5j58M94k38J72J94n53N42K63j003M27K35l25k42J95n23M72q4k03
2417c39M04o05K50K11j17L30J33l01L54j43k38N36m75L64j9n94J09L99j74k57
$$ y = [769, -582, -737, 707, -356, -1083, 235, 23, -932, -29, 256, -102, -476, 275, 586, -353, -51, 964, 61, -595, 969, 486, -460, -98, 399, -157, -487, 66, 11, -544, -190, 461, -709, -422, 560, 4, -339, 824, 786, 54, 49, 363, 491, -133, 97, 668, -470, -513, 457, -342, -853, 47, 28, -386, -353, 293, -97, -163, 293, 686, -456, -170, 841, 287, 44, 724, 214, -13, 149, 81, -324, -531, -173, 302, -844, -227, 303, -577, -699, 405, 2, -325, 358, 208, 335, 42, 441, 439, -161, 80, 707, -240, -276, 159, -346, -333, -99, -356, 129, -312, -169, 280, -271, 78, 514, -251, -1, 466, 126, 4, 547, 321, 254, -114, -190, 313, -588, -356, -139, -282, -339, 89, -308, 21, -4, -162, 332, 94, 266, 460, -93, 449, 712, -291, 136, 371, 46, -196, -1, -524, -52, -136, -339, 65, -540, -290, -79, -196, 134, 267, -34, 320, 177, -61, 475, 0, 364, 345, -249, -140, 259, 85, -172]
2437a72J51m88L95k03K65K54l65p1L21k81KO27m18J86j0o3K19m67n2N18o23j41
2459d16N43k64J06J24j32k8L5j35J88j76J78O00o27j2N42l56l60L42k29r4K52
2480H1p4j72k13J17N55o18J67L73o23J35P14k58k51J79P6l84o3L26M87p92o3O80
2502C79q78K84P15q04m46Q94J37k20j26L28p3o42L51N46o30Q1Q25q03j36P00n19
2523c7l57J65L63m15m19Q66M71j355M03P94p02j70J059m24j64k1N98n06p36J055
2543D68k69r45N94O88j175J67P14j65p72O37L07m00j59Q19m3q30O93K97r96J92
2563a78J110q94k52M14L52q48m74J036l46q77R72M97j236N19R47r45l45P81J21
2582C54l37J5Q43n11r49J142m6j177N91L80o83l62R92m1l73KM99m21o05J093j7
$$ y = [-172, -21, -509, -114, -317, -52, 202, -163, -234, 87, -194, -192, 435, 17, 203, 193, 130, 349, -118, -170, 348, -275, -416, 127, -137, -31, 93, -39, -67, -32, -167, 21, -155, 23, 623, -4, -16, 526, 170, -190, 152, -77, -171, 81, 7, -165, -378, -261, 294, -324, -157, 216, -407, -272, 442, 184, -67, 112, 188, -196, -259, 67, 554, -238, -301, 379, -499, -215, 500, -304, -750, 144, 281, 61, -65, 263, 190, -452, -101, 445, -185, -104, 721, -82, -218, 482, -37, -394, -229, 134, -281, -700, 166, 637, -718, -315, 479, -223, -393, 666, 242, 78, 57, 655, 149, -587, 468, 199, -746, -152, 536, -639, -472, 242, 77, -695, -58, 249, -151, -310, 509, 466, -364, 329, 626, -370, -178, 932, 38, -214, 200, 552, -296, -770, 266, -80, -957, 15, 512, -724, -205, 742, -203, -548, 233, 354, 17, 32, 875, 364, -585, 557, 511, -666, -75, 305, -378, -740, 252, 211, -162, -160, 339, -82, -687, 406, 389]
2603C89p89P51L18n98m8L94k55o74N47M73o20n56J094j12j181J042K53j160N05
2622b27R10p14m61M64M96q78j0R81k28j062J079M14j292L44P90r65k00N68K97
2641C06o61k02J116k03r68J298K6j266O65L01o92k3R64m10r88J18R53n38m42J191
2661E45k22j172R30N96j101J55O43j05m11K96M63p39j98J125p04j204J340n6p31
2680e50J43P24j66o77L77M69p12K2P91n41l23J090or95N09N18o43k89L95L97r54
2701d21J64P85q55m01J120m57n53R14J39p31j24P04j28o55L29J408j599K17J080
2720I36o36q81P14M11j002K05K90j62m15O95L26r77N9R71k16r12Q73J42o81M12
2740A52M48k23o14K96N46j107M25O30q47l12P99k02q27L49R03m60m16N28Q82j134
$$ y = [389, -400, 351, 669, 71, 23, 417, 162, -512, 35, 508, -112, -668, 426, 314, -867, 175, 428, -732, -227, 683, -31, -492, -28, 468, -410, -420, 561, 333, -729, 350, 764, -528, -184, 606, -359, -559, 9, 306, -355, -557, 559, 356, -612, 686, 712, -554, 111, 412, -280, -303, 661, 251, -737, -619, 334, -204, -646, 545, 323, -849, 81, 677, -424, -269, 374, 269, -142, 154, 617, -122, -320, 805, 101, -1103, 237, 181, -550, -407, 317, 151, -526, -149, 320, -392, -370, 421, -120, -443, 647, 641, -354, 155, 673, 30, -259, 136, 533, -421, -257, 528, -327, -728, 392, -65, -618, 296, 435, -296, -420, 284, 156, -499, -170, 1238, -361, -144, 936, 300, -581, 133, 544, -458, -253, 37, -125, -540, 155, 481, -496, -437, 534, 318, -594, 279, 421, -260, 152, 600, 377, -237, 59, 605, -502, -77, 553, -294, -606, 193, -9, -836, -487, 416, -44, -460, 68, 950, -184]
2760a84J4J135r59j96Q28k11q46Q13j02o50j63M10K60q69J94J078q99k10J026
2779D69l46m45M64J48k51O6L89J08r28L13L67q87J34P16m91l55M38K76l67j06
2799b88N04k3o51O08M54j084M12O79q74K9M88j0l33j14N19k42m17N18k0p54M11
2820a88M01r12L92R61o06k60L39J55l22k16N27q4l48n3N32l26l13N10o80j6N96
2841H9p7j12j80M72j38k77K42N46o61K80J91m17k55N60K6l47j53L09l36k99L53
$$ y = [-184, -170, 965, 6, -190, 638, 427, -419, 394, 292, -358, -521, -111, 149, -720, -526, 552, -347, -557, 469, 123, -322, 142, 290, 39, 105, 494, 602, -326, -13, 354, -533, -399, 317, -174, -529, -91, 185, -182, -288, 216, 193, -458, 150, 604, -480, -68, 611, -263, -234, 254, 244, -89, -203, 316, 74, -343, 175, 155, -599, -188, 213, -699, -307, 654, 48, -212, 127, 282, -40, -256, 271, 187, -161, -214, 318, -8, -321, 189, -491, -507, 89, 12, -100, -280, 192, 54, -223, 19, 565, -96, 184, 375, -42, -297, 263, 289, -58, -211, 98, -238, -537, -184]
$$ [...]
8191b55
##END NTUPLES=NMR FID
##END=
