##TITLE=1H_Ser 3514-EA
 CDCl3
 8 sc, 
 10.9.2024
##JCAMPDX= 6.0         $$ Bruker NMR JCAMP-DX V2.0
##DATA TYPE= NMR FID
##DATA CLASS= NTUPLES
##ORIGIN= UXNMR, Bruker Analytische Messtechnik GmbH
##OWNER= root
$$ XWIN-NMR		Version 3.5
$$ Tue Sep 10 15:53:31 2024 Russian Standard Time (UT+4h)  she@DPX200
##.OBSERVE FREQUENCY= 200.1318
##.OBSERVE NUCLEUS= ^1H
##.DELAY= (6, 6)
##.ACQUISITION MODE= SIMULTANEOUS
##.ACQUISITION SCHEME= undefined
##.AVERAGES= 8
##.DIGITISER RES= 18
##SPECTROMETER/DATA SYSTEM= spect
##.PULSE SEQUENCE= zg30
##.SOLVENT NAME= CDCl3
##.SHIFT REFERENCE= (INTERNAL, CDCl3, 0, 15.7039)
##AUDIT TRAIL= $$ (NUMBER, WHEN, WHO, WHERE, WHAT)
$$ ##TITLE= Audit trail, XWIN-NMR		Version 3.5
$$ ##JCAMPDX= 5.01
$$ ##ORIGIN= Bruker BioSpin GmbH
$$ ##OWNER= she
$$ F:/spectra/data/she/nmr/H-F/1/audita.txt
$$ ##AUDIT TRAIL=  $$ (NUMBER, WHEN, WHO, WHERE, WHAT)
(   1,<2024-09-10 15:52:12.62 +0400>,<she>,<DPX200>,
      <created by zg, POWCHK disabled, PULCHK disabled
       configuration hash MD5:
       00 E9 B6 7A A2 85 ED C7 34 08 36 98 17 FE 4E 26
       data hash MD5: 16K
       D3 F4 2D 11 96 28 4E 02 6F F5 D7 77 7D 3C 04 3E>)
$$ ##END=
$$ 
$$ hash MD5
$$ 5D B4 B5 29 11 F0 25 11 31 6E CB E0 49 23 BC 90
##$RELAX= 
##$RELAX= 
##$RELAX= 
##$RELAX= 
##$RELAX= 
##$RELAX= 
$$ Bruker specific parameters
$$ --------------------------
##$DU= <F:/spectra>
##$EXPNO= 1
##$NAME= <H-F>
##$PROCNO= 1
##$TYPE= <nmr>
##$USER= <she>
##$AMP= (0..31)
100 100 100 100 100 100 100 100 100 100 100 100 100 100 100 100 100 100 
100 100 100 100 100 100 100 100 100 100 100 100 100 100 
##$AQSEQ= 0
##$AQ_mod= 1
##$AUNM= <au_zg>
##$AUTOPOS= <>
##$BF1= 200.13
##$BF2= 200.13
##$BF3= 200.13
##$BF4= 200.13
##$BF5= 200.13
##$BF6= 200.13
##$BF7= 200.13
##$BF8= 200.13
##$BYTORDA= 1
##$CFDGTYP= 0
##$CFRGTYP= 5
##$CHEMSTR= <none>
##$CNST= (0..31)
1 1 145 1 1 1 1 1 1 1 1 1 1 1 1 1 1 1 1 1 1 1 1 1 1 1 1 1 1 1 1 1 
##$CPDPRG= <>
##$CPDPRG1= <>
##$CPDPRG2= <>
##$CPDPRG3= <>
##$CPDPRG4= <mlev>
##$CPDPRG5= <mlev>
##$CPDPRG6= <mlev>
##$CPDPRG7= <mlev>
##$CPDPRG8= <mlev>
##$CPDPRGB= <>
##$CPDPRGT= <>
##$D= (0..31)
0 1.2 0 0 0 0 0 0 0 0.06 0 0.03 0 0 0 0 0.0002 0 0 0 0 0 0 0 0 0 0 0 0 
0 0 0 
##$DATE= 1725969132
##$DBL= (0..7)
120 120 120 120 120 120 120 120 
##$DBP= (0..7)
150 150 150 150 150 150 150 150 
##$DBP07= 0
##$DBPNAM0= <>
##$DBPNAM1= <>
##$DBPNAM2= <>
##$DBPNAM3= <>
##$DBPNAM4= <>
##$DBPNAM5= <>
##$DBPNAM6= <>
##$DBPNAM7= <>
##$DBPOAL= (0..7)
0.5 0.5 0.5 0.5 0.5 0.5 0.5 0.5 
##$DBPOFFS= (0..7)
0 0 0 0 0 0 0 0 
##$DE= 6
##$DECBNUC= <off>
##$DECIM= 24
##$DECNUC= <off>
##$DECSTAT= 4
##$DIGMOD= 1
##$DIGTYP= 9
##$DL= (0..7)
0 120 120 120 120 120 120 120 
##$DP= (0..7)
150 150 150 150 150 150 150 150 
##$DP07= 0
##$DPNAME0= <>
##$DPNAME1= <>
##$DPNAME2= <>
##$DPNAME3= <>
##$DPNAME4= <>
##$DPNAME5= <>
##$DPNAME6= <>
##$DPNAME7= <>
##$DPOAL= (0..7)
0.5 0.5 0.5 0.5 0.5 0.5 0.5 0.5 
##$DPOFFS= (0..7)
0 0 0 0 0 0 0 0 
##$DQDMODE= 0
##$DR= 18
##$DS= 0
##$DSLIST= <SSSSSSSSSSSSSSS>
$$ [...]
##$SUBNAM2= <"">
##$SUBNAM3= <"">
##$SUBNAM4= <"">
##$SUBNAM5= <"">
##$SUBNAM6= <"">
##$SUBNAM7= <"">
##$SUBNAM8= <"">
##$SUBNAM9= <"">
##$SW= 24.0689170037331
##$SWIBOX= (0..15)
0 0 2 0 0 0 0 0 0 0 0 0 0 0 0 0 
##$SW_h= 4816.95568400771
##$TD= 16384
##$TD0= 1
##$TE= 0
##$TE2= 300
##$TE3= 300
##$TEG= 300
##$TL= (0..7)
0 120 120 120 120 120 120 120 
##$TP= (0..7)
150 150 150 150 150 150 150 150 
##$TP07= 0
##$TPNAME0= <>
##$TPNAME1= <>
##$TPNAME2= <>
##$TPNAME3= <>
##$TPNAME4= <>
##$TPNAME5= <>
##$TPNAME6= <>
##$TPNAME7= <>
##$TPOAL= (0..7)
0.5 0.5 0.5 0.5 0.5 0.5 0.5 0.5 
##$TPOFFS= (0..7)
0 0 0 0 0 0 0 0 
##$TUNHIN= 0
##$TUNHOUT= 0
##$TUNXOUT= 0
##$USERA1= <user>
##$USERA2= <user>
##$USERA3= <user>
##$USERA4= <user>
##$USERA5= <user>
##$V9= 5
##$VALIST= <valist>
##$VCLIST= <CCCCCCCCCCCCCCC>
##$VD= 0
##$VDLIST= <DDDDDDDDDDDDDDD>
##$VPLIST= <PPPPPPPPPPPPPPP>
##$VTLIST= <TTTTTTTTTTTTTTT>
##$WBST= 1024
##$WBSW= 4
##$XGAIN= (0..3)
0 0 0 0 
##$XL= 0
##$YL= 0
##$YMAX_a= 251212
##$YMIN_a= -194389
##$ZGOPTNS= <>
##$ZL1= 120
##$ZL2= 120
##$ZL3= 120
##$ZL4= 120
##$ABSF1= 10
##$ABSF2= 0
##$ABSG= 5
##$ABSL= 3
##$ALPHA= 0
##$AQORDER= 0
##$ASSFAC= 0
##$ASSFACI= 0
##$ASSFACX= 0
##$ASSWID= 0
##$AUNMP= <proc_1d>
##$AZFE= 0.1
##$AZFW= 0.1
##$BCFW= 1
##$BC_mod= 2
##$BYTORDP= 1
##$COROFFS= 0
##$CY= 11.3945322036743
##$DATMOD= 1
##$DC= 2
##$DFILT= <>
##$DTYPP= 0
##$F1P= 15.6554695791079
##$F2P= 12.8336369535428
##$FCOR= 0.5
##$FTSIZE= 0
##$FT_mod= 4
##$GAMMA= 1
##$GB= 0.15
##$INTBC= 1
##$INTSCL= 1
##$ISEN= 128
##$LB= 0.24
##$LEV0= 0
##$LPBIN= 0
##$MAXI= 10000
##$MC2= 0
##$MEAN= 0
##$ME_mod= 0
##$MI= 1.114404
##$NCOEF= 0
##$NC_proc= 0
##$NLEV= 6
##$NOISF1= 3.799351
##$NOISF2= 2.8
##$NSP= 1
##$NTH_PI= 0
##$NZP= 0
##$OFFSET= 15.70392
##$PC= 1
##$PHC0= -26003.17
##$PHC1= 24.58748
##$PH_mod= 1
##$PKNL= yes
##$PPARMOD= 0
##$PSCAL= 0
##$PSIGN= 0
##$REVERSE= no
##$SF= 200.130013532006
##$SI= 16384
##$SIGF1= 3
##$SIGF2= 2
##$SINO= 400
##$SIOLD= 16384
##$SREGLST= <1H.CDCl3>
##$SSB= 0
##$STSI= 0
##$STSR= 0
##$SW_p= 3612.71676300578
##$SYMM= 0
##$S_DEV= 0
##$TDeff= 0
##$TDoff= 0
##$TI= <>
##$TILT= no
##$TM1= 0
##$TM2= 0
##$TOPLEV= 0
##$USERP1= <user>
##$USERP2= <user>
##$USERP3= <user>
##$USERP4= <user>
##$USERP5= <user>
##$WDW= 1
##$XDIM= 8192
##$YMAX_p= 0
##$YMIN_p= 0
$$ End of Bruker specific parameters
$$ ---------------------------------
##NTUPLES= NMR FID
##VAR_NAME=  TIME,          FID/REAL,        FID/IMAG
##SYMBOL=    X,             R,               I
##VAR_TYPE=  INDEPENDENT,   DEPENDENT,       DEPENDENT
##VAR_FORM=  AFFN,          ASDF,            ASDF
##VAR_DIM=   8192,          8192,            8192
##UNITS=     SECONDS,       ARBITRARY UNITS, ARBITRARY UNITS
##FACTOR=    0.0002076,     1,               1
##FIRST=     0,             0,               0
##LAST=      1.7004516,     0,               0
##MIN=       0,             -194389,         0
##MAX=       1.7004516,     251212,          0
$$ Real data points
##PAGE= N=1
##DATA TABLE= (X++(R..R)), XYDATA
0@%%%%%%%Kj0J6j6K4l2L2m0N0n8P2q8J04j22J44j70J98k28K62k99L41l89M42m99
$$ 0 0 0 0 0 0 0 0 2 -8 8 -8 16 -16 16 -24 26 -32 40 -48 56 -66 78 -92 106 -122 140 -159 182 -207 235 -264
31b64N61o31P11p97Q90r92J103j226J360j509J671j849K048k268K513k785L090
$$ -264 297 -334 377 -420 470 -522 581 -645 715 -794 877 -972 1076 -1192 1321 -1464 1626
48A626l437L836m298M835n474O253p219Q458j0113J2438j5969K2102m9343K66721
$$ 1626 -1811 2025 -2273 2562 -2912 3341 -3878 4580 -5533 6905 -9064 13038 -36305 230416
62B30416j24255k24381K66888n8846j21300J39987j14818j67226K09167l7927
$$ 230416 106161 -118220 148668 89822 -31478 108509 -6309 -173535 35632 -2295
72b295j70074J81757N2728j27584J74102J7282j96005J29673O6091k21166O1810
$$ -2295 -172369 9388 62116 -65468 108634 125916 -70089 59584 125675 -95491 -33681
83c3681O8139j84838J05444J44660k10837N6464K32214j70256o8373J96612j15351
$$ -33681 34458 -150380 -44936 99724 -111113 -54649 177565 7309 -61064 135548 20197
94B0197j06634J49520r4457j06227J76813l7329j12458J76837L853j39656J43994
$$ 20197 -86437 63083 -31374 -137601 39212 1883 -110575 66262 70115 -69541 74453
105G4453K7519j73905Q4433N3938j60103N3427Q0291j10564O2503P6900j27656
$$ 74453 101972 -71933 12500 66438 -93665 -40238 40053 -70511 -8008 68892 -58764
116e8764O7159J17213j60187r740J38322j25191m7364J37579r2812n2257J62796
$$ -58764 8395 125608 -34579 -44319 94003 -31188 -78552 59027 -33785 -86042 76754
127G6754o9035j01070J63404j0797j32789J09956J1681j31771R4089M7613j32086
$$ 76754 7719 -93351 70053 59256 -73533 36423 48104 -83667 10422 58035 -74051
138g4051N3123P5486r0942L1193N1177q4394M9681N6967j24155K7047J07834j07559
$$ -74051 -20928 54558 -36384 -5191 45986 -38408 11273 68240 -55915 -28868 78966 -28593
150b8593k0855J11730p7678l5889J16255o1673o2940J16325l6864r2839J08424
$$ -28593 -49448 62282 -15396 -51285 64970 3297 -59643 56682 19818 -73021 35403
161C5403N708j06687P5273L5727r6219M9190M7665q2905L0562M6800p9637K5052
$$ 35403 41111 -65576 9697 45424 -50795 -1605 46060 -36845 -6283 40517 -39120 -14068
173a4068O1436p6734M254P1623o2824j1561P2906n0963k3744P1464m7790l8931
$$ -14068 47368 -29366 -25112 46511 -16313 -27874 45032 -5931 -29675 41789 -6001 -44932
185d4932Q2535k4812n9207P0645m201o0403O3941O231p3621N4616L1238q3615
$$ -44932 37603 12791 -46416 24229 20028 -40375 23566 29797 -43824 10792 42030 -41585
197d1585K5447N4393o0132M091M6150n1234L155O1220m4055k6544N2402j7593
$$ -41585 -16138 38255 -21877 -17786 28364 -22870 -19715 41505 -2550 -29094 23308 5715
209E715k4739L3129j8767j4482M0339k4239k4824M8916q712l2569M1272r844m2932
$$ 5715 -19024 14105 -4662 -19144 21195 -3044 -27868 21048 12336 -20233 21039 11195 -31737
222c1737N0604R528o3374K8937L5645n0847R697M0581m0652j763M2709l1783j9733
$$ -31737 18867 28395 -34979 -6042 29603 -21244 -11547 29034 -11618 -13381 29328 -2455 -22188
235b2188L9687j0401k2632J9987o829r774K2835r504j2351K1276j0702j1318K8096
$$ -22188 17499 7098 -15534 4453 -2376 -12150 10685 1181 -11170 10106 -596 -11914 16182
248A6182j3573k4911L4994l97l7266K7088J6890l4130J5391J8554l7009J0360
$$ 16182 2609 -22302 12692 12295 -24971 2117 19007 -15123 268 18822 -18187 -7827
260g827L5173l3471j4123L5769j2079j7609K3573m506j4281J8189o431j5170J9275
$$ -7827 27346 -6125 -20248 15521 3442 -14167 9406 4900 -9381 8808 2377 -12793 6482
273F482n61j6579J2558k86j1740J6337O5j6462J6328J723k2240J7645J0383k8693
$$ 6482 5921 -10658 1900 1614 -10126 6211 6276 -10186 6142 7865 -14375 3270 13653 -15040
287a5040R600K0083k5989J223K9012j9709j1069K7365j1337j8773K5337p60k5202
$$ -15040 -5440 14643 -11346 -10123 18889 -820 -11889 15476 4139 -14634 10703 9943 -15259
300a5259J4092Q930j7180P975J0813j2566J498Q173o635J631K251o943M187j58
$$ -15259 -1167 7763 -9417 -1442 9371 -3195 -1697 6476 -159 1472 3723 -3220 967 809
314H09j1684J0232Q561j5987L827J4348j4316j74J8708j4333j1797J9366m062
$$ 809 -10875 -643 7918 -8069 -4242 10106 -4210 -4384 14324 -9 -11806 7560 3498
327C498j7772J4709P519j7086N605J1418j0669N7J1354n233p295L748Q69j464
$$ 3498 -14274 435 7954 -9132 -3527 7891 -2778 -2721 8633 3400 -3895 -147 722 -742
341g42q24r22J890j753k259Q880J566j0556N409P878j1234k218J0830n522o684
$$ -742 -1566 -2488 -598 -2351 -4610 4270 5836 -4720 689 8567 -2667 -4885 5945 423 -6261
356f261P708l327m456J0901J115r856L922N349m764O95J828m166m88J052j149
$$ -6261 1447 -1880 -6336 4565 5680 -4176 -254 5095 331 1026 2854 -1312 -1800 -748 -1897
371a897J203J095j086J953m16k096M090Q74m105J355j932m357P510J816j0907
$$ -1897 -694 401 -685 1268 852 -1244 2846 3720 -385 970 -962 -5319 2191 4007 -6900
386f900L653R477q350k163J0738m412o722Q662j571r532P449N794r914j432P216
$$ -6900 -3247 6230 -2120 -4283 6455 2043 -4679 3983 2412 -7120 329 6123 -3791 -5223 1993
401A993j022k498K649J339l177j681M064K324o803n04Q874m861q986R495M853
$$ 1993 971 -1527 1122 2461 -716 -2397 1667 3991 -2812 -3316 5558 697 -8289 1206 6059
416F059j0519J681P596q462q10J2285m865r943P836N233q622n40O437k811m973
$$ 6059 -4460 -2779 4817 -3645 -4455 7830 2965 -6978 858 6091 -2531 -3071 3366 555 -4418
431d418L133K373k635R23M644j824m872M060M670n965k300L393m447j757P052
$$ -4418 -1285 1088 -1547 -624 4020 2196 -2676 1384 6054 89 -2211 1182 -3265 -5022 2030
446B030j397n774O171M329n577P26M993l102k941J83l194q80L656J29k742J185
$$ 2030 633 -5141 1030 5359 -218 508 5501 2399 -542 -359 -3553 -4433 -777 -648 -3390 -2205
462b205L924K645j540m33J733l093m616L097o93o119M106N351o798J029J1418
$$ -2205 1719 4364 2824 2391 4124 1031 -3585 -488 -1181 -7300 -3194 2157 -4641 -3612 7806
477G806l017n114P053k547r844N707L864j1543q45J0458k739m489Q404M253m880
$$ 7806 4789 -325 6728 4181 -5663 44 3908 -7635 -8480 1978 -761 -5250 3154 7407 2527
492B527r03L494l219m837J929J638o592k233Q703K342n769L957O901o100k530
$$ 2527 1624 5118 1899 -2938 -1009 629 -5963 -8196 507 2849 -2920 1037 7938 1838 -692
507f92P370l732r081M561L289q455r6R785q26m966N394K858l863J296K653o342
$$ -692 6678 2946 -6135 -1574 1715 -6740 -6836 2949 2123 -2843 2551 5409 1546 2842 5495 -847
523h47m293N593o16n713K536N088k945k72N105m45j680K781j944m953Q76J522
$$ -847 -5140 453 -163 -5876 -3340 1748 -1197 -1469 3636 3191 1511 4292 2348 -2605 -1729 -207
539b07k081n46m35K16K883K032m91J109K93j113M01j955j741J944j827m198L475
$$ -207 -2288 -2834 -3269 -3053 -170 1862 1371 2480 2773 1660 2061 106 -1635 309 -1518 -5716 -2241
556b241K002j784M328K394o088K487O539p528l319O341m765o004P578R70o971
$$ -2241 -239 -2023 2305 4699 -1389 1098 7637 109 -3210 3131 -1634 -7638 -60 910 -6061
571f061O692M711o149N76O598l443k861P98k415j850Q59J166P75j892j27O640
$$ -6061 631 5342 -807 -231 6367 2924 63 861 -1554 -3404 -2545 -1379 -604 -2496 -2623 4017
587D017j45o077N388L615r967k56P068o608k767Q866l740o549R972L065p110K724
$$ 4017 3872 -2205 3183 6798 -3169 -3425 3643 -2965 -5732 3134 -606 -7155 2817 5882 -1228 1496
603A496K741n065N59J849l922m9J433j711J782l6l83N687j332o972N203L963q151
$$ 1496 4237 -828 -269 1580 -2342 -2391 -958 -2669 -887 -923 -1306 4381 3049 -3923 1280 5243 -2908
620b908J868L952p931J636P976p292k243J0254m611m340Q474l288n764R119k264
$$ -2908 -1040 2912 -5019 -3383 4593 -2699 -4942 5312 701 -3639 4835 1547 -4217 4902 2638
635B638r643P449L498q245M177L063o591L980M810o824J481L919n604J208L399
$$ 2638 -7005 444 3942 -4303 -126 2937 -3654 326 5136 -1688 -207 3712 -1892 -684 2715
650B715o952L211N628r262O90R878p525j396J1099q978p133J5058k512j3890J1486
$$ 2715 -4237 -1026 4602 -4660 -3970 5908 -1617 -3013 8086 -892 -8025 7033 4521 -9369 2117
665B117L356j3806P809P418j1668K365R559q841j950P978m349j520L930n424P01
$$ 2117 5473 -8333 -524 6894 -4774 -2409 7150 -1691 -3641 4337 -12 -1532 2398 -3026 -2325
680b325O132n992j29P270p630j023J0774p785o188J3454m434j1808J3233K006
$$ -2325 3807 -2185 -2314 4956 -2674 -3697 7077 -708 -6896 6558 2124 -9684 3549 5555
694E555j3587Q382O584j2608K878R884r115j066P487o706r02P685n113j735O080
$$ 5555 -8032 350 6934 -5674 -2796 7088 -2027 -3093 4394 -2312 -3214 4471 -642 -2377 3703
709C703m851j064P058n454k654Q206n857m912J0560l103p445R883n61r862Q507
$$ 3703 -1148 -2212 4846 -608 -3262 4944 -913 -5825 4735 1632 -5813 4070 3509 -6353 2154
724B154K739r535N243L290j0430N895O799j1599K879R215r978n73J1233p864m113
$$ 2154 4893 -4642 601 3891 -6539 -644 6155 -5444 -2565 6650 -3328 -3901 7332 -532 -4645
739d645R439n223m940Q986l355n900R365k422o093Q804j251o267Q108k863q912
$$ -4645 4794 -429 -5369 3617 262 -5638 3727 1305 -4788 4016 2765 -3502 4606 1743 -7169
754g169J0304P94j2086R514L678j4291Q817J1627j6283j28J4963j0287n552J0823
$$ -7169 3135 3929 -8157 1357 5035 -9256 -439 11188 -5095 -5223 9740 -547 -6099 4724
768D724n810m732J0189m613o689J0424l80n615O876l234o091J0980k793j0973
$$ 4724 -1086 -5818 4371 -242 -6931 3493 3113 -2502 4374 1140 -4951 6029 3236 -7737
782g737R028J996j0153Q590K985j2349R084Q940j5505J319J2492j0244l147J0126
$$ -7737 1291 3287 -6866 1724 4709 -7640 1444 10384 -5121 -3802 8690 -1554 -4701 5425
796E425q498l474J1694m843n681R258l891l759J1310n580r597J1083J352j1574
$$ 5425 -3073 -6547 5147 304 -5377 3881 -10 -3769 7541 1961 -7636 3447 4799 -6775
810f775N958L094o993O155J898q920O554N690r646L008M700r427L964P153j0918
$$ -6775 -817 2277 -4716 1439 3337 -5583 971 6661 -2985 23 4723 -4704 -740 6413 -4505
825d505K01J0039q283j843J1226p880m513J2673m789r823J0547J116r645O080
$$ -4505 -4304 5735 -2548 -4391 6835 -1045 -5558 7115 2326 -7497 3050 4166 -5479 601
839F01J682o990M615K825n120L761r0m877O941Q87r787N925M747j0474L748P434
$$ 601 2283 -4707 -92 2733 -2387 1374 1284 -3593 3348 4235 -5552 373 5120 -5354 -1606 5828
855E828j0321J243J0551r693l039J1810m765o621R483k372p984Q067R19o993M115
$$ 5828 -4493 -3250 7301 -2392 -5431 6379 1614 -5007 4476 2104 -5880 2187 3106 -3887 228
870B28N89m314O453n30o500O009J620p668M989L259r158M276N316r437J410Q727
$$ 228 817 -3497 2956 2426 -4074 1935 3555 -4113 876 4135 -5023 -747 4569 -4868 -3458 5269
886E269o901j131P838o841j657R791n406o227Q699k589o337Q169o82p113O784
$$ 5269 -1632 -2763 5075 -1766 -3423 6368 962 -5265 3434 845 -5492 2677 1995 -5118 1666
901A666J117o395N405K078p333M095L643p599J425M563m925J437K821n713K831
$$ 1666 2783 -3612 1793 3871 -3462 633 4276 -3323 -1898 2665 -2260 -823 1998 -3715 -884
916h84O395o895n52O321n542j167P187o221m909R571k053p195O830K300n715M241
$$ -884 5511 -1384 -1936 4385 -1157 -2324 4863 -1358 -6267 3304 1251 -5944 886 3186 -2529 1712
932A712J955o273L114L468m905p48J283k146L098J023n112L570L073m658K258
$$ 1712 3667 -2606 508 3976 -929 -1677 -394 -2540 558 1581 -3531 39 3112 -1546 712
947G12L238o325J258O136p505k872P955j879m457N008j149k841O151l31n469L386
$$ 712 3950 -2375 -1117 5019 -2486 -5358 2597 718 -3739 1269 120 -2721 3430 3099 -2370 1016
963A016R93l775J891o11l190M239R37m530L276L196m241K066J759n404K009L829
$$ 1016 2009 -1766 125 -486 -3676 563 1500 -3030 246 3442 -799 1267 3026 -2378 -369 3460
979C460n789n98M575l656m38N304l313j204N776l018l564N855k073n428N177m61
$$ 3460 -2329 -2927 1648 -2008 -2446 2858 -455 -1659 4117 1099 -2465 3390 1317 -4111 1066 605
995F05n232N092K152n323K818L253m579J409L021m100K52K301l843O28L246l391
$$ 605 -4627 465 2617 -2706 112 3365 -1214 195 3216 -884 -632 1669 -2174 -1546 1700 -1691
1011a691J014L301m422J098M950m410k219N426k804l730N090n64m940M700J596
$$ -1691 -677 2624 -1798 -700 4250 -160 -2379 3047 243 -3487 1603 1039 -3901 799 2395
1026B395n431K834L765m502O9L071k862K16J713k398J17J745k338J213K288k939
$$ 2395 -3036 -202 3563 -939 -870 2201 -661 -445 1268 -1130 -1013 732 -1606 -393 1895 -1044
1042a044N40L058l580j17M209l217k547M842j750l692M318N48m017L057P20l091
$$ -1044 -504 2554 -1026 -1143 3066 -151 -2698 2144 394 -3298 1020 1568 -2449 608 1328 -1763
1058a763K409J592l431Q80J709k524O61J739l067O42K300k301m2L053j931q8K018
$$ -1763 646 2238 -1193 -313 1396 -1128 -467 1272 -1795 -1153 1147 -1154 -1196 1857 -74 -162 1856
1075A856k175p58L432k479k181L579j648j875L926j285k976M149Q17m286K583
$$ 1856 -319 -1077 2355 -124 -2305 1274 -374 -2249 1677 392 -2584 1565 2382 -1904 679
1090F79K276m723J191K486l995k9L841k267j710L100k90j056K453j583j021K229
$$ 679 2955 -1768 -577 1909 -2086 -2115 1726 -541 -2251 849 559 -497 1956 373 -648 1581
1106A581k214o82K151j995j034M041k118k457N307K91n343K803K463n026J602
$$ 1581 -633 -1315 836 -1159 -2193 1848 -270 -2727 2580 2871 -2472 331 2794 -2232 -630
1121f30L004m744j64M718k191j936L681k90j885J741o39j407J807o98k139J938
$$ -630 2374 -2370 -2534 2184 -7 -1943 1738 1448 -437 1304 665 -742 1065 367 -1772 166
1137A66o27j139L056p75k868L354J259l789J451K057l549O34J988k799o0L533
$$ 166 -461 -1600 1456 681 -2187 1167 2426 -1363 88 2145 -1404 -770 1218 -1581 -1641 1892
1153A892j581j776K389m60r73J974j207j926K696p40k061K249O5j717J312J024
$$ 1892 311 -1465 924 464 -509 1465 258 -1668 1028 288 -1773 476 541 -1176 136 1160
1169A160k255J164J729k308RJ184q53M1O62j327L69J090j392L66J238j793m0K573
$$ 1160 -1095 69 1798 -510 -501 683 -170 -129 533 -794 -425 665 -727 -361 877 -916 -956 1617
1187A617j966j503L694n84k793J830Q90k536J398J434k841J15K226r72m3R71l39
$$ 1617 -349 -1852 1842 1258 -1535 295 1185 -1351 47 1481 -1360 -1245 981 9 -34 937 598
1204E98k50O37j443J94R75j696J62J098j312q2L118j544k359L591J5l057K138
$$ 598 348 985 -458 -264 711 -985 -823 275 -1037 -1119 1999 455 -1904 1687 1702 -1355 783
1221G83Q38l905J193K178k266m22K993j021j421K335q03j061K108j552j490J804
$$ 783 1621 -2284 -1091 1087 -1179 -1601 1392 371 -1050 1285 482 -579 1529 -23 -1513 291
1237B91m88j535K078lj876K423R19k723J393J394k682K79J302k147O60J810k058
$$ 291 -197 -1732 346 343 -1533 890 1809 -914 479 1873 -809 -530 772 -1375 -715 1095 -963
1254i63n11K773j408k95K341j767j534L408j164l507L022P39l959K453K118l489
$$ -963 -1474 1299 -109 -404 1937 170 -1364 2044 880 -2627 395 1134 -2825 -372 1746 -1743
1270a743J366L066l013j202L278r11j490J343j578k52J939j409q87K777j505q42
$$ -1743 -377 2689 -324 -1526 1752 841 -649 694 -884 -1136 803 -606 -1493 1284 -221 -1063
1286a063L191j439k638M112o69m525L244J871m910J999L065m052O28M147k850
$$ -1063 2128 689 -1949 2163 1494 -3031 213 2084 -2826 -827 2238 -1814 -1186 2961 111
1301A11j523L412j599j409K235j371j274K865k071j816L673j402j164L533j392
$$ 111 -1412 2000 401 -1008 1227 -144 -1418 1447 -624 -2440 1233 -169 -1333 2200 808
1316H08l246M109K19m474K949J550m412J624L101m191J085L631l667j12L799l110
$$ 808 -2438 1671 1890 -2584 365 1915 -2497 -873 2228 -1963 -878 2753 -914 -1026 2773 -337
1332c37m95L275l241j651M514k380k518M569j098k986M387j76m322L972J055n223
$$ -337 -832 2443 -798 -2449 2065 -315 -2833 1736 638 -2348 2039 1863 -2459 1513 2568 -2655
1348b655K964J352m432K560J726m012J975L678m520Q73M408m936q86N663m598
$$ -2655 309 1661 -2771 -211 1515 -2497 -522 3156 -1364 -491 3917 -1019 -1905 3758 -840
1363h40k827N983k482l719N880m78m360N062L97n342L457J896m768J882J876m846
$$ -840 -3667 2316 -166 -3885 1995 1517 -2843 2219 2616 -2726 731 2627 -2141 -259 1617 -3229
1379c229L036K673n295K243M055n543J202M773n293o58N641m622k838O853k570
$$ -3229 -193 2480 -2815 -572 3483 -2060 -858 3915 -1378 -2036 3605 -1017 -3855 2998 428
1394D28m250O125j069m790N364N36n448M468J104n462L187K339n722K780L230
$$ 428 -3822 2303 1234 -3556 1808 2344 -3104 1364 2468 -2994 193 2532 -3190 -410 2820
1409B820n631K097L957m676J05N103n331o67O177m714k466N764k489l416N786
$$ 2820 -2811 -714 3243 -1433 -1328 3775 -1556 -2223 3954 -760 -3226 2538 49 -3367 2419
1424B419j489m057N254n11m966N008N90n699M372J686o481L374M078o375J438
$$ 2419 930 -3127 2127 1616 -3350 1658 2248 -3451 921 2607 -3874 -500 3578 -2797 -1359
1439a359M674n498O77N294m789r84N165l521k372N257k842k322N293k702l232
$$ -1359 3315 -2183 -1506 3788 -1001 -1985 3180 -341 -2713 2544 -298 -2620 2673 -29 -3261
1454c261O127j791m504N981k91n924N366J394p068L747L650o908K310M978n867
$$ -3261 2866 1075 -3429 2552 2261 -3663 1703 3097 -3971 -224 3426 -3482 -1172 3806 -2061
1469b061O20N100n148m03N322m174j560M669k529k787N668l165k626N848j503
$$ -2061 -1441 3659 -1489 -1892 3430 -744 -2304 2365 -164 -2951 2717 -448 -3074 2774 1271
1484A271m741N979j34n748M958R84o768M676K846o675K368M123n337J070M926
$$ 1271 -3470 2509 2375 -3373 1585 2569 -4199 477 3323 -3352 -984 3139 -2198 -1128 3798
1499C798n499J69N298m864j258N656m135k420O138l304l435O362j208m575N713
$$ 3798 -1701 -1532 3766 -1098 -2356 3300 -835 -3255 2883 -421 -3856 2506 1298 -3277 2436
1514B436p88m936N218O86o007L760J668n390L082K674n400K278M324n471N61N695
$$ 2436 1648 -3288 1930 2616 -3391 369 2037 -3353 -271 2403 -2997 -719 3605 -1866 -1305 4390
1530D390n609q14N283m678j914O436k987l862N530o06l805M779m45m458M386Q6
$$ 4390 -1219 -2033 3250 -1428 -3342 3094 107 -3755 1775 1169 -2636 2143 1698 -2760 1626 1712
1546A712m641L319J388m794L437J549n289L379L381n104Q30M194m885K47N150
$$ 1712 -2929 390 1778 -3016 421 1970 -3319 60 3441 -1663 -833 3361 -1524 -1277 3873
1561C873n352j403N365k772k558M922j757k546M584j070l540L659J37l943L594
$$ 3873 -1479 -2882 2483 -289 -2847 2075 318 -2228 2356 1286 -2254 1405 1542 -2401 1193
1576A193j33m296M106J144m719K894K484m727J668L712n240O45L936m000n46M180
$$ 1193 1060 -3236 870 2014 -2705 189 2673 -2054 -386 3326 -1914 -1269 2667 -1333 -1879 2301
1592B301l164j177M483k841j825M404j692k462L932j374l311M259L2m317L169
$$ 2301 -863 -2040 2443 -398 -2223 2181 489 -1973 1959 585 -2726 1533 1565 -2752 417
1607D17J215l774K397K094m149J248L008l595L52K486l030P76K639l704m98M330
$$ 417 1632 -2142 255 2349 -1800 -552 2456 -1139 -787 1699 -1331 -555 2084 -1620 -2118 2212
1623B212k697j188M085k682j914M448r22l727L477J47l707L005Q97l498J996K117
$$ 2212 -485 -1673 2412 -270 -2184 2264 1342 -2385 1092 1239 -2468 537 1434 -2064 -68 2049
1639B049l257R17J989k551R52J762l315R63K310k835l41L020k656n83L722k399
$$ 2049 -1208 -291 1698 -853 99 1861 -1454 -491 1819 -1016 -1357 1663 -993 -1576 2146 -253
1655b53j761L866q31k735K768k17k644K324L38l145K236J019k297J914N07k517
$$ -253 -2014 1852 1021 -1714 1054 837 -1807 517 855 -2290 -54 965 -1332 582 1089 -1428
1671a428J967J695l216L79J862k433N77J928k333p1K729j552j457K740j399o79
$$ -1428 539 2234 -982 -603 1259 -1174 -597 1331 -1002 -1073 1656 104 -1353 1387 -12 -691
1687f91K094j181j717K478n63k184K446k93k009K415O27l086J883J346k741J071
$$ -691 1403 222 -1495 983 420 -1764 682 389 -1620 795 1422 -1664 219 1565 -1176 -105
1703a05J325k585J159J509k208O0J829j130k95J898k224M0K208j619j325K508
$$ -105 1220 -1365 -206 1303 -905 -845 984 -146 -441 1457 -767 -727 1481 -138 -1463 1045
1719A045r35j852L552j190k584K853J54k369J597J197k466P71J493k319Q22J106
$$ 1045 110 -1742 1810 620 -1964 889 1043 -1326 271 1468 -998 -227 1266 -1053 -231 875
1735H75j686M32J279j524L10J676k058Q7J925j881m40K613j865j251K528p88j967
$$ 875 -811 -379 900 -624 -314 1362 -696 -609 1316 -565 -1005 1608 -257 -1508 1020 232 -1735
1752a735K351m6j956J839N31j814J118P48j643L89O38j906J428N48j621P19J330
$$ -1735 616 570 -1386 453 984 -830 288 1036 -607 -218 420 -1486 -58 490 -1131 -412 918
1769I18j428L94J741j858m75J848j593m14J385r45q34J829o65j022K023n90o65
$$ 918 -510 -116 1625 -233 -708 1140 -453 -867 518 -427 -1261 568 -97 -1119 904 314 -351
1786c51J078l70j518K041m23k221J788Q02k102J265J629k361P96J486j903K53
$$ -351 727 357 -1161 880 457 -1764 24 826 -1276 -11 1618 -743 53 1539 -364 -111
1802a11J137j523k30J379j485o2J586o79p23K053j113j183K337j012j886K269
$$ -111 1026 -497 -727 652 -833 -895 691 12 -711 1342 229 -954 1383 371 -1515 754
1818G54k32j830J541M21j938J345J168k083Q57J250j594K3Q03j334L02J252j454
$$ 754 522 -1308 233 654 -1284 61 1229 -854 3 1253 -341 -318 485 -849 -547 705 -749
1835g49rJ740j190l18J794j463p00K297j115j609K087m04j770J619L54j668J645
$$ -749 -758 982 -208 -526 1268 -195 -895 1402 287 -1322 765 361 -1409 210 564 -1104 541
1852E41O61j805O38J022j478M36P07j685K15J506j458L47J092j031j92J393q59
$$ 541 1202 -603 35 1057 -421 15 722 -963 -748 758 -700 -353 739 -292 -484 909 50
1869E0o51J486n87j034J092l19o85J245n40r58J474Q6j561J641j43j407J161N11
$$ 50 -601 885 298 -736 356 37 -648 597 57 -901 573 659 -902 739 596 -811 350 861
1887H61j941J133J064j787j22J409q92j75J142p94o08R68k22p23J297r35k19J313
$$ 861 -1080 53 1117 -670 -792 617 -275 -450 692 -102 -710 258 36 -687 610 -325 -544 769
1905G69p95p22J361l52j387J842m72j114J573k06j611J146P26j525M06J004j248
$$ 769 -26 -748 613 261 -1126 716 244 -870 703 497 -1114 32 758 -767 -361 643 -605
1922f05R2Q11o10j18Q31n72mR62r02QP68q58p22J280m40o94J191J6q85R38J01
$$ -605 -513 298 -312 -430 401 -171 -175 787 -115 -107 661 -197 -919 361 -79 -773 418 434 -451 487 588
1943E88j089O18L36r14L05N84q66N7Q26p15J10R37q96k12J347j146n24R41n52
$$ 588 -501 117 453 -461 -156 428 -438 -381 445 -270 -160 777 -119 -331 1016 -130 -654 287 -265
1962b65q10J018R3p33R04K01n44N14q2n68L61L0o38N89l02l12N03N11r89M83J042
$$ -265 -1075 -57 36 -697 207 408 -136 378 296 -272 89 119 -519 70 -232 -544 -41 470 -519 -36 1006
1983A006j138k2J014q42l71N61m38k31M66J71k97M92l9m49L31L05m73L19l74m59
$$ 1006 -132 -154 860 18 -353 208 -230 -461 5 176 -121 371 332 -117 214 519 46 365 -9 -468
2003d68O91m7o20K73O45j136O65L65o49M09J80o42j28N82l6n83J74J7J03K12M04
$$ -468 223 176 -444 -171 474 -662 3 368 -281 128 308 -334 -462 120 84 -499 -325 -308 -205 7 411
2024D11l08L73m15M8r9j51L6M8K1n68M42M87l14n5K92j49M7J64l02M8m14J29K57
$$ 411 103 476 61 109 10 -141 -105 -57 -36 -604 -162 325 11 -44 248 99 146 310 8 56 -358 -229 28
2047B8l48j8K63N55l93n1R7l2l6L3k60l01L48J96J1m76M84L13n71J09L81j97j78
$$ 28 -320 -338 -75 480 87 36 133 101 65 98 -162 -463 -115 81 92 -384 100 413 -158 -49 332 135 -43
2070d3J34J13k83K64l92r2L25j04K44m1r7K62N4l57Q7J37k09l88N05j37m12M88
$$ -43 91 204 -79 185 -207 -299 26 -78 166 125 28 290 344 -13 74 211 2 -386 119 -18 -430 58
2092E8J31j07l66L69K83o69N96n7o54P04k50l8PJ75k49L15J22n18L92K21q32J69
$$ 58 189 82 -284 85 368 -301 295 238 -416 288 38 0 7 182 -67 248 370 -148 244 465 -367 -198
2114a98P96o30M1J96n55L25K43m3m42M89n4r2Q4k2k02M62l02p09P70k72l62M52
$$ -198 598 -32 9 205 -350 -25 218 175 -267 222 168 76 160 138 -64 398 96 -613 157 -115 -477 -25
2136b5M23o92K74N47o44l04P08j90j05J49n57J86N67k15j12J85k30m86J193o45
$$ -25 398 -294 -20 527 -117 -421 287 97 -8 141 -416 -230 337 122 10 195 -35 -521 672 27
2156B7l72O43r1m06M85l19m36O88M41j001K62M16n56J30J93k67P9K78k79l71Q84
$$ 27 -345 298 207 -199 286 -33 -469 219 660 -341 -79 337 -219 -89 104 -163 -84 194 -85 -456 428
2177D28m62r5K20l86J56O57n09l69N78K3o95R80l92p73P54j44m65N03O15q44K62
$$ 428 -34 -129 91 -295 -139 518 9 -360 218 241 -454 526 134 -639 115 -29 -494 9 624 -220 42
2198D2L38m39J95K72o89LP86n45m60P05l52l99P93m44P0Q12l68o39O34Q1q48M29
$$ 42 380 -59 136 408 -281 -278 508 -37 -497 208 -144 -543 250 -194 -124 688 320 -319 315 396 -452 -23
2220b3k12l10O24j07m31Q79k30p95O48L98j103M07M47n80P3P10n19j65J072o50
$$ -23 -235 -545 79 -28 -459 420 190 -605 43 441 -662 -255 192 -388 -315 395 -124 -289 783 133
2240A33l96P60m24k34L35k14n45L87k4j68K63M44o48P50J60n43L7N38r62K36N27
$$ 133 -263 497 73 -161 174 -40 -585 -198 -222 -390 -127 317 -331 419 579 36 73 611 -351 -115 412
2261D12r50K8J002p74K63M61n16K1M12j25l27L43m56k22N57l06n14R71q6m99P04
$$ 412 -538 -510 492 -282 -19 442 -74 -53 359 234 -93 250 -206 -428 129 -177 -691 280 194 -305 399
2282C99J08r35N85J44m79J29K61o90M04M73o44L32M56p53J78J59n47P2Q98p86
$$ 399 507 -428 157 301 -178 -49 212 -478 -74 399 -245 87 543 -210 -32 127 -420 -348 550 -236
2302b36O8N42o71p5Q90k98n68P79k86j54K93j5q80P69K02j185Q16L09q45P39L44
$$ -236 -168 374 -297 -372 518 220 -348 431 145 -9 284 269 -611 158 360 -825 -9 300 -545 194 538
2323E38j308P73O46j041L92O69q64k4P01q26j27O80j36m25N55k22n10R57k81n09
$$ 538 -770 3 649 -392 0 669 -195 -219 482 -344 -471 209 73 -352 203 -19 -529 428 147 -362
2343c62M19j89k50N32J63j070Q49M61j240Q52j06k50J03P72o92k57Q53p37q3P5
$$ -362 57 -132 -382 150 313 -757 92 553 -687 165 59 -191 -88 684 -8 -265 588 -149 -232 -157
2363a57j04J08M70l65k61M80k12r1N14l4r08O59o5n24L87K46o16M67L88q07M67
$$ -157 -261 -153 317 -48 -309 171 -41 -132 382 348 -560 99 34 -490 -103 143 -473 -6 382 -425 42
2384D2N63n82j67L66l30m05R30m92l88R71o14r4R18o14m53Q64o65n40J167l60
$$ 42 605 23 -144 222 -108 -513 417 -75 -463 508 -106 -200 718 104 -349 515 -150 -690 477 117
2404A17m16M49L00j067P07O59p84o3L86n17J93O32j056J58R80r66k99R54m81J25
$$ 117 -299 150 450 -617 90 749 -35 -98 288 -229 -36 596 -460 -302 678 -288 -587 367 -114 11
2424A1O37n79m56P60k34n38P45j75q14P18L80q16M58M05p63L33J30m33L48M02
$$ 11 648 69 -387 373 139 -399 346 171 -643 75 455 -361 97 502 -261 72 202 -231 117 519
2444E19p60j81J163q91j1O30q10n8R22m43j43M18j30m70P21o53l68P39J10r14
$$ 519 -241 -422 741 -150 -161 469 -341 -399 523 80 -63 355 225 -245 476 -177 -545 194 304 -610
2464f10J049jq93P33Q4q47M77O18p92j13N24o33K56P13j028K64O15l39k98Q94
$$ -610 439 438 -455 278 362 -485 -8 610 -182 -295 229 -404 -148 565 -463 -199 416 77 -221 673
2484F73p15l24J073p39m70M30L18o70P79K4q01P23J32p97N04L82r55J86O17n99
$$ 673 -42 -366 707 -32 -502 -72 246 -424 355 379 -422 301 433 -364 140 522 -433 -247 370 -229
2504b29l1Q17m61l32P44m63M5N82n81m49Q59o40k74Q91o19m60Q99l48l13N65L4
$$ -229 -260 557 96 -236 508 45 90 672 91 -358 501 -139 -413 478 -141 -601 298 -50 -363 202 236
2525B36n40N72R5o45M40M4k26J00K75p89N17K33l55K19L33o38j17M16l10k53P69
$$ 236 -304 268 363 -282 158 202 -24 76 351 -438 79 312 -43 176 509 -129 -246 170 -140 -393 376
2546C76k67m78O95K22q21K90K78m84K87J08l79J12M51p41O59j25o04K13P10l87
$$ 376 109 -369 326 548 -273 17 295 -189 98 206 -173 -61 390 -351 308 183 -421 -208 502 115
2566A15k61J95j65j87L47k52j44M51k27m26O85m2m41M99K71o56M27j7l84J37N85
$$ 115 -146 49 -116 -303 44 -208 -352 99 -128 -554 131 89 -352 147 418 -238 189 172 -212 -75 510
2587E10r95L51O73o77n1O52r16K71M67m33K6O40o29j23M36k74q9M99m28k12N95
$$ 510 -485 -134 539 -138 -189 463 -453 -182 285 -148 -122 518 -111 -234 202 -72 -161 338 -90 -302 293
2608B93Q3l29L79k00p09N91p3m50M21J30l37n2O04o98L49J77j14l76K79j14l3
$$ 293 376 47 426 226 -483 108 35 -415 6 136 -201 -253 351 -347 2 179 65 -311 -32 -146 -179
2629a79K44q8j21N48l60m47O68m14j12K07q4j41N26m01j88J6M15l0j86M44l33
$$ -179 65 -23 -144 404 44 -403 265 -149 -261 -54 -138 -279 247 -154 -342 -326 89 59 -127 317 -16
2650a6j70K78j4j31K53k73lJ39j98m49P32j17l32M69j03l47J22O31m61rK7n2k57
$$ -16 -186 92 78 -53 200 -73 -76 63 -135 -584 148 31 -301 168 65 -282 -160 471 10 1 28 -24 -281
2673b81J15K59k38L70l37K28p8j66j30N93j60n19L83L6m22L85j25J09R2q5l4J12
$$ -281 -166 93 -145 225 -112 116 38 -128 -258 335 175 -344 39 75 -347 38 -87 22 114 29 -5 107
2695A07J30l50K9M48k71J00M1n15L44k5k72K31J48l26K43j06M09l03l97M64l11
$$ 107 237 -113 -84 364 93 193 234 -281 63 38 -234 -3 145 -181 62 -44 365 62 -335 129 -182
2716a82M7M6l1K73p3j64L6L23ml42O0J46m87M78m36N94n54J76K27J18R4l88N4
$$ -182 -135 -89 -120 153 80 -84 -48 275 271 -71 -11 135 -352 126 -310 284 -270 -94 133 251 345 -43 11
2739A1op7R9Rj90J35J22l73M34K0j34l4K6P7J35k94j68mJ39O9m42M69J44n7q9
$$ 11 5 -72 27 36 -154 -19 103 -270 164 184 50 16 42 119 254 -40 -208 -212 -73 -4 -446 23 167 110 21
2764B1J44o2j9Q2P6k66p5L9j7r3M38k84n7jQ9OL5k77N02k80j78N8O0j60M28l18
$$ 21 165 103 84 166 242 -24 -99 -60 -77 -170 268 -16 -73 -74 15 21 56 -221 281 1 -177 -119 -59 -219 209 -109
2790a09l32L04O44p19K11l8p8L0O7J18k54K97j31pK59m12J71k9P2m10M81J75m17
$$ -109 -441 -137 507 -212 -1 -39 -117 -87 -20 98 -156 141 10 3 262 -150 21 -8 64 -346 135 310 -107
2813a07R8K36m04L3L68k12j56M84o6l66K03j08j64M29l11K25L7K7q0k96J84m44
$$ -107 -9 227 -177 -144 224 12 -144 340 274 -92 111 3 -161 268 -43 182 219 246 166 -130 54 -390
2835c90N51k0m65N12j78O8J09J42m95K57k5j63J15j82O62n79K68j84P0j95K53
$$ -390 161 141 -324 188 10 78 187 329 -166 91 66 -97 18 -164 498 -81 187 3 73 -122 131
2856A31k87M32l93j80L60j5m33L09K82k06p6K60l54J91PJ30l0q7q5J72p4k04P
$$ 131 -156 276 -117 -297 63 48 -385 -76 206 0 -76 184 -170 21 28 158 128 41 -44 128 54 -150 -143
2879a43M96j30j99M99o35J17J2j68n8M23l73k07L51K65k76Q6kj95J1K61r0j53
$$ -143 353 223 24 523 -112 5 17 -151 -209 214 -159 -366 -15 250 -26 60 58 -137 -126 135 45 -108
2901a08J62l21J02O59o07M0N8j68j96P38n8l57L25o21j7M98j84m2K18j48j17L28
$$ -108 54 -267 -165 494 -113 -73 -15 -183 -379 359 301 -56 269 -352 -369 129 -55 -97 121 -27 -144 184
2923A84m23M66P0l62j57L72j27l35L56j64k9K11R3K6j00J18k31k22J32p2o9J91
$$ 184 -239 227 297 -65 -222 150 23 -312 44 -120 -149 62 155 181 81 199 -32 -254 -122 -194 -263 -72
2945g2N9l66N43p8j46K21j10k03K3K99m37J92R7P4l30J52k85J11N62o52M43j3
$$ -72 -13 -379 164 86 -60 161 51 -152 -129 170 -267 -75 22 96 -234 -82 -367 -256 306 -346 97 84
2967H4O9j68L8Q6l78L68N1l7j2L3k30L81N1l43J82k41k2RJ30j03k89K47n2N4K14
$$ 84 153 -15 23 109 -269 99 150 113 101 134 -96 285 336 -7 175 -66 -88 -79 51 -52 -341 -94 -146 -92 122
2992A22m2q7L72m62O6m1J47k08K26m2l02K68Jj33L75j53j45Q6P2l07K56K75n64
$$ 122 80 -7 365 -97 -31 -72 75 -133 93 51 -251 17 18 -115 260 107 -38 48 120 -187 69 344 -220
3015b20n6J93j71J57J14oj54L68j08q9J82k28q9K95Q5n73O40l34K06l80L78k65
$$ -220 -276 -83 -254 -97 17 11 -143 225 117 28 210 -18 -107 188 273 -300 340 6 212 -168 210 -55
3037e5J58N8m12L68p0j36kJ55j67N9n3K68n04N86l91j34L54l42O4K74K8p2n6J29
$$ -55 103 161 -251 117 47 -89 -91 64 -103 -44 -97 171 -333 253 -138 -272 82 -260 -196 78 106 34 -22 107
3061A07j35K11Q0j20r7q4q8j68J97J14L21m2m91K63J78l59o0J92j80j54N73J34
$$ 107 -28 183 263 143 46 -38 -126 -294 -97 17 338 296 -195 68 246 -113 -173 19 -161 -315 258 392
3083C92l16m05k4J07K75n2J03j82j05K65k5L62o96L62j06j53J47L6k84L42k9l18
$$ 392 76 -329 -353 -246 29 -23 80 -102 -207 58 33 395 -301 61 -45 -198 -51 -15 -299 43 14 -304
3105c04J35J16j27o0L15K4J92k07p8k11K53m9m13K91K24l9N4j02q9j6L05m75J18
$$ -304 -169 -53 -180 -240 75 99 291 84 6 -205 48 -1 -414 -123 101 62 116 14 -75 -91 214 -261 -143
3128a43n5KN15p9q68Q27M5m61K27K48k66K7p6K24m7Q0k36J17K66l47j69N92n15
$$ -143 -198 -196 319 240 -628 199 244 -217 10 258 -8 19 -57 167 120 200 -36 81 347 0 -169 423 -92
3151i2j57L05J25j85R1j2j53l3l3j34N13L7m59j18M65k13l30M42k20R0m7k90N24
$$ -92 -249 56 181 -4 87 75 -78 -111 -144 -278 235 272 -187 -305 160 -53 -383 59 -161 -71 -118 -408 116
3174A16L16o29j53M36k28K51K03m52p6L31k7K0n2M9k65j69M61l55K67J85j63k29
$$ 116 432 -197 -350 86 -142 109 312 -140 -216 115 88 108 56 105 -160 -329 132 -223 44 229 66 -163
3196a63K37k41j0K84L1k36J57m56J81Q9L8L50m86K14L7N2l09J22R5L67m75J18
$$ -163 74 -167 -177 107 138 -98 59 -397 -216 -127 -89 261 -225 -11 26 78 -231 -109 -14 353 -122 -4
3218dL1q1R3Nn4j18L53k25K99n39K72j22L15k78j00pj7J59K12j76m60P55k25m4
$$ -4 27 -54 39 44 -10 -128 225 0 299 -240 32 -90 225 -53 -153 -160 -177 -18 194 18 -442 313 88 44
3242D4o3Rj84Q7O16l97l79L84j64o2J62j22K9K10n54K66J59q5k9R3k95K06k25
$$ 44 -19 -10 -194 -107 509 112 -267 117 -47 -109 53 -69 -40 170 -384 -118 41 -44 -73 20 -275 -69 -294
3265b94K95k76L05k98L55j42R2L6k99N03k03q8J96k33l5J6k9K26j99K87m40K06
$$ -294 1 -275 30 -268 87 -55 37 73 -226 277 74 -14 182 -51 -86 -70 -99 127 -72 215 -225 -19
3287a9k77K69j54K58Mm9k7L9L16l31K57k49pk04R9k0L63k03j20K38Qj51j0l33
$$ -19 -296 -27 -181 77 81 32 5 44 360 29 286 37 30 -174 -75 -95 268 65 -55 183 191 40 30 -303
3311c03N39n25N81m22P8P9r3j53L18n07L41PJ94j8l85L12rr2j35J35J06k96J37
$$ -303 236 -289 292 -130 -52 27 -66 -219 99 -408 -67 -60 134 116 -269 43 34 -58 -193 -58 48 -248 -111
3334a11K01q3K77m32J49M55m58k82J06M74o11L03J06l28J77M1j24L81l13J71N7
$$ -111 90 7 284 -148 1 456 -2 -284 -178 296 -315 -12 94 -234 -57 -16 -140 241 -72 99 156
3355A56j67K38n34K33K80j45L59p02J83P2l91N73q5l10K29j35J76l2l5m3Q7k36
$$ 156 -11 227 -307 -74 206 61 420 -282 -99 -27 -418 155 70 -240 -11 -146 30 -2 -37 -80 7 -229
3377b29K38L6K49l22J31j19K14l62J74k09J77j12K84l20J48J52l7k22K03l51K52
$$ -229 9 45 294 -28 103 -16 198 -164 10 -199 -22 -134 150 -170 -22 130 93 -129 74 -277 -25
3398b5L24n83K22L25l44p4K69k30P1M3K74k81kJ20Pp5M0k1k14o5K21j9O4l2p9
$$ -25 299 -284 -62 263 -81 -155 114 -116 -45 -2 272 -9 -11 109 116 41 81 60 -154 -219 2 -17 47 15 -64
3423f4O9q2J29O2Jk7K86m50j42M65N0k56J26J40n76Q1J27J03N2j80K10O6j04j13
$$ -64 5 -77 52 114 115 88 374 -76 -218 247 297 41 167 307 -269 -188 -61 42 94 -86 124 190 86 -27
3447b7j44J28j35L27K1j25j45p7K58R7pj8l36m4N7j43M47j11L2K23l62K7k33J29
$$ -27 -171 -43 -178 149 170 45 -100 -177 81 178 171 153 -183 -227 -170 -313 134 23 55 278 -84 -57 -290 -161
3471a61K74J11l27N7k77N70m82J74K42n3j05n4Q6j15M0j22M21j18o2j02j69K30
$$ -161 113 224 -103 -46 -323 247 -235 -61 181 128 23 -31 55 -60 -20 -142 279 161 99 -3 -172 58
3493E8j6O8n1m22K83K79k64K54k31p1K00M5j84J70k54J07J28r5L2O9k65J64m4
$$ 58 42 110 59 -363 -80 199 -65 189 -42 -113 87 132 -52 118 -136 -29 99 4 36 105 -160 4 -40
3516d0m2L39k70R5j94q9J81R5j48J31k40L80l15J62n3k50M51l66K64r2K48k50
$$ -40 -82 257 -13 82 -112 -201 -20 75 -73 58 -182 198 -117 45 -8 -258 193 -173 91 -1 247 -3
3538cJ78j16k53N0K62j28J97jk29K87m74J60J80j26k79M38J25j74J28l74K1L73
$$ -3 175 59 -194 -144 118 -10 187 186 -43 244 -230 -70 110 -16 -295 143 268 94 222 -152 -131 242
3560B42q8m85L98J19k19K27k1J78j27rl25K29O6N6m53L28l86jL44k54P5p9nJ21
$$ 242 154 -331 67 186 -33 194 173 351 224 215 -110 119 185 241 -212 116 -270 -271 73 -181 -106 -185 -190 -69
3584f9J84l22J63j09J93j83m9J65k56M51o5k5N8k8j77l2L16l66J43n8M19k46j02
$$ -69 115 -207 -44 -153 40 -143 -192 -27 -283 168 103 78 136 108 -69 -101 215 -151 -8 -66 353 107 5
3607EL34m22r6R2J88O7j5j70j63J99j28N2L48l35J60k71L1N6K55k19pJ08j35l
$$ 5 339 -83 -179 -87 101 168 153 -17 -180 19 -109 -57 291 -44 116 -155 -124 -68 187 -32 -39 69 -66 -69
3631f9L4P9m3k72L82J18k85l7J8R3Q2k64Q2J06n9J03J09k62J42K01j22j27j88
$$ -69 -35 44 1 -271 111 229 -56 -93 -75 18 100 -164 -82 24 -35 68 177 -85 57 258 136 9 -179
3654a79J09k11q7N18n5j65j28K62rk59J42n9L44L15p38L33j17P1L76n99J77j54
$$ -179 -70 -281 -368 150 95 -70 -198 64 55 -204 -62 -121 223 538 -200 133 16 87 463 -136 41 -113
3676a13l17M27j65J35k18M73L6q6Ok50J40o7L1J45L1l07L7K45k03J59j29J10j80
$$ -113 -430 -3 -168 -33 -251 222 258 172 178 -72 68 1 32 177 208 -99 -62 183 -20 139 10 120 -60
3699f0k85L14O1l10M04k67m6L07j88J92n6l84K39M5R2j12Q3J61J9l41q0L88k67
$$ -60 -345 -31 30 -280 124 -143 -189 118 -70 122 66 -318 -79 -34 58 -54 29 190 209 -132 -212 176 -91
3722i1N1J77m0m9N5J4j30Q2R7qJ3l17Q3M9M5k41J92k56K50J09J07k27J33q4j31
$$ -91 -40 137 97 48 103 117 -13 69 166 158 171 -146 -63 -14 31 -210 -18 -274 -24 85 192 -35 98 14 -117
3747a17L28K4m38j55L88P0q4L7J43k68o9M17K1j98j0k21L43l20j4J94q5K6J62
$$ -117 211 235 -203 -358 30 100 16 53 196 -72 -141 276 297 99 89 -132 211 -109 -123 71 -14 12 174
3770A74l87K82J06j65k07K10j42J17M31l28j04K61Nl17J86j13K2Q5o9J6l19L71
$$ 174 -213 69 175 10 -197 13 -129 -12 419 91 -13 248 253 -64 122 9 31 116 47 63 -256 115
3792A15Q4K4j52Q2k89R0K8J28k0k05K76J04l81K01R0m14M51J92n01J6K60j1m44
$$ 115 199 223 71 153 -136 -46 -18 110 90 -115 161 265 -116 85 175 -239 212 404 -97 -81 179 168 -276
3815b76L92k42j74J51P8o6K16J43m98K02o3J59q2J11o8q4k99M14r3K37k09RL94
$$ -276 116 -126 -300 -149 -71 -137 79 222 -276 -74 -137 22 -60 51 -17 -101 -400 14 -79 158 -51 -42 352
3838C52l96k8J00j12j0K04k84Q5N2J22O6k61K12m50L63l7J12l60N13k26j20K92
$$ 352 -44 -72 28 -84 -94 110 -174 -89 -37 85 151 -110 102 -348 15 -22 90 -270 243 17 -103 189
3860A89o3l69O2K95p7J3K2j68L97n65K28J23k09P3K1M0j75N16n99K59o2N00k39
$$ 189 126 -243 -181 114 37 50 72 -96 301 -264 -36 87 -122 -49 -28 12 -163 353 -246 13 -49 451 212
3883B12j39j59j59L47m3O5l78K14q5k57M51q9n67N02oL4J44k0k78O7O1K9o5K48
$$ 212 73 -86 -245 102 59 124 -254 -40 -125 -382 69 -20 -587 -85 -91 -57 87 67 -211 -144 -83 -54 -119 129
3907A29O2k8j94l24L22L65m65j30N40k97j85K35Q4k30J51p1Q3J36k10l01M12n5
$$ 129 191 163 -31 -355 -33 332 -133 -263 277 -20 -205 30 114 -116 35 -36 47 183 -27 -328 84 29
3929B9k83M30P7m00K94m9k50J5M41o08L92R7l44L12k26j75O9M68m90L05J77j20
$$ 29 -254 176 253 -147 147 98 -152 -137 304 -304 88 185 -159 153 -73 -248 -179 289 -201 104 281 161
3951A61k20K4K16l34K17j2l9K8J28l21M33k66k33K73j37M6J12K07k14j44K87k27
$$ 161 -59 -35 181 -153 64 52 13 41 169 -152 281 15 -218 55 -82 -36 76 283 69 -75 212 -15
3973a5j05J89k37J64K91k58k25L3K99j6K47j52k13Q1r6k55P0L12q1J39K11l22
$$ -15 -120 69 -168 -4 287 29 -196 -163 136 120 367 215 2 83 -13 -268 -198 114 33 172 383 61
3995F1L0R5m10K05N8J2j34K70j28q4OM90n22J91m5n4N9m0l76M32J8k66K20p7m19
$$ 61 91 186 -224 -19 39 51 -83 187 59 -25 -19 471 -51 140 95 41 100 60 -316 116 134 -132 88 11 -408
4020d08N69p7k37R9M65j93l81J72j94J70M20k62j14k0r4J13J05j33l03K53q0l92
$$ -408 161 84 -153 -54 411 218 -163 9 -185 -15 405 143 29 9 -85 28 133 0 -303 -50 -130 -522
4042e22K52L12l21M93qk23Q8K51l54R6K42l47mj62J52N6J27k28n1N65p59M24K6
$$ -522 -270 42 -279 214 206 -17 71 322 -32 64 306 -41 -45 -207 -55 1 128 -100 -151 414 -345 79 105
4065A05o8Kl3L08j79Lj90J75r7J44m79K76K64l00L89n2m67J33N5M5q0J4q6j12
$$ 105 37 39 6 314 135 138 -52 123 26 170 -309 -33 231 -69 320 268 -199 -66 -11 34 -46 -32 -118 -230
4089b30K71K06k84J07K01l91L52j88k01K71k52J08K51q5k53J36J89k97J45N1j7
$$ -230 41 247 -37 70 271 -120 232 44 -157 114 -138 -30 221 136 -117 19 208 -89 56 107 90
4110I0l5m7l5k55N46k68l25P49p19nL52J38j00k56L7o7L48Q0l62k0L54l21J83
$$ 90 55 8 -27 -282 264 -4 -329 420 -299 -304 48 186 86 -170 -133 -200 148 228 -134 -154 200 -121 62
4133F2O9nO0k65l9J85J93n46K43M56l04k13K70k89l7j3J50r0J40l34N34K0j28
$$ 62 131 126 186 -79 -118 67 260 -286 -43 413 109 -104 166 -123 -160 -173 -23 -113 27 -307 227 247 119
4156A19K15p3j05l72K19k58L11L3o0p0j39M61l34j03%J47j50J82R1J13k57q7N70
$$ 119 334 261 156 -216 3 -255 56 89 29 -41 -180 281 -53 -156 -156 -9 -159 23 114 227 -30 -117 453
4179D53m33%l71L06l29J73J43n7L16j5Ql57J94K4j45J01M0j55J97k38k99L94J23
$$ 453 20 20 -351 -45 -374 -201 -58 -115 201 186 194 -163 31 55 -90 11 51 -104 93 -145 -444 -50 73
4202G3mj8N9J33k71J19j80n7L49k74oJ29j05J19r1J19j4K5p4j00L52k67j80K17
$$ 73 69 51 110 243 -28 91 -89 -146 203 -71 -77 52 -53 66 -25 94 80 105 31 -69 283 16 -164 53
4226E3j5J1Q8k40O7J10J19k10N7q9rJ7K00m95Q4J85J66l51K41k15NM56j53o1M22
$$ 53 38 49 137 -103 -36 74 193 -17 40 -49 -58 -41 159 -336 -252 -67 99 -252 -11 -226 -221 235 82 21 443
4251D43n08N4J53j52j24J47p4J68l18R3M4J85K48n63L82k38r1k0K26Q2L9m19Q7
$$ 443 -65 -11 142 -10 -134 13 -61 107 -211 -118 -74 111 359 -204 178 -60 -151 -171 55 137 176 -243 -156
4274a56KK42J23j64K4j10J46l25J65k85N64j93Q7J33k13q1j67L40n16L55k02M30
$$ -156 -154 88 211 47 71 -39 107 -218 -53 -338 226 33 120 253 40 -41 -208 132 -384 -29 -231 199
4296A99l56J78J55r1k44L28k09j48Q7J8J70K25j8k70M5k38K24k52M15m71M69k92
$$ 199 -157 21 176 85 -159 169 -40 -188 -101 -83 87 312 294 24 69 -169 55 -197 218 -253 216 -76
4318g6p7L47j8k45K35k35p8K33j82K15k62J75j10N8k36J32K20l47K24Q6j69M12
$$ -76 -153 194 176 -69 166 -69 -147 86 -96 119 -143 32 -78 -20 -256 -124 96 -251 -27 59 -110 302
4340C02l39n7K4r1M3K9L0L65n15k6N22m87J25j7n3M85l38K27j23O2j01N4Jj03
$$ 302 -37 -94 -70 -161 -118 -89 -59 306 -209 -235 287 -200 -75 -92 -145 340 2 229 106 168 67 121 122 19
4364A9J13l33R5J3N13m79O5OM9q0j38M36j32rj43l83L78j00K7J56j67P7k07K37
$$ 19 132 -201 -106 -93 420 -59 6 12 61 -19 -157 279 147 138 -5 -388 -10 -110 -83 73 -94 -17 -224 13
4388A3oK73j41q0K11k91J05k6J47k41K5k23K13J48j55m1J37r1l1K63r9q0j14J14
$$ 13 7 280 139 59 270 -21 84 58 205 -36 -11 -234 -21 127 -28 -69 68 -23 -54 209 110 30 -84 30
4412C0n9k60L09j02R7o5j83J71nK6L90j59n67K94J10r5J53k21q9K00M02k08j86
$$ 30 -29 -289 20 -82 15 -50 -233 -62 -67 -41 349 190 -377 -83 27 -68 85 -136 -225 -25 377 169 -17
4435a7K11j84p4KJ72J40J04j24l55n8O2J12R1K7o23M31J65K9Q0l11J10p7P56p12
$$ -17 194 10 -64 -62 110 250 354 230 -125 -183 -121 -9 82 109 -514 -83 82 111 191 -120 -10 -87 669 -43
4459d3K22k34J24k7M7M1j67L88l98R2j13p2RR1p0J76k5K8J1l23L97j88J13J2k60
$$ -43 179 -55 69 42 89 130 -37 351 -47 45 -68 -140 -131 -40 -110 66 41 69 80 -243 154 -34 79 91 -169
4484a69M81l17k95L52k22O85n13J49k00j80N8L20j08l00L03l55L46jnL7K48j94
$$ -169 312 -5 -300 52 -170 515 2 151 -49 -229 -171 149 41 -259 44 -311 35 34 29 66 314 120
4506A20l0k04J88p9j54L47k32jk21K50j64L32k86J88m13M47J97n03J0L45O0j13
$$ 120 90 -114 74 -5 -159 188 -44 -45 -266 -16 -180 152 -134 54 -359 88 285 -218 -208 137 197 84
4528H4j42L9M4q1l2L7R3l19K04l9j14K95N0J69l73J51o0O2K11j6k87M1K01Q7l00
$$ 84 -58 -19 25 -56 -88 -51 42 -277 -73 -112 -226 69 119 288 -85 66 6 68 279 263 -24 17 218 305 5
4553Ej02o8J16M61l17j4k19J37J73k03j7M5L3K79l22J62j81j13n7J05K66k72L19
$$ 5 -97 -165 -49 412 95 81 -138 -1 172 -31 -48 -3 30 309 -13 149 -32 -145 -202 -97 169 -103 216
4576B16l99J44J00R7N0q2l4j64J71J71k85K03k64r4J20J09n6K04j71l4j87R7O4
$$ 216 -183 -39 61 158 208 126 92 -72 99 270 -15 188 -76 -170 -50 59 3 207 36 2 -185 -88 -24
4599b4J44P4k92M8K08m42K99J45k97J7K21j43m8J51j69P5k16M38m43O36m20o7
$$ -24 120 194 -98 -50 158 -284 15 160 -137 -120 101 -42 -90 61 -108 -33 -249 189 -254 382 -38 -105
4621a05M27k25q2L20m25j37M23o2l42K87j19m3q6k7M04k22J63m91L55J7k4k45
$$ -105 322 97 15 335 -90 -227 196 134 -208 79 -40 -83 -169 -196 208 -14 149 -342 13 30 6 -239
4643b39M98l52L5J77l78L51K65o7l59M24m13q4M66o8j91j74K04n5R3J83r3j85
$$ -239 259 -93 -58 119 -259 92 357 290 -69 355 -58 -142 324 256 65 -109 95 40 133 316 223 38
4665C8O4J38m79K91P2l79M59l16J02M01k64k60L66l95j30L66Lk81K57J87j4k90
$$ 38 102 240 -239 52 124 -255 204 -112 -10 391 127 -133 233 -162 -292 74 77 -204 53 240 226 -64
4687f4L83m28O8K35m49J98L50o20L11K34l37J96O5l08O9N18%m93M36j32m31K06
$$ -64 319 -109 -41 194 -255 -57 293 -327 -16 218 -119 77 142 -166 -97 421 421 -72 364 232 -199 7
4709GK16n18M13j98j21K37n9Pj29L56m05L36q1l12M38r7m26M38l65K0K46K37m80
$$ 7 223 -295 118 -80 -201 36 -23 -16 -145 211 -194 142 61 -251 187 90 -336 102 -263 -243 3 240 -240
4732b40L7N01l43q4K52k64J39J0j49K74J06l47R6K60n0l79K96j09l03L83o8q7
$$ -240 -203 298 -45 -129 123 -141 -2 8 -141 133 239 -108 -12 248 198 -181 115 6 -297 86 18 -69
4754f9J56j78j40J05L00j82j85L58j48R1j01L4l59L23j33K8P2K8k30L52l17o7
$$ -69 87 -91 -231 -126 174 -8 -193 165 17 108 7 41 -318 5 -128 -100 -28 0 -230 122 -195 -262
4776b62P95j78m38k5M26l17N6O0n05M88%k35Q6M72o53L59j72J75j72N6J79j81
$$ -262 533 355 -83 -108 318 1 57 117 -388 100 100 -135 -49 423 -230 129 -43 132 -40 16 195 14
4798A4K37m07L00j93j3J76J75m74J13J4J29l07N82M1l70j05Q9j42O9M74k42j54
$$ 14 251 -156 144 -49 -62 114 289 -185 -72 -58 71 -236 346 387 17 -88 1 -141 -72 402 160 6
4820FJ79n01N14K6l10K27l1m5k8L24l99m9K02k00j77J25N02m49J51k41q2K02P
$$ 6 185 -316 198 224 -86 141 110 65 37 361 -38 -87 115 -85 -262 -137 365 -84 67 -174 -256 -54 -47
4843d7k68M56K44o05J38j3L8o3J82j61m37O85k31J23O0m79K14K70j07k09M01j54
$$ -47 -315 141 385 -220 -82 -95 -57 -120 62 -99 -536 149 -82 41 101 -378 -164 106 -1 -210 191 37
4865C7j92K84r2l45K96L9k11L10o8j67J34J48l58J42Q2j74K4o6P9J48J8l7p3l
$$ 37 -155 129 37 -308 -12 27 -184 126 58 -109 25 173 -185 -43 39 -135 -111 -177 -98 50 68 31 -42 -45
4889d5K59k93L65k81l15O97k04k43K18j36n1J53j17k70N52l47l1j71P41k64j62
$$ -45 214 -79 286 5 -310 387 183 -60 158 22 -29 124 7 -263 289 -58 -89 -260 481 217 55
4910E5M06o18N7J81J49l34K55l22K35K3O4o5J82k59j00M41j90n27L22M41o35R
$$ 55 461 -157 -100 81 230 -104 151 -171 64 87 151 86 268 9 -91 350 160 -367 -45 396 -239 -230
4932b30p6j02J69K79k24L3r3N4K74Q4k11J45J91n23R7K66l4j04M9j59J2K17m4
$$ -230 -306 -408 -239 40 -184 -151 -244 -190 84 168 -43 102 293 -230 -133 133 99 -5 44 -115 -103 114 70
4955G0k53J91O3l39O90l80k07M36l07l69L47k08q5L86J41o22L43J05k71K81j89
$$ 70 -183 8 71 -268 422 42 -165 271 -36 -405 -58 -266 -351 35 176 -446 -103 2 -269 12 -177
4976a77J48j30K87l7j92O8o9l1N0j76J65n7M11q6j70j9k07N35l09j76L17j0j37
$$ -177 -29 -159 128 91 -101 -33 -102 -133 -83 -259 -94 -151 260 174 4 -15 -222 313 4 -172 145 135 -2
4999br3K58k35K82k43j57K87Jj69J95k78J18j3K54l34k9L51l33j30R3K81p4q9
$$ -2 -95 163 -72 210 -33 -190 97 98 -71 124 -154 -36 -49 205 -129 -158 193 -140 -270 -177 104 30 -59
5022e9P1p6J04j2k75K82J90m17l9J99j6J83j7K01m16N40q76M89J09k28o6K08j42
$$ -59 12 -64 40 28 -247 35 225 -192 -231 -32 -48 135 118 319 -97 443 -433 56 165 -63 -129 79 -63
5045f3k52N22l73J95l47N20k17K81j31l78M02k09k1K43l1k03J4R7O9l49K03M2
$$ -63 -315 207 -166 29 -318 202 -15 266 135 -243 159 -50 -71 172 141 -62 -48 49 118 -231 -28 14
5067A4J0k38L34k59K74p6l21K83j14l10N38j13n0j30N3J%M53q0k39L62k65j67
$$ 14 24 -214 120 -139 135 59 -262 21 -93 -403 135 22 -28 -158 -105 -104 -104 349 269 30 392 127 -40
5090d0K27k67j23K77P3k53N32l72q3k60L99n6O9o5J73r3l58K27n0J0J47J06q8
$$ -40 187 -80 -203 74 147 -106 426 54 -29 -289 110 54 123 58 231 138 -220 7 -43 -33 114 220 132
5113A32L3j98J69p2L9k88L46K95n29kL8L8l7j14K45J14k68L3n4K1J56k81J60O2
$$ 132 165 -33 136 64 103 -185 161 456 -73 -75 -37 1 -36 -150 95 209 -59 -26 -80 -59 97 -184 -24 38
5137C8j99J07J1K19k56k89O37l56j09N04k42m3j95L83k55J92O1j25r2k92L57K04
$$ 38 -161 -54 -43 176 -80 -369 268 -88 -197 307 65 22 -173 210 -45 147 208 83 -9 -301 56 260
5159B60j89L0k54K43m9K9M5J02j66m2k84L17l22L03J52k41M3k11K89j91J83l18
$$ 260 71 101 -153 90 41 70 115 217 51 9 -275 42 -280 23 175 -66 -23 -234 55 -136 47 -271
5181b71L11m58N78J3k90P4l56M47j42M30k77o3L20k35k02K32q3K2k19L13k36K0
$$ -271 40 -418 160 173 -117 -43 -399 48 -94 336 59 -4 316 81 -121 111 28 50 -169 144 -92 -72
5203g2J94Nk25M49m50P6JO6K25m51p8K65P4M7k17J88N3k87n6J21O5n9j73M53k97
$$ -72 122 127 -98 351 -99 -23 -22 44 269 -182 -260 5 79 126 -91 97 150 -137 -193 -72 -7 -66 -239 214 -83
5228h3N5K2p6L65l30P8R2k20N2J20J40j72k37K04m17K18K79l8j30M53l07o5J38
$$ -83 -28 -6 -82 283 -47 31 123 -97 -45 75 215 43 -194 10 -407 -189 90 52 -78 375 68 3 141
5251A41j36L2j09r1L63j37j89N1M04k94p9J81l31L08k08K48k23l2J50O5j08j76
$$ 141 5 37 -72 -163 200 63 -126 -75 329 35 -44 137 -194 114 -94 154 -69 -101 49 114 6 -170
5273a70l2K90j57R2J72l28R5j18j03L20j11p%j06N26l98p9K24r1R3j91J75o3J35
$$ -170 -202 88 -69 23 195 -133 -38 -156 -259 61 -50 -57 -57 -163 363 -35 -114 110 19 112 -79 96 33 168
5297A68j50J44k87K45L5k32J61j46J27l32J16K1L3N7r0P8K13j83K53j25J9j21
$$ 168 18 162 -125 120 155 -77 84 -62 65 -267 -151 -130 -97 -40 -130 -52 161 -22 231 106 125 4
5319DJ54k00K21l48J0J88j38J17j27j02L15J9R0k49K62n73K37PL20j78N4j91k30
$$ 4 158 -42 179 -169 -159 29 -109 8 -119 -221 94 113 203 -46 216 -357 -120 -113 207 29 83 -108 -338
5342c38L1K02P5J49j14L0j28r0M7j08M10j63J67j37j81j38K95r3j52K39q8K7K60
$$ -338 -307 -105 -30 119 5 35 -93 -183 -136 -244 166 3 170 33 -148 -286 9 -84 -236 3 -85 -58 202
5365B02l65K88j26O4k50K96k41l9k00P31k54k51J49r9J1k93M90k0P5l7j25J51
$$ 202 -163 125 -1 63 -187 109 -132 -171 -371 360 106 -145 4 -95 -84 -377 113 93 168 131 6 157
5387A57k75N2M87l06j04R4j35j23J85j82J46L09k03q5M4L8j06k25J15K00j69K34
$$ 157 -118 -66 421 115 11 105 -30 -153 32 -150 -4 305 102 17 61 99 -7 -232 -117 83 -86 148
5409A48k62l6LJ95l76L22J30k62P4J41K27l65J35k00K46l01j72K12L70l7l14N7
$$ 148 -114 -150 -147 48 -328 -6 124 -138 -64 77 304 -61 74 -126 120 -181 -353 -141 229 192 -122 -65
5431f5J44j89j50J69M44m28k55J64m4K05lJ22L52n67J85J63j76Qj73R1O3J49n22
$$ -65 79 -110 -260 -91 353 -75 -330 -166 -210 -5 -8 114 466 -101 84 247 71 79 -94 -3 60 209 -313
5454c13N32q2o3j87K68j69M1L2Jk08n9K99J24l27l9O73m57jk00J08l0L36l19J23
$$ -313 219 137 74 -113 155 -14 27 59 60 -148 -207 92 216 -111 -150 523 66 65 -135 -27 -57 279 -40 83
5478H3l02J92p6J70j50O7L24k23n2L8j35K02l99N66m82L83j63j91R2J18KN2l75
$$ 83 -219 -27 -103 67 -83 -16 308 85 33 71 -64 138 -261 305 -177 206 43 -148 -56 62 64 116 -259
5501b59J31J0L34k71q6P8K16jk73J10k60K81J26k9k11M7L44p8l77J12j79L12m5
$$ -259 -128 -118 216 -55 -141 -63 153 152 -121 -11 -271 10 136 107 -104 -57 287 209 -168 -56 -235 77 32
5524C2k15O2M61k97N9j78k3K13j74K97k21p0oj39P6J16K33n5nk61L97m7m54L61
$$ 32 -183 -121 340 43 102 -76 -99 114 -60 237 16 -54 -60 -199 -123 -7 226 171 166 -95 302 255 -199 162
5548A62m00j38L10n8l4K99k45J39m2L65k87J05l34J02J36J88k59m4J99j08k17
$$ 162 -238 -376 -66 -124 -158 141 -104 35 -7 358 71 176 -158 -56 80 268 9 -35 164 56 -161
5569a61P4M7R8j82K48j61J87m4m06K87N5j24m0K00j58J26O4Jk50RK39J77l51J51
$$ -161 -87 -40 58 -124 124 -37 150 106 -300 -13 42 -82 -122 78 -80 46 110 111 -139 -130 109 286 -65 86
5593H6k42L05l6j47j2k62J34L24l82K31Q7k17J51m29L72L8K10k65j35J03L44l08
$$ 86 -156 149 113 -34 -46 -308 -174 150 -232 -1 86 -131 20 -409 -37 1 211 -54 -189 -86 258 -50
5615e0q0Q3K22j77J34rJj13N3J50K4j18j12K03j41k50J89p4Q7l5M2k40O0R9K82
$$ -50 -130 -47 175 -2 132 123 124 11 64 214 238 120 8 211 70 -180 9 -65 22 -13 29 -211 -151 -52 230
5640B30j51p7J55K24l22j10O8l04J69J71j81J90j33L81m34l2j9M6P2J02k9l17
$$ 230 79 2 157 381 59 -51 17 -287 -118 53 -128 62 -71 310 -124 -156 -175 -129 -57 45 16 -301
5662c01j2K60K68l4k21R2k04L57q1O0j37Qj82J19J46k38k5kJ38J01K02n43L47
$$ -301 -313 -53 215 181 -40 52 -152 205 124 184 47 55 -127 -8 138 -100 -125 -127 11 112 314 -229 118
5685A18j45k39L98k38L9R7J86l08L04Jk84q2M02l28N5n8L1J85k06j9L80o2k04
$$ 118 -27 -266 132 -106 -67 30 216 -92 212 213 -71 -153 249 -79 -24 -82 -51 134 -72 -91 289 227 23
5708B3J61l21R6M5N6J16l11J66J03l18J00J35j7j35J23k9Q6j87K58M0k59Jj3J35
$$ 23 184 -137 -41 4 60 176 -135 31 134 -184 -84 51 34 -101 22 -7 79 -108 150 190 -69 -68 -81 54
5732E4r3J25r5Q0j91L51k39J32m0k02l1k6L94l53K70l46J45m9j55L29k43J01L7
$$ 54 -39 86 -9 71 -120 231 -8 124 84 -118 -149 -175 219 -134 136 -210 -65 -114 -269 60 -183 -82 -45
5755d5M8K83m20mO2J3L55l96L32k18r4J91P8l71J15K53j61L1j8n7J40k06J26l09
$$ -45 3 286 -134 -138 -76 -63 292 -104 228 10 -84 107 185 -186 -71 182 21 52 34 -23 117 -89 37 -272
5779b72K31J8L6J07j06K5k14L4J61j95nP0J31q3K17j10j13p8J62k35K57j22M9
$$ -272 -41 -23 13 120 14 39 -175 -141 20 -175 -180 -110 21 -62 155 45 -68 -146 16 -219 38 -84 -35
5802c5P7r0p1J42O5k16o7P8J00j63J66K9R8k96N57n89L64l90J16K95k48J84M0
$$ -35 42 -48 -119 23 88 -128 -195 -117 -17 -180 -14 15 113 -183 374 -215 149 -241 -125 170 -78 106 146
5825A46k26Q4L36l74JRk5lj57J94j57n2J15J81j59L09l35m7J45j67J79L3N6l91
$$ 146 -80 4 340 -34 -33 -24 -49 -52 -209 -15 -172 -224 -109 72 -87 222 -113 -160 -15 -182 -3 30 86 -305
5849c05M1K89k14J36J0L81k40l19K54q1mk67J79J25o4K84m3j69j06j6L53l77M05
$$ -305 -264 25 -189 -53 -43 338 98 -221 33 -48 -52 -319 -140 -15 -79 205 162 -7 -113 -129 224 -153 252
5872B52M5l95L17j55j17l13L43P4J36l92J24k03J27K02J39m83J03L87k88J81K55
$$ 252 297 -98 219 64 -53 -366 -23 51 187 -205 -81 -284 -157 45 184 -299 -196 191 -97 84 339
5893C39l88K2K9J38k74L45j85J72q5k83j04J16J84k21M28k64R0k85K33L65l40
$$ 339 -49 -27 2 140 -134 211 26 198 113 -170 -274 -158 26 -195 233 -31 59 -226 7 372 32
5914C2R7j59q8J3P5j37j58M42j66O5L3k22R6j90J88k0J00J54q7NJ06l78M37j90
$$ 32 129 -30 -118 -105 -30 -167 -325 117 -49 16 49 -173 -77 -267 -79 -99 1 155 68 73 179 -199 238 48
5938D8K40k74L95k40l44K36j58J37J52m55l2M65k90M04k96K56l58L49j87k91L35
$$ 48 288 14 409 169 -175 61 -97 40 192 -263 -295 170 -120 284 -12 244 -114 235 48 -243 92
5959I2J02k56J64J9k41Qj67K49L61l41j31mM66l96n2J24k02J95N1j32L69J14m21
$$ 92 194 -62 102 121 -120 -112 -279 -30 331 -10 -141 -145 321 -75 -127 -3 -205 -10 41 -91 278 392 -29
5982b9j95L02P1q9l66O33k57n8k7j03K36l42N96l50j56M9R5k21K7K19k66K17j99
$$ -29 -224 78 149 60 -306 327 70 12 -15 -118 118 -224 372 22 -134 -85 10 -211 -184 35 -231 -14 -213
6005b13J19J75L6k43O0L30k36N9q7K22m97J54m8K68l81J08M80l53K93M9o1k63
$$ -213 -94 81 117 -126 -66 264 28 87 0 222 -275 -121 -169 99 -282 -174 306 -47 246 295 234 -29
6027b9L1J73k57K63j70n2J52l9j13j31J96R3M1j67j25L26l02j68L43M6k59J47
$$ -29 2 175 -82 181 11 -41 111 72 -41 -172 24 117 158 -9 -134 192 -110 -278 65 111 -148 -1
6049aj43J44j60J67J02m3nQ1j72K0q7L3q2J1J3L74k88l16K51J4K1K30j25m42L25
$$ -1 -144 0 -160 7 109 66 61 142 -30 -10 -97 -64 -146 -135 -122 252 -36 -352 -101 -87 -66 164 39 -403 -78
6074g8K21m69L77J01k15K9j31J77o7j11L63k98K30j1j04N7j50J50J1J58m99J42
$$ -78 143 -326 51 152 -63 -34 -165 12 -55 -166 197 -101 129 118 14 71 -79 71 82 240 -259 -117
6096a17J52o8O5m8R2K08l46J25L61k91j53j06J19L35k78n5l9r5L88k80P6K21l23
$$ -117 35 -33 32 -16 76 284 -62 63 424 133 -20 -126 -7 328 50 -5 -44 -139 249 -31 45 266 -57
6119e7j29N2L35j64J9J04np7j11m0k8Qj5J97K0k94o2J7L96j44Q0k30J76j17l95
$$ -57 -186 -134 201 37 56 160 155 78 -33 -73 -101 -93 -108 89 109 -185 -247 -230 166 22 102 -128 48 -69 -464
6144d64N05k78r0M40j61L14n42L21Q7l09L24n0k31P4J39J14l14K14l24L78l34
$$ -464 41 -237 -327 113 -48 266 -276 45 132 -177 147 97 -134 -60 79 193 -121 93 -231 147 -187
6165a87N18k87k95m2M50j57k23J41J32j39K04m5J05n23J90L21q8J61k15R2k81
$$ -187 331 44 -251 -293 157 0 -223 -82 50 -89 115 70 175 -348 -158 163 75 236 21 113 -168
6186a68J66J83j38l81L26J8J61j56j39R9K85l86J33j87K49j23jJ87j01K2j7n7
$$ -168 -2 181 43 -338 -12 6 167 11 -128 -29 256 -130 3 -184 65 -58 -59 128 27 49 32 -25
6208b5M3m9J64o7K0K09k82Q0n4K41l62o7L10m9o2K3l9J7l0j11M08m73J73pL57
$$ -25 18 -31 133 66 86 295 13 93 39 280 -82 -149 161 112 50 73 34 51 21 -90 318 -155 18 11 368
6233C68m22p3J22J65j0j77R2Rr9m0j75PK38L7J00k6k69MJ76k53L41j96k64J65
$$ 368 -54 -127 -5 160 150 -27 65 74 -25 -65 -240 -233 5 42 142 116 -153 -149 27 -226 115 -81 -345 -180
6257a80K06K34k33L47l88J85l83M03k55R2J54n7j28R0j40q6N9j0O5j83J85O9j5
$$ -180 26 260 27 374 -14 171 -212 191 -64 28 182 125 -3 87 -53 -139 -80 -90 -25 -208 -23 46 31
6280C1m1J66j26l13L59j91m7M10j78j45Q2j65O22o53N77n64L5M50l81N2J04l8
$$ 31 -10 156 30 -283 76 -115 -162 248 70 -75 7 -158 464 -189 388 -176 -141 309 -72 -20 84 46
6302D6k94L96q6k82K51j82q8K90j39M8q5K38k94M14k71K23j62J31j32l5J02j16
$$ 46 -248 148 62 -220 31 -151 -239 51 -88 -40 -125 113 -181 233 -38 185 23 154 22 -13 89 -27
6324b7o2R9PM9l51j03K09J27l6R7o6J84Ql01L80j98N1J26j99J80k22l4M1J39j97
$$ -27 -89 10 17 66 -285 -388 -179 -52 -88 9 -57 127 135 -166 214 16 67 193 -6 174 -48 -82 -41 98 -99
6349i9rK20P9k60J8K77k30J00n2N3k67J84J53j12R0j19k70J29J23r1J36R1k78
$$ -99 -108 112 191 -69 -51 226 -4 96 44 97 -170 14 167 55 145 26 -244 -115 8 -83 53 144 -134
6372a34L03j38j05j00L68k74K56O7k90J86j64J08J04k03J21l27mL61n72N45O4
$$ -134 169 31 -74 -174 194 -80 176 243 -47 139 -25 83 187 -16 105 -222 -226 135 -437 108 172
6393A72k93L72m15K21j52o4K69J66n00L79J64o10O7M60k29J72l38M42k35k49L65
$$ 172 -121 251 -164 57 -95 -159 110 276 -224 155 319 -291 -224 236 7 179 -159 283 48 -201 164
6414A64m12K57K77m62K04j66M7L2K5j00L90j45k9j09k28J46M7K23l08p5Q5o4Q0
$$ 164 -248 9 286 -176 28 -138 -91 -59 -34 -134 256 111 82 -27 -255 -109 -62 161 -147 -222 -137 -201 -121
6437a21L03j33k47K28K80m67L24j05k9k36J04M57k23j43j02K20j53J47o1r1N7
$$ -121 182 49 -198 30 310 -157 167 62 33 -203 -99 358 135 -8 -110 110 -43 104 43 -48 9
6458Ij09L37k66Q8J10k31q3J85M9n29K66m5L69J2k5j16K93n75M93j81J08j6k46
$$ 9 -100 237 -29 59 169 -62 -145 40 89 -440 -174 -219 150 162 137 21 314 -261 232 51 159 143 -103
6481a03J09J7k06m9J91J81Q4l43j64M33j44l61M45q3l3m6Q7R0O9l87O1R3K35j9
$$ -103 6 23 -183 -232 -41 140 224 -119 -283 150 6 -355 90 7 -26 -72 15 105 174 -213 -152 -59 176 157
6505A57M0p9J18k29O7k35J85J1r9L08l20K82m31L78j01p5k9J40j02j04K92l52
$$ 157 197 118 236 7 74 -161 24 35 -64 244 -76 206 -225 153 52 -23 -52 88 -14 -118 174 -178
6527a78K39o0K39n38Q13n68r0L47j9m6r1p5j96K59j04j18J05j75J92J51O9k75
$$ -178 61 1 240 -298 515 -53 -143 204 185 139 48 -27 -223 36 -68 -186 -81 -256 -64 87 156 -119
6549a19J18j1j61M83m27J13L66p2j27K21k49j41j17k08J05N00m10L63j60K52l95
$$ -119 -1 -12 -173 310 -117 -4 362 290 163 384 135 -6 -123 -331 -226 274 -136 227 67 319 -76
6570g6j83L02j68KJ83j19J84rr1l3J1k19K19L3J56j46k65N64m03m0J86j74m2k06
$$ -76 -259 43 -125 -123 60 -59 125 116 25 -8 3 -216 3 36 192 46 -219 345 -58 -98 88 -86 -128 -334
6594c34O63n42K85k38K43L02j59j57J33M9j50l21L14r2L7j06J09l03M73j37k46
$$ -334 329 -213 72 -166 77 379 220 63 196 245 95 -226 88 -4 33 -73 36 -267 206 69 -177
6615a77J12p6L19K00j50k06j86r1L51N2k00Np5J49NN4l29L37M0k37J77rkP6j32
$$ -177 -65 -141 178 378 228 22 -164 -255 96 148 -52 -47 -122 27 32 86 -243 94 134 -103 74 65 63 139 7
6640GJ42j75k31J22M0q4R2m6l7M6J53qN5k60K63l0k08J79k42n7J08N16k89n2o4
$$ 7 149 -26 -257 -135 -95 -179 -87 -133 -170 -124 29 21 76 -184 79 49 -159 20 -222 -279 -171 345 56 4 -60
6665f0P6o8p0m4L57j84M3J45m71M23m1j07j7O6j07J64M8l83J66J59k1j78J13K58
$$ -60 16 -52 -122 -166 191 7 50 195 -276 147 106 -1 -18 48 -59 105 153 -230 -64 95 74 -104 9 267
6689B67k51K49j13k68j8K98k26l5K6M8m0l6J01o4N9k3K54l43J0lJ43k04L20l99
$$ 267 16 265 152 -116 -134 164 -62 -97 -71 -23 -63 -99 2 -62 -3 -26 228 -115 -105 -108 35 -169 151 -248
6713b48J85J18r7j30J28K38r3J24m04J98M3l68M18j56K0Q0j04K56k14Q0K1J92
$$ -248 -63 55 -42 -172 -44 194 101 225 -179 19 62 -306 112 -44 -24 56 -48 208 -6 74 95 287
6735B87k29ml95M53J81k76k22L09l67J78j34M8N5k43L16L0L3j98K24k67O1M53
$$ 287 58 54 -341 112 293 17 -205 104 -263 -85 -219 -171 -116 -359 -43 -13 20 -178 46 -221 -160 293
6757B93l40J39j01j42j48K80O7k07p8M77l23J20K05k36j23J90N1K56l13l45M75
$$ 293 -47 92 -9 -151 -299 -19 48 -159 -237 240 -83 37 242 6 -117 73 124 380 67 -278 197
6778A97%Ok99K56k4j27J15kj19k05K69J13n24M69l70J72R5N9L5p8j00M4L35j55
$$ 197 197 203 -96 160 136 9 124 122 3 -202 67 180 -344 125 -245 -73 22 81 116 38 -62 -18 317 162
6802A62k83j7K61k54K90j58m70L60Q7r7j96L42K16j42m0k75P6K5j15N11l17K25
$$ 162 -121 -138 123 -131 159 1 -469 -109 -22 -119 -315 27 243 101 61 -214 -138 -113 -228 283 -34 191
6824A91j1k18j5R3j9L11l50l5l15K45J34l55O25m67J43kJ00o0R9k95M7mJ10j05
$$ 191 180 -38 -53 40 21 332 -18 -53 -368 -123 11 -344 281 -186 -43 -45 55 -5 94 -201 -154 -158 -48 -153
6848a53Q5L37l00k28L29j05n4r4L11l84J06O3J05J60l09p5J22M75o5j29o9k85
$$ -153 -68 269 -31 -259 70 -35 -89 -183 128 -256 -150 -87 18 178 -131 -206 -84 391 326 197 128 -157
6870a57M48l27k7K03j72krK84j46J46j82j36L25j20k2J40l4o00O42k9n4l27K65
$$ -157 291 -36 -63 140 -32 -34 -43 241 95 241 59 -77 248 128 106 246 212 -388 254 225 171 -156 109
6893A09M9p1K7m23J01N09m20K70j54p3Q6K69k1m35K22J72m22K49j87J41J32q4
$$ 109 158 87 114 -309 -208 301 -119 151 -3 -76 10 279 258 -177 45 217 -205 44 -143 -2 130 46
6915D6m8r3mJ1r3Q5Q5o2n7J61L6lj35R9P6l26L97l58L09j59J36k98J28J48q6N5
$$ 46 -2 -95 -99 -88 -181 -96 -11 -73 -130 31 67 64 -71 28 104 -222 175 -183 126 -33 103 -195 -67 81 -5 50
6941E0j67L61j95j69R2k49L57j92J79q4J17m4k22J51K89k42J79l44l1J6K76k46
$$ 50 -117 244 49 -120 -28 -277 80 -112 67 -17 100 56 -166 -15 274 32 211 -133 -164 -148 128 -118
6963a18L43k73n4N1K79j52l57J07K32K5o1j75K63J97l43J9k7J50J63k57j86J85
$$ -118 225 -48 -102 -51 228 76 -281 -174 58 83 22 -153 110 307 -36 -17 -44 106 269 12 -174 11
6985A1Q3j98L55J51r7l48j76K42Q3k90J86r9M19k13r2k89K70j57K86n5k5l48N32
$$ 11 94 -104 251 402 305 -43 -219 23 106 -184 2 -97 322 109 17 -272 -2 -159 127 72 47 -301 231
7008B31m11K08J01l7m0r3J32K8k26K69l55J12PQ8M7m39N92l06m2qk43K87l7J88
$$ 231 -180 28 129 92 52 -41 91 119 -107 162 -193 -81 -74 14 61 -378 214 -92 -134 -142 -385 -98 -135 53
7032E3j3j3M28m57Mp5J52k16K12n1r9L02r6j40r3M32m87L42R4l79j77J77J62J30
$$ 53 40 27 455 -2 2 -73 79 -137 75 24 -75 227 131 -9 -102 330 -157 185 279 -100 -277 -100 62 192
7056A92N4l98M07k81K90l64j33J05k2K64l70M34k28M6ML20r7l13m4K27j38O3j96
$$ 192 246 -152 255 -26 264 -100 -233 -128 -150 114 -256 178 -50 -4 0 320 223 -90 -134 93 -45 18 -178
7079a78N2n8M61l99k78L00K22k92K43J65l18j74L73j52K08l6L9j15q3l1M7O7j53
$$ -178 -126 -184 277 -122 -400 -100 122 -170 73 238 -80 -254 119 -33 175 139 178 63 -20 -51 -4 63 -90
7102i0Pl4M97n54J94jj52J2J37mP7J3nl90K67J77r2k7K6m45M33K24m01jL22k91
$$ -90 -83 -117 380 -174 20 19 -133 -121 16 12 89 102 97 -293 -26 151 59 32 58 -387 46 270 -131 -132 190 -101
7128a01L50k96o6L37m84P5J14J40q5j47P7k14L30k9O8M0m05K88j96K50n1n7J80
$$ -101 249 -47 -113 224 -260 -185 -71 69 -16 -163 -86 -300 30 1 69 109 -296 -8 -204 46 -5 -62 118
7151A18j48K32J77l35kM6k05o2K00j81q9K16k8j22J42N9J20o1p9q0J8O8J79J10
$$ 118 -30 202 379 44 42 88 -117 -179 21 -160 -249 -33 -61 -183 -41 18 138 77 -2 -82 -64 4 183 293
7175B93m82Q9k3L04j28Mm21M11k0ql09J47Q2oj81M12j85K69l23O6J87n70L65m7
$$ 293 -189 -100 -123 181 53 57 -364 47 27 19 -290 -143 -61 -67 -248 164 -21 248 -75 -9 178 -392 -27 -74
7199g4K45k57K72k47J67l44L73o3Q2j58j24P4k70L05P2o0k1j03O1K89k04J6j06
$$ -74 171 -86 186 -61 106 -238 135 72 154 -4 -128 -54 -324 -19 53 -7 -28 -131 -70 219 15 31 -75
7222g5r3K99j11J1l88L90K06o15K53lj88M13K21k12p7O6l4L03k9l53j23J63N9
$$ -75 -168 131 20 31 -357 33 239 -376 -123 -126 -314 99 320 108 31 97 63 366 337 -16 -139 24 83
7245H3nj37J80q9j8J50O4N0k36o7k26K63j01j0P9k4j21J55l3J28j63p1N94k62
$$ 83 78 -59 121 32 14 164 228 278 42 -25 -251 12 -89 -99 -20 -44 -165 -10 -43 85 -78 -149 445 183
7269A83j03J56j06R6k10j93j03M29J29l72o0lj47L76o3j5k06K27j76m2K1M56j73
$$ 183 80 236 130 226 16 -177 -280 149 278 -94 -154 -157 -304 72 9 -6 -212 15 -161 -203 -182 274 101
7292A01m42O06l72J40k11K69nk72L70j77l4J5P7L13l22k11K92j39K2n0j85L00
$$ 101 -341 265 -107 33 -178 91 86 -186 184 7 -27 -12 65 378 56 -155 137 -2 20 -30 -215 85
7314H5k57O4J34PQ6R0m72N64m63J80q9k62M34J21j81Rk11L90j24m63N80j82l1
$$ 85 -172 -108 26 33 119 209 -263 301 -162 18 -71 -333 101 222 41 50 -161 229 105 -358 222 40 9
7337Ik77L09k44K79j57n0Q4K98r2k18k86K55%L96l20O7K07l05J7q3J07R2l58R3
$$ 9 -268 41 -203 76 -81 -131 -47 251 159 -59 -345 -90 -90 306 -14 53 260 -45 -28 -111 -4 88 -270 -177
7361a77K64j47K9j02J09K6K21l52M2O6J9R6l88L71k8o9N1J28l0r2J9k1J67l98
$$ -177 87 -60 -31 -133 -24 2 223 -129 -87 -21 -2 94 -294 77 49 -20 31 159 129 37 56 35 202 -196
7385a96J25J63J01l55K13m3N5M5J67j80J25j9l43K77l8K5j26J38m7k86J08o1K68
$$ -196 -71 92 193 -162 51 8 63 108 275 95 220 201 -142 135 97 122 -4 134 87 -199 -91 -152 116
7408A16J09l30N1m4J35j56J54k57L18%k25lq0K93J93k80k35L85m2k28J59J74j82
$$ 116 225 -105 -54 -98 37 -119 35 -222 96 96 -129 -132 -212 81 274 -6 -241 144 102 -126 33 207 25
7431B5K66m77K59m6J7j30K48j82l3pP9M30p64N21k04k44K44l3J9p5L46m17L32
$$ 25 291 -186 73 27 44 -86 162 -20 -53 -60 19 449 -315 206 2 -242 2 -31 -12 -87 259 -158 174
7454A74j46j95J0J99m1p9k10K82J32o2j91J18j48J29J21K0k49N5j38L17j59n9
$$ 174 28 -167 -157 42 1 -78 -288 -6 126 64 -127 -9 -157 -28 93 113 -136 -81 -219 98 -61 -120
7476a20J43J0k95L24k18L42k85j8j28O8J13j27K42J65j94k8j65K54j05j85N04
$$ -120 23 33 -262 62 -156 186 -99 -117 -245 -177 -64 -191 51 216 22 -6 -171 83 -22 -207 297
7497B97k27n1j69M30j51j56J61K10k71J61k38J34k65L00k82j27M82j78r6l52J55
$$ 297 70 19 -150 280 129 -27 134 344 73 234 -4 130 -135 165 -117 -244 238 60 -36 -388 -233
7518b33k7N14k50k11J08O1J42l9r6L00l76K17o6K45k56k42M72K5j96J66l16J73
$$ -233 -260 254 4 -207 -99 -38 104 65 -31 269 -107 110 44 289 33 -209 263 288 92 258 -58 115
7540A15j67j02O7J61p8k58M22N6q9j39K48p7k00J37j32q7J30J86j00j99J19j41
$$ 115 -52 -154 -87 74 -4 -262 160 216 127 -12 236 159 -41 96 -36 -123 7 193 93 -106 13 -128
7562a28j97J27k5K94P7K1l23K31k4r0K0k26K71N0J19j62r2j34J23k9K39K6m35
$$ -128 -325 -198 -223 71 148 169 -154 77 53 -37 -17 -243 28 78 197 35 -57 -191 -68 -97 142 168 -267
7585b67J30k2K04%r6Pj21M84l84K50j59M4j37J80j95k77N78l20L91l60J67k81
$$ -267 -137 -159 45 45 -51 -44 -165 319 -65 185 26 70 -67 113 -82 -359 219 -101 290 -70 97 -184
7607a84J26oj33L00J00k65K41m12L00m9L12k07o8l37P2K09j46K70p7q8K15j57
$$ -184 -58 -64 -197 103 203 -62 179 -233 67 18 330 123 55 -282 -210 -1 -147 123 46 -42 173 16
7629A6J04N0j65RL11n74L53k5m81M86k07J66l12m2J52K70n89L87P5J50l51J67
$$ 16 120 170 5 14 325 -249 104 79 -402 84 -123 43 -269 -311 -159 111 -478 -91 -16 134 -217 -50
7651e0M85k74j00k01L04k73J70O0m5o8J13k59N2P6l38L98qJ05k19L7J81m29J49
$$ -50 435 161 61 -140 164 -109 61 121 76 8 121 -138 -86 -10 -348 50 42 147 -72 -35 146 -283 -134
7674a34K78J1nk25nJ24J0j76J58qN9K4j20J01k65J48R9q8r4MK91Rl00J83Nm8K1
$$ -134 144 155 150 -75 -80 44 54 -122 36 28 87 111 -9 92 -173 -25 74 -14 -108 -104 187 196 -104 79 84 36 57
7701E7J04k60k1K23j27J13J17k07L57n82R7N7R6j72L03N9k91JL1J36k75J23M4
$$ 57 161 -99 -120 103 -24 89 206 -1 356 -226 -129 -72 24 -148 155 214 -77 -76 -45 91 -184 -61 -17
7724a7K10j08j24J44k39j25M03Mj29O3m4rJ36o08M35j7j72K49N0oj26j48L67j11
$$ -17 193 85 -39 105 -134 -259 144 148 19 82 38 29 165 -443 -8 -25 -197 52 102 96 -30 -178 189 78
7748G8l13J27j07N5K93k42L03l94J46K22J9j76m2n7J13J17j68j9K66Q9n16M6R2
$$ 78 -235 -108 -215 -160 133 -109 194 -200 -54 168 187 11 -31 -88 25 142 -26 -45 221 310 -206 -160 -68
7771f8L58j87r6P0j16J35L4L2j52k52L53k43n3O3K07k85K28J00k92K08K87j11
$$ -68 290 103 7 77 -39 96 130 162 10 -242 111 -132 -185 -122 85 -200 28 128 -164 44 331 220
7793B20k33M9l1o7j31K89q9o0O9J22k02N38m30J10j11r5J49j09J23J08m06M6J92
$$ 220 -13 36 5 -62 -193 96 7 -53 16 138 -64 474 44 154 43 -52 97 -12 111 219 -187 -141 51
7816E1k75J99K24k75L24Q5m29L00j11rJ10j70J43k57M2L8r2l05M79k77P8J27R3
$$ 51 -224 -25 199 -76 248 333 -96 204 93 84 194 24 167 -90 -48 -10 -102 -407 72 -205 -127 0 93
7839I3k78K26j70K98k03J19m11K07M82j49k17L5j17p6J61j83L72k65j26K41N2
$$ 93 -185 41 -129 169 -34 85 -326 -119 363 214 -3 32 -85 -161 0 -183 189 -76 -202 39 91
7860I1l05K22J42J21k61k78K76J1L9j51Q7J16k02J66r1Q2l39J63J78l6J00j17
$$ 91 -214 8 150 271 10 -268 8 19 58 -93 -6 110 -92 74 -17 65 -274 -111 67 31 131 14
7882A4O6j12Q4p7Q8q3K34q0JL8J12n26K89L4K2k13K44j25J81p4j56K7q1M96l80
$$ 14 80 -32 52 -25 63 -20 214 134 135 173 285 -241 48 82 104 -109 135 10 191 117 -39 -12 -93 403 23
7907B3J06j95J49j73M34p3k71m4J40P3j21k09L9K72j9k34r7K76Rj1p9Pj00K12
$$ 23 129 -66 83 -90 344 271 0 -44 96 169 48 -161 -122 150 131 -103 -200 76 85 74 -5 2 -98 114
7931A14l1N2r9J8k83N98n29J74K1Om3R5k04j85K33K49J78k56J40k29M7j0k79L24
$$ 114 83 135 36 54 -229 369 -160 14 35 41 -2 93 -111 -296 -63 186 364 108 248 19 66 56 -223 101
7955A01k35p9L27k80N7k07K41j28Q9K31k45o0J15M6J4l1nk21Q2J72Q8N2n2j79
$$ 101 -134 -213 114 -166 -109 -316 -75 -203 -114 117 -128 -188 -73 -27 -13 -44 -49 -270 -188 -16 72 124 72 -107
7979a07k34L68l5N7p6j40K00j2K5J11n2l13J35p5J8K15j74kK51j51J8M39o46L24
$$ -107 -341 27 -8 49 -27 -167 33 21 46 157 105 -208 -73 -148 -130 85 -89 -91 160 9 27 466 -180 144
8003A44J89k48Lj04K18K8j23P2o5k09J86j02j03N6J18p4P4j20j89K63k68L32k09
$$ 144 333 85 88 -16 202 230 107 179 114 -95 91 -11 -114 -58 60 -14 60 -60 -249 14 -254 78 -131
8026a31J12K28m34L9L23J02j75p3J98m08K3K86j22l9L14k33o6j87K79q3J41k2
$$ -131 -19 209 -225 -186 137 239 64 -9 189 -219 -196 90 -32 -71 243 10 -56 -243 36 -47 94 72
8048G2k70J41k21k4J35J43K2k21J24K12J0j06k53J98n4L11j02l0L4n8P0l17j2
$$ 72 -198 -57 -278 -302 -167 -24 -2 -223 -99 113 123 17 -236 -38 -92 219 117 87 121 63 133 -184 -196
8071a96K73k61J97N1Qj24J62j28N3J15m26K81p3o3J94j58o1K8O0m4K28Q5k66q4
$$ -196 77 -184 13 64 72 -52 110 -18 35 150 -276 5 -68 -131 63 -95 -156 -128 -68 -112 116 201 -65 -149
8095a49K80P2K60n15N5M9q1l10J59L17R8r7K6p0J12l91K35k55J01K78j79K49k87
$$ -149 131 203 463 -52 3 52 -29 -339 -180 137 235 138 164 94 206 -185 50 -205 -104 174 -5 244 -43
8118d3M7R0lk69L41k70m0J02l15M34J02J61j78k51j11K56j69K54j40p9l03M58
$$ -43 4 94 91 -178 163 -107 -147 -45 -360 74 176 337 159 -92 -203 53 -116 138 -2 -81 -384 74
8140G4j07K5J84k04M2K0k52L8K86jQ0k83J28r7j53L70L1k82R9k87K5K84J7K82
$$ 74 -33 -8 176 -28 14 34 -218 -180 106 105 185 -98 30 -67 -220 150 181 -101 -2 -289 -264 20 37 319
8164C19l44J69k92J36j51J89L5K8j71j68J43J02k06L86j97l7O9J47m80J17L73
$$ 319 -25 144 -148 -12 -163 26 61 89 -82 -250 -107 -5 -211 175 -22 -59 10 157 -323 -206 167
8185A67j82o0L8J91L1m50
$$ 167 -15 -75 -37 154 185 -265
8191b65
$$ Imaginary data points
##PAGE= N=2
##DATA TABLE= (X++(I..I)), XYDATA
0@%%%%Qj6J6j6K4l2M0m8N6p2Q8j11J35j60J89k21K58k99L47m02M63n30O06o89
$$ 0 0 0 0 0 8 -8 8 -8 16 -16 24 -24 32 -40 48 -63 72 -88 101 -120 138 -161 186 -216 247 -283 323 -366
28c66P80q81R94j119J257j408J571j748J946k164K402k664K950l265L614m003
$$ -366 414 -467 527 -592 665 -743 828 -920 1026 -1138 1264 -1400 1550 -1715 1899 -2104
44b104M434m915N458o074O779p597Q559r706J1103j2851J5108j8151K2494k9233
$$ -2104 2330 -2585 2873 -3201 3578 -4019 4540 -5166 5937 -6914 8194 -9957 12537 -16696
58a6696M1176o8495K33765O1462m18147K46877K4328k07494Q7300J0704j89169
$$ -16696 24480 -44015 189750 251212 -166935 79942 104270 -103224 -15924 -5220 -194389
69a94389J98708P4727j86551J30513J38927j77599P0940O7941k15661M4038J38617
$$ -194389 4319 79046 -107505 23008 161935 -15664 55276 123217 -92444 -48406 90211
80I0211k06046K27J63762j26763K7721J98118j64527m4263K39508j29044j71801
$$ 90211 -115835 -115608 48154 -78609 -50888 147230 -17297 -61560 177948 48904 -122897
91a22897J92861m0527j71729J47470P432j37280J61704M7690j53072J23650O4267
$$ -122897 69964 29437 -142292 5178 12610 -124670 37034 84724 -68348 55302 119569
102A19569j79271P1943Q3722j84110K6580J22323j36139P489J40140q8040m342
$$ 119569 -59702 12241 95963 -88147 -61567 60756 -75383 -67894 72246 -15794 -20136
113b0136J11137j05795j0988J32146j29709p6070J59466o5905j01164J49216k1258
$$ -20136 91001 -14794 -25782 106364 -23345 -99415 60051 -5854 -107018 42198 20940
124B0940j01678J45291o079j44307J26933M6344j65336O5584P5787j34888M7181
$$ 20940 -80738 64553 58474 -85833 41100 87444 -77892 -12308 63479 -71409 -24228
135b4228R9386j23399P533J15930q1661k1029Q1005o8196m249P9436r6805j9289
$$ -24228 75158 -48241 -40708 75222 -6439 -27468 53537 -14659 -18908 60528 -36277 -55566
147e5566J27458p2968p0265J21105l1247q0911J07434j4056j00197R7466J4183
$$ -55566 71892 -1076 -71341 49764 18517 -62394 45040 30984 -69213 28253 42436
158D2436j15211P9837N3686j18058M0071P7351r5150R670P9574p5141q716P2611
$$ 42436 -72775 7062 60748 -57310 -17239 60112 -35038 -25368 54206 -20935 -29651 42960
170D2960o1893j1648P8919n5583l1467Q2267l7361m5796P5073k2834n4897O8080
$$ 42960 -18933 -30581 48338 -7245 -38712 43555 6194 -39602 35471 12637 -42260 25820
182B5820j3262o1439P2454P981p7434N2762L0738p2761L7504L6653p6966K5412
$$ 25820 12558 -48881 23573 31554 -45880 6882 37620 -35141 2363 39016 -37950 -12538
194a2538N7535p5933k078P5703m7608k5818N9702l0899k3007O2137k6630m8556
$$ -12538 44997 -30936 -33014 42689 -4919 -30737 28965 -1934 -24941 37196 10566 -37990
206c7990N2892L008m2367L0049K109k6814L4193l879l6856M1061R553m6450K7508
$$ -37990 14902 17910 -24457 5592 7701 -19113 15080 11201 -25655 15406 24959 -21491 6017
219F017J2143m7110L1737K8744o2038J0761N4126m3754j2642N0714k8227k3346
$$ 6017 18160 -28950 2787 31531 -30507 -19746 34380 -9374 -22016 28698 471 -22875
231b2875M5483j7690l3809L8803L987l4106J8351Q157j6636J8162K37k0441J7862
$$ -22875 22608 4918 -28891 9912 13899 -20207 -1856 6301 -10335 7827 8064 -12377 5485
244E485J382j9342K1489k41l0084K6141J4177l8960J5025K9721l3765p74K9034
$$ 5485 6867 -12475 9014 8773 -21311 4830 19007 -19953 -4928 24793 -8972 -9746 19288
257A9288k8840m955L9265k4339k6363L7872M69k8560K0253N996k0885J2910L752
$$ 19288 -9552 -14507 24758 419 -25944 11928 12397 -16163 4090 10086 -10799 2111 5863
270E863j8434J4064Q099j9986Q216R407j4030R880P318j9217Q879J0460k1952
$$ 5863 -12571 1493 9592 -10394 -2178 7229 -6801 3079 10397 -8820 59 10519 -11433
283a1433Q435J8038k4605j393K7258j8553j0399L0668j1649k2016K4886l77k5205
$$ -11433 -2998 15040 -9565 -10958 16300 -2253 -12652 18016 6367 -15649 9237 8860 -16345
296a6345J9458R118k7358Q175J8882j6680L34J5512j1912m137J0169n234l211
$$ -16345 3113 12231 -15127 -6952 11930 -4750 -4416 11096 -816 -4953 5216 -18 -3229
309c229N050o136Q27M657q170N246J2159j3225l251J6681r587q428J7409p601
$$ -3229 1821 -4315 -3488 1169 -7001 -1755 10404 -2821 -6072 10609 1022 -7406 10003 2402
323B402j7484J8103M060j9612J0486J4294j7190J43J5420r061n612J1101m159
$$ 2402 -15082 3021 7081 -12531 -2045 12249 -4941 -4798 10622 1561 -4051 7050 2891
336B891j0053N130L105k246o0j95J819N08k101N584K532j0415R03R672r099n650
$$ 2891 -7162 -2032 1073 -1173 -1233 -1428 391 899 -1202 4382 6914 -3501 -2598 7074 -2025 -7675
352g675J1604k055r585Q106K055n864P697L334j1158J254P748n227k409L008l129
$$ -7675 3929 1874 -7711 395 2450 -3414 4283 7617 -3541 -2287 5461 234 -2175 833 -2296
367b296j214L613l16N23J545j217L57O23k431J999J547n052J99J127l271N169
$$ -2296 -3510 103 -213 310 1855 638 995 1618 -813 1186 2733 -2319 -2120 -993 -4264 905
383I05M214r829Q59J1118o249n934J0147k068r412O996K599r725N009Q071r297
$$ 905 5119 -4710 -3851 7267 1018 -4916 5231 3163 -6249 747 3346 -6379 -1370 6701 -2596
398b596l330R070J06m610K278J193l018j285L235K319n489j892P500j817q967
$$ -2596 -5926 3144 3250 -1360 918 2111 -907 -2192 1043 3362 -2127 -4019 3481 1664 -7303
413g303P390P618j0365j753R299n017m165J1171k784j1768O596Q142r226k892
$$ -7303 87 7705 -2660 -4413 4886 -131 -4296 6875 4091 -7677 -1081 7061 -2165 -5057
427e057P891j378n406L126M162l017j49L975j822n706K967M847o003l838M882
$$ -5057 2834 1456 -3950 -824 3338 321 172 4147 2325 -3381 -414 4433 -1570 -5408 -526
442e26r67k603O785J139o868M349N723p230j906M648k581m745J680K00k32M209
$$ -526 -1493 -4096 2689 3828 -3040 1309 7032 -198 -2104 2544 -37 -4782 -3102 -2902 -3134 1075
458A075J318k848J289L055O06k611k712J055k152l757K391K911l656K957O982
$$ 1075 2393 -455 834 3889 4495 1884 -828 227 -1925 -5682 -3291 -380 -4036 -1079 5903
473E903n193j414R195k262r720M089R63r642L862P519q766j467J2598k19o678
$$ 5903 710 -704 8491 6229 -3491 598 1561 -8081 -4219 3300 -5466 -6933 5665 5446 -1232
488a232N789L691p458l251L224k338m421K619K993l209j111Q678L462p257P94
$$ -1232 4557 8248 790 -2461 763 -1575 -5996 -3377 -384 -3593 -4704 3974 7436 179 973
503I73O054n815n344N885j349q923L814P342o355n74J0357o6p189L167L942n432
$$ 973 7027 1212 -4132 1753 404 -8519 -4705 2637 -3718 -4292 6065 5999 -1190 1977 5919 487
519D87k033K465m342l809O060K677n535K474O260k346k416M188p73l975P85q11
$$ 487 -1546 919 -3423 -7232 -1172 1505 -4030 -1556 4704 2358 -58 4130 3357 -618 167 -644
535f44m290J253L746j631m65J770Q56K723R79k074p47k33j773p36n66j606K124
$$ -644 -4934 -3681 65 -1566 -2031 -261 595 3318 4297 2223 1476 1243 -530 -1266 -1832 -3438 -1314
552a314N37k682L093M169k228J387K390n935j024O656n613o400P255q63o382P268
$$ -1314 -777 -3459 -366 3803 1575 2962 5352 -583 -1607 5049 -564 -6964 291 -572 -6954 314
568C14M251o877L271O676p122k532O546l292n421J320P18j316K311J678J18m9
$$ 314 4565 -2312 959 7635 513 -2019 4527 1235 -4186 -2866 -2148 -3464 -1153 525 643 594
584E94k90M158M12p143J906M645q695k230Q801k802n262R008n5p658P541N121
$$ 594 304 4462 4874 -2269 -363 4282 -4413 -6643 2158 -644 -5906 3102 3047 -4611 2930 8051
600H051r593j60M703n308j092L992k922m99L378p84P97J176j131K806l77p091
$$ 8051 -1542 -1702 3001 -2307 -3399 593 -2329 -2828 550 -234 563 1739 608 3414 3037 -4054
616d054L261N538p379j410O967n267j366R264m486n375R518j717p858P403N37
$$ -4054 -793 4745 -2634 -4044 2923 -2344 -3710 5554 1068 -4307 5211 3494 -4364 3039 3576
631C576q456N963K137j0405N390P418q116Q8O637n938P53O418n985k342N954m474
$$ 3576 -4880 1083 3220 -7185 -1795 5623 -2493 -2405 4232 -1706 -953 5465 -520 -2862 3092 -1382
647a382j823N664m602q39P455o473k453J0237m048o048R715l967j0319J3023K287
$$ -1382 -3205 2459 -2143 -2982 4473 -2000 -4453 5784 1736 -4312 5403 1436 -8883 4140 6427
662F427j5565P674Q959j3254K620J1382j0611k254J1584o514o231R244k256n094
$$ 6427 -9138 -1464 7495 -5759 -3139 8243 -2368 -4622 6962 448 -5783 3461 1205 -3889
676c889N185k359k195O934l311l704P378m105m607J0053l970r687J1658J200j3758
$$ -3889 1296 -1063 -3258 3676 365 -3339 4039 -66 -4673 5380 1410 -8277 3381 4581 -9177
691i177R740P928j4231L145J0948j1495j787J2071o713n841R497l476m843Q350
$$ -9177 563 8491 -5740 -2595 8353 -3142 -4929 7142 429 -5412 4085 609 -4234 4116
705D116k615n244O730k192m424O987k233n771P791j859p280R151R79r750O877
$$ 4116 1501 -3743 2987 795 -3629 3358 1125 -4646 3145 1286 -5994 3157 4136 -5614 1263
720A263L981j1010M629P434j0412J498P096q820J725R498q980k011J0985p017
$$ 1263 5244 -5766 -1137 6297 -4115 -2617 4479 -4341 -2616 6882 -2098 -4109 6876 -141
734a41n593J1579l766q553R390r63p913Q318Q36p991P258J584q485O414K571q964
$$ -141 -5734 5845 2079 -6474 2916 1953 -5960 2358 3194 -4797 2461 4045 -4440 1974 4545 -4419
750d419N082J938r561P110N599j2082M908Q835j2636K570J3745j3565o131J6644
$$ -4419 663 2601 -6960 150 5749 -6333 -1425 7410 -5226 -2656 11089 -2476 -8607 8037
764H037n921j1204J1774k05q855R328K57r202R122L084r328M622O58p531Q027
$$ 8037 2116 -9088 2686 2481 -6374 2954 3211 -5991 3131 6215 -3113 1509 2167 -5364 2663
779B663J299j1985O768P352j1045M150Q094j1759K725J1667j3063m565J4873o707
$$ 2663 3962 -8023 -1255 6097 -4948 -798 7296 -4463 -1738 9929 -3134 -7699 7174 467
793D67q394J1290l255o825J1453q87r446Q107Q60p718Q143m55j1576Q493N750
$$ 467 -7927 3363 108 -6717 4736 3849 -5597 2510 3370 -4348 3795 3340 -8236 257 6007
808F007j2126K911Q365p331J878N262q349K324Q209r114j372P583p492n19R927
$$ 6007 -6119 -3208 5157 -2174 -296 4966 -3383 -1059 7150 -1964 -3336 4247 -3245 -3764 6163
823F163q269l978J1726m151o670J0623l569q744J1395q1j2767Q173O224j1077
$$ 6163 -2106 -6084 5642 1491 -5179 5444 1875 -6869 4526 4445 -8322 -149 6075 -5002
837e002K805O418p249J807N700n826P42L460n882L949L645r320K417P946q930
$$ -5002 -2197 4221 -3028 -1221 4479 -1347 -605 2855 -3027 922 4567 -4753 -2336 5610 -3320
852c320l60R719p641l227J1637o013p267J1602j490r996P749K184r491N843M514
$$ -3320 -3680 6039 -1602 -4829 6808 795 -6472 5130 3640 -6356 1393 3577 -5914 -71 4443
867D443q680K864M478n267L051K625p123L631M081p700J884O222q430P21Q568
$$ 4443 -4237 -1373 3105 -2162 889 3514 -3609 22 4103 -3597 -1713 4509 -3921 -3200 5368
882E368p744k162J0469m298n475P993l379n273R064k122r043P963J823q190N709
$$ 5368 -2376 -4538 5931 1633 -3842 4151 772 -4501 4563 2441 -6602 1361 3184 -5006 703
897G03L409p823M076M419p393K193M842p035N70N982o471j239O539l173j784M724
$$ 703 4112 -3711 365 4784 -2609 -416 4426 -2609 -2039 3943 -2528 -3767 2772 -401 -2185 2539
913B539l809K02O665n448m000P319l305m194P244l055o821R015J853r113M972
$$ 2539 -1270 -1068 5597 149 -3851 3468 163 -4031 3213 158 -6663 2352 4205 -4908 64
928F4N253o761J518M009o263L49N116m374k385L481j449J706K130m070J181M596
$$ 64 5317 -1444 74 4083 -2180 -1831 3285 -1089 -3474 7 -1442 264 2394 -1676 -495 4101
944D101m433r83M145n032j278O764m648m718Q474N83o522M540J951n007M038J345
$$ 4101 -332 -1315 2830 -2202 -3480 3284 -1364 -6082 2392 2975 -3547 993 2944 -2063 1975 3320
960C320o767K036L470m094P52K017l506K921L202n087J661M734n171n37L201m443
$$ 3320 -3447 -1411 2059 -2035 -1283 734 -2772 149 3351 -1736 -75 4659 -512 -1049 2152 -2291
976b291l02N358m457k373O549j856k180M770j660l621N204j524n421M769P84o216
$$ -2291 -2593 2765 -1692 -4065 2484 628 -1552 3218 1558 -2063 3141 1617 -3804 965 1749 -4467
992d467L989K842n588K849M548n559N95M680m463n53L187l194j426L493j850r54
$$ -4467 -478 2364 -3224 -375 4173 -1386 -791 3889 -574 -1127 2060 -1134 -2560 933 -917 -1871
1008a871L841j870j083L870k802j842N105k673m605N197k87m941M450K052n863
$$ -1871 1970 100 -983 2887 85 -1757 3348 675 -3930 1267 980 -3961 489 2541 -3322
1023c322L193L526n185R49M658m365j519L749j877j622L016j840o76K524j344
$$ -3322 -129 3397 -1788 -839 3819 -546 -2065 1684 -193 -1815 1201 -639 -1315 1209 -135
1038a35l57K474k603o92L615k738j871M810k171l464M359K52m556L457K154m596
$$ -135 -492 1982 -621 -1313 2302 -436 -2307 2503 332 -3132 1227 1479 -3077 380 2534 -2062
1054b062J511K902l709R29K753l340j27K529k172m58K484j908q20L274j878q09
$$ -2062 -551 2351 -1358 -429 2324 -1016 -1143 1386 -786 -1244 1240 -668 -1488 1786 -92 -901
1070i01L284j528k121K814j582j504K828j250k836K995P19k827L395K31l950L073
$$ -901 2383 855 -1266 1548 -34 -1538 1290 40 -2796 199 918 -1909 1486 1717 -2233 840
1086H40K118m736Q13L679m071o50L853l111r52M571j568l232L713R8j667J398
$$ 840 2958 -1778 -965 2714 -1357 -2007 1846 -1265 -2217 2354 786 -2446 1267 1365 -302 1096
1102A096q26k126K556p41j839K319k13k080L812n10l822L998J841n625N88M201
$$ 1096 270 -1856 700 -41 -1880 439 226 -1854 1958 1448 -2374 1624 3465 -2160 -1572 2629
1118B629m543n12M427k866j958N142r71l400K967J007k934J004P09k446K081J60
$$ 2629 -1914 -2426 2001 -865 -2823 2319 1348 -2052 915 1922 -1012 -8 701 -1745 336 496
1134D96k826K336O11j449J990L03k982J892J938l806L3L472l322o53L515k011
$$ 496 -2330 6 617 -832 1158 1461 -1521 371 2309 -1497 -1464 2008 -1314 -1967 1548 -463
1150d63j205L721j138k533K497J91j901J203q0k046K168N91k365J117J661k053
$$ -463 -1668 2053 915 -1618 879 1070 -831 372 292 -1754 414 1005 -1360 -243 1418 -635
1166f35N84J357k172K56K304k342o16J801m66k92R09j286k46J451p51n04J200
$$ -635 -51 1306 -866 -610 1694 -648 -1264 537 71 -221 688 -598 -844 607 -144 -648 552
1183E52o20q58K170m83k199L057l61l213J554J660k455K95K350k072p26K776n51
$$ 552 -68 -926 1244 761 -1438 1619 1258 -1955 -401 1259 -1196 -901 1449 -623 -1349 1427 876
1200H76j402J155l35n54Q48q58m92J327j240o6J701q43j074K972m54l372K326
$$ 876 -526 629 294 -260 588 -270 -762 565 -675 -741 960 117 -957 2015 1561 -1811 515
1217E15J331l570R02K259k910k22L322j718j074K553l41k126K058m25j386J465
$$ 515 1846 -1724 -822 1437 -1473 -1695 1627 -91 -1165 1388 1047 -1079 979 554 -832 633
1233F33n88j712J623M40j813J755Q02k179J420J625k727q8K265k149j205K566
$$ 633 45 -1667 -44 396 -1417 338 1140 -1039 381 2006 -721 -809 1456 -693 -1898 668
1249F68j331n89K239j050j072K932n15k123K333q68k432K751J46l871K406K336
$$ 668 -663 -1252 987 -63 -1135 1797 1282 -841 1492 624 -1808 943 1089 -2782 -376 1960
1265A960l773J101L613l638P2L331k285k146K815l62k079J643n98p74J600o9j381
$$ 1960 -1813 -712 2901 -737 -665 2666 381 -1765 1050 688 -1391 252 -346 -1120 480 411 -970
1282i70K143k81k161K842q84k789K989J168m934J914L342m073L84M046l245j082
$$ -970 1173 892 -1269 1573 689 -2100 889 2057 -2877 -963 2379 -1694 -1310 2736 -509 -1591
1298a591M661k630l014L384m9k338J734P7k016K534j83k086K652K42k569K406
$$ -1591 3070 440 -2574 810 761 -1577 157 234 -1782 752 569 -1517 1135 1377 -1192 1214
1314A214J16l933L153J691m761J352L271l872N01L974l639l04M292k701k190L805
$$ 1214 1330 -2603 550 2241 -2520 -1168 2103 -1769 -1268 2706 -933 -1237 3055 354 -1836 1969
1330A969j460k994L685j179l116M166J93m004L946J025m061K883J824n203J950
$$ 1969 509 -2485 1200 21 -3095 1071 1264 -2740 1206 2231 -1830 1053 2877 -2326 -376
1345c76K861n073J372L298l951M69L952l381L9M377l885j810N016l099k688N587
$$ -376 2485 -2588 -1216 2082 -1869 -1400 2552 -829 -790 3587 -298 -2108 2908 -191 -2879 2708
1361B708k520m365O206m91m887M882J491n769L187K759n785J835L782n200K75
$$ 2708 188 -4177 2029 1538 -3349 1533 3024 -2745 442 3201 -2584 -749 3033 -2167 -1892
1376a892L731l821Q41M108m020m13N090m256j504N543l650l472O547k356n062
$$ -1892 1839 -1982 -1141 2967 -1053 -1466 3624 -632 -2136 3407 -243 -3715 2832 476 -4586
1391d586O543J04n946N173J518n500L555K318n708J759L652n302J180L998m585
$$ -4586 1957 2061 -3885 1288 2806 -2694 861 3179 -2529 -770 2882 -2420 -1240 2758 -1827
1406a827J96M935m548r32O141l898k234N103k902l379N937j911m765N563L28n083
$$ -1827 -1631 3304 -1244 -2176 3965 67 -2167 2936 34 -3345 2592 681 -4084 1479 1807 -3276
1422c276M449J162n574L975K230n712K814K844o062K084M205n903P42O188n563
$$ -3276 1173 2335 -3239 736 2966 -2746 68 2912 -3150 -1066 3139 -2764 -2022 4166 -1397
1437a397j251O133l575k454N672l041l367N762j692m430N343o64l949M252M31
$$ -1397 -2648 3485 -90 -2544 3128 87 -3280 2482 790 -3640 1703 1039 -2910 1342 1773
1452A773m870M882J136o444M184K254o419L198L883o470R19N981n978p75O733
$$ 1773 -3097 1785 2921 -3523 661 2915 -3504 -306 3577 -2893 -1974 4007 -1971 -2746 3987
1467C987m514j951N791l011l457N891k036m220N019o73l710M759n73m504M912
$$ 3987 -527 -2478 3313 302 -3155 2736 700 -3520 1499 826 -2884 1875 1302 -3202 1710
1482A710P94o152M748K044o338K780L613o495K256N236o714Q5O253m611j168N140
$$ 1710 2504 -3648 1100 3144 -3194 -414 3199 -3296 -1040 4196 -2518 -2433 3820 -791 -1959 3181
1498C181l331k602N525k654l640N691j770m072N733p12n579O076J259o074L381
$$ 3181 -150 -2752 2773 119 -3521 2170 400 -3672 2061 1349 -4230 1846 3105 -2969 412
1513D12K486n896L118K957o502K245M399n311M05N041m426m27N211m132k117O309
$$ 412 2898 -2998 120 3077 -3425 -1180 3219 -2092 -1687 3354 -1072 -1499 3712 -420 -2537 3772
1529C772l740l534N709j914m045O397j100n078M883J446m912K825J528m924K568
$$ 3772 32 -3502 2207 293 -3752 2645 1545 -3533 1350 2796 -2116 709 2237 -2687 -119
1544a19K933n263J481L317m518J536L866m697N47M694m458j522N319l730k508
$$ -119 2814 -2449 -968 2349 -2169 -633 3233 -1464 -917 3777 -681 -2203 3116 -614 -3122
1559c122N625k576l660N774l20m403L825Q83m530L841P47m667K610J918m636K417
$$ -3122 2503 -73 -3733 2041 1721 -2682 1143 2026 -2504 1337 2084 -2583 27 1945 -2691 -274
1575b74K160m405K613L100m924R65L668m124m64M386l681j591N297l100k299M738
$$ -274 1886 -2519 94 3194 -1730 -765 2903 -1221 -1685 2701 -980 -2571 2726 -374 -2673 2065
1591B065j703k381L997q77l722M065K63m294L572Q72m329K891K062n048J717L266
$$ 2065 362 -2019 1978 1101 -2621 1444 1707 -2587 985 1857 -2472 419 2481 -2567 -850 2416
1607B416l920N97L561l565m42L764l098r47L537k715r79L616k081j986M357j408
$$ 2416 -1504 -907 2654 -911 -1353 2411 -687 -1634 1903 -812 -1791 1825 -256 -2242 2115 707
1623G07k830L485n63l276L773M47m669K774K484m392J318K592l356N59L232k793
$$ 707 -2123 1362 799 -2477 1296 1743 -2926 -152 2332 -2060 -742 1850 -1506 -947 2285 -508
1639e08l46K548j819p59K303k310n55L277k229j462L360j552j537L585j177k949
$$ -508 -854 1694 -125 -884 1419 -891 -1446 1831 -398 -1860 1500 -52 -1589 1996 819 -2130
1655b130L385L32l502J911J178k839J400J870l019Q64K425k367J72J868k333L85
$$ -2130 1255 1587 -1915 -4 1174 -1665 -265 1605 -1414 -550 1875 -492 -320 1548 -785 -400
1671d00K226k643q21K568j340n63K404j870r65L252j050k163K264l2k028J644
$$ -400 1826 -817 -1638 930 -410 -973 1431 -439 -1404 1848 798 -1365 899 867 -1161 483
1687D83j80k222K237J036k916J691Q99j912J444J001l225Q22K559k348l25K160
$$ 483 303 -1919 318 1354 -1562 129 1028 -884 560 1561 -1664 -842 1717 -631 -956 1204
1703A204j603n25K460j875l36J954r30j259J907r14j444K531j509j443K220K89
$$ 1204 -399 -924 1536 -339 -675 1279 349 -910 997 83 -1361 1170 -339 -1782 438 727
1719G27k382K606J42k956J921J878l202J108J598k241J53J751j445q59K357j270
$$ 727 -1655 951 1093 -1863 58 1936 -1266 -158 1440 -801 -648 1103 -342 -1201 1156 -114
1735a14o73J769r46q28J898j021q06K087j287j097K114r02j843K682k41k046J484
$$ -114 -787 982 36 -792 1106 85 -721 1366 79 -1018 1096 194 -1649 1033 792 -1254 230
1752B30J040j909P37P87j497K6J550j721K82J497k052N57J598j488p3J869j428
$$ 230 1270 -639 98 885 -612 -586 964 -757 -475 1022 -1030 -473 1125 -363 -436 1433 5
1769Em89J780r97j692K152p09j366J546j36j158J766Lj365J514K1j712J179Pj622
$$ 5 -484 1296 299 -1393 759 50 -1316 230 94 -1064 702 705 -660 854 875 -837 342 349 -1273
1788a273J200P42k103J154J517j801K97J902j848o37K172j587o29J335o15r16
$$ -1273 -73 669 -1434 -280 1237 -564 -267 1635 -213 -850 1322 -265 -894 441 -174 -1090
1804a090J795o46q47J764n82j113J659j84j801J526M7k487J922M15j936J164J705
$$ -1090 705 59 -788 976 394 -719 940 756 -1045 481 528 -1959 -37 378 -1558 -394 1311
1821A311j525K56J430j760m19J559j088q63J403q79n42K111j074o51J875q89j040
$$ 1311 -214 42 1472 -288 -707 852 -236 -1099 304 -575 -1117 994 -80 -731 1144 255 -785
1838g85K075j108j261J346J12j786J657P71j750J044R20j501M45R29j875L67J231
$$ -785 1290 182 -1079 267 379 -1407 250 1021 -729 315 1235 -266 179 1108 -767 -400 831
1855H31j493q5J407j352j02J987j320q32K094p81r40J601j007r34J598n03j331
$$ 831 -662 -747 660 -692 -794 1193 -127 -959 1135 354 -586 1015 8 -926 672 169 -1162
1872a162J311L20j153J007k6n59R67m3j637J075J019k252Q11J005j361K98J483
$$ -1162 149 469 -684 323 297 -262 705 662 -975 100 1119 -1133 -322 683 -678 -380 1103
1889A103j326n38J698p31q97J242m86j166J646j79q74J077m13p40J152l22j100
$$ 1103 -223 -761 937 206 -691 551 65 -1101 545 366 -508 569 156 -584 568 246 -854
1906h54J185K06j496J300M33j674Q45J209j665R4J474j608J65J117q19o69J294
$$ -854 331 537 -959 341 774 -900 -55 1154 -511 -417 1057 -551 -386 731 -88 -757 537
1923E37l30p69J388r44l12O70j10p42R48j70j027J246J36j440J175L62j175O51
$$ 537 207 -562 826 -118 -430 240 130 -612 336 166 -861 385 521 -919 256 618 -557 94
1941I4Q67j407n7J121j217m68J485j177N15R93p50q6Q41p19p24J373r04o55J090
$$ 94 961 -446 -503 618 -599 -1067 418 -759 -244 749 -1 -87 754 35 -689 684 -220 -875 215
1960B15n7q88Q62J59n08N66R8q77O66K52q74O4K36k38J78K88m25L53O14m80o08
$$ 215 158 -730 132 291 -217 349 447 -430 236 488 -386 -322 -86 -324 -146 142 -283 70 684 204 -404
1981d04J380q68q93J267m84m77L97k9l7k59R38m64J88L89p90L81k03l99J33J7
$$ -404 976 108 -785 482 -2 -479 -82 -111 -148 -407 531 67 255 644 -146 235 32 -367 -234 -217
2001b17n8J26K72m78N62M96q71L7N44q3m50O04m76m31K40L86m31K67L56l90K09
$$ -217 -275 -149 123 -355 207 703 -168 -131 413 330 -120 484 8 -423 -183 203 -228 39 395 5 214
2022B14j9l42J62J44l30j1k21j83L81N59j005O50L09j53O8q2m7J51k61M8k91J42
$$ 214 195 -147 15 159 -171 -182 -403 -586 -205 354 -651 -1 308 155 223 141 94 245 -16 32 -259 -117
2044a17K33j30L97n31L07L11J91o08L48k86n07L75m1J5j36L6Q1j25K23L59n06
$$ -117 116 -14 383 -148 159 470 661 53 401 115 -392 -17 -58 -43 -179 -143 -62 -187 36 395 -111
2065a11j61N36k90j28j7J69j71Q7J95jj06J79L49j93n25M19p7O8k43OJ17m84Q8
$$ -111 -272 264 -26 -154 -171 -2 -173 -86 109 108 2 181 530 337 -188 231 154 222 -21 -15 102 -382 -294
2088b94K23l08L33L97l26j29K49k51n32N15n0L7j07L64k12K31K7r3J67qm42K91
$$ -294 -71 -379 -46 351 25 -104 145 -106 -638 -123 -173 -136 -243 121 -91 140 167 74 241 233 -209 82
2110H2J00l21L06l4n39l5N10k0m35Q46j48p61N48J36k15K5K20o05M02Q2p10O00
$$ 82 182 -139 167 133 -406 -441 69 49 -386 460 312 -449 99 235 20 45 265 -340 62 144 -566 34
2132C4K71n31J84M77j82n04L92j61o28O06J42n13M21L46n44K81K5l61K64K04n98
$$ 34 305 -226 -42 435 253 -251 141 -20 -648 -42 100 -413 8 354 -190 91 116 -245 19 223 -375
2153c75J59j16j30P91k77l40L16J82p46O91P1l48k77O87l24l37P84l98l53K50
$$ -375 -216 -332 -462 329 52 -288 28 210 -536 155 226 -122 -399 288 -36 -373 411 13 -340 -90
2173i0K5k26L34j85J5L28K90q14O87k68n70N15Q7o24M26M18p11K90M61n54n2P02
$$ -90 -65 -291 43 -142 -127 201 491 -323 364 96 -474 41 128 -496 -70 348 -363 -73 388 -166 -218 484
2195D84p02P3N21n99l9L42l61l67P82k85j26P18M9j089J196j89q25L89M72r90
$$ 484 -218 -145 376 -223 -262 80 -281 -648 134 -151 -277 441 490 -599 597 408 -417 -28 444 -546
2215e46L27N85r74N96N11o66J54N32o43j99Q28o03R7M10n85p1O63m96k56R17n60
$$ -546 -219 366 -608 -12 499 -167 -13 519 -124 -323 505 -98 -1 409 -176 -247 416 -80 -336 581 21
2236B1l86J092l54j120R34K36r66K46N14l69R9J92j66K47k7o2J60L3n44k1P66
$$ 21 -365 727 373 -747 187 423 -543 -297 217 -152 -53 139 -27 220 193 131 291 324 -220 -241 525
2257E25q66k11P07k42o1P15k94o41Q26l14n99N52R4n49N08m24l5L07L31n90N64
$$ 525 -341 -552 155 -87 -148 567 273 -368 458 144 -455 97 191 -358 150 -274 -309 -2 329 -261 303
2278C03K30r99M99L37o71J0M58n50J21N68n99P3R74r82j18R19o97j11O38n57j99
$$ 303 533 -466 33 370 -301 -291 167 -383 -262 306 -293 -220 754 -228 -346 573 -124 -235 403 -154 -353
2299c53P29k67m68P37l0n49L60K00o05K3N80p46K20N98r53J45N73l36k0P22o71
$$ -353 376 109 -359 378 348 -201 159 359 -246 -223 357 -389 -169 429 -524 -379 194 -142 -162 560 -111
2320a11Q7M65q00l7R77p26k02R26o73m41Q42l5j079R72J15o60M51L22p81P46j37
$$ -111 -24 441 -359 -396 581 -145 -347 579 -94 -535 307 272 -807 165 280 -380 71 393 -388 358 221
2341B21o47N39L44o23L51L91j164L74Q71q93j43J077p75j30P74o36m58J033m59
$$ 221 -426 113 457 -166 185 576 -588 -214 657 -236 -379 698 -77 -207 567 -69 -527 506 47
2360D7n43O57m0n10R02j27n47L76L8m63L95j09n24O88M6o41J97O03p99P6P35p31
$$ 47 -496 161 121 -389 513 386 -161 215 253 -210 185 76 -448 240 286 -355 -158 445 -354 -278 457 -274
2382b74j03J022o75k14M78l97j99R00l93m24O82j76m43M86j19r18J189m19o22
$$ -274 -377 645 -30 -244 234 -163 -362 538 145 -279 403 227 -216 270 151 -767 422 3 -619
2401f19M84N36r47M94N38m99j80L97j61m20O59m08j71N85o96K78M47k50n48Q74
$$ -619 -135 401 -546 -52 486 -13 -193 204 43 -377 282 -126 -297 288 -408 -130 317 67 -481 393
2421C93l28m65J045m70p97Q11J51r17L52P20p03L74L13p46K66M87n55J31K17n89
$$ 393 65 -400 645 175 -622 189 340 -577 -225 495 -208 166 479 -267 -1 486 -69 62 279 -310
2441c10J09Q51j151n6J269p16o30J301n88m65P89p3p86Q12l49n06Q10o2n88J92
$$ -310 -201 650 -501 -557 712 -4 -634 667 79 -386 403 330 -456 356 7 -499 311 249 -339 -147
2461a47O42q04M07N02p64J64O29j060Q0P62p16k05J313p12o38J087m02m27N40
$$ -147 495 -309 98 600 -164 0 629 -431 -351 411 -305 -510 803 91 -547 540 138 -289 251
2480B51O8n67O95l43n95Q05l14l58L17L50q36Q50Q3j074Q46L04p71K27L07m40
$$ 251 319 -248 447 104 -491 314 0 -358 -41 309 -527 323 406 -668 178 482 -289 -62 245 -195
2500a95l46R38l82j29O07j75o99O85l37j80N82m88m90Q05K68r42P16j4q08M84
$$ -195 -541 397 15 -114 493 318 -381 304 -33 -213 369 -119 -609 196 464 -478 238 224 -584 -100
2520a00O76n99J35J71n57m4O00n38j14N61k57j17N86l88j23L91j38l86P82m52
$$ -100 576 -23 112 283 -274 -318 282 -256 -370 191 -66 -183 403 15 -108 283 145 -241 541 89
2540H9p55J033j84r02Q20L74p14K08L57n90J46N28o58j9M63m85k0Q98q26K58K98
$$ 89 -666 367 183 -719 101 475 -239 -31 326 -264 -118 410 -248 -267 196 -289 -309 589 -237 21 319
2561C19n63J96O07k83m44M16m17k97O52K19p05K86J28l29K46J91k32K71L52r57
$$ 319 -244 -48 559 276 -168 248 -169 -466 186 405 -300 -14 114 -215 31 222 -10 261 613 -344
2581c44J50Q65j017K65M49p11L78N03n17k10O29l85m02M36J8p34J212o94l56N93
$$ -344 -194 671 -346 -81 368 -343 35 538 21 -189 440 55 -347 89 107 -627 585 -109 -465 128
2601A28l00p0K49M31p17N09P8n18L21j90k19K41K60l57J00L00m92kN56l21j43
$$ 128 -172 -242 7 438 -279 230 308 -210 111 -79 -298 -57 203 -154 -54 246 -246 -248 308 -13 -156
2622a56K47N1m27L96kl22K36J47l89O5J68k63K1O19o64N48R1o82L96J43m79K67
$$ -156 91 142 -285 111 109 -213 23 170 -219 -154 14 -249 -228 391 -273 275 366 -316 80 223 -256 11
2644A1K68l87j96L44k04J27M68k63k01j29Q5j52L27k80M9J80K27l00K8O2l69K09
$$ 11 279 -108 -304 40 -164 -37 431 168 -33 -162 -77 -229 98 -182 -133 47 274 -26 2 64 -305 -96
2666i6L73k64K2J08l53j41N90k22j33L6n6J08K92k02J5J29k25l23M77l26rK22
$$ -96 277 13 35 143 -210 -351 239 17 -116 -80 -136 -28 264 62 77 206 -19 -342 135 -191 -200 22
2688B2N3l75N22q8L8m86M25l72Q0K13k47K33n7M3m15N53k61J59K0J62k95J05P3
$$ 22 75 -300 222 134 172 -314 111 -261 -181 32 -215 18 -39 4 -411 142 -119 40 60 222 -73 32 105
2711A05k6p1J94j81j32j89L60j57K81K4m07K44j72r2o7M31k41K5J83O0L01n59
$$ 105 79 8 202 21 -111 -300 60 -97 184 208 -199 45 -127 -219 -286 145 -96 -71 112 172 473 -86
2733h6k14L49j24K11j20L30j82n35J67J14J49pL27l36J23O9j56K64l41J33n7j80
$$ -86 -300 49 -75 136 16 346 164 -371 -204 -90 59 52 379 43 166 235 79 343 2 135 78 -102
2755a02J80k09l4J74J37k20j63K27L27k53j49N7Pj3l9J88l91J51J99j29o7L00
$$ -102 78 -131 -165 9 146 -74 -237 -10 317 64 -85 -28 -21 -34 -73 115 -276 -125 74 -55 -122 178
2777A78m4k59J14k46K62k24M6P7L23k45L23k72j75p7M31k6m68L63j70o07O15J22
$$ 178 134 -125 -11 -257 5 -219 -173 -96 227 -18 305 33 -142 -219 212 186 -282 81 -89 -696 -81 41
2799D1j55J66j62J05P2J16n4m4r8k46R1L97m93m2N20n66L31J55N3m41L06j06k16
$$ 41 -114 52 -110 -5 67 183 129 85 -13 -259 -168 229 -264 -306 214 -352 -21 134 187 -254 52 -54 -270
2822b70M80m3j00L16l04k47L00l0l28O85l87k21J40K20m90K24L01o51L76L40m88
$$ -270 210 167 67 383 79 -168 132 102 -226 459 72 -149 -9 211 -279 -55 246 -405 -29 311 -177
$$ [...]
8191D6
##END NTUPLES=NMR FID
##END=
