##TITLE=1H_Ser 3511-ValMe
 CDCl3, 8 sc, 
 27.6.2019
##JCAMPDX= 6.0         $$ Bruker NMR JCAMP-DX V2.0
##DATA TYPE= NMR FID
##DATA CLASS= NTUPLES
##ORIGIN= UXNMR, Bruker Analytische Messtechnik GmbH
##OWNER= root
$$ XWIN-NMR		Version 3.5
$$ Thu Jun 27 16:38:17 2019 Russian Standard Time (UT+4h)  she@DPX200
##.OBSERVE FREQUENCY= 200.13155
##.OBSERVE NUCLEUS= ^1H
##.DELAY= (6, 6)
##.ACQUISITION MODE= SIMULTANEOUS
##.ACQUISITION SCHEME= undefined
##.AVERAGES= 8
##.DIGITISER RES= 18
##SPECTROMETER/DATA SYSTEM= spect
##.PULSE SEQUENCE= zg30
##.SOLVENT NAME= CDCl3
##.SHIFT REFERENCE= (INTERNAL, CDCl3, 0, 15.7039)
##AUDIT TRAIL= $$ (NUMBER, WHEN, WHO, WHERE, WHAT)
$$ ##TITLE= Audit trail, XWIN-NMR		Version 3.5
$$ ##JCAMPDX= 5.01
$$ ##ORIGIN= Bruker BioSpin GmbH
$$ ##OWNER= she
$$ F:/spectra/data/she/nmr/H-F/1/audita.txt
$$ ##AUDIT TRAIL=  $$ (NUMBER, WHEN, WHO, WHERE, WHAT)
(   1,<2019-06-27 16:37:25.10 +0400>,<she>,<DPX200>,
      <created by zg, POWCHK disabled, PULCHK disabled
       configuration hash MD5:
       00 E9 B6 7A A2 85 ED C7 34 08 36 98 17 FE 4E 26
       data hash MD5: 16K
       54 35 C7 24 98 F2 FC 74 7E 67 DE 59 C6 C2 B8 F2>)
$$ ##END=
$$ 
$$ hash MD5
$$ 97 E7 FC 21 A5 63 7B 10 D6 20 C3 21 EC 5C D9 19
##$RELAX= 
##$RELAX= 
##$RELAX= 
##$RELAX= 
##$RELAX= 
##$RELAX= 
$$ Bruker specific parameters
$$ --------------------------
##$DU= <F:/spectra>
##$EXPNO= 1
##$NAME= <H-F>
##$PROCNO= 1
##$TYPE= <nmr>
##$USER= <she>
##$AMP= (0..31)
100 100 100 100 100 100 100 100 100 100 100 100 100 100 100 100 100 100 
100 100 100 100 100 100 100 100 100 100 100 100 100 100 
##$AQSEQ= 0
##$AQ_mod= 1
##$AUNM= <au_zg>
##$AUTOPOS= <>
##$BF1= 200.13
##$BF2= 200.13
##$BF3= 200.13
##$BF4= 200.13
##$BF5= 200.13
##$BF6= 200.13
##$BF7= 200.13
##$BF8= 200.13
##$BYTORDA= 1
##$CFDGTYP= 0
##$CFRGTYP= 5
##$CHEMSTR= <none>
##$CNST= (0..31)
1 1 145 1 1 1 1 1 1 1 1 1 1 1 1 1 1 1 1 1 1 1 1 1 1 1 1 1 1 1 1 1 
##$CPDPRG= <>
##$CPDPRG1= <>
##$CPDPRG2= <>
##$CPDPRG3= <>
##$CPDPRG4= <mlev>
##$CPDPRG5= <mlev>
##$CPDPRG6= <mlev>
##$CPDPRG7= <mlev>
##$CPDPRG8= <mlev>
##$CPDPRGB= <>
##$CPDPRGT= <>
##$D= (0..31)
0 1.2 0 0 0 0 0 0 0 0 0 0.03 0 0 0 0 0 0 0 0 0 0 0 0 0 0 0 0 0 0 0 0 
##$DATE= 1561639044
##$DBL= (0..7)
120 120 120 120 120 120 120 120 
##$DBP= (0..7)
150 150 150 150 150 150 150 150 
##$DBP07= 0
##$DBPNAM0= <>
##$DBPNAM1= <>
##$DBPNAM2= <>
##$DBPNAM3= <>
##$DBPNAM4= <>
##$DBPNAM5= <>
##$DBPNAM6= <>
##$DBPNAM7= <>
##$DBPOAL= (0..7)
0.5 0.5 0.5 0.5 0.5 0.5 0.5 0.5 
##$DBPOFFS= (0..7)
0 0 0 0 0 0 0 0 
##$DE= 6
##$DECBNUC= <off>
##$DECIM= 24
##$DECNUC= <off>
##$DECSTAT= 4
##$DIGMOD= 1
##$DIGTYP= 9
##$DL= (0..7)
0 120 120 120 120 120 120 120 
##$DP= (0..7)
150 150 150 150 150 150 150 150 
##$DP07= 0
##$DPNAME0= <>
##$DPNAME1= <>
##$DPNAME2= <>
##$DPNAME3= <>
##$DPNAME4= <>
##$DPNAME5= <>
##$DPNAME6= <>
##$DPNAME7= <>
##$DPOAL= (0..7)
0.5 0.5 0.5 0.5 0.5 0.5 0.5 0.5 
##$DPOFFS= (0..7)
0 0 0 0 0 0 0 0 
##$DQDMODE= 0
##$DR= 18
##$DS= 0
##$DSLIST= <SSSSSSSSSSSSSSS>
$$ [...]
##$SUBNAM2= <"">
##$SUBNAM3= <"">
##$SUBNAM4= <"">
##$SUBNAM5= <"">
##$SUBNAM6= <"">
##$SUBNAM7= <"">
##$SUBNAM8= <"">
##$SUBNAM9= <"">
##$SW= 24.9336996594482
##$SWIBOX= (0..15)
0 0 2 0 0 0 0 0 0 0 0 0 0 0 0 0 
##$SW_h= 4990.01996007984
##$TD= 16384
##$TD0= 1
##$TE= 0
##$TE2= 300
##$TE3= 300
##$TEG= 300
##$TL= (0..7)
0 120 120 120 120 120 120 120 
##$TP= (0..7)
150 150 150 150 150 150 150 150 
##$TP07= 0
##$TPNAME0= <>
##$TPNAME1= <>
##$TPNAME2= <>
##$TPNAME3= <>
##$TPNAME4= <>
##$TPNAME5= <>
##$TPNAME6= <>
##$TPNAME7= <>
##$TPOAL= (0..7)
0.5 0.5 0.5 0.5 0.5 0.5 0.5 0.5 
##$TPOFFS= (0..7)
0 0 0 0 0 0 0 0 
##$TUNHIN= 0
##$TUNHOUT= 0
##$TUNXOUT= 0
##$USERA1= <user>
##$USERA2= <user>
##$USERA3= <user>
##$USERA4= <user>
##$USERA5= <user>
##$V9= 5
##$VALIST= <valist>
##$VCLIST= <CCCCCCCCCCCCCCC>
##$VD= 0
##$VDLIST= <DDDDDDDDDDDDDDD>
##$VPLIST= <PPPPPPPPPPPPPPP>
##$VTLIST= <TTTTTTTTTTTTTTT>
##$WBST= 1024
##$WBSW= 4
##$XGAIN= (0..3)
0 0 0 0 
##$XL= 0
##$YL= 0
##$YMAX_a= 308073
##$YMIN_a= -577508
##$ZGOPTNS= <>
##$ZL1= 120
##$ZL2= 120
##$ZL3= 120
##$ZL4= 120
##$ABSF1= 10
##$ABSF2= 0
##$ABSG= 5
##$ABSL= 3
##$ALPHA= 0
##$AQORDER= 0
##$ASSFAC= 0
##$ASSFACI= 0
##$ASSFACX= 0
##$ASSWID= 0
##$AUNMP= <proc_1d>
##$AZFE= 0.1
##$AZFW= 0.1
##$BCFW= 1
##$BC_mod= 2
##$BYTORDP= 1
##$COROFFS= 0
##$CY= 11.3945322036743
##$DATMOD= 1
##$DC= 2
##$DFILT= <>
##$DTYPP= 0
##$F1P= 18.9103706918063
##$F2P= -1.10871071338519
##$FCOR= 0.5
##$FTSIZE= 0
##$FT_mod= 4
##$GAMMA= 1
##$GB= 0.15
##$INTBC= 1
##$INTSCL= 1
##$ISEN= 128
##$LB= 0.24
##$LEV0= 0
##$LPBIN= 0
##$MAXI= 10000
##$MC2= 0
##$MEAN= 0
##$ME_mod= 0
##$MI= 1.114404
##$NCOEF= 0
##$NC_proc= 0
##$NLEV= 6
##$NOISF1= 3.799351
##$NOISF2= 2.8
##$NSP= 1
##$NTH_PI= 0
##$NZP= 0
##$OFFSET= 15.70392
##$PC= 1
##$PHC0= -8507.555
##$PHC1= 26.00098
##$PH_mod= 1
##$PKNL= yes
##$PPARMOD= 0
##$PSCAL= 0
##$PSIGN= 0
##$REVERSE= no
##$SF= 200.130013532006
##$SI= 16384
##$SIGF1= 3
##$SIGF2= 2
##$SINO= 400
##$SIOLD= 16384
##$SREGLST= <1H.CDCl3>
##$SSB= 0
##$STSI= 0
##$STSR= 0
##$SW_p= 3612.71676300578
##$SYMM= 0
##$S_DEV= 0
##$TDeff= 0
##$TDoff= 0
##$TI= <>
##$TILT= no
##$TM1= 0
##$TM2= 0
##$TOPLEV= 0
##$USERP1= <user>
##$USERP2= <user>
##$USERP3= <user>
##$USERP4= <user>
##$USERP5= <user>
##$WDW= 1
##$XDIM= 8192
##$YMAX_p= 0
##$YMIN_p= 0
$$ End of Bruker specific parameters
$$ ---------------------------------
##NTUPLES= NMR FID
##VAR_NAME=  TIME,          FID/REAL,        FID/IMAG
##SYMBOL=    X,             R,               I
##VAR_TYPE=  INDEPENDENT,   DEPENDENT,       DEPENDENT
##VAR_FORM=  AFFN,          ASDF,            ASDF
##VAR_DIM=   8192,          8192,            8192
##UNITS=     SECONDS,       ARBITRARY UNITS, ARBITRARY UNITS
##FACTOR=    0.0002004,     1,               1
##FIRST=     0,             0,               0
##LAST=      1.6414764,     0,               0
##MIN=       0,             -577508,         0
##MAX=       1.6414764,     308073,          0
$$ Real data points
##PAGE= N=1
##DATA TABLE= (X++(R..R)), XYDATA
0 0 0 0 0 -7 8 -8 8 -16 16 -24 32 -34 48 -56 72 -80 104 -120 144 -168 199 -232 269 -309 354 -407 464
27 464 -527 598 -677 764 -858 962 -1077 1202 -1338 1491 -1654 1838 -2037 2255 -2497 2765
43 2765 -3062 3391 -3761 4177 -4650 5196 -5827 6568 -7455 8543 -9903 11673 -14075 17541
57 17541 -23014 32976 -56994 234261 81853 -355345 121360 308073 56534 -33464 221112
68 221112 98736 -155868 -12942 276703 103021 -130781 -4318 136780 -49805 -96649
78 -96649 135822 162361 -105471 -112390 107382 61442 -150523 -35864 195483 82097 -178778
89 -178778 -131388 83269 117824 13442 -31116 -52714 -85127 -28318 97056 96509 -42277 -120164
101 -120164 -55270 33089 54145 8275 -61634 -73692 -5469 32306 -6679 -20337 -672 -37295
113 -37295 -58945 20528 51342 -51766 -71528 68200 92719 -74105 -119103 44594 104931
124 104931 -21286 -57144 32333 10969 -57706 47059 133555 -38202 -170006 16988 174871
135 174871 20518 -105861 15653 64044 -58163 -20039 148213 58982 -176154 -95854 177759
146 177759 152672 -84893 -79481 87056 47603 -65011 37977 139324 -1896 -103083 43331
157 43331 131989 1993 -52157 68001 82539 -46818 -53809 67696 80089 -1232 10313
168 10313 51386 -24780 -80443 43327 151259 37860 -106613 -54275 64584 67354 28441
179 28441 27652 -7422 -70724 -36735 78512 107109 7053 -70422 -28263 37082 24089 -6056
191 -6056 18658 31155 -21717 -54803 -6540 46337 31194 -12734 -28107 -26933 -34952 -25081 26738
204 26738 58754 4359 -74116 -73454 -8923 40497 47026 6195 -69561 -93328 -7690 84685 55850
217 55850 -46550 -79179 -26340 7103 -3803 11396 37991 -12771 -86221 -44521 52755 39135
229 39135 -44710 -44919 6020 -7644 -41165 -2997 43333 4884 -57990 -44781 4867 5200 -5802
242 -5802 20468 14623 -50513 -55560 31229 60344 -14624 -53558 -9492 12707 -7705 6682 35799
255 35799 1600 -52372 -28341 33249 26099 -18997 -8073 18332 -10377 -22661 32802 43518
267 43518 -30259 -47082 29190 49530 -15303 -23957 39947 43111 -26081 -39094 27496 55797
279 55797 7793 -23692 1369 20258 15747 24460 25372 -7453 -22118 7320 25397 18571 25018
292 25018 23076 -17584 -36185 12355 58616 30786 -26826 -32371 8887 31722 21349 12587 8586
305 8586 -10898 -25649 -7477 24521 38977 21402 -20061 -39063 -2038 38608 24479 -5865
317 -5865 -8075 -11802 -21077 5965 44693 30542 -16692 -30866 -14000 -1605 14459 37691 25311
330 25311 -30937 -49932 7311 50269 16853 -19508 -7982 -5157 -21758 1092 41033 25852
342 25852 -15671 -23877 -15902 -11222 15324 42982 13363 -42558 -36110 21375 34314 -5526 -12601
355 -12601 13646 -4464 -43056 -9435 55629 39057 -29141 -43499 -9105 10575 13734 13471 -1412
368 -1412 -20638 -17246 -1105 6674 8847 10100 -7898 -38449 -31192 23347 47652 634 -40619
381 -40619 -18514 9802 -143 -4230 12503 7204 -18596 -20464 4079 21048 13618 -9470 -26152
394 -26152 -18790 4258 19347 12297 -9353 -20576 -9151 3940 1464 -1976 -2825 -10492 -14156 -1968
408 -1968 8257 5430 -1467 -10775 -18533 -10013 9017 14528 2216 -12792 -15278 1093 14311 3220
422 3220 -11855 -6560 508 -7453 -7403 11102 19972 -938 -27152 -22102 9139 22407 2090 -13348
436 -13348 -5087 707 -4065 822 11590 8797 -6634 -19754 -13435 16161 35702 12926 -21203
449 -21203 -20878 3081 13883 9964 6802 4442 -5833 -17129 -8352 19693 28542 -1156 -31987
462 -31987 -28804 -824 23395 21121 -5289 -23988 -18804 -9300 -2361 11825 14160 -13739 -33886
475 -33886 -15170 12564 14684 1344 -10482 -21063 -26399 -11089 17672 22122 -9438 -32827 -18752
488 -18752 -1514 -4821 -2668 4858 -10495 -31345 -21822 2080 8700 1649 -12119 -30704 -32235
501 -32235 -4666 19088 7539 -19564 -23306 -7665 -5168 -11581 677 12674 -11646 -37081 -14780
514 -14780 21208 15485 -13455 -21886 -12182 -5542 -6833 -5813 3149 6863 -10485 -27694 -15959 8626
528 8626 12164 -6204 -21784 -18837 -2919 9117 8674 1108 -10622 -18536 -8876 8299 12468 5891
542 5891 831 -10262 -14808 9077 30985 8463 -24701 -15921 13525 18131 5364 3398 3757 -6312
556 -6312 -9056 9292 18790 -592 -10202 10416 15096 -8804 -5183 27468 20248 -21094 -19507 21679
570 21679 28230 -457 -4421 17322 10448 -18030 -6717 32804 26756 -18972 -24603 11619 22867
583 22867 7331 4685 -1786 -24035 -14616 25192 24559 -17591 -23485 12959 14154 -22307 -16104 26987
597 26987 16292 -37006 -27141 31094 24475 -29008 -18256 28359 7731 -41038 -20341 30098
609 30098 22358 -16255 -19404 -6439 -11563 -4383 24186 13358 -40695 -46204 15212 39784 -5359
622 -5359 -28637 -5778 -6462 -25529 -1286 32016 5223 -38787 -23806 17847 15974 -12525 -11975
635 -11975 4034 -5279 -18095 -229 16033 -78 -11915 2439 1385 -22959 -18100 20040 29912
648 29912 -9550 -39952 -16606 25736 24688 -9704 -18168 -2298 -5705 -11457 17988 37186 -2887
661 -2887 -41901 -12220 35165 24480 -11464 -9861 8689 3159 1438 22095 14668 -22214 -10253
674 -10253 37751 19136 -38340 -11343 55487 27680 -42427 -19943 38747 14507 -27878 9302
686 9302 43036 -13328 -50177 17928 65541 -270 -52355 -3093 32557 -3424 -6926 31848
698 31848 5188 -48830 -9601 56116 17787 -50763 -22476 34214 11962 -26240 -811 21630
710 21630 -15759 -32718 11682 24522 -23016 -30266 18160 21293 -26136 -27072 12871 11635 -17142
723 -17142 -12477 3346 -9232 -17115 7951 22477 -8843 -41612 -21200 23387 25663 -12219 -34309
736 -34309 -17294 8144 12733 -720 -13173 -16026 -16699 -9836 10269 16601 -13179 -32826 -6231
749 -6231 15247 -5417 -18876 261 2607 -16617 -7334 14042 -5694 -29596 1536 32385 -9707
762 -9707 -52974 -8446 46989 13048 -37457 -13071 13805 -16318 -16975 34826 24822 -47655 -43291
775 -43291 34743 43121 -19362 -28162 10988 3150 -24778 5729 39812 -1203 -41897 -885 37998
788 37998 -1510 -31736 8760 30019 -9666 -23622 11318 17261 -7980 -355 17813 -6857
800 -6857 -32411 833 40595 15773 -29318 -19923 14043 10587 -6239 4602 9922 -15558 -23576
813 -23576 9781 30551 5251 -25986 -21116 7362 18740 681 -16092 -7423 6766 3355 -3572
826 -3572 -3561 -5238 -6687 2080 6337 -5913 -14094 427 14094 785 -17153 -7798 7849 -2268
840 -2268 -10979 8424 13332 -18529 -25318 15241 27902 -13894 -32725 400 19422 -678 -9587
853 -9587 3863 -1491 -19210 -3715 22675 3621 -29278 -11407 23035 5615 -22360 -1382
865 -1382 19230 -9015 -27641 3750 23121 -4285 -20578 3184 13505 -10222 -19041 5642
877 5642 16372 -5500 -16359 -2533 2160 -2113 9546 12750 -17183 -31463 4624 33313 7080
890 7080 -23941 -10179 12744 3229 -10515 6292 18656 -7187 -27174 996 29068 10115
902 10115 -15651 -5938 7852 -823 -4721 6656 8158 -1753 -2538 2501 -1753 -5437 6178 14927
916 14927 -2109 -19999 -5632 17398 10251 -6406 -1572 3650 -8604 -10521 10084 18429 491
929 491 -14998 -7329 7028 8918 1384 -1238 -1489 -6207 -4754 6643 9797 -322 -4489 -380 -1705
944 -1705 -6322 -697 10315 9182 -5942 -14569 -1110 14837 7942 -7903 -5479 3337 -949 -2358
958 -2358 9314 11004 -3015 -9637 -980 5241 4440 3979 2245 -5794 -7098 7468 15112 -3201 -17096
973 -17096 852 14821 -3249 -14462 6237 13978 -7418 -14405 5330 10604 -6015 -10321 3142
986 3142 6726 -3116 -3453 4052 283 -7447 -999 5670 -3735 -6358 6679 5348 -11144 -7562 10822
1001 10822 6323 -11880 -9057 4782 3356 -3820 -94 3483 -3736 -8654 -870 4965 -1258 -3271
1015 -3271 3401 140 -9211 -2286 11386 4597 -9164 -6745 1498 1237 1915 4951 922 -5180 -4042
1030 -4042 -2459 -2251 2661 7292 -3 -12919 -10540 6864 12841 -1901 -12177 -4867 123 -3249
1044 -3249 1403 8727 2856 -8447 -8542 -2493 4488 8908 4099 -8366 -9557 2312 9539 4067 -2296
1059 -2296 -1326 125 -4454 -4259 7715 12779 -123 -10226 -3124 4912 3553 2807 2356 -1614 -2162
1074 -2162 2116 3064 2257 4017 3766 -1556 -4731 -467 6726 8884 3034 -3085 -2468 527 2014 4231
1090 4231 3279 -1205 -1468 902 -1055 -477 6495 5482 -6002 -10317 -1111 6947 5697 -1480 -6158
1105 -6158 -3171 2053 1319 -2392 -1065 1414 -219 -3718 -3035 3662 7197 -1924 -10863 -3037 8409
1120 8409 3414 -6294 -3448 3812 2292 -2485 -3506 -516 1384 -1065 -4028 -1164 4124 2265 -4093
1135 -4093 -6518 -1513 5652 3693 -6743 -7991 3550 6487 -1889 -3833 2008 767 -4865 -3245
1149 -3245 2797 4717 1068 -3925 -3899 -67 2105 2166 190 -4385 -5067 2315 5454 -1597 -3455 2826
1165 2826 2383 -4935 -4912 3188 7182 3396 -2616 -3111 1516 3610 2942 3348 1755 -1760 218 4631
1181 4631 2871 2685 7289 4090 -7200 -5205 9260 13042 876 -5917 1515 8299 1450 -4309
1195 -4309 5303 11414 -535 -9990 1394 11795 6415 -575 -916 -2307 -1794 4864 8022 2522 -2399
1210 -2399 323 2307 -918 -161 7710 6700 -8464 -11677 7420 15600 -2004 -11576 1048 7385
1224 7385 -2114 -5426 2656 4477 -2138 -2581 3107 1690 -4927 -1822 6915 2378 -7806 -2641 7261
1239 7261 2282 -4849 2475 5970 -4994 -9003 3119 10285 1080 -7698 -3483 4209 2298 -2777
1253 -2777 -475 1240 -3857 -2414 4820 1573 -6052 -1612 6345 -865 -8951 -1505 7303 2127 -6814
1268 -6814 -2718 5968 1754 -8162 -3252 8239 2934 -10041 -4762 9205 6025 -6611 -6186 2545
1282 2545 4600 153 -1861 -1208 -88 1495 4935 4031 -5819 -7746 5651 10825 -1253 -6491 3317
1297 3317 5072 -3446 -435 10178 4529 -10264 -7108 10775 12761 -3874 -7980 4742 6647 -3443
1311 -3443 -707 7506 -574 -8346 4769 12599 -3474 -12133 4042 13538 -1586 -12150 183
1324 183 9665 506 -5401 4171 5361 -8751 -7878 9550 9085 -7534 -7575 4408 2812 -3064 1865
1339 1865 3439 -5722 -6598 5652 7920 -5487 -9947 5608 12071 -4470 -14159 373 11413 1477
1353 1477 -6430 -334 2319 -2849 -2013 4797 4193 -4492 -9126 -1737 7964 6482 -3628 -7147 -2973
1368 -2973 388 3540 3683 -3067 -8647 -1738 8291 4166 -7981 -8741 3562 7977 -3811 -9511
1382 -9511 1412 5599 -3705 -3267 6599 -110 -13597 -3428 13221 5222 -11475 -6226 5816 1669
1396 1669 -4581 2955 5776 -8863 -11335 9532 15353 -8213 -15302 8131 13967 -7918 -11568 8365
1410 8365 9834 -5938 -4580 7144 2349 -7319 695 10755 478 -11214 -582 10837 1645
1423 1645 -5807 4094 4284 -9881 -5281 14543 8928 -13961 -11592 11087 13266 -5235 -10964 1329
1437 1329 7143 -359 -3221 2176 933 -4820 304 7589 1315 -8089 -3713 5010 4265 -342 -1227
1452 -1227 -1309 -1745 -472 3765 4638 -3187 -9498 329 12288 3959 -10305 -4769 7880 5010 -4580
1467 -4580 -2221 4419 963 -2790 3114 6660 -2942 -8582 3714 10700 -2382 -8614 4135 7329
1481 7329 -5829 -3992 9691 3324 -13034 -4591 13950 6449 -13162 -7879 11398 8038 -10643
1494 -10643 -7909 7454 4605 -6322 -164 4926 -5747 -6405 8911 8292 -9339 -9791 6368 7303
1508 7303 -4658 -2328 7372 -98 -12651 -1914 15542 5503 -15054 -8690 11149 7976 -6387
1521 -6387 -3709 4115 -426 -4328 2604 4779 -2588 -3763 3811 5116 -3667 -5615 3587 6813 -2617
1536 -2617 -4488 3089 2914 -4447 -721 7391 1923 -8792 -5402 5380 6630 -723 -5264 -2272 1231
1551 1231 108 293 1828 -1842 -4683 446 4694 -1093 -4188 2238 4686 -2791 -6310 1121 7185
1566 7185 2015 -5503 -2140 4911 1081 -4817 1406 7461 -618 -7895 -549 7513 4058 -2040 -2854
1581 -2854 -1545 38 3634 4701 -282 -5540 -1144 6566 3746 -4911 -2117 5498 969 -5187 1866
1596 1866 7466 -890 -6880 747 6717 114 -5645 -1089 4633 1432 -3431 -726 2144 -2031 -2474
1611 -2474 2444 730 -5490 -1776 5566 578 -6012 -2003 3454 168 -3356 -1031 2072 368 -2756
1626 -2756 -840 2532 408 -2603 -840 604 -1184 733 2822 -1398 -3852 961 3464 -1504 -3455
1641 -3455 710 2371 -801 -3380 -922 3297 2880 -3204 -5170 -719 3040 2376 -960 -3562 -1683
1656 -1683 1517 264 -1787 1014 1882 -3875 -5025 2160 4920 288 -3502 -3292 -1708 1001 2487
1671 2487 257 -2712 -2029 265 781 -755 -577 2306 654 -5081 -2924 5295 4400 -2924 -2378 1919
1687 1919 237 -1213 1922 3147 -369 -1486 632 1340 590 1345 3075 630 -3757 -1722 5623 4652
1703 4652 -2576 -2328 2678 1772 -2138 -34 2897 1893 -298 -1627 -1103 1609 3346 1086 -2678 -2468
1719 -2468 616 3484 1458 -1450 -482 1580 -1388 -3089 1610 4458 273 -4137 -2799 1167 4266
1734 4266 1573 -3792 -3503 1683 1844 -964 286 1822 -223 -2641 -1300 2087 3144 -175 -3294
1749 -3294 -1545 2075 2531 1274 -609 -2716 -857 2482 1509 -2090 22 2348 -976 -2826 1094
1764 1094 3352 -199 -3358 -1664 1067 1770 123 -640 -456 -1645 -825 1770 423 -3202 -183 3186
1780 3186 -1125 -4588 981 4648 84 -4280 -1875 2044 2221 -617 -987 764 288 -2038 -746 1780
1796 1780 1828 463 25 -2458 -1518 4164 5012 -1710 -4268 681 3464 1339 -392 1766 2756 -825
1812 -825 -3751 788 6602 3171 -3132 -2819 1292 2354 2305 1987 -583 -1837 -43 907 1199 2526 2149
1829 2149 -727 -3268 -1868 3060 5516 809 -5270 -2470 3463 2368 -700 87 436 -1533 -1772 265
1845 265 1810 1641 -215 -1783 -1101 69 1242 2111 154 -3285 -1461 3208 1563 -2272 59 3213
1861 3213 -158 -3378 -1038 3329 3359 -1015 -3355 -385 2254 1091 -493 -100 -367 -1232 79 805
1877 805 -257 742 740 -2749 -3227 1443 3594 132 -3467 -2141 1658 1899 -1636 -2557 1523 1392 -3476
1894 -3476 -2969 2496 3505 -1223 -3912 -2448 960 2442 499 -1826 -2301 -1229 338 2397 1447 -1703
1910 -1703 -1865 -148 -649 504 3694 1909 -3904 -3747 1838 4822 1412 -3006 -2519 1340 2206 85
1926 85 750 1248 -1398 -1771 1212 1550 -453 1137 2242 -1299 -3206 181 3616 1385 -2194 -1948 891
1943 891 601 -2053 704 4337 5 -6347 -2875 4024 3655 -511 -2310 -1716 -761 837 1891 565
1959 565 -1314 -1805 -581 317 -38 947 2863 -502 -4868 -1802 4263 2966 -1678 -1082 839 -536
1975 -536 -2065 815 4359 2548 -3807 -5239 1019 5610 2697 -1091 -2087 -2969 -1076 3874 4795 -1310
1991 -1310 -4916 -1839 2137 2250 -314 -380 312 -2131 -3250 1444 4680 -779 -5310 -88 2696 -1028
2007 -1028 -2416 1360 1774 -2055 -2512 545 1241 -563 -163 1664 -1249 -5404 371 7141 1639 -6991
2023 -6991 -2672 4952 1276 -3485 812 3620 -2335 -5017 1575 6544 606 -5172 -1600 3303 724
2038 724 -1617 1515 1236 -3256 -845 4286 319 -4462 718 5257 -732 -6003 -464 6341 2413
2053 2413 -4557 -3079 2192 1022 -2026 1882 3461 -3697 -6187 1519 6219 477 -3402 -2330 -1263
2068 -1263 -746 2572 4470 -482 -6620 -3638 5105 5597 -2504 -4398 1809 2204 -2369 -579 4275 1428
2084 1428 -3475 -2368 2051 1982 -163 412 1879 -255 -3194 -307 4252 1708 -1979 217 446 -3271
2100 -3271 -912 6619 4689 -6169 -7002 2767 7377 323 -4680 -429 2569 -1969 -2881 3398 3942
2115 3942 -3406 -4433 1710 2120 -2081 113 2724 -1584 -4325 -61 3177 -233 -2030 1946 1917 -4721
2131 -4721 -5424 4504 8211 -2594 -8569 -507 5253 859 -1043 1505 -1131 -4915 -591 5585 3460
2146 3460 -3842 -3898 823 1326 -577 1583 2865 -3137 -5790 2096 6312 -1003 -5064 579 2973 -1574
2162 -1574 -3014 1491 3477 -136 -3456 -1881 1136 928 338 493 -1614 -3860 -343 3733 937 -2575
2178 -2575 -1458 0 -1262 -317 2318 1684 -2275 -4789 -754 4821 3196 -3608 -4130 1132 2509 -456
2194 -456 -743 996 992 -972 -1352 102 1573 955 -333 355 -558 -1717 1430 3844 393 -2587 -474
2211 -474 639 -961 1230 4276 1259 -5085 -3813 3516 5593 -60 -3867 -1708 873 -50 994
2226 994 3163 -592 -4955 -1674 3115 1147 -716 737 -7 -3505 -2398 3019 3343 -1050 -4025 -1313
2242 -1313 1418 -329 -643 2216 1008 -3436 -3398 1367 2757 1238 -143 -2270 -2967 330 3647 2251
2258 2251 -1881 -2761 -673 1418 1497 30 470 72 -1779 -1886 1066 2501 601 -1649 -1881 -131 1247
2275 1247 391 -1078 299 848 -2069 -2672 1473 2736 -169 -1517 -1676 -1604 -216 2210 2108 -1762 -4108
2292 -4108 -1233 2565 1605 -1121 -644 -122 -2520 -1945 3547 3770 -2544 -3991 -123 1744 519 948
2308 948 831 -1784 -2439 775 3084 1076 -1350 -41 981 -1362 -1179 3978 3949 -2790 -4878 1444
2324 1444 4023 645 -1047 32 -371 -1031 173 2282 1871 -858 -1881 -1017 339 1260 2503 733
2340 733 -3708 -2917 2559 3261 -1024 -1910 111 98 -1410 -574 1800 1658 -1116 -3357 -1477 2203 1882
2357 1882 -100 -1035 -925 -878 68 1272 1212 187 -727 -1688 -1125 1118 2443 1382 -1231 -3346 -1130
2374 -1130 3252 3100 -1110 -1643 -10 -391 -884 1690 2662 156 -2900 -2668 349 2817 2073 -316 -2439
2391 -2439 -2744 -347 2995 1971 -1652 -2262 32 -583 -1538 2175 3254 -1270 -4647 -2082 2757 3581
2407 3581 -202 -2774 -1701 332 216 1041 1124 -588 -1979 -1070 -38 391 2102 1478 -2347 -3056 983
2424 983 3191 1161 -1319 -879 698 475 -856 372 2569 903 -2645 -1912 1437 1888 1473 143
2440 143 -1560 -1376 777 1721 418 -75 -139 -683 -1122 -423 1497 2367 -647 -3894 -1688 2226 2071 -159
2458 -159 -1328 -1460 -1023 564 1282 631 -130 -1020 -1908 -796 1647 2260 355 -2449 -2845 358 3389
2475 3389 1867 -1655 -1893 -144 -86 663 1416 801 -799 -2004 -1006 1171 3147 1358 -2018 -2437 -132
2492 -132 2009 1991 366 -1257 -345 -103 -520 1088 2201 541 -2671 -2220 541 1902 1814 -377 -2515
2509 -2515 -1324 405 969 375 356 -343 -1635 -1183 -297 1227 1384 -847 -2366 -1153 1199 1002 609
2526 609 -4 -1468 -1620 20 869 731 1162 -227 -2154 -1430 654 2134 1692 -681 -2884 -1567 1724
2543 1724 2275 790 -89 -1439 -1661 195 2106 1709 169 -1443 -2215 -409 2300 2001 213 -1708
2559 -1708 -2344 -160 2425 1520 -1108 -875 -616 -1259 -198 1937 1884 -947 -2558 -1799 952 2245 388
2576 388 -1433 -1005 -1145 -453 1679 1457 -580 -1649 -496 -254 150 1856 1450 -1299 -2374 -229 2153
2593 2153 1899 -694 -1501 230 475 -829 448 1950 171 -1511 -225 420 241 1240 1506 -846 -2071
2610 -2071 -704 1690 2124 -249 -1596 -60 154 -1279 603 3238 563 -3596 -2354 2128 2388 253
2626 253 -1167 -1797 -1054 301 1731 1343 -695 -2569 -732 705 206 196 1601 -599 -3911 -1642 3527
2643 3527 2374 -1941 -2202 594 727 -978 474 2293 998 -2554 -2739 1382 2947 467 -387 -813
2659 -813 -2171 -398 3561 2497 -2266 -2235 444 1364 -89 111 1719 258 -2863 -1843 2808 3035
2675 3035 -1381 -2672 711 1139 -849 -78 1344 -33 -1497 -684 -342 -175 777 1434 129 -2532 -2485
2692 -2485 1782 3609 -723 -2880 -265 1332 -1125 42 2384 916 -3006 -2744 1160 3478 1352
2707 1352 -1498 -1835 189 1038 1022 1401 -133 -1841 -134 1540 -175 -225 1671 955 -2440 -2052 1698
2724 1698 3453 332 -2577 -1618 1342 619 -756 1122 1634 -1833 -3136 708 2990 814 -1059 -1486
2740 -1486 -1359 -15 1880 1989 -1153 -2820 -1188 2148 1560 -1307 -807 1021 -571 -2099 720 2451
2756 2451 -319 -1913 -456 959 -179 -435 327 828 -213 -1519 -232 1154 868 105 267 -1041
2772 -1041 -2108 1036 3574 971 -2674 -1988 850 1526 735 65 68 -829 -1712 -113 2771 1324 -1769
2789 -1769 -1792 -130 413 564 1112 4 -2010 -1068 389 527 221 224 -215 -1264 -1617 -307 2177 2059
2807 2059 -1505 -2902 -337 1670 1290 550 -147 -1362 -1152 597 1567 1303 -575 -2116 -935 1649
2823 1649 1495 216 -91 -886 -1330 688 2085 563 -1211 -606 322 519 -93 138 1066 762 -1499 -1493
2841 -1493 852 1392 -373 -22 503 -1535 -1449 1415 1803 -847 -1364 -572 25 -110 430 1236 -95 -2809
2859 -2809 -1696 2334 2464 -1408 -1997 535 125 -870 713 1584 -180 -1401 -441 269 503 920 892 -362
2877 -362 -1654 -849 1742 2414 -452 -1635 405 389 -487 927 2134 48 -2244 -1206 1117 2291
2893 2291 956 -1682 -2061 208 1008 1212 655 -968 -1696 -596 999 561 -75 -161 -674 -1146 -729 887
2911 887 1537 -134 -2195 -1011 1457 473 -1657 -48 1439 -760 -2387 -66 1901 634 -725 -1117
2927 -1117 -822 67 827 1311 304 -1754 -1173 1650 1032 -835 381 1950 -965 -2707 1126 3359
2943 3359 463 -2459 -827 1259 723 -239 377 922 -578 -1751 4 1427 608 167 249 -1704 -1932
2960 -1932 1786 3397 -574 -2847 -606 1147 394 165 588 193 -1250 -1555 587 2375 798 -1881
2976 -1881 -1662 -198 800 1282 574 -1183 -1325 418 682 129 160 395 -147 -807 -502 861 1981 569
2994 569 -1445 -938 1011 1082 -85 -88 473 50 -401 -139 800 1672 -41 -1432 -787 556 932 674 3
3013 3 -1265 -968 962 854 -444 -283 511 -259 -1659 -260 1487 1082 -988 -1987 -175 1298 122
3030 122 -585 150 -485 -1256 -204 1043 141 85 70 -1260 -1249 1262 1883 37 -1415 -1366 340 1306 559
3049 559 -143 -131 -510 -1035 418 1993 646 -605 -950 -650 199 1580 995 -1067 -1323 -67 889 924
3067 924 370 -201 -668 -500 -302 476 1159 180 -1174 -799 4 568 1377 297 -1343 -1039 250 482 -18
3086 -18 406 -150 -871 -409 -54 326 631 130 -1354 -648 231 580 553 330 -570 -757 83 282 232 781 337
3107 337 -1035 -965 461 909 1035 -69 -1130 -466 934 719 284 404 -391 -1126 70 1257 790 303
3125 303 -485 -1235 -760 731 1110 463 -979 -1431 -226 1157 505 -639 -155 -281 -1103 -264 1462 451
3143 451 -807 -907 -742 -254 1188 894 -557 -1316 -468 659 1225 -85 -451 300 168 -1038 -232 1853
3161 1853 647 -1418 -1017 326 779 687 196 -451 -357 116 -25 419 790 322 -248 -364 -275 298 1499
3180 1499 281 -1714 -632 963 712 -244 83 134 -242 -645 -572 609 1253 -31 -1623 -772 507 441
3198 441 572 -129 -1061 -745 312 597 -44 338 178 -807 -1159 95 1446 1384 -783 -2193 38 1918
3216 1918 599 -518 19 -218 -738 83 1110 683 161 -778 -745 198 1249 1017 24 -1255 -1207 969
3234 969 1910 -576 -1564 428 570 -1149 -661 1408 881 -842 -1243 -284 818 912 -247 -579 -191 -354
3252 -354 33 588 178 -477 109 116 -1400 -117 1727 606 -1719 -1250 460 1033 -115 -656 -168 376
3270 376 -477 -640 494 1276 -58 -792 -193 -91 524 1206 513 -1339 -596 477 507 368 305 248 -248 -605
3290 -605 -373 1316 1653 -596 -2181 16 1554 601 56 -380 -798 -632 584 809 297 -279 -820 -519
3308 -519 356 511 351 91 -1105 -1250 357 1371 -263 -1257 -125 145 -549 55 424 339 -130 -1055 -413
3327 -413 605 740 -96 -430 -161 -569 0 1015 290 -410 -172 250 -136 412 626 183 -471 -730 -224
3346 -224 891 855 -133 -671 295 200 -249 503 400 -314 -545 -295 -404 241 435 80 -234 -790 -678 295
3366 295 939 -38 -1028 -682 89 72 435 836 -443 -960 -591 410 1095 740 -662 -860 12 432 618
3385 618 574 -134 -780 -214 971 287 -31 100 47 -471 -177 551 583 383 -448 -498 426 603 50 172 310
3406 310 -509 -664 416 636 450 181 -273 -632 242 757 111 -310 -685 -579 343 893 -405 -922 386
3425 386 146 -757 -351 801 382 -197 -321 -369 372 497 -52 101 127 -412 -446 626 324 -32 476 117
3445 117 -1074 27 1854 831 -1190 -994 391 1204 827 -729 -328 210 -326 -561 819 1371 -869
3462 -869 -1035 204 574 568 202 -450 -979 -120 409 455 -144 -826 45 511 -228 -987 708 1370 -787 -1799
3482 -1799 109 1431 149 -722 -219 86 -96 -323 266 649 -168 -855 -148 407 -30 127 340 -831
3500 -831 -1110 957 1468 -408 -996 541 912 -202 -786 203 1053 404 -1045 -473 879 567 -334 375
3518 375 205 -746 -309 595 230 -126 21 -69 -764 -35 771 940 -635 -1523 -318 1190 841 -1078 -702
3537 -702 320 -138 -418 342 839 -46 -687 -329 465 835 238 -217 -746 -145 -11 470 523 -776 -679 529
3557 529 201 -627 328 1099 56 -1199 -7 1077 1090 -416 -741 15 628 -14 -19 652 -46 -826 240
3576 240 738 -174 -134 316 -560 -668 316 745 53 -827 -374 499 181 -669 -382 794 620 -1036 -557 426
3596 426 226 -345 308 -22 -842 -120 477 178 -207 -154 -104 -283 133 175 617 -311 -914 -210 1009 722 -543
3617 -543 44 -272 -4 512 748 13 -159 -63 -373 -141 667 475 -297 -211 -198 -15 566 579 -94 -442 -253
3638 -253 113 255 42 -412 -383 322 -409 -215 710 -100 -1064 -521 336 12 -65 -27 -642 -304 210 251 -126
3659 -126 -111 -308 221 387 64 -222 659 539 -480 -392 279 359 -88 30 64 92 53 151 -312 441 341 -45
3681 -45 -358 162 367 566 113 -543 -422 582 249 -14 113 -134 -319 37 97 -185 386 -50 -897 -619
3701 -619 612 513 -331 -665 -155 -252 196 -76 -38 406 -339 -615 87 403 137 -176 -404 -543 -18 1053
3721 1053 307 -820 -505 359 272 -94 49 184 220 -653 -236 506 747 -324 -329 -127 451 634 377 -13
3741 -13 -508 -319 702 -16 -386 129 42 -312 -542 -95 579 251 -427 -644 -188 599 -170 -434 289 187
3761 187 -374 -174 -252 -73 428 -132 -599 -595 115 209 -2 -135 -257 216 255 -245 -212 763 293 -706 -277 684
3783 684 398 -231 -256 -399 115 575 -99 -6 145 -320 -455 277 437 -114 190 -31 -783 -26 902 455 -695
3804 -695 -486 360 500 6 66 -197 268 -452 -288 -25 362 -298 -179 -155 -290 -183 516 -118 -617 -4 457
3825 457 -218 -344 -277 -73 351 -268 -448 252 409 -487 -301 202 541 -148 -107 55 -30 386 -54 -188 -57
3846 -57 587 143 -184 35 -174 49 269 -281 -319 416 448 -153 -248 380 68 -227 -282 48 448 202 -543 -206
3868 -206 265 234 -154 129 -200 -835 -82 341 -306 -567 254 -131 -385 14 816 158 -248 -465 -268 572
3888 572 235 -345 -338 214 -120 116 502 103 -554 52 385 -204 364 458 -126 -422 -69 351 469 204 -356
3909 -356 -168 47 373 -2 71 174 -145 160 362 -137 -166 348 -266 -227 362 116 -60 -15 87 -268 -32
3930 -32 22 -207 -52 288 32 -214 -87 -6 190 551 -147 -581 27 279 -277 -141 258 -244 -247 -43 13 170
3952 170 659 185 -505 33 434 37 84 -225 -303 251 282 -186 -51 297 -61 -452 167 716 261 115 -305
3973 -305 144 514 673 -145 -364 19 117 -99 364 -178 -168 16 -103 -312 309 396 -278 -557 -95 280 231
3994 231 -534 -802 -194 514 -93 -730 -6 55 -45 -406 52 49 -58 293 -27 -154 215 127 -138 19 -131
4015 -131 78 181 -335 -392 397 949 -487 -541 468 614 27 -78 75 85 327 -3 25 155 310 -240 36
4036 36 -5 -84 70 273 -568 -687 453 546 -294 -420 142 37 -203 -324 302 579 -265 -918 -250 672 251
4057 251 -69 -258 -70 -223 189 614 -149 -453 91 147 82 337 174 149 -259 -504 246 754 -41 -577 78
4078 78 834 62 -545 31 291 -52 146 214 142 -11 54 -65 139 -37 -144 462 17 -790 17 855 -218
4099 -218 -597 106 456 -344 -490 31 283 131 -124 -234 95 214 -350 65 670 3 -314 133 -48 -407
4119 -407 109 628 -340 -419 278 382 426 -182 -271 72 188 32 227 399 11 -468 -33 629 146 -30 113
4140 113 -364 -377 500 175 -181 -229 -151 138 488 -273 -416 80 194 -447 -45 242 41 -479 -132 131 -114
4161 -114 32 -44 -120 -89 114 -141 289 186 -281 -292 19 -293 37 523 209 -379 59 482 438 -52 -189 -213
4183 -213 218 328 30 263 133 -110 -200 235 -22 -72 315 343 -101 -45 177 392 -220 7 327 10 -79 -647
4205 -647 23 378 150 -705 -158 271 -54 112 -156 -186 -457 107 348 73 -92 -236 -273 100 136 387 331
4226 331 -217 -509 42 685 250 -430 -211 255 48 135 84 -56 170 -1 -63 -66 448 170 -282 44 21 247
4248 247 270 18 -394 199 108 -360 79 81 -137 -275 126 -263 237 515 -204 -465 -11 442 20 -487 -67
4269 -67 323 298 8 -574 107 423 -124 -308 55 -125 -137 288 129 -291 -377 190 -223 -166 482 357 -350 -351
4291 -351 29 423 405 -410 -536 226 505 65 156 233 86 -68 349 102 139 318 -101 -345 -188 692 126
4312 126 -6 -341 -422 235 463 -293 -194 529 291 -402 -146 370 -38 -134 -241 -61 122 343 -151 -230 63
4333 63 -133 48 444 -91 -79 187 78 -235 34 472 285 -276 -138 286 444 57 -266 89 369 -121 -255
4354 -255 148 569 -243 7 -48 -41 201 384 -2 -112 -137 10 113 42 152 -9 144 -126 -361 352 300 -308
4376 -308 -560 240 209 -76 236 336 -249 -463 203 10 198 -100 -320 -47 -6 -244 272 54 -283 -574 304
4397 304 487 -351 -206 171 -175 -258 603 259 246 -32 -249 -87 395 191 11 86 -165 -132 161 521 -69
4418 -69 -202 253 350 49 41 84 86 131 0 -49 208 110 -169 -75 301 -205 -74 224 69 -87 88 161 -367 -133
4442 -133 271 126 140 -190 -341 15 429 17 -320 235 -233 -81 387 28 -239 -219 52 -219 378 437 -58
4463 -58 -253 35 98 241 445 -189 -346 -6 245 -97 252 257 -309 -444 373 72 308 350 -307 -427 102 282
4485 282 -98 132 28 -217 -131 202 71 43 242 -283 -540 129 54 -99 -324 -306 -397 297 276 -342 -2 343
4507 343 -19 -162 49 245 -126 30 -488 -167 369 387 -262 -115 247 143 136 71 245 66 82 -185 -121 409
4529 409 251 196 20 41 -79 333 317 -254 -313 185 14 -248 322 511 46 -351 -22 -13 503 96 -449 -423
4551 -423 68 1 64 354 -123 -112 -15 61 -148 391 259 -405 -412 70 500 49 -117 -297 -103 107 -5 -1 271
4574 271 -171 -536 -188 182 223 261 92 -285 -408 619 368 -245 -123 212 -79 -210 61 122 251 9 -428
4595 -428 -220 255 49 19 -111 93 -147 388 81 -120 244 63 -159 -216 131 122 -38 -155 -424 -218 475
4616 475 116 -397 -159 30 -287 -108 223 273 -205 -362 -267 87 517 298 -130 -251 20 -95 575 100 -324
4637 -324 -186 333 -119 -106 224 287 -163 -545 -31 408 209 -143 -216 -20 298 61 440 275 -150 -384 243
4658 243 284 -14 89 -142 -420 -193 243 87 -228 -230 -319 -3 264 -136 -227 232 -233 -416 61 634 324 -115
4680 -115 115 -233 -266 145 62 -4 -267 -70 -235 -23 292 -82 410 283 -470 40 498 84 173 208 -158 -419
4702 -419 114 416 154 -7 -157 -357 379 359 207 -275 219 -470 -261 395 310 -441 -446 -30 -60 122 71 52
4724 52 -146 -252 -352 -14 270 143 -194 -166 -153 12 274 238 -441 -241 300 145 85 109 -192 -90 -125 -123 294
4747 294 367 -312 -609 134 217 122 -49 113 -35 -123 334 133 -148 323 20 -57 -56 -58 17 329 -6 -308 -34
4770 -34 196 217 -315 151 37 -171 4 39 12 344 -22 -730 -122 76 174 30 -395 -406 -240 410 114 -197
4792 -197 64 -68 -503 -143 318 142 -45 -403 -439 164 493 -118 -49 -155 -116 -123 109 286 -48 -53 -233 -141 172
4815 172 509 23 -265 -327 -223 143 191 32 -398 163 25 -321 -28 180 15 -361 -214 -93 240 288 -344
4836 -344 -338 -50 367 158 -38 51 21 -183 15 -112 144 378 -137 -294 -6 -78 26 270 -67 -264 60 232
4858 232 28 -172 306 -100 -363 68 286 59 159 -147 -350 0 136 -16 83 -85 -331 -65 118 66 114
4879 114 52 -274 -332 86 648 259 -44 -262 15 176 167 -49 55 114 -440 -151 164 272 -172 -74 -46 -277
4901 -277 128 292 106 -391 -286 -186 288 8 -29 41 187 -90 -55 398 393 -323 -259 275 133 -88 190 134
4923 134 -45 -157 51 2 145 51 -6 -44 15 -87 78 341 -341 -281 57 124 111 132 241 -204 -334 -84 -147
4946 -147 288 -5 -367 -155 -118 -22 143 173 -50 -321 116 477 -41 6 71 -355 -169 64 147 305 46 -233
4968 -233 -224 129 257 260 217 146 -394 -24 239 163 -34 11 10 -147 50 440 131 16 -372 3 219 562 -245
4991 -245 -270 35 -54 -490 118 270 -176 -78 -90 -312 123 251 -85 68 -191 -74 112 185 -150 -243 72 -143
5013 -143 -334 -59 110 -96 -275 -146 -37 221 431 -65 -285 5 26 59 13 144 -314 -226 79 -24 260
5034 260 432 -9 -317 92 20 231 75 -100 -27 -14 10 37 185 188 -282 -33 83 33 51 -199 -388 -295 355
5057 355 124 -102 -301 -112 -157 -221 -60 -44 87 -232 -354 -334 235 -8 1 -259 -81 -203 229 222 -40 -100 292
5080 292 -181 -195 349 145 -29 -119 -144 -65 -17 152 -44 -245 174 76 107 121 159 237 -1 -59 -172 171 315 -402
5104 -402 -291 123 57 30 -32 -273 122 -7 -175 -159 542 209 -267 -259 -228 38 252 26 -306 -246 -80 47 -9
5127 -9 257 375 -247 -312 -98 315 48 62 -692 22 272 108 57 51 -170 -201 259 80 313 259 61 -160 -192
5150 -192 307 188 11 214 -214 -79 444 465 -220 -77 -15 -231 44 259 421 38 -350 -92 -57 271 168
5171 168 -19 -90 -165 -98 21 45 -116 103 88 -218 -109 274 109 -30 -319 -185 -18 -182 83 -195 -54 -295
5193 -295 -181 -68 522 37 -131 211 -126 -103 377 352 -93 -399 -123 110 305 111 112 136 134 -216 118 216 30
5216 30 -252 23 -101 192 304 154 -165 -497 -70 206 380 93 -354 -323 121 139 -40 107 -60 -498 -171
5237 -171 -26 170 -276 -53 -443 -98 21 -5 42 115 8 -51 -25 134 -21 39 161 -214 -215 245 58 -112 -142
5260 -142 -226 -73 160 299 -71 205 -63 -97 87 427 80 -113 57 -82 -129 206 231 -317 -150 202 -64
5281 -64 35 101 204 -307 -134 -360 4 264 -141 -301 -72 -2 -297 125 94 -106 -381 51 -85 -191 392 161
5303 161 -34 -271 -116 194 498 -209 -286 -252 121 86 -25 187 3 7 -123 -194 143 419 53 -194 -150 209
5325 209 47 3 213 -94 29 184 -154 141 364 165 -338 -40 223 370 -120 -112 -226 -141 259 -61 413
5346 413 173 -79 -445 188 -26 -134 -180 15 -303 -138 326 151 -48 -19 -64 -136 55 -83 84 73 -85 -336
5368 -336 -163 312 244 53 -158 -141 87 206 154 -170 -105 -8 -69 180 165 147 -290 -153 -7 160 312 95 -259
5391 -259 59 57 202 359 58 -238 -23 190 -64 104 244 -130 -235 33 73 -12 -163 -151 -357 -35 232 63
5413 63 -189 165 -131 -228 118 3 111 145 -206 -215 -189 160 -48 71 11 -4 -33 -21 118 21 136 -218 -100 34
5437 34 24 -250 270 -101 -250 60 265 124 52 186 -204 -452 -62 225 -78 -55 93 -142 253 385 -139
5458 -139 201 -23 -95 -351 327 -35 115 -50 -170 -129 259 409 -111 -11 -216 -248 -45 241 -9 -422 286
5479 286 -75 -30 125 275 -108 -358 -107 59 100 199 -233 25 32 -242 240 542 -103 -201 36 153 -204 -232
5501 -232 201 2 -181 -53 -10 135 20 -53 -118 24 -241 -15 239 -7 -442 -84 323 -160 33 28 -211 -277
5523 -277 84 -55 167 6 -91 -63 111 225 -309 31 231 52 -304 136 277 60 197 -254 -332 -41 184
5544 184 285 60 -91 47 -62 45 -31 -221 -10 -150 -397 103 148 -59 -8 -127 -187 -10 179 97 -331 -149
5566 -149 -62 -182 245 90 -193 -70 -127 -352 198 377 -66 -194 -116 110 217 -142 -220 14 -4 40 -185 99
5588 99 -74 -59 -488 -8 -31 139 102 44 219 -44 -123 -36 -185 325 255 -13 -305 -25 270 119 -114 -221 91
5611 91 271 -215 20 262 -142 234 20 134 174 213 -308 -380 18 93 149 -129 -223 -148 143 -3 102 58 67 -201
5635 -201 -237 47 193 30 -87 -404 -195 209 289 49 -87 -141 -58 218 266 17 -298 -175 -150 -92 395 -55
5657 -55 -194 -24 133 35 96 208 -122 -117 256 -134 154 125 215 -147 34 7 -60 47 105 -230 -135 39 51 -65
5681 -65 101 -10 -108 215 -259 -122 -54 149 -426 -281 -90 -134 234 21 -131 -6 104 -41 -260 185 323
5702 323 -129 -151 63 81 245 141 -93 -70 47 54 148 166 16 -258 19 -126 -52 170 14 -312 78 247 308
5725 308 22 191 -357 -260 131 -60 181 184 253 -50 -15 234 -176 -8 -8 34 104 77 253 131 -44 87 -202
5748 -202 157 195 -15 -116 -63 -118 218 95 -8 125 -95 -62 -71 94 118 9 -3 -50 11 202 322 -40 -47 145
5772 145 -146 -245 209 390 -276 -344 113 90 201 328 -149 26 -221 113 72 15 76 -165 48 -63 32 100 -4
5795 -4 -307 -290 -25 3 163 136 -141 -155 -157 -179 -220 89 -169 -188 -67 -66 -52 6 46 -346 -73 75 286 54 -118
5820 -118 72 -204 -81 96 222 71 6 -211 -233 201 81 119 82 175 -12 281 -108 -76 35 184 19 31
5842 31 194 143 146 -10 -90 -295 199 117 -43 378 29 -48 -216 135 109 -16 -69 -360 -29 156 -1 -231 -50
5865 -50 -52 -91 -86 -84 -30 -66 211 -119 -127 53 9 -184 0 91 117 227 -89 -68 -10 180 57 187 37 131 -264 -219
5891 -219 -118 28 199 -14 -198 -184 70 86 -255 33 -4 11 -77 98 176 80 133 -105 -142 156 -130 -58 48
5914 48 -17 -382 67 -225 71 30 0 -112 -6 71 -52 225 69 -48 -121 183 -19 145 84 2 3 11 88 273
5938 273 -40 -28 -258 178 350 8 -55 166 106 91 124 142 -29 53 -9 -145 262 419 63 45 32 -250 2
5961 2 109 124 -317 -72 117 113 -3 90 1 -161 -92 -182 284 256 -234 -484 -189 -192 -66 64 -140 -190 41 97 -66
5986 -66 -11 -202 -298 -16 -85 78 71 262 -184 -318 197 126 -269 53 27 51 -14 -60 89 47 -89 -99 -213 23
6010 23 17 162 152 56 195 60 99 -50 134 84 295 -179 125 20 15 -105 -233 -85 -113 -179 -126 -15 95 -184
6034 -184 -396 270 227 -248 193 -136 -73 -3 34 -94 -79 11 -86 -141 107 44 -221 168 4 29 314 155 -62
6057 -62 -24 -61 76 -66 238 5 -82 86 -82 308 150 -50 -35 133 281 -151 111 -33 -136 -131 134 -105
6079 -105 -46 0 -36 -95 -39 96 -20 -50 -190 -66 112 12 -41 263 226 -228 -404 188 243 62 -47 48 131 -22
6103 -22 -57 -94 -11 328 -134 87 -43 180 14 54 -106 -78 293 65 12 -213 34 4 -79 105 97 -28 41 -9
6127 -9 -206 148 90 -80 -306 -152 32 133 337 -179 -112 161 -178 -174 102 -21 -79 -228 -237 27 251 -164 -353
6150 -353 -327 -103 246 -104 -46 -66 -181 51 76 -108 57 6 -43 -9 -107 348 211 -97 -96 -29 229 116 -224 3
6174 3 311 -59 -89 42 76 27 92 -182 143 247 -52 -196 126 -16 130 -174 106 -110 -194 117 -274 -170
6196 -170 168 139 -1 -86 -158 -131 95 -168 -123 263 94 -297 96 151 -200 -20 -91 -369 -111 373 -118 -42 63
6219 63 -155 -136 246 171 -82 -3 70 -81 -159 113 110 -103 -118 -55 -128 -103 170 -63 9 66 -143 -43 307 -43 -156
6244 -156 38 52 49 -8 -89 -346 -64 -318 120 -28 -79 -39 -163 -7 43 -93 8 -47 -290 -47 124 -158 -84
6267 -84 0 -70 -210 186 72 -18 -9 31 -307 55 -14 -41 118 39 13 -172 130 -226 62 82 -100 -61 -131 60 146
6292 146 160 -33 -179 -27 211 254 -399 -33 -234 -324 -16 71 -102 33 11 222 248 -24 -145 26 173 -206
6314 -206 -48 116 -132 -204 -165 17 -13 186 33 -167 -180 -143 50 -258 -35 -17 -3 85 -49 -58 112 -113 -78 -77
6338 -77 55 163 191 164 -93 -1 102 162 -110 204 -53 205 104 55 -103 107 71 -225 -239 -25 3 -49 6 56
6362 56 -269 -198 -192 -65 114 -24 -127 -157 152 25 19 153 -20 -166 200 98 -12 217 33 -34 -26 -25 170 48
6386 48 -362 -191 -3 269 16 -38 171 35 -47 -12 24 201 -11 57 29 16 403 154 86 -371 36 232 162
6409 162 301 -262 143 -28 -36 95 14 -39 -201 -204 208 23 8 -47 159 95 -50 111 88 -28 -103 -124 3 79
6433 79 -6 117 -128 -115 27 117 -244 135 232 82 -127 -62 -119 -46 296 51 68 -105 108 2 63 -170 -95 59
6457 59 -51 -38 123 118 103 -339 2 -43 -93 14 -199 -192 60 273 282 -65 120 -271 54 -37 43 57 -137 -224 -256
6482 -256 142 93 -119 -131 130 51 -3 267 -30 -235 81 -72 -314 98 175 -127 -124 -134 -192 110 -48 -100 -98 -25
6506 -25 350 -23 -5 5 89 -37 -67 7 67 -67 -18 73 178 -84 15 168 270 -84 34 65 -93 255 -116 -127
6530 -127 -28 -128 -190 -173 -45 -68 -78 -3 -3 220 232 -97 -56 -90 27 -6 104 42 -83 -5 75 27 90 133 -54 -283
6556 -283 62 95 -304 -135 120 116 -155 208 34 -86 113 -52 -228 87 -128 106 18 186 73 39 22 25 34
6579 34 212 -51 -213 -133 59 -22 64 -77 -112 -163 -64 -47 -222 200 -139 -263 -21 0 31 -118 -39 41 -258 92
6603 92 -13 24 72 -38 -2 161 27 -237 20 83 -125 -28 108 -201 -141 93 -72 63 114 84 -232 -252 -24
6626 -24 100 -117 -118 26 116 177 -10 -1 127 112 -240 111 22 -2 165 -160 -61 -79 -8 -217 -307 -30 -135 136 22
6651 22 -166 3 -45 -156 -295 108 133 160 -217 -67 -55 240 45 64 7 49 8 -228 157 -60 -140 -44 119 -61
6675 -61 -12 126 163 -125 296 -22 -339 -159 148 10 118 -241 -134 -105 -5 -104 -77 144 -31 32 -121 99
6697 99 -113 5 128 -41 165 -36 120 -101 29 210 76 -69 -97 -58 44 -200 110 -90 151 -70 -104
6718 -104 -1 166 217 -46 -325 -207 216 119 19 -37 -90 -137 29 105 -62 160 -130 74 59 -149 108 136 2
6741 2 51 37 191 -128 -38 -5 49 -55 146 198 -4 -115 126 -215 149 43 -192 20 234 8 -305 -136 -108
6764 -108 -49 -63 -10 -153 -96 209 -217 -177 -124 -29 -122 -57 -127 207 157 -116 -488 -38 114 -73 -83 -74 -203 -155 -190
6789 -190 -65 133 32 146 181 66 306 121 -108 -62 -39 124 191 -133 -83 228 177 -48 177 -11 20 -196
6811 -196 192 92 73 215 -12 -112 56 -8 14 83 74 23 0 127 -184 55 -14 -136 -244 -155 156 -117 84
6834 84 -37 -165 299 176 93 206 59 -171 127 219 214 -105 72 -102 31 1 -60 109 138 33 -103 59 156
6857 156 190 67 230 -65 -220 -18 48 -57 248 -2 112 35 175 116 138 43 -185 -83 274 89 -156 117
6879 117 73 91 -187 18 18 -52 -30 132 -272 -12 40 -146 -93 -395 93 86 51 -119 -137 -31 -159 -28 235 12
6903 12 -25 159 21 64 113 -245 -10 -217 281 182 68 -63 146 -261 81 197 -53 -29 -101 -146 -237 201 -23
6926 -23 -99 -135 -47 -14 337 52 -61 -7 -62 91 69 -64 -7 109 35 -214 -36 198 64 -131 -71 -136 -148 191
6950 191 -45 -177 66 -8 -64 -123 197 -51 -126 -103 -36 80 71 -177 -52 -40 -47 -74 64 -272 146 13 -129 -131 2
6975 2 15 -101 79 104 -231 -42 171 -75 137 -114 -127 -144 -126 113 219 -181 -176 50 -74 -19 101 -468 133
6998 133 67 -2 124 223 -10 53 -176 -32 126 257 -127 -100 166 217 -198 -163 222 -46 -154 -51 -194 11
7020 11 89 -111 53 39 157 65 -19 -43 -171 -125 -7 54 -197 84 -129 170 1 202 -55 106 -37 -218 33
7043 33 84 -223 -66 -43 103 -234 245 332 -515 12 2 -281 -168 83 32 -134 -129 -221 -58 29 188 -19 -28 -6
7067 -6 -74 399 -32 -84 -144 134 158 -215 236 3 -161 14 -93 -64 287 -132 -109 -19 277 23 95 173 95 281
7091 281 224 -161 64 -20 40 30 -154 61 -92 98 160 -329 -60 155 -286 67 106 86 69 -96 -81 -197 147
7114 147 -197 21 -9 79 -11 -261 238 42 9 16 275 -18 -91 -189 -290 82 89 139 119 217 42 197 135 -97 133
7139 133 100 -105 -69 187 159 -120 -358 -96 -97 -25 259 -212 -14 -161 -69 128 -64 -66 41 -146 85 -171 174
7162 174 89 173 -158 -22 -48 -116 -23 58 31 311 407 6 -110 -36 14 -79 93 67 -56 -115 -53 38 -140 203 -91
7187 -91 119 210 132 77 44 -4 9 83 284 75 36 102 107 199 17 56 -154 94 -228 -28 298 -91 -77 26 -8
7212 -8 111 -186 -221 -227 121 147 37 -191 -71 95 -197 36 -96 -73 -57 -235 -335 40 -16 40 53 -31 -76 -200
7236 -200 51 -46 231 21 -41 -50 -8 -120 18 -109 -113 -122 147 -90 -218 28 239 345 -88 232 79 -32 -200
7259 -200 128 -68 -34 -79 48 82 80 -174 -32 -139 186 -285 -107 21 138 156 15 3 -73 271 53 -43 -93
7282 -93 68 25 62 6 128 114 -29 -282 37 84 -100 122 166 -113 49 232 13 -22 107 -58 -88 -45 146
7305 146 -118 110 202 -75 9 331 216 -60 172 0 -68 139 -247 84 144 -26 -208 75 122 109 -122 -169
7327 -169 217 35 225 76 -180 84 108 -50 42 -126 67 -154 32 -95 -433 -183 -109 -180 70 -134 6
7348 6 60 111 37 55 -111 -243 -87 18 -55 -245 -63 191 3 -87 -31 5 34 216 -302 181 -13 -39 64 37
7372 37 122 66 -53 119 -115 -44 133 -67 53 -129 2 -195 -91 -166 -295 -90 41 -82 -28 -36 -163 62 -119
7395 -119 133 -288 38 -125 -227 75 -141 -175 14 98 -50 -44 336 46 272 5 100 -6 53 -5 -104 179 -172
7418 -172 -82 -120 208 -174 21 -139 -97 -95 258 -102 -38 110 156 -184 -147 55 60 80 -222 14 -218 -41 -34 27 -51
7443 -51 185 63 -264 111 -11 -36 38 -71 -123 171 114 -135 236 -9 -75 -330 11 -44 -46 9 -72 66 35 -226
7467 -226 -111 -58 91 6 -79 -221 115 -72 0 -92 -134 -66 131 175 140 -10 -4 58 -147 245 260 36 -45 22 -46
7492 -46 -30 222 49 -29 -226 50 -129 -117 245 -13 -23 -6 -87 -59 272 -189 -86 2 -56 5 51 36 -153 -7
7516 -7 -10 -202 -90 157 85 102 -123 254 17 -84 -65 -128 134 41 -12 -79 -152 56 -164 -59 91 -254 -36 154
7540 154 -84 -36 308 -4 -35 -37 109 211 308 36 -100 34 -107 59 48 176 40 -73 -337 47 78 70 -128
7563 -128 6 -68 -32 52 176 46 184 -70 278 37 145 80 -82 -94 -266 271 -121 180 -244 -117 -81 3
7585 3 -29 -37 143 45 -12 -64 156 -172 55 -98 7 34 219 157 152 64 -19 116 126 367 -113 -13 113 -138 -2
7610 -2 -34 -85 -80 -4 -117 -52 18 -101 -63 -24 -89 129 199 149 54 -78 -119 34 159 124 -128 -70 -189 -21 181 -37
7636 -37 172 18 49 -98 -309 180 -49 -109 179 46 8 166 82 -133 -95 75 14 112 -7 256 -121 99 76
7659 76 -94 -225 -56 -157 -133 -120 18 -25 -86 -173 16 48 -54 36 -217 -34 -204 -154 -46 15 -81 111 96 80
7683 80 -96 -15 6 -226 -132 -183 -166 -4 139 -312 213 270 44 62 -44 172 50 250 -188 205 -2 97 182
7706 182 -82 19 161 205 -37 22 -8 -103 -205 -11 323 -164 -304 19 -91 207 63 -6 -119 -22 -102 -132 -128
7729 -128 317 -75 -202 -36 -272 -2 -60 -190 -133 220 35 -247 -42 179 106 46 -24 39 366 -14 -49 63
7751 63 -59 175 -91 -94 -224 -94 -218 142 -29 -204 96 -254 -147 161 125 -112 25 57 -225 -70 -243 -97
7773 -97 -73 -39 -69 25 -4 -49 17 277 136 10 39 51 -236 -65 50 -305 -100 162 -116 116 61 159 -83 8
7797 8 26 -163 -43 68 -117 126 314 -11 213 -75 -44 171 67 222 72 134 228 193 282 -18 137 -240 -15
7820 -15 -30 66 168 50 221 -73 -5 64 -213 240 -75 -14 171 -90 -23 294 91 136 97 94 -18 -86 -19 230
7844 230 203 36 -224 11 -195 101 141 74 98 -129 85 -18 -72 -284 -111 -145 284 63 12 -40 56 31 97 148
7868 148 -65 -216 150 -62 21 -84 40 -147 -158 147 230 50 -73 -36 -369 -9 -40 92 87 177 2 10 288
7891 288 185 106 -342 -72 -8 152 118 336 -53 -30 -185 175 165 -55 -162 -57 -102 199 -118 7 -88 39
7913 39 21 -68 -1 -80 49 -17 80 -81 -28 -27 -254 18 61 -83 -15 107 288 -161 97 79 74 133 280 31 10 174
7939 174 96 275 -66 73 -85 -110 -58 -57 137 -70 -258 -122 -95 141 21 -89 -45 -204 42 -131 -26 -55 20
7962 20 -238 -63 180 -226 202 109 -26 -7 -13 161 -178 79 76 -166 287 -62 -123 29 192 -164 -76 -16 233
7985 233 -176 20 90 -106 217 21 0 51 -175 56 -117 -46 117 -210 3 -15 -95 -100 -100 41 -87 190 10
8008 10 -68 205 -85 106 -205 -22 35 84 163 160 -242 -92 -97 116 -41 -104 226 197 78 69 47 156 76 -6 -246
8033 -246 -189 81 -144 -202 -40 -63 15 -2 -142 -52 -263 72 -10 45 163 79 -178 31 21 16 -195 41 34 -86 -19
8058 -19 -105 -89 -40 -139 -202 5 216 310 225 56 -118 256 271 -79 31 -101 -220 337 -16 161 -53 33 -63 -15
8082 -15 -117 100 208 -275 -102 24 -164 102 63 47 54 -30 36 183 -185 98 23 133 -114 0 76 35 65 -287
8106 -287 124 -28 -175 107 -146 159 -193 28 132 122 -99 78 -200 79 20 -202 -7 4 -124 104 -16
8127 -16 7 86 -253 -285 99 -59 -246 -17 -97 -157 93 -106 -56 214 -29 85 41 28 -85 131 303 120 63
8150 63 -70 167 -48 19 131 -40 -3 -144 13 183 128 -64 222 -75 128 -51 37 136 -313 194 -8 69
8172 69 -69 21 -102 -154 25 176 49 -122 -181 -64 -228 -29 2 198 -208 193 5 106 90
8191I0
$$ Imaginary data points
##PAGE= N=2
##DATA TABLE= (X++(I..I)), XYDATA
0 0 0 0 0 0 -8 0 -8 8 -8 16 -16 24 -29 32 -40 48 -56 64 -80 93 -109 125 -144 165 -191 220 -247 278 -318
29 -318 358 -405 452 -508 567 -632 703 -781 866 -963 1065 -1179 1306 -1446 1598 -1775 1970
46 1970 -2191 2444 -2738 3078 -3486 3981 -4595 5380 -6423 7890 -10092 13766 -21010 40636
60 40636 -200834 -577508 11366 299741 -38782 -232013 2322 -42668 -270860 -117310
70 -117310 183481 15691 -256360 -128080 58058 -98065 -176605 38438 78121 -182162
80 -182162 -202466 37660 22257 -190073 -100312 120950 2428 -246845 -157814 89193 88300
91 88300 -76196 -123194 -82852 -63115 -6665 80049 42934 -101240 -143072 -30869 64685 48192
103 48192 -22169 -73489 -59119 14877 45464 -8491 -38094 -10325 -20449 -39477 20429 48074
115 48074 -43806 -68244 54243 75184 -80169 -113182 57600 114521 -30299 -81006 28008
126 28008 41153 -32827 29091 101876 -40431 -147803 39926 191106 17065 -133130 473
137 473 90508 -26994 -31477 108318 36624 -166272 -74037 186706 132032 -133110 -126207 75911
149 75911 59743 -74846 -3174 99622 -26990 -128220 19328 117198 -21867 -95198 27305
160 27305 59400 -64657 -71812 56889 66863 -38604 -46253 10089 -32776 -75948 28187 106759
172 106759 -21453 -154345 -68868 69890 48812 -35287 -47065 -51073 -78203 -32254 63676
183 63676 57977 -58435 -117634 -45006 33439 12374 -34566 -19806 -2420 -41797 -61279 -5214
195 -5214 40215 6300 -47733 -52655 -29802 -18760 -7419 24125 29924 -31538 -91139 -59171 21850
208 21850 51315 18738 -34474 -79817 -65576 25808 88861 26780 -78902 -84250 -1484 41657
220 41657 16335 5710 18714 -18642 -67908 -16338 74238 46684 -47768 -43968 24006 20396
232 20396 -18439 8116 45130 2370 -54413 -26371 34608 32584 2311 11457 10511 -35385 -31550
245 -31550 48841 66584 -17119 -53561 7632 42814 13888 10206 31307 3024 -38746 -6243
257 -6243 55350 40794 -14187 -8009 27188 8387 -9851 31271 41029 -25419 -38984 38041 58223
270 58223 -12610 -28850 33464 37355 -29371 -36027 34078 55102 -4123 -36247 156 27020
282 27020 13122 6611 6281 -17310 -24759 9796 28592 9872 380 -1064 -26346 -32299 15912
295 15912 49132 7441 -48122 -37082 15717 33001 7118 -12540 -13843 -20915 -23300 401 26860
308 26860 23099 -5965 -37355 -37553 5573 38949 12545 -26897 -23448 -8545 -8173 10611 34542
321 34542 9425 -38560 -39384 -3882 15149 17360 20788 1472 -41572 -43191 17923 51668 4439
334 4439 -39316 -19125 2233 -8117 5489 33647 10108 -35639 -32922 -5122 5179 17354
346 17354 26996 -5733 -50041 -30859 29145 34954 -14635 -27973 2489 -1499 -30560 -1040 51253
359 51253 22064 -49270 -48451 6141 27530 13940 2418 -10476 -21952 -11081 9491 13250 4880
372 4880 -1472 -14010 -28492 -12209 33048 41186 -13469 -50484 -15582 22272 9091 -6175 5708
385 5708 3217 -18424 -14298 12849 22120 4716 -17459 -22758 -4925 18243 23307 6639 -14395
398 -14395 -18266 -526 13326 7006 -2617 -2656 -5370 -6003 5421 12468 3393 -6905 -10993 -10855 775
413 775 16496 13967 -3322 -14596 -8972 7951 16963 3150 -11801 -4192 8379 3137 1363 14822
427 14822 16900 -5398 -23111 -8199 22454 27838 319 -16393 -3678 7093 1461 1709 8198
440 8198 2089 -12377 -16419 -3412 19699 25776 -3827 -34136 -22094 9833 17906 4833 -4365
453 -4365 -6089 -10152 -13141 -1251 19268 17444 -15253 -36605 -18033 15056 27136 9945 -19732
466 -19732 -31536 -15280 2189 5349 7609 2715 -21189 -32500 -6587 20270 12196 -10725 -20111
479 -20111 -19173 -12352 4841 23760 16813 -16456 -31903 -7507 16318 9562 1948 5652 -5052
492 -5052 -19220 -4491 19910 17965 169 -12702 -19147 -10444 16162 29670 8434 -20070 -17553
505 -17553 4471 10255 1010 5818 13823 -5242 -22981 2905 35659 21139 -13130 -15877 4266
518 4266 14085 11183 9215 13482 12837 -1635 -11740 4168 26317 21800 -1731 -12312 -1386 16370
532 16370 21960 12660 200 -7062 -6517 6352 21369 18936 5242 -847 -2939 -1333 18132 31485
546 31485 6557 -22324 -5669 28073 27124 5142 -426 4097 -387 -1043 13857 19669 -37 -11363
560 -11363 7872 14481 -7870 -9038 18103 10990 -26491 -21393 21072 24338 -11616 -18449 5187
573 5187 3799 -19351 -9200 24698 15276 -28758 -28556 14356 23742 -3757 -13152 -10340 -19481 -9474
587 -9474 23216 17307 -25848 -29920 8980 13188 -22021 -19811 19051 10112 -38392 -27456 30006
600 30006 22415 -34535 -26957 22772 7116 -39131 -16261 34970 20272 -25830 -24887 1691 3508
613 3508 2551 18205 6519 -35881 -31185 29707 45719 -9995 -37199 -4706 8315 -9596 4496
626 4496 29502 1223 -38367 -16380 28264 21167 -14538 -14440 7071 3404 -9022 5755 20883
639 20883 3404 -11697 2170 7943 -9170 -3927 27952 28586 -12490 -32999 78 38382 26057
652 26057 -14428 -20922 4327 8988 872 17129 27049 -10852 -40789 -3465 42024 22367 -21383
665 -21383 -16991 10948 8985 -893 11449 7577 -21754 -12177 30419 15539 -36950 -14601 47089
678 47089 18336 -52328 -27710 37865 15903 -35454 -5914 30080 -17183 -51234 11824 53526
690 53526 -15931 -67715 -9543 36910 -3854 -24614 10399 -2567 -48363 -13400 47683 7737
702 7737 -61120 -27283 37088 13260 -34800 -12266 17448 -14268 -32954 8598 23648 -22524
714 -22524 -32411 15599 20058 -28358 -29979 14397 13956 -20187 -17517 4864 -2808 -12895 5828
727 5828 15190 -14415 -37178 -8677 31748 22688 -20720 -34072 -5525 20323 15634 -5238 -16239
740 -16239 -11449 -3290 3793 14701 13462 -13933 -27831 1439 24005 717 -17372 2190 10542
753 10542 -8223 -4606 15573 1308 -20776 4652 31557 -5349 -41214 3657 54198 13904
765 13904 -41428 -13502 26723 1890 -10833 29278 22089 -41623 -32518 45753 47928 -24804 -36057
778 -36057 14527 16798 -14467 5382 34664 -2963 -41060 303 41323 1077 -34096 5575
790 5575 31170 -9249 -26997 10619 20997 -9429 -9599 10486 -5715 -26275 5138 37607 6116
803 6116 -37966 -21325 19862 14911 -10718 -5085 4621 -13685 -18406 12872 26482 -5096 -32609
816 -32609 -16930 14696 19223 -4410 -19529 -6254 9609 3928 -6941 -5430 -2932 -3021 2858 5174
830 5174 -5374 -11276 2438 13218 -1285 -17576 -6267 11766 3317 -9037 4810 11143 -14482
843 -14482 -19967 17242 26850 -15607 -31550 7336 27165 553 -14619 1018 2598 -11899 -490
856 -490 21273 3354 -26906 -7862 26869 9196 -22180 -3933 19787 -4479 -23208 7758
868 7758 26794 -2900 -20927 4293 17585 -5895 -14896 9822 19737 -4352 -15300 3197 12155
881 12155 3207 5741 7730 -14014 -20990 14130 36243 3462 -28058 -8757 18927 8766 -8727
894 -8727 3179 14798 -6538 -22006 6347 31281 6976 -21696 -8179 11616 3727 -3785 5957
907 5957 7689 -3433 -4939 2183 801 -2876 4732 10244 -4824 -18120 -1785 19811 8995 -12258
921 -12258 -7869 3003 -4901 -7046 10441 14814 -5763 -18419 -4896 11307 9012 -2598 -5367
934 -5367 -2360 -2472 -605 7990 8935 -2863 -7337 -358 1283 -2213 2206 9541 4934 -8856 -12321
949 -12321 2301 15318 4937 -12413 -8432 4441 2260 -2087 5583 6186 -7561 -11840 209
962 209 7826 3387 -965 -1835 -5495 -4735 6437 10764 -6052 -17470 1091 15291 -2347 -15081
976 -15081 4020 13261 -8340 -15962 5005 10952 -7389 -12136 3484 7390 -4072 -6427 2097
989 2097 299 -6922 -1474 6392 -1479 -6200 5028 5858 -8591 -6206 11491 6863 -11409 -7493
1003 -7493 9140 7480 -3394 -1257 3495 -2169 -6279 1622 7727 513 -4323 1511 1471 -6411 -1048
1018 -1048 10727 3125 -11243 -6434 5922 5293 1982 2894 -447 -5474 -2403 2427 2982 4659 6124
1033 6124 -998 -9697 -3825 11837 13706 -3428 -12581 -1655 7159 3016 2801 7667 1234 -9141
1047 -9141 -5555 4898 8683 7680 1090 -8141 -5389 7688 12662 3833 -3855 -1365 2500 730
1061 730 1214 9813 11491 -1901 -10406 -328 9748 5966 866 745 -1585 -1832 2924 3874 748
1076 748 820 620 -3770 -4403 891 6657 5357 -1825 -6682 -3620 1455 2914 2535 792 -2959 -2951 945
1093 945 720 59 4271 2588 -7497 -8340 2910 9423 4112 -4684 -7179 -1971 3814 2121 -2541
1108 -2541 -1300 1754 25 -2958 -980 4153 5034 -3101 -9140 -83 10568 4312 -6407 -2178 6174
1123 6174 3650 -2197 -1820 2052 3309 1251 -1323 1138 5427 2499 -3623 -3957 2365 7153 3302
1138 3302 -5542 -5171 6095 8512 -1606 -4491 2403 3007 -2202 -39 5618 6149 773 -2780 -876
1153 -876 4510 5458 3072 1015 -992 -350 5931 8171 549 -2338 3828 4753 -2151 -1074 6722 9070
1169 9070 2529 -3319 -1726 4015 5485 3300 2085 1235 -894 1166 5688 4054 1172 3757 1794
1184 1794 -6221 -2869 10606 11414 -3017 -8762 1132 7819 624 -5418 2620 7955 -3380 -11126
1198 -11126 1567 11517 2741 -6731 -5098 -2504 -1076 3767 5053 -1798 -6262 -2054 1301 -947
1212 -947 -1286 3814 2563 -9110 -9555 8039 14013 -4817 -14549 163 8764 -1978 -6481 2234
1226 2234 4677 -2724 -3926 1893 1486 -4490 -2239 5464 1771 -7983 -3114 7546 2632 -6194 -397
1241 -397 4662 -4277 -7487 4410 10045 -877 -9190 -2640 5922 2846 -3293 -1502 1943 -1636 -1803
1256 -1803 4758 2307 -5399 -1682 6166 130 -7703 -178 8646 2463 -6361 -2110 6558 2959 -6329
1271 -6329 -1872 9250 4081 -8285 -2836 10971 6439 -6987 -5129 5507 6621 253 -2019 564
1285 564 2835 2787 4039 1969 -4856 -4833 6949 10691 -2270 -8007 2849 6551 -2380 -1917 7416 2395
1301 2395 -10366 -5474 11583 10610 -7284 -11207 3803 7299 -4101 -3747 5424 -425 -8428 2306
1315 2306 10100 -4829 -12934 3450 11976 -3905 -13550 -2 10427 -81 -8053 1020 4174
1328 4174 -7566 -6669 9218 8213 -9216 -9141 5694 5052 -3874 -1111 2641 -4329 -5248 5575 7054
1343 7054 -5961 -8908 5436 10585 -5523 -13748 2181 13292 900 -9193 -1440 3930 -1160
1356 -1160 -1999 3848 2345 -5422 -7121 1605 9051 4190 -6461 -7755 -242 3953 3215 1499 -3503
1371 -3503 -6609 534 8575 3002 -8700 -6906 5984 8822 -3619 -8642 2832 8151 -1598 -3984
1385 -3984 5582 1569 -9642 -813 14735 5390 -11766 -5245 9529 5492 -4079 1302 5646 -5075
1399 -5075 -7340 10543 14629 -8299 -14859 8796 15574 -7311 -11912 9336 12073 -6486 -6700 7306
1413 7306 4255 -6700 -292 9434 -127 -10876 -106 12029 1946 -7912 820 4707 -6935
1426 -6935 -4456 12635 7225 -14743 -10575 12837 12459 -8193 -12628 2920 9168 -633 -5069 1295
1440 1295 1981 -3416 -227 6662 304 -8050 -1947 7382 4640 -2099 -2477 -289 150 1295 3706 2740
1456 2740 -3533 -6855 2412 11674 2350 -11522 -4902 9228 5103 -6234 -3665 4121 1665 -3535
1470 -3535 941 4181 -3282 -7810 3367 9890 -3144 -10145 2898 8052 -4942 -6060 7357 2702
1484 2702 -11962 -4173 13566 5531 -14214 -7815 12011 7453 -11802 -8816 8620 6085 -7021
1497 -7021 -2832 5101 -2833 -5786 7426 7087 -9759 -9526 7991 9229 -5043 -4402 5791 982
1511 982 -9882 -307 14961 4224 -15535 -7121 13678 9313 -8592 -6077 5017 1399 -4203
1524 -4203 1772 4737 -2688 -4265 2653 3941 -4196 -5555 3657 5968 -3267 -6084 2343 3997 -3970
1539 -3970 -1799 5736 857 -8635 -3677 7224 6320 -2746 -6467 -1189 3106 1484 -103 621 -1409
1554 -1409 -3428 1169 4879 -810 -4439 1641 4224 -2646 -5382 2236 7323 916 -6364 -2053 5249
1569 5249 1904 -4416 266 6348 -1087 -7621 864 8620 2718 -4986 -3863 -7 1447 2916 2485
1584 2485 -2589 -5809 -945 5409 1998 -6395 -3850 4160 815 -5917 -44 5698 -2455 -8257 135
1599 135 5892 -1227 -6769 -1421 4526 932 -4746 -1701 2045 -1311 -2869 1825 1024 -4576 -1444
1614 -1444 5155 309 -6522 -1939 4046 597 -3954 -962 2499 285 -2625 -767 2416 276 -2887
1629 -2887 -938 1769 26 152 2000 -1333 -3598 989 3746 -1382 -3359 856 2715 -779 -3146
1644 -3146 -170 2959 1271 -3809 -4429 1375 4267 1307 -2683 -3455 -970 2219 1059 -1631 356
1659 356 1669 -2794 -3100 3648 5477 -892 -4412 -1848 1474 2916 3132 224 -2250 -849 1594 2140
1675 2140 232 -9 2112 1365 -3253 -951 6079 4449 -3812 -3272 2633 1835 -955 1688 2813 -689
1691 -689 -2005 890 1756 474 388 1315 -364 -3473 -938 5119 3145 -4322 -3940 2396 1469 -3059 -704
1708 -704 2348 110 -2353 -2023 -946 1181 1902 -1127 -4213 -2470 1215 2727 260 -2937 -1447 1146
1724 1146 -889 -2639 1380 3830 -1278 -4729 -1786 2664 3332 91 -4426 -3140 2615 2744 -961
1739 -961 -1014 971 -785 -2577 -470 2159 1776 -1213 -3655 -902 2877 1983 -663 -2121 -2447 -569
1755 -569 2969 1207 -2583 -962 1862 -1081 -3027 843 2861 -1070 -3573 -1024 2067 1728 -716
1770 -716 -1546 -798 -796 -265 1239 436 -2339 -422 2891 -488 -3853 1216 5039 -111 -4314 -521 3636
1787 3636 2455 -659 -1215 1021 793 -974 113 2544 1861 -322 -733 -1060 -196 4020 4005 -2891 -4836
1804 -4836 1563 4045 832 -1238 356 1150 -1655 -3450 1229 5526 1208 -5192 -3562 1811 2384
1819 2384 301 -446 -1933 -2614 -306 1233 545 453 -174 -2778 -3584 -1079 2693 3455 -1694 -6380 -2354
1836 -2354 3800 2128 -2198 -1818 -199 -1618 -1341 769 2124 265 -1474 -2325 -1112 807 1205 956
1852 956 -1104 -3346 -1286 3004 1435 -2939 -1268 2111 -736 -3702 -522 3384 1808 -2464 -4216
1867 -4216 -357 2942 483 -2005 -1140 -622 -1106 -99 737 -507 -540 -287 -2389 -2583 1755 3166 -1215
1884 -1215 -3908 -1950 2260 1846 -1977 -2514 1171 1677 -2820 -2255 3477 3270 -2293 -3900 -374 2707
1900 2707 2945 282 -2061 -1484 400 1452 2429 864 -2034 -1473 945 937 785 2541 427 -4143 -2871
1917 -2871 3274 4787 -223 -3645 -2222 1655 2739 73 -778 425 -1391 -2106 1216 1784 -753 -305
1933 -305 974 -1773 -2961 703 3270 245 -3223 -2316 1177 1012 -1391 -137 2969 -985 -6036 -1620
1949 -1620 5136 3205 -2649 -3461 -1155 244 1836 1570 -386 -1534 -1163 474 1282 681 602 1693 -825
1966 -825 -4237 -742 5014 2882 -2675 -2252 998 407 -1231 850 2881 592 -4391 -4398 2285 5551
1982 5551 870 -3856 -3094 -1485 693 4054 2939 -2751 -5324 -316 3416 2102 -1349 -2041 -423
1997 -423 -1088 -1736 1878 4239 -1548 -5455 -340 3903 -169 -2581 1159 2011 -1883 -2250 1287 2165
2013 2165 -325 -832 936 -722 -3386 1288 6766 879 -7324 -2246 6490 2523 -3727 174 3752
2028 3752 -1333 -3936 2388 5679 -377 -5880 -898 4402 1438 -2275 556 1294 -2617 -1016 3605
2043 3605 609 -4595 95 4847 -1015 -6159 186 6200 1491 -5761 -3257 2898 2379 -1751 663
2058 663 2617 -3220 -5159 2808 6604 -429 -5161 -1695 1089 1063 2566 2853 -2066 -5720 -1120 6294
2074 6294 5374 -3882 -4906 2260 3639 -1604 -747 3780 1224 -3845 -1867 3222 2427 -625 -645 1130
2090 1130 -549 -2680 141 4161 1075 -3188 -1150 856 -1900 -277 4798 1930 -7157 -6298 4590
2105 4590 7203 -1440 -6395 -1018 3034 -1109 -2993 2527 2999 -3922 -4565 2458 2824 -2039 -907 1952
2121 1952 -948 -3528 530 3955 -92 -2566 799 1966 -3474 -3666 4660 7027 -3748 -8912 772
2136 772 7426 1240 -3043 -56 -836 -3334 586 5703 2171 -4796 -3767 1997 2479 -552 343 1653
2152 1653 -2763 -4365 2765 6324 -1591 -5959 430 3553 -1122 -2879 1375 3103 -961 -3654 -980
2167 -980 2370 1730 -469 -554 -1369 -2056 1031 4124 769 -3119 -1461 1353 516 435 2023 1155 -2376
2184 -2376 -3304 1260 5320 2353 -4259 -3622 2550 3668 -442 -1336 1032 936 -1105 -920 963 1841 399
2201 399 -745 -568 -366 -713 1265 3431 -452 -3694 -630 1828 347 300 2713 -157 -5568 -2433
2217 -2433 4478 4952 -1757 -5149 -1552 2162 1044 458 1324 -1526 -4739 -822 4118 1651 -2109 -703
2233 -703 1 -2485 -1129 3698 3096 -2176 -4157 46 2672 724 -728 1111 698 -3130 -2316 2918
2249 2918 3531 119 -1573 -1862 -1411 1663 3867 1246 -2847 -2534 295 2081 1457 -485 -842 -171 -1223
2266 -1223 -998 1701 2228 -539 -2279 -1322 665 1613 564 -1084 -351 761 -1480 -1696 1849 2973
2282 2973 -595 -2649 -957 26 1156 2411 1143 -2377 -3060 403 3301 2048 -1342 -1145 307 -495
2298 -495 -445 3544 3369 -2799 -4081 1208 3726 741 -36 154 -1340 -1484 1846 3126 527 -2207 -747
2315 -747 1391 -97 -673 2925 2836 -3457 -4851 2337 4788 -106 -2597 -635 -136 -531 385 1885 691
2332 691 -2039 -2460 -376 1627 1602 855 -726 -3218 -2019 3118 3142 -1758 -2888 216 980 -688 82
2349 82 1586 1171 -1505 -3012 -336 2987 1966 -1138 -1595 -367 -228 740 1600 328 -813 -779 -721 -140
2367 -140 1953 2164 242 -2378 -2870 175 3641 2374 -1886 -2651 368 427 -134 1300 1814 -1010 -3045
2384 -3045 -1661 1727 3033 903 -2233 -2822 -1253 978 3035 1311 -2679 -2755 459 820 -209 1518
2400 1518 1897 -2198 -4301 -525 4023 3025 -1185 -3249 -734 1419 1401 810 639 -640 -1728 68
2416 68 1451 1164 1351 324 -2380 -2236 2071 3657 344 -1949 -993 929 730 -726 301 1996 340
2433 340 -2597 -1713 2060 1938 -44 -1252 -1820 -817 949 1445 -111 -973 -607 -485 -700 182 1325
2450 1325 970 -1365 -3293 -605 3064 2110 -1214 -2051 -918 -212 912 1549 107 -1010 -995 -922 450
2467 450 2395 1614 -1080 -2587 -1693 1851 3698 990 -2677 -1867 770 1131 740 1096 228 -1415 -1260
2484 -1260 -170 1673 2323 70 -2937 -2221 1079 2162 1246 -703 -1685 -924 331 358 770 1344 -482
2501 -482 -2978 -1598 1397 2005 662 -1531 -2505 -1046 1469 1363 -222 -543 -520 -990 -366 1081 1433
2518 1433 1050 -1216 -2317 -186 2062 1325 164 -510 -1158 -1060 923 1512 920 562 -519 -1286 -771 1822
2536 1822 2120 708 -1542 -2561 -109 2468 2173 -442 -1531 -1412 -788 918 2233 935 -1043 -1995
2552 -1995 -1621 517 2428 1332 -1212 -2448 -1786 857 2601 691 -1936 -1899 -429 -319 464 1900
2568 1900 1200 -1505 -2464 -599 1796 2489 -148 -1970 -940 158 534 1919 1350 -1459 -1819 443
2584 443 686 507 1428 742 -1710 -1967 917 2511 1356 -1396 -1754 722 1138 -217 397 1448 -230
2601 -230 -1985 -296 855 432 452 595 -1060 -2164 -15 2117 1259 -1372 -1907 -431 549 -448 189
2618 189 1988 -52 -3982 -1771 3100 2619 -857 -2154 -1553 -42 1335 1779 266 -929 -1793 -130
2634 -130 1858 650 -31 812 -291 -2849 -346 4255 2139 -2860 -2394 1354 1607 -158 96 1658
2650 1658 508 -2607 -2020 2171 3333 -215 -1756 -810 -943 372 3189 1323 -3005 -2638 1086 2077
2666 2077 -182 -560 711 -227 -2378 -1310 2729 2541 -2294 -3400 751 1881 -642 -551 1075 -284
2682 -284 -1605 -242 536 121 760 809 -408 -2168 -1138 2459 2891 -785 -3370 -151 2228 231 -381
2699 -381 1828 694 -2578 -1656 2252 3265 141 -2567 -1770 777 1648 709 556 -629 -1832 -63
2715 -63 1771 489 -834 617 646 -2398 -1814 2308 3036 -600 -3378 -1309 1835 1184 -1012 103 1140
2732 1140 -1930 -2721 1259 3065 -162 -2152 -1746 -462 716 2124 968 -1846 -2426 -92 2659 1269
2748 1269 -1625 -1231 998 273 -1440 979 2442 -402 -2286 223 1564 513 -261 92 452 -82
2764 -82 -956 74 1469 806 -550 -651 -681 -1369 1184 2948 144 -3412 -1675 1887 1554 26 -721
2781 -721 -861 -719 -956 358 2047 418 -2457 -1906 661 1211 126 192 -271 -1775 -455 921 602
2798 602 -57 -223 -206 -833 -472 401 2088 1134 -2076 -2641 479 2649 1059 -410 -750 -1260 -398 1366
2816 1366 1856 627 -1127 -1987 -339 2278 1720 -73 -559 -655 -862 938 2370 310 -1558 -819 542
2833 542 584 -340 -393 412 82 -1385 -1405 1426 1463 -693 -587 236 -1105 -885 1779 1459 -1005 -1833 -28
2852 -28 714 417 658 671 -402 -2146 -852 2816 2296 -1853 -2228 853 1207 -676 527 1398 -257 -1134
2870 -1134 26 1080 851 568 37 -404 -1210 -318 1792 1820 -1256 -2039 284 825 -368 692 1241 -840
2888 -840 -2325 -443 2077 2097 -254 -2452 -1804 976 1661 299 -521 -1162 -1600 116 1375 650 -464
2905 -464 -282 -608 -833 4 1015 995 -616 -2141 -659 2195 1295 -1200 -554 1319 -204 -1889 503
2922 503 2512 520 -1299 -844 248 725 896 641 -415 -1707 -522 1885 1424 -1246 -525 1421 -724
2939 -724 -2294 1399 3284 -487 -3263 -727 1790 720 -666 -267 377 -732 -1462 328 1615 276
2955 276 -795 -422 -1259 -1283 1741 2504 -1134 -3370 -78 2003 848 -451 142 -119 -1120 -924 1240
2972 1240 2253 337 -2434 -1264 963 1279 1154 327 -1258 -1023 857 1299 211 -23 312 -592 -736
2989 -736 144 893 1359 157 -1758 -922 1488 1671 -459 -603 -202 -104 -378 -216 640 797 -349 -1647
3007 -1647 -754 1154 888 -81 -554 -1335 -947 1033 1021 -734 -585 520 -401 -1039 86 1634 467 -1251
3025 -1251 -1691 356 1268 811 -813 -126 119 -840 369 1487 374 -431 -245 -685 -346 1694 1899 -595
3043 -595 -1754 -457 1374 1643 139 -665 -585 -68 -255 633 1505 113 -1583 -839 -387 658 1145 232
3061 232 -1700 -1237 368 760 491 -161 -806 -1037 -156 174 527 817 -415 -1536 -799 815 579 488 79
3080 79 -1191 -804 962 822 38 132 -201 -800 -338 561 895 442 -60 -894 -517 801 809 328 -38 -759
3100 -759 -747 665 800 300 304 3 -911 -459 798 1286 373 -723 -1360 -615 920 673 -441 -271 -518
3119 -518 -917 111 952 314 -632 -694 -841 -234 1070 1228 -663 -1298 -1001 363 1357 511 -867 -597 -33
3138 -33 -557 507 1476 611 -1319 -877 174 718 992 614 -1042 -1049 247 1073 1030 -106 -617 -247 476
3157 476 -449 -107 1543 732 -1658 -789 840 941 241 -85 -600 -205 260 72 140 339 -205 -522 -360
3176 -360 -197 588 771 -71 -1773 -826 1204 713 -641 -414 91 -291 -503 -11 656 789 -269 -1643
3194 -1643 -295 1083 742 -139 -535 -807 -489 1097 635 -226 -293 281 -674 -530 745 1237 764 -1108
3212 -1108 -1691 503 2391 753 -1136 -294 -77 -347 460 1092 195 -595 -778 -358 654 1301 716 -744
3230 -744 -1039 -717 1243 1393 -727 -1838 652 805 -871 -752 1051 695 -1562 -1195 188 1023 528
3247 528 -420 -899 183 168 71 457 303 -654 195 300 -605 168 1715 238 -1872 -906 1345 1125 -125
3266 -125 -700 -36 289 56 -208 558 1254 -292 -1334 -161 588 493 797 -68 -962 -399 818 659 -60
3285 -60 -147 -21 -175 -365 -190 1032 844 -1088 -2121 263 1690 386 -971 -756 -645 -280 760 488
3303 488 -271 -677 -458 -350 604 828 -14 -196 -704 -819 743 1438 -431 -1302 -348 958 75 95 639
3322 639 490 -233 -555 -331 862 1042 -370 -485 51 -213 176 1013 181 -742 -174 408 -6 268 524
3341 524 -274 -824 -542 119 531 385 -741 -832 65 51 -309 64 287 -353 -660 -354 -224 270 359 -363 -744
3362 -744 -493 -78 444 1015 -228 -1096 -328 469 361 254 390 -292 -1054 41 1137 1075 81 -970 -831
3381 -831 400 1207 668 175 -273 -1006 -168 1102 402 -558 -47 -101 -524 74 766 320 -288 -912 -735 300
3401 300 835 -167 -420 -13 -246 -498 191 787 -104 -464 -633 -617 347 628 248 -579 -846 -239 506 721
3421 721 -487 -859 397 531 -524 -54 967 627 -436 -545 11 557 464 -318 -26 302 -307 -400 569
3440 569 636 -87 -38 -35 -567 419 1372 381 -1429 -999 681 1128 338 -960 -607 266 125 -245 459 772
3460 772 -1035 -1356 224 797 119 -267 -587 -703 -30 772 276 -409 -667 -253 415 -64 -688 291 1112
3479 1112 -876 -1667 434 1821 -122 -1114 -52 417 59 -104 97 357 -208 -678 91 707 471 87
3497 87 104 -417 -848 851 1475 -552 -1048 373 962 -87 -870 15 915 -49 -1027 -369 1038 681 -361
3516 -361 -255 117 -556 -246 626 39 -403 -238 -253 -565 36 1043 304 -968 -1135 -120 1542 638 -1283
3535 -1283 -894 814 312 -318 574 338 -340 -791 -287 541 710 -9 -518 -231 5 322 493 314 -574
3554 -574 -583 422 589 -459 223 1100 -271 -1057 -373 1272 575 -736 -1168 301 764 -167 -201 110 -258
3573 -258 -855 225 775 -218 -618 168 -409 -497 228 790 -32 -734 -354 533 109 -334 -327 607 399 -1017
3593 -1017 -343 736 257 -180 219 34 -516 174 718 398 -488 85 368 152 342 329 296 -34 -580 -9
3613 -9 1108 711 -570 -229 96 63 359 493 -428 -524 44 132 28 461 225 -557 -403 -75 113 317 -23
3634 -23 -826 -500 -12 32 342 -25 -407 -357 58 -40 -122 491 -82 -913 -298 740 324 -169 -151 -152 -248 428 203
3657 203 -15 -174 -111 102 247 100 -265 299 494 -509 -250 512 378 -290 96 75 -153 -103 284 -343 15
3678 15 185 -291 -330 -1 331 -173 -241 -618 -236 532 274 -572 -420 93 -381 -182 15 -49 248 -57 -498
3699 -498 -457 580 671 -595 -728 -118 373 419 140 -161 -83 -147 -237 171 751 192 -220 -240 -23 136 1198
3720 1198 420 -1111 -173 843 417 -331 -6 387 85 -167 -179 535 480 -466 -899 108 410 192 -89
3739 -89 -227 -484 -15 657 161 -423 -81 152 -522 -706 -65 560 277 -544 -764 94 573 -162 -728 218
3759 218 487 -450 -488 170 426 424 -30 -384 -366 456 438 -38 94 -289 254 508 -110 -326 625 343 -650 -560
3781 -560 844 856 -329 -376 -292 287 551 -171 -380 115 -79 -276 298 108 -62 -110 -71 -588 4 769 257
3802 257 -886 -535 522 437 -200 -509 -106 -24 -278 -298 196 423 -114 -642 -30 105 -59 437 -374 -527
3822 -527 186 641 17 -582 -130 140 191 48 -182 394 391 -288 -644 406 626 -130 -237 199 231 305 110
3843 110 -204 7 315 89 -131 -20 88 82 324 -313 -592 89 421 -234 -397 185 -50 -665 -140 156 302
3864 302 -258 -432 -277 332 430 -191 171 -310 -411 50 843 224 -284 43 24 17 118 566 48 -265 -320 52
3886 52 444 239 -115 -279 80 -23 -94 494 37 -492 -113 462 -179 13 535 -173 -382 138 443 210 72
3907 72 -437 -439 291 47 -219 -16 -21 -90 -17 -20 -229 -106 224 44 -482 113 -2 -248 -328 74 -265 76 -23 -246
3931 -246 -117 275 116 -123 -109 155 345 93 -238 -420 -156 513 -106 -108 284 -206 -142 113 8 61 110 67
3953 67 -556 261 687 250 -338 -321 -14 288 411 -347 9 19 -119 -496 50 250 -135 -211 -352 -312 440 410
3975 410 -514 -312 130 172 72 94 64 -451 -101 95 -138 -72 192 -321 -576 109 467 199 -159 -662 59
3996 59 797 270 -610 -86 259 -113 -356 214 -96 14 177 109 -209 194 351 -18 -11 -152 46 217 -92
4017 -92 -467 347 562 -511 -857 271 782 -313 -702 -18 149 251 61 -431 72 158 -457 -401 33 -213
4037 -213 21 16 -207 -348 326 633 -365 -436 177 49 -422 -11 298 187 -9 -502 -12 717 485 -382 -380 118
4059 118 8 488 496 -9 -413 138 395 12 -110 -72 76 -227 -234 284 617 -14 -918 -137 802 265 -605 200
4081 200 143 -163 -195 -51 -199 -122 48 -45 -151 149 -98 144 11 -538 -103 646 -346 -577 297 441 -385
4102 -385 -511 60 574 117 -32 -134 354 243 -125 -72 282 -62 -330 198 327 -172 77 485 -270 -338 238
4123 238 569 -46 -417 -333 272 248 19 150 263 -172 -651 146 470 10 -455 -160 -264 -56 273 202 -430
4144 -430 -439 88 48 368 43 -499 -298 107 -157 -10 420 -19 -483 -6 449 8 73 225 -22 226 30
4165 30 -62 273 176 -277 -125 276 -293 -159 516 390 -561 -259 320 239 -159 -97 -354 54 167 -28 -159 161
4187 161 -72 -270 -1 -25 -253 -125 345 -529 -253 85 17 -331 -124 -6 -73 -139 -428 -140 479 -258 -573
4208 -573 -123 514 109 10 -168 -412 -240 564 401 -70 35 102 -311 180 398 139 51 -244 -499 429 795
4229 795 68 -369 -52 143 337 -15 99 32 -97 33 -188 -31 226 60 -379 -70 58 129 76 -69 -498
4250 -498 162 420 -94 -132 31 -339 -264 22 -229 118 425 -20 -543 450 506 -149 -262 95 127 -100 -24 -417
4272 -417 28 470 143 -492 31 243 98 141 75 -391 -128 325 -72 -159 467 184 -306 -428 488 626 401
4293 401 -345 -643 379 520 -150 -114 173 -233 -407 134 205 -262 72 -8 -658 33 560 -277 -335 -162 2
4314 2 158 270 -333 -393 297 -117 -320 8 438 -79 -199 -270 27 250 150 -338 -6 247 -87 -55 269 -75
4336 -75 -297 330 228 -153 127 312 -70 -481 -18 608 256 46 -157 70 269 158 -302 397 517 -85
4356 -85 -87 219 -107 -264 283 -3 -273 -17 294 178 31 -83 267 -213 -276 -221 338 401 -366 -528 149 364
4378 364 -388 -140 49 -260 -77 311 141 242 -189 -74 -242 110 221 182 174 -157 -350 563 629 -205 -358
4399 -358 75 139 -264 528 184 -227 -266 -161 -274 395 212 -282 -317 6 -269 158 500 -235 -331 168 -65
4420 -65 -126 75 -48 -313 66 -299 -305 7 228 -403 -242 334 -99 -100 259 78 -416 -161 173 -191 55 162
4442 162 161 -330 -281 -43 -41 448 -218 -385 20 25 -329 287 105 -191 -71 165 138 114 237 -123 -348 52 364
4465 364 150 61 -264 -446 259 323 -22 -80 26 -259 -274 123 356 168 -101 -376 -458 236 408 -106 -275 -117
4487 -117 -256 -142 -104 94 -20 137 -387 -143 313 347 -194 -103 -66 -19 61 250 -248 -245 354 -273 -100 158 -153
4510 -153 181 44 -40 -105 242 274 -223 -114 189 314 43 58 104 -45 192 -37 -59 396 273 -139 -536 83
4532 83 96 200 85 -271 -303 63 8 -321 77 248 -233 -397 -66 269 230 61 -419 -401 58 220 -37 -11
4554 -11 -323 -342 214 196 -114 216 167 -330 -331 473 766 208 -159 -422 158 190 137 -59 93 -7 -445 53 174
4577 174 19 67 51 -432 -188 423 427 -555 -353 254 -46 261 8 11 178 4 -504 -40 530 -6 -609 -249
4599 -249 -55 -201 -38 -14 -414 -146 -51 -51 -317 374 145 -118 -176 -298 -161 339 -16 -488 -123 250 90 -110
4621 -110 517 340 -362 -381 52 169 274 -150 -268 -94 279 170 460 280 -271 -328 306 173 -115 71 -11
4642 -11 -319 -163 -55 421 152 -127 -281 -93 163 104 184 196 -268 -585 13 339 -3 76 -192 -285 -56 1
4664 1 282 -125 -565 -167 -171 372 66 -52 138 -81 -253 119 203 -145 127 97 -131 38 405 238 45 -143
4686 -143 298 -188 170 217 -166 137 75 -265 5 482 406 -176 -232 -111 -26 172 200 -138 -114 -126 -76 355 435
4709 435 129 -209 24 -409 -177 322 339 -485 -482 27 34 -46 108 -153 -356 -69 -166 -29 372 84 -297 -113
4731 -113 100 147 560 321 -244 -401 357 179 109 61 -186 -122 38 235 122 248 -75 -497 41 437 127
4752 127 44 -92 -445 -77 405 121 -64 108 -189 -77 -41 160 -28 110 -30 -415 -90 164 165 -135 140
4773 140 42 -226 -111 345 -14 106 -289 -314 70 468 182 -338 12 73 156 520 229 -117 93 -4 -141 -34
4795 -34 238 124 -416 -296 -238 403 771 268 -371 23 35 -106 -2 492 31 -327 44 24 191 444 -232
4816 -232 -391 -197 160 -10 88 86 -469 -93 -22 -8 -12 223 -276 -314 -245 139 161 91 -233 -250 100 451 -174 -255
4840 -255 -96 0 -169 93 281 296 349 -43 -407 -56 477 222 -94 -210 -85 -9 369 -356 -258 278 -89 -483
4862 -483 84 465 -24 137 -51 -380 350 363 110 -84 -69 -4 -182 135 224 -197 -146 159 -252 -55 507 177
4884 177 -496 -447 -94 249 305 92 90 -143 -306 -116 724 310 -222 -319 -71 175 145 288 -2 -353 -189 146
4906 146 294 58 116 -177 -155 12 -20 261 458 -106 -153 -32 59 -222 7 -90 -265 -146 108 -67 48 107
4928 107 -349 -341 128 -16 -13 60 -261 -611 290 39 -187 -270 -15 -164 -317 91 172 -141 -139 -237 -452 43 393
4951 393 16 175 -202 -489 32 361 12 -157 291 -1 -377 156 71 136 5 -157 -70 181 432 -173 24
4972 24 -46 -45 34 488 98 -124 -38 -29 -150 180 275 215 -34 -270 -148 194 162 45 -276 102 -19 -96 364 28
4996 28 -357 -125 -9 -130 -6 285 -160 -233 -205 168 65 284 -10 -224 256 205 -306 116 362 -107 -280
5017 -280 63 -7 214 198 -160 -50 -58 -47 -187 63 74 60 -157 194 -22 119 423 -214 -380 185 333 32
5039 32 -65 -93 -204 40 258 -20 29 -5 -204 -257 290 331 156 -77 -377 -146 363 260 30 -191 -385 8
5061 8 -89 193 48 21 -1 -187 -235 271 269 11 -347 -73 130 234 161 -108 -128 -38 83 98 288 327 -89 26
5085 26 -235 105 389 15 -112 -112 5 169 -217 89 255 -103 -92 6 -255 285 250 -341 -232 172 113 -125
5107 -125 -36 -113 -158 104 -21 -87 194 -23 -251 -340 14 -50 231 50 -351 -129 357 222 101 269 -75 -211
5129 -211 -113 285 204 129 -70 -347 -201 433 263 92 292 134 -281 307 179 131 199 -8 22 85 239 85
5151 85 -53 -129 -506 -9 194 247 -199 -95 100 -93 20 96 -59 -63 -228 127 -153 305 190 -187 -20 -13 -185
5174 -185 164 175 -89 128 -62 28 -90 425 90 -165 -87 257 201 216 161 -105 -45 216 -164 150 407 -248
5196 -248 -95 -1 -79 -15 123 42 -277 -102 142 189 229 143 108 -53 54 168 235 409 -430 -419 -117 171 51
5219 51 69 47 -44 -382 189 73 115 -22 -133 -380 64 186 -257 38 -110 -396 -88 370 214 -337 -192 -101
5241 -101 -203 208 109 -147 -9 -97 157 327 -3 -59 88 54 -177 139 530 148 -443 -68 248 -64 77
5262 77 338 229 -180 -230 -88 122 42 -135 -46 37 -107 -68 413 84 -232 -88 165 109 -182 235 -223 71
5284 71 -237 -177 -20 374 111 -511 -35 -21 389 194 39 26 -116 -39 219 108 342 220 -253 167 172 367
5306 367 412 174 -444 -103 346 286 -86 -104 146 -260 89 96 81 -2 -97 -100 -83 258 100 6 -30 -242 98 -103
5330 -103 2 -211 -44 -42 -243 63 231 106 -277 -180 -318 -176 270 201 72 243 75 -223 76 190 78
5351 78 161 -236 -268 43 233 356 -201 81 1 190 129 -10 181 -13 -5 -315 -48 230 175 80 -301 -44 23
5374 23 118 46 -192 49 238 -107 181 338 -24 -155 -152 -25 26 180 -98 -365 -142 192 70 110 -62 -88 -125
5397 -125 201 -211 165 108 6 -494 -41 -5 171 -25 -244 -384 -71 -73 -51 171 77 -258 -96 126 205 168 33
5420 33 11 -298 -32 277 -2 125 149 84 72 217 -118 -75 304 -314 -114 209 175 -116 -201 127 19 -55 99
5443 99 118 -232 -94 -121 -130 135 315 58 91 -139 -237 173 405 16 -125 172 -118 -64 283 167 -240 -90 -76
5466 -76 -45 368 95 134 -164 17 7 80 246 -98 -382 176 308 -123 288 142 -165 -209 -108 10 164 -78
5488 -78 -76 1 91 -88 -135 266 105 -119 66 271 -4 -40 164 -40 -19 -114 -104 45 59 -290 -197 -7 -57 -234
5512 -234 122 166 -211 -327 342 -2 -220 277 -134 -124 -99 -11 25 110 -215 -83 223 140 204 -58 57 -227 -143
5535 -143 252 179 177 -42 -277 -27 151 303 249 -31 -276 -14 61 35 -47 -22 164 -177 -206 221 231 -136 -196 55
5559 55 -133 217 23 -176 -32 -128 -134 -101 111 -35 -126 -50 -212 -220 264 36 -285 -476 -43 189 97 130 77 -238
5583 -238 -14 -64 -93 142 167 28 -306 -26 -138 3 -197 -132 -102 -7 -8 0 294 25 73 -110 18 14 -19 36 -242
5608 -242 -85 230 104 -28 98 -107 -169 -124 167 -301 -39 47 -242 48 139 66 -18 162 -358 -45 183 392
5630 392 -61 -47 115 -251 -47 134 324 -127 2 -147 71 243 329 -107 -237 -80 -38 -83 443 112 -190
5651 -190 -80 -94 284 249 228 -187 -250 112 41 111 -55 -139 -137 239 -40 -406 -4 64 -73 -146 -127 206 30 280
5675 280 -98 -376 191 -102 -42 122 234 42 -315 40 -14 -12 54 -140 -106 93 103 -1 -176 -248 -45 -64 187
5698 187 136 175 302 -98 71 178 22 355 230 -109 0 21 179 17 -69 -365 -180 21 -17 96 48 8
5720 8 -121 -160 84 -52 17 -124 -159 -250 73 149 159 -79 -287 -141 -32 223 -319 -139 -10 -107 47 250 99
5743 99 -76 -88 179 57 46 -7 -143 -213 32 -119 -32 32 -19 -78 31 -48 -26 176 220 80 -78 -252 108 62
5767 62 194 -42 -125 -19 -125 104 435 -9 -336 -249 17 -8 73 -126 -23 -112 317 321 44 127 -227 7 57
5790 57 25 -108 -82 -81 -114 -100 410 24 -3 73 337 -238 145 304 45 -155 1 -208 -88 95 102 62 91 -101
5814 -101 -314 99 147 -332 76 13 -236 89 227 -91 43 -106 -74 11 268 247 -238 -69 183 -30 23 178
5836 178 -223 157 -132 -22 -155 54 64 -54 -56 -19 -46 52 88 -280 99 -23 -112 -22 79 -68 -330 -121 -135
5859 -135 -172 140 105 -188 -10 -108 -116 57 94 -97 -154 104 -159 -291 197 -252 -221 -13 37 241 -143 -284 -335
5882 -335 -97 86 257 59 275 -66 34 29 13 -20 -13 11 -397 -22 219 -195 -165 178 -115 -42 -16 -275 81
5905 81 129 -6 -174 52 304 21 -251 -73 18 1 17 -50 99 84 95 60 -21 30 -86 -110 88 187 -113 192
5929 192 132 -231 -14 -195 -111 124 78 -13 129 164 -431 9 153 -166 200 54 -191 -55 132 338 -49 164
5951 164 -193 -13 140 276 -284 -214 -133 -97 67 174 -61 -302 -60 -97 237 -215 123 -211 -79 52 -246
5972 -246 54 48 -199 -252 -2 197 211 81 172 20 40 33 -198 198 153 -25 224 -99 -100 -105 -169 -45 -49 -113 54 -188
5998 -188 49 50 -39 95 287 -175 -61 80 -248 -264 -109 -82 35 24 -121 -95 39 70 69 -58 129 38 -104 162
6022 162 -111 -73 10 -152 -150 -139 98 132 72 163 -53 87 288 -20 -48 115 250 -192 47 116 46 -371 24 -73
6046 -73 133 -222 36 -106 78 202 -79 363 222 -231 -21 89 -106 160 -65 -117 -32 -122 -223 -21 -7 -177
6068 -177 -100 7 169 -155 24 2 14 -49 12 -10 81 95 -198 -241 -120 -107 136 217 29 -223 51 50 -118 -171 301
6093 301 22 -191 -70 70 221 22 -63 -84 48 14 2 -12 30 77 -59 287 -39 138 144 -43 -260 19 301
6116 301 -79 -113 98 36 -59 137 67 242 171 17 -191 128 91 -142 -257 66 85 108 130 -51 -287 -64 87
6139 87 -165 136 90 -199 -227 70 -4 77 -31 -158 -143 262 170 8 -100 -109 66 0 121 7 253 19 173
6162 173 -1 64 238 17 -50 -109 -239 309 1 -239 -28 260 -156 -59 -62 -247 -2 -10 85 -121 368 147 70
6185 70 -116 -4 -223 -157 13 -70 -183 -4 -134 -287 1 44 30 -185 292 -109 67 135 -92 -61 156 -194
6207 -194 -45 226 56 -119 65 -88 -69 91 -33 -19 -127 -48 116 143 -97 170 -63 50 -13 182 104 132
6229 132 -134 -155 177 219 -180 30 -171 189 25 235 -60 104 98 -212 39 52 -155 -123 354 22 -13 170
6251 170 5 -67 148 -171 29 -24 3 28 23 -47 -212 -347 159 -145 64 114 -3 8 30 240 108 75 -214 42
6275 42 98 301 61 -9 69 16 13 -68 11 -142 51 -120 95 -103 125 -111 -198 -25 -90 -84 -19 196 6 89 -29
6300 -29 -43 393 349 -144 -1 -123 28 67 138 -274 -129 -14 93 -150 313 227 29 97 197 -167 122 -103
6322 -103 -141 -166 -20 -70 -190 -123 -122 -104 207 205 -80 -170 54 -94 -36 91 -4 7 134 375 -152 -12 346 45
6346 45 27 -40 1 -30 157 -181 11 9 -54 -27 268 137 108 -29 61 -68 -135 57 83 95 -96 -199 8 222 50
6371 50 79 -187 74 -80 -33 230 -36 -201 200 15 9 307 121 55 136 -3 47 65 -63 81 237 229 -196 -55
6395 -55 67 207 -12 84 168 -111 234 188 -218 206 6 200 178 -55 -45 -160 136 -192 -268 14 -57 -252 -278
6418 -278 233 38 -64 -190 107 -20 -182 10 -72 406 109 -126 91 16 185 0 108 -71 2 171 38
6439 38 22 362 105 -107 85 67 -162 94 158 -326 56 177 -96 -31 -141 195 -1 -159 239 -109 -40 2
6461 2 -62 -214 190 -36 21 -268 -8 23 55 -64 -114 232 -273 103 133 223 -315 53 -116 -36 -33 343 3 -39
6485 -39 214 -54 -197 -108 -8 44 -25 104 81 114 33 -46 128 108 195 127 175 -310 64 185 -3 17 -160 185
6509 185 -122 -101 226 -29 5 144 62 -94 45 0 67 -165 -194 -26 -93 65 154 -34 200 -33 -14 33 -15 50
6533 50 -71 -20 -52 105 260 22 14 -34 -64 -103 212 -49 -56 262 -60 -136 -72 63 -104 9 183 -1 -158 129
6557 129 -26 -114 -41 85 -67 258 94 -124 44 -2 -17 -73 -46 -205 46 56 -51 35 130 139 -188 59 92 -197
6581 -197 58 -49 93 99 259 -218 49 20 -173 -210 121 174 -11 28 126 -273 -101 -94 -171 -82 -28 58 -215 8
6605 8 -174 -24 -104 -207 -83 53 70 41 30 137 -89 -299 53 46 -134 193 77 32 -112 -170 -4 76 -49 73
6629 73 -16 306 -163 -100 -115 -152 -85 216 -178 -100 -83 -35 -117 149 63 56 -193 -31 7 -156 -19 45 -94 40 94
6654 94 0 243 -20 26 -55 136 44 -62 -8 22 -76 -43 -153 7 375 306 132 25 191 -200 -53 50 -90
6677 -90 51 -103 57 -140 -64 -189 -244 -154 5 -80 156 23 -62 82 -12 81 -128 77 -102 -294 -209 -155 28
6700 28 113 -44 -126 -128 -18 -91 -37 -231 110 -217 221 41 -62 147 215 -95 -40 130 54 109 -175 -4 -67 34
6724 34 -217 -136 105 -123 78 113 188 -69 181 -101 8 -41 261 -135 5 129 -89 79 -103 -72 -182 -103
6746 -103 -1 -10 -98 101 -115 12 310 139 -144 -176 -68 -304 -140 -44 -30 -84 91 69 104 -97 200 -21 50
6769 50 29 -113 130 35 75 -102 -25 26 151 95 -137 -59 116 109 -105 147 -21 169 126 204 -55 116 -48 -163
6793 -163 18 -184 83 -198 -12 86 319 123 90 19 -67 125 75 31 54 -77 -10 24 15 -239 -37 -99 -304 259
6817 259 324 25 -100 -51 -231 70 -42 138 49 153 -185 -135 -4 33 281 270 -103 156 -60 186 0 56
6839 56 165 -130 -17 152 248 -69 143 -75 -137 -8 121 127 97 -85 -51 29 177 47 183 166 0 -222 142
6862 142 -88 -57 -83 86 31 -51 -67 70 -126 -152 -117 67 162 -151 -172 -18 -19 257 16 -172 -119 -134 -16 123
6886 123 216 157 130 -137 -157 -70 -42 128 142 39 -138 301 -27 6 16 125 -220 -49 86 124 191 17 -329 50
6910 50 66 27 23 105 62 95 16 30 -66 160 278 -391 -6 128 68 -129 -140 54 221 326 -181 -21 212 -74
6934 -74 -5 88 -45 226 -191 1 -79 50 57 79 11 111 -75 78 -97 168 40 -89 105 -65 16 -48 210
6957 210 -44 -188 -226 -72 -20 -141 -127 -75 -25 153 36 151 -204 -10 276 282 39 85 134 -64 -11 22 38 14
6981 14 -99 9 167 8 -44 -58 -100 -189 -119 37 158 144 -151 3 -115 78 379 -133 168 128 98 144 -49
7004 -49 156 52 -197 -83 -172 -32 290 159 -22 -44 -23 -173 -61 47 62 -117 60 -47 107 -132 -5 -10
7026 -10 47 -41 -45 36 -33 -30 75 -139 60 -37 54 102 89 198 48 44 -32 -207 -166 136 -13 -146 -167 247 -149 -163
7052 -163 -31 -89 64 -190 200 100 78 60 -52 191 166 -87 -37 94 -4 120 -93 -36 158 125 59 13 148
7075 148 114 3 -41 -11 -156 25 -211 -1 -107 5 141 -112 44 -170 45 178 48 -101 -123 -115 82 -19
7097 -19 58 -86 -109 90 150 -31 109 -86 -217 -164 -223 30 -26 161 211 -85 183 -15 -37 8 -101 -173 53 -22
7121 -22 19 253 226 15 113 279 -5 123 -32 -70 40 -18 100 63 42 77 -246 -10 -183 57 20 1 -58 -59 471
7146 471 -151 5 61 -39 53 -24 -13 12 -13 118 -112 -250 72 35 119 112 -75 143 -208 217 13 -122 -63 -103
7170 -103 -279 -210 -153 54 227 124 -94 119 42 118 -84 -39 129 176 166 145 59 -121 223 232 -103 -110 -7 -5 -126
7195 -126 -280 -161 208 16 29 54 -220 -136 -18 36 -27 112 -99 71 259 234 -246 -163 184 -106 108 124 76
7218 76 -81 -118 -85 -27 -94 164 55 -70 -10 26 116 -113 -66 -3 18 114 20 -7 -116 41 -46 104 6 -38 -119 -155
7244 -155 201 244 136 -66 -83 66 -140 281 52 61 -49 104 5 67 -202 -185 -62 -245 -126 -221 -46 201 0
7267 0 104 103 -71 22 115 -296 -144 -238 -254 -170 12 253 -165 175 16 -236 236 153 -100 176 -95 -171 216 153
7291 153 75 -171 30 242 -36 314 116 0 -31 -33 -88 -80 16 -105 -5 130 -299 -207 0 12 12 108 16 60 110
7316 110 12 -56 -37 -244 113 79 -2 -238 -170 4 113 -237 28 -131 25 201 150 -29 -296 2 174 -176
7338 -176 -54 248 243 -67 -33 161 -145 137 -5 112 35 -241 33 -83 59 -229 122 -90 -162 136 192 -236
7360 -236 70 51 20 74 133 13 -141 317 -51 -117 -17 -55 -245 96 1 -22 68 103 117 98 5 -110 47 60 -90
7385 -90 -80 321 -37 65 -9 127 -48 -193 -62 122 70 24 92 -130 36 -144 -143 71 -65 -45 29 27 92 -24
7409 -24 186 -22 -97 -23 -146 25 12 126 -172 130 45 -100 -29 -147 -102 91 222 -306 -113 91 124 -176 -66
7432 -66 -8 59 113 -220 26 -70 21 -29 -151 -23 341 -299 -168 171 -72 -26 146 -229 -74 -19 33 -111 107
7455 107 57 49 -145 -185 -133 -139 79 -187 95 -228 273 -33 1 -72 197 159 -84 10 -25 -200 -204 -84 -43 104 44
7480 44 -175 -164 25 142 -305 -41 -103 -156 54 -49 121 -57 -26 35 -173 -55 -20 38 -52 -86 -42 -125 -221 -51
7504 -51 -145 135 -39 161 -58 -24 42 -90 311 -56 -168 -81 -37 -86 55 74 145 126 154 -144 -25 102 -76 -228
7528 -228 105 12 -24 -124 -152 144 41 -35 210 -82 -21 244 -81 37 14 -79 84 -92 64 174 -87 -127 186
7551 186 170 -64 96 90 -178 -158 -37 120 24 -20 25 -127 -1 24 -83 255 -180 -85 83 120 -61 45 214
7574 214 49 34 -435 219 -129 -78 77 50 91 15 131 -37 122 148 -140 -50 -46 -73 -238 -323 -31 -153 -62 -196
7598 -196 85 3 -108 -9 -237 153 -155 -113 90 -163 171 131 173 -268 -184 3 0 99 159 -164 180 -28 -24 250
7622 250 122 -192 105 -58 55 147 201 14 -99 78 -135 100 134 55 111 -9 -169 -29 108 215 61 -134
7644 -134 19 52 63 35 -11 75 214 31 -150 -166 -100 161 -233 58 -89 -181 244 -108 -24 63 -44 -162 -3
7667 -3 125 -16 -17 -29 -34 -345 -2 -66 -236 -30 -135 239 41 -23 -80 114 -10 251 70 17 159 -122 181 57
7691 57 -80 29 131 -60 284 122 -8 6 -94 62 -4 0 -75 -175 -91 47 -70 133 159 -273 87 -172 -47
7714 -47 -82 68 -268 -135 -139 2 155 281 -114 -196 158 140 -161 -8 50 -186 -85 -117 -126 206 256 14 -27 -137
7738 -137 -111 67 134 -295 -116 184 147 5 -77 31 -47 -172 162 3 71 -159 -32 -9 94 -168 -103 -49 -104
7761 -104 164 -151 -288 -21 107 92 -20 134 -157 123 -76 -168 -72 145 -3 38 -3 -81 60 58 43 -71 225
7784 225 -73 -27 -33 -138 342 21 -88 -12 89 -116 79 -147 160 32 -213 -104 209 262 94 -269 -50 -102
7806 -102 -373 -89 84 -43 -91 0 -54 -175 -148 -83 17 -237 -52 -41 -182 48 8 -1 -13 -54 -71 -58 103 99 -13
7831 -13 -129 -169 22 -122 129 -217 -178 -117 113 100 -68 10 -80 113 -96 88 62 30 -56 152 41 -253 -73
7854 -73 265 188 19 -24 -114 -169 118 90 45 102 102 -41 -160 131 58 -76 -75 -152 -36 -20 7 31 -256 -44 -127 -172
7880 -172 -147 -91 32 -6 -162 129 -311 67 111 45 47 -49 -61 -11 149 -108 -151 -17 104 126 -108 154 -39 109
7904 109 25 -235 -17 -27 208 -25 -296 15 118 -145 63 151 -189 37 139 -38 -94 229 -41 -401 -100
7925 -100 94 225 -52 142 89 -187 -96 -214 -158 222 -119 52 -61 165 -14 154 95 -338 36 -42 -208 -186
7947 -186 126 8 -128 -73 68 -80 10 -61 -251 113 -35 181 -29 -118 25 -84 151 -46 -79 -220 -23 36
7969 36 176 206 6 -116 -150 204 -91 41 22 73 17 -133 -246 -71 103 -134 -236 41 4 118 -30 48 49
7992 49 52 -150 -35 11 8 107 -19 -55 -1 30 -48 -31 -119 -90 -64 -150 280 229 -269 -54 -103 -89 258 -48 -58 -132 140
8019 140 22 -55 137 -46 54 163 -38 -84 -9 159 -117 248 91 -356 89 -201 -30 -103 -86 223 -145 -60
8041 -60 -98 38 13 -102 53 81 -10 -140 59 124 -34 -186 -33 27 26 -25 -64 -144 -130 138 96 25 116 -117 43
8066 43 -217 39 -9 -132 49 40 -109 -16 159 -129 -162 150 -202 -15 -224 -70 112 -63 146 -146 153 -71
8088 -71 -4 281 19 141 -126 -122 205 84 -53 -54 12 313 19 -90 -56 234 107 173 -375 -2 -30 24 26 -103
8112 -103 -281 -21 117 -94 -154 53 110 92 206 96 -243 -156 47 -122 98 -36 -102 -72 13 202 212 77 -83
8135 -83 -111 143 -60 250 -192 13 89 116 61 70 -62 -189 -13 -26 89 -182 25 -94 -209 -39 -34 -11 -66 -290
8159 -290 -59 208 -138 -162 -5 -236 -94 -201 -189 174 -12 -241 -79 106 72 -298 98 -73 -55 93 33 -6
8181 -6 118 287 -9 -180 -123 -322 -38 65 -102 141
8191A41
##END NTUPLES=NMR FID
##END=
