##TITLE=1H_Ser 3511-Val
 CDCl3, 8 sc, 
 3.7.2019
##JCAMPDX= 6.0         $$ Bruker NMR JCAMP-DX V2.0
##DATA TYPE= NMR FID
##DATA CLASS= NTUPLES
##ORIGIN= UXNMR, Bruker Analytische Messtechnik GmbH
##OWNER= root
$$ XWIN-NMR		Version 3.5
$$ Wed Jul  3 14:41:46 2019 Russian Standard Time (UT+4h)  she@DPX200
##.OBSERVE FREQUENCY= 200.13155
##.OBSERVE NUCLEUS= ^1H
##.DELAY= (6, 6)
##.ACQUISITION MODE= SIMULTANEOUS
##.ACQUISITION SCHEME= undefined
##.AVERAGES= 8
##.DIGITISER RES= 18
##SPECTROMETER/DATA SYSTEM= spect
##.PULSE SEQUENCE= zg30
##.SOLVENT NAME= THF
##.SHIFT REFERENCE= (INTERNAL, THF, 0, 15.7039)
##AUDIT TRAIL= $$ (NUMBER, WHEN, WHO, WHERE, WHAT)
$$ ##TITLE= Audit trail, XWIN-NMR		Version 3.5
$$ ##JCAMPDX= 5.01
$$ ##ORIGIN= Bruker BioSpin GmbH
$$ ##OWNER= she
$$ F:/spectra/data/she/nmr/H-F/1/audita.txt
$$ ##AUDIT TRAIL=  $$ (NUMBER, WHEN, WHO, WHERE, WHAT)
(   1,<2019-07-03 14:40:18.93 +0400>,<she>,<DPX200>,
      <created by zg, POWCHK disabled, PULCHK disabled
       configuration hash MD5:
       00 E9 B6 7A A2 85 ED C7 34 08 36 98 17 FE 4E 26
       data hash MD5: 16K
       2F 87 4B B7 88 B1 50 84 79 A7 F2 8A 7B 09 2F F5>)
$$ ##END=
$$ 
$$ hash MD5
$$ BC 59 C4 D6 76 E2 21 10 27 E8 3F E8 81 F2 00 70
##$RELAX= 
##$RELAX= 
##$RELAX= 
##$RELAX= 
##$RELAX= 
##$RELAX= 
$$ Bruker specific parameters
$$ --------------------------
##$DU= <F:/spectra>
##$EXPNO= 1
##$NAME= <H-F>
##$PROCNO= 1
##$TYPE= <nmr>
##$USER= <she>
##$AMP= (0..31)
100 100 100 100 100 100 100 100 100 100 100 100 100 100 100 100 100 100 
100 100 100 100 100 100 100 100 100 100 100 100 100 100 
##$AQSEQ= 0
##$AQ_mod= 1
##$AUNM= <au_zg>
##$AUTOPOS= <>
##$BF1= 200.13
##$BF2= 200.13
##$BF3= 200.13
##$BF4= 200.13
##$BF5= 200.13
##$BF6= 200.13
##$BF7= 200.13
##$BF8= 200.13
##$BYTORDA= 1
##$CFDGTYP= 0
##$CFRGTYP= 5
##$CHEMSTR= <none>
##$CNST= (0..31)
1 1 145 1 1 1 1 1 1 1 1 1 1 1 1 1 1 1 1 1 1 1 1 1 1 1 1 1 1 1 1 1 
##$CPDPRG= <>
##$CPDPRG1= <>
##$CPDPRG2= <>
##$CPDPRG3= <>
##$CPDPRG4= <mlev>
##$CPDPRG5= <mlev>
##$CPDPRG6= <mlev>
##$CPDPRG7= <mlev>
##$CPDPRG8= <mlev>
##$CPDPRGB= <>
##$CPDPRGT= <>
##$D= (0..31)
0 1.2 0 0 0 0 0 0 0 0 0 0.03 0 0 0 0 0 0 0 0 0 0 0 0 0 0 0 0 0 0 0 0 
##$DATE= 1562150418
##$DBL= (0..7)
120 120 120 120 120 120 120 120 
##$DBP= (0..7)
150 150 150 150 150 150 150 150 
##$DBP07= 0
##$DBPNAM0= <>
##$DBPNAM1= <>
##$DBPNAM2= <>
##$DBPNAM3= <>
##$DBPNAM4= <>
##$DBPNAM5= <>
##$DBPNAM6= <>
##$DBPNAM7= <>
##$DBPOAL= (0..7)
0.5 0.5 0.5 0.5 0.5 0.5 0.5 0.5 
##$DBPOFFS= (0..7)
0 0 0 0 0 0 0 0 
##$DE= 6
##$DECBNUC= <off>
##$DECIM= 24
##$DECNUC= <off>
##$DECSTAT= 4
##$DIGMOD= 1
##$DIGTYP= 9
##$DL= (0..7)
0 120 120 120 120 120 120 120 
##$DP= (0..7)
150 150 150 150 150 150 150 150 
##$DP07= 0
##$DPNAME0= <>
##$DPNAME1= <>
##$DPNAME2= <>
##$DPNAME3= <>
##$DPNAME4= <>
##$DPNAME5= <>
##$DPNAME6= <>
##$DPNAME7= <>
##$DPOAL= (0..7)
0.5 0.5 0.5 0.5 0.5 0.5 0.5 0.5 
##$DPOFFS= (0..7)
0 0 0 0 0 0 0 0 
##$DQDMODE= 0
##$DR= 18
##$DS= 0
##$DSLIST= <SSSSSSSSSSSSSSS>
##$DSPFIRM= 0
$$ [...]
##$SUBNAM2= <"">
##$SUBNAM3= <"">
##$SUBNAM4= <"">
##$SUBNAM5= <"">
##$SUBNAM6= <"">
##$SUBNAM7= <"">
##$SUBNAM8= <"">
##$SUBNAM9= <"">
##$SW= 24.9336996594482
##$SWIBOX= (0..15)
0 0 2 0 0 0 0 0 0 0 0 0 0 0 0 0 
##$SW_h= 4990.01996007984
##$TD= 16384
##$TD0= 1
##$TE= 0
##$TE2= 300
##$TE3= 300
##$TEG= 300
##$TL= (0..7)
0 120 120 120 120 120 120 120 
##$TP= (0..7)
150 150 150 150 150 150 150 150 
##$TP07= 0
##$TPNAME0= <>
##$TPNAME1= <>
##$TPNAME2= <>
##$TPNAME3= <>
##$TPNAME4= <>
##$TPNAME5= <>
##$TPNAME6= <>
##$TPNAME7= <>
##$TPOAL= (0..7)
0.5 0.5 0.5 0.5 0.5 0.5 0.5 0.5 
##$TPOFFS= (0..7)
0 0 0 0 0 0 0 0 
##$TUNHIN= 0
##$TUNHOUT= 0
##$TUNXOUT= 0
##$USERA1= <user>
##$USERA2= <user>
##$USERA3= <user>
##$USERA4= <user>
##$USERA5= <user>
##$V9= 5
##$VALIST= <valist>
##$VCLIST= <CCCCCCCCCCCCCCC>
##$VD= 0
##$VDLIST= <DDDDDDDDDDDDDDD>
##$VPLIST= <PPPPPPPPPPPPPPP>
##$VTLIST= <TTTTTTTTTTTTTTT>
##$WBST= 1024
##$WBSW= 4
##$XGAIN= (0..3)
0 0 0 0 
##$XL= 0
##$YL= 0
##$YMAX_a= 364949
##$YMIN_a= -652548
##$ZGOPTNS= <>
##$ZL1= 120
##$ZL2= 120
##$ZL3= 120
##$ZL4= 120
##$ABSF1= 10
##$ABSF2= 0
##$ABSG= 5
##$ABSL= 3
##$ALPHA= 0
##$AQORDER= 0
##$ASSFAC= 0
##$ASSFACI= 0
##$ASSFACX= 0
##$ASSWID= 0
##$AUNMP= <proc_1d>
##$AZFE= 0.1
##$AZFW= 0.1
##$BCFW= 1
##$BC_mod= 2
##$BYTORDP= 1
##$COROFFS= 0
##$CY= 11.3945322036743
##$DATMOD= 1
##$DC= 2
##$DFILT= <>
##$DTYPP= 0
##$F1P= 18.9103706918063
##$F2P= -1.10871071338519
##$FCOR= 0.5
##$FTSIZE= 0
##$FT_mod= 4
##$GAMMA= 1
##$GB= 0.15
##$INTBC= 1
##$INTSCL= 1
##$ISEN= 128
##$LB= 0.24
##$LEV0= 0
##$LPBIN= 0
##$MAXI= 10000
##$MC2= 0
##$MEAN= 0
##$ME_mod= 0
##$MI= 1.114404
##$NCOEF= 0
##$NC_proc= 0
##$NLEV= 6
##$NOISF1= 3.799351
##$NOISF2= 2.8
##$NSP= 1
##$NTH_PI= 0
##$NZP= 0
##$OFFSET= 15.70392
##$PC= 1
##$PHC0= -8496.292
##$PHC1= 8.400969
##$PH_mod= 1
##$PKNL= yes
##$PPARMOD= 0
##$PSCAL= 0
##$PSIGN= 0
##$REVERSE= no
##$SF= 200.130013532006
##$SI= 16384
##$SIGF1= 3
##$SIGF2= 2
##$SINO= 400
##$SIOLD= 16384
##$SREGLST= <1H.CDCl3>
##$SSB= 0
##$STSI= 0
##$STSR= 0
##$SW_p= 3612.71676300578
##$SYMM= 0
##$S_DEV= 0
##$TDeff= 0
##$TDoff= 0
##$TI= <>
##$TILT= no
##$TM1= 0
##$TM2= 0
##$TOPLEV= 0
##$USERP1= <user>
##$USERP2= <user>
##$USERP3= <user>
##$USERP4= <user>
##$USERP5= <user>
##$WDW= 1
##$XDIM= 8192
##$YMAX_p= 0
##$YMIN_p= 0
$$ End of Bruker specific parameters
$$ ---------------------------------
##NTUPLES= NMR FID
##VAR_NAME=  TIME,          FID/REAL,        FID/IMAG
##SYMBOL=    X,             R,               I
##VAR_TYPE=  INDEPENDENT,   DEPENDENT,       DEPENDENT
##VAR_FORM=  AFFN,          ASDF,            ASDF
##VAR_DIM=   8192,          8192,            8192
##UNITS=     SECONDS,       ARBITRARY UNITS, ARBITRARY UNITS
##FACTOR=    0.0002004,     1,               1
##FIRST=     0,             0,               0
##LAST=      1.6414764,     0,               0
##MIN=       0,             -652548,         0
##MAX=       1.6414764,     364949,          0
$$ Real data points
##PAGE= N=1
##DATA TABLE= (X++(R..R)), XYDATA
$$ [...]
2380a090J522J255l163k102K701M616j050m416k072K281L281P19k816j965J293
2395a006J032j154L26K833L59l614k566K049L775O61k362k175P5J393J603O22
2411A851j043j410L3k38n28K458K504k662l811M86L653N41j228k96K54j776m58
2428a670K435K455k310k678N17J023k36Q89J898j601l329N07K909M08j141k51
2444a75k05j004M59K286M83j636k199R67J539p38J14J576r62k862L81L252P34
2461B010j926j093J16M63P94N09k82m65p80NP61M53L91L55j143k057P40L417J79
2480B447l018j791J972K378j060j502M15J715j750k335J458L584R0l782j326J716
2496g89K186K34j674j343L37J483j11j102M08K147m16l798j166M816L139l733
$$ y = [-1090, 432, 1687, -1476, -3578, -877, 3739, 2689, -1727, -3799, -1518, 1763, 2482, -334, -2299, -1006, 26, -1128, -802, 2031, 2390, -1224, -3790, -1741, 2034, 2695, 333, -1842, -1767, -374, 1229, 1851, 808, -602, -569, -807, -1335, 1123, 3627, 965, -2846, -2360, 1293, 1834, 606, 310, 564, -1212, -1670, 765, 3220, 910, -1768, -1251, -228, -464, 425, 2323, 722, -2607, -2100, 809, 1217, 76, -175, -380, -1384, -925, 1361, 1844, 208, -1991, -1024, 515, -223, -109, 1467, 505, -2357, -1976, 1276, 2010, 84, -1009, -893, -430, 364, 873, 591, 126, -654, -649, 112, 565, 956, 1311, 168, -1889, -1149, 2268, 2447, -571, -2362, -390, 1988, 928, -574, -159, 1556, -194, -2529, -1071, 2513, 2603, -1179, -2505, -789, 1397, 1631, -43, -1386, -1049, 434, 323, -779, -371, 1776, 1360, -2438, -3604, 1212, 4351, 618]
2512F18m686J868M819q32l235M06K478p20k581NL256J638k331l113L30K597K269
2529B786q82l325p60L056J793l213j276L289J444l827l120L285N042j407n206
2544b321q33L894J833k478j365J615O65j413j308R95K624R1k669k642Q20M629
2560B137J020l562l279K074L976r79l857P51M536j009m463k85M531K247l678l468
2576c308J926L353k24k199p17J394P89j224p77Q93J758M24l171k412L335M237
2592D077j659n306k48M869J362l596j888L058J726k793k859L185L629k593l197
2607b233j39L079J330j516j977L56J272N03j475o03J233J672j082k739R5L809
2623A585J731m060l035L139L187j729k152R59J697r08k196J116K868m09l041j079
$$ y = [618, -4068, -2200, 2619, 1787, -1448, -1042, 1436, 716, -1865, -1860, 1396, 3034, 703, -2410, -2080, 517, 2786, 1904, -1421, -2181, 875, 2668, -545, -1821, 1468, 2912, -915, -4035, -750, 4292, 2885, -2321, -3154, 740, 2573, 95, -1270, 345, 1010, -403, -1711, -716, 1908, 1999, -670, -3312, -2492, 2137, 3157, -405, -3684, -1610, 2366, 1387, -2470, -1719, 2817, 1808, -2655, -2940, 1591, 3838, 160, -3308, -1382, 1971, 1747, -452, -1169, 225, 1014, -210, -987, -94, 1664, 2088, -1083, -3495, -160, 4077, 2418, -2888, -3136, 1733, 3095, -501, -2389, 669, 2395, -398, -3257, -72, 3557, 964, -2233, -2372, 707, 2037, 521, -1456, -1100, 172, 675, -800, -1403, -170, 1502, 420, -2319, -2224, 1585, 3316, -744, -3779, -640, 2547, 818, -1334, -375, 1322, 414, -1782, -666, 2202, 1793, -1248, -2327]
2639b327K468J810j044p81p05n93J610R13o86j251O48P90o00j652P92K597l67
2656A622l438m48L614R92k823n66K177m42k645Q45K538L29k552j319J502J414
2672H00p64Q9M93j916r15K626J777k208j822J854J002j654p51K905L36l080q07
2689b035L166J003k994q11L123K13l414J17L399N00l302J75J864j81k128J347
2705D2J907j367k547R33K939n73k006L42P67j290O3K695m23l277j48L387L86l595
2723a765l34L451P40l734n87L586R60l681j510L795J074k636j374K626J016k290
2739f63l46R92L89j52Q8k44j292P1K963N87l756j564L973K027l766j987L655J814
2757B789l817j811L983K508l817l489K755L766j587k943J042J364n10o08Q34o90
$$ y = [-2327, 141, 1951, 907, 126, -579, -1172, 438, 1351, 665, -586, 62, 852, 252, -1400, -608, 1989, 1622, -1816, -2264, 1350, 2342, -481, -1047, 1130, 688, -1957, -1112, 1426, 1755, -797, -2116, -614, 800, 36, 125, 618, -1298, -2213, 413, 2190, -18, -1840, 14, 1016, -638, -1389, 1516, 1852, -1228, -2035, 1131, 2134, -860, -1671, 1452, 1665, -1749, -1632, 1767, 2267, -1035, -860, 1004, 823, -1305, 42, 1949, 582, -1965, -1032, 1907, 1334, -672, -330, 437, -853, -790, 1905, 1482, -1795, -1943, 1444, 1830, -1765, -2099, 1352, 2092, -1642, -2229, 1357, 2317, -1364, -2874, 921, 1995, -641, -2015, 611, 1627, -663, -1009, -17, 372, 220, 308, 64, -1228, -1157, 1806, 2393, -1363, -2927, 1046, 3073, -693, -2680, 975, 2789, -1028, -2839, 1144, 3652, -165, -3654, -899, 2867, 1280, -1663, -621, 743, 233, -375, 459, -231]
2773b31o37J568J007k868j740L916K262l851l288L518L920k993l869K532L776
2788C022k931l804K703M223j650l892j72K931J253p02j412p44M28J330P99j767
2804c85j396K344K007k655l153K751M281k632m570J812M537j039m038L77M327
2819B568K74m757p96L881K063k935j910M94J568P04m05j532r93J431K355j771
2835B39k171J304K669j212l412O07L882K74m279q66M415J120l626j648L083J669
2851B048j768k314Q20K225N48j685p89L67Q81O58l90j660K02K119M35k759o48
2868a710K889P52k493j886L291J637k045k822J514L896j911l168M98K880K28k033
2884d83l36N95O09k71j49K6k85P6J106j086j172J351J594j649k403K123K612j968
$$ y = [-231, -868, 700, 1707, -1161, -2901, 1015, 3277, -574, -3862, -344, 3576, 583, -3286, -754, 3022, 91, -3713, -1010, 3213, 1563, -2329, -2501, 430, 1683, 981, -431, -1175, -747, 583, 1382, -385, -1781, 563, 2570, -85, -3238, -487, 3794, 1162, -3408, -1596, 2941, 1902, -2136, -1759, 2568, 2842, -1915, -2711, 1170, 3233, 298, -1612, -1118, 450, 1154, 749, -783, -1776, -345, 2010, 239, -1932, -628, 2041, 829, -2583, -1976, 1906, 2180, -2099, -2965, 1450, 2570, -1056, -2704, 379, 2048, 280, -2034, -1214, 1011, 1559, -126, -915, -548, 333, 991, 601, -1059, -857, 1262, 1697, -1062, -1710, 1179, 1931, -562, -2448, 843, 2480, 435, -2387, -873, 3023, 1112, -2056, -1558, 1322, 1550, -483, -819, -224, 385, 114, -35, -9, -294, -218, 888, -198, -1370, -19, 1575, -74, -2477, -354, 2258, 290]
2902B90k388J207K956j144l183O00L438n06k007m95J621J17p57J31P69o20o99
2919f70Q99L07n43k44R59m84q15L92J552o20j621J30J931m63j945M75K309k54
2937A295k217J98J438J64j270j02J035j97j304P5J926k69j724k83J639j3j082
2954f91J84J046l84r87O13P37r88j98J099K64j636l77K322j02j875l1K212M4k639
2973a387J92K368L95k508o64K504R21k026o02J336K15r90l36Q88k95L4N25r7j543
2992a070M09K134k73k495J21K301k00k333k3K375P84k728j281K304J421j437j236
3009a227O03J091Oo17m72L31P41j54r22l81J385J083j072k069M88K224L98k209
3027g73m57K058R31k230j300K119J903j383k419L64K358M94j575j419J343J148
$$ y = [290, -2098, -891, 2065, 921, -2262, -1662, 1776, 1270, -737, -1232, 389, 506, -251, -120, 649, 29, -670, 229, 536, -7, -251, 708, 224, -591, -199, 1353, 733, -888, -758, 1173, 710, -1235, -760, 1549, 1295, -922, -724, 714, 878, -392, -494, 541, 344, -960, -885, 1041, 772, -952, -1235, 404, 391, -691, -507, 539, 155, -832, -219, 518, -470, -668, 431, 695, -941, -1318, 1004, 902, -973, -1004, 1208, 1252, -1387, -1195, 1173, 1568, -940, -1604, 900, 1821, -205, -807, 529, 744, -246, -582, 306, 11, 45, 570, 473, -1070, -661, 1473, 1200, -1295, -1174, 1127, 927, -1406, -1429, 946, 1730, -998, -2279, 25, 1446, 9, -1227, -624, 467, 473, -144, -616, -285, 456, 302, -620, -1001, 384, 1467, 395, -1674, -1186, 1038, 1436, -773, -1230, 828, 1759, -471, -1771, 348, 2251, 868, -1551, -1187, 1171, 1665, 90, -1329, 14, 1162]
3043A162n37j323k72J792P36j571j509P25K297j39k492o33K490J092j790k171
3059b143J588K565r86k694O3K790L08k028j371J854J687j197j586l7J796O92j401
3076a00j536J083J740r7j853p60K284P44j528j638J130K307p24j978m94K036J171
3093A787j634j613J413J586n92j935J01J963K95j932q11R62J820j93k176n15J718
3110B44J022o90j663O50J481p73j425l18K069J079j919j563Q61J967L7j665o16
3127a222J389O35j493n80J257J316j131j306P5J354Q17p34j162J96J031J17p73
3144b14j85Q47M60q16j272R73J725Qk437l82J606Q79j135r95J218P20j066n17
3162e83L37J045m45p03n28O29O23L48p50m21qR09j74j123N78J138n80j383M34
$$ y = [1162, 625, -698, -970, 822, 1558, -13, -1522, -797, 1500, 1361, -1131, -1764, 726, 1818, 28, -2143, -555, 2010, 1024, -1670, -1607, 1183, 1491, -537, -1908, -54, 1633, 436, -1150, -1187, 609, 1301, -100, -1636, -553, 1187, 1090, -763, -1523, 761, 1505, -23, -1661, -531, 1776, 1052, -926, -1420, 616, 1787, 153, -1460, -47, 1539, 947, -988, -887, 1076, 1371, -561, -1372, -410, 1410, 1217, -959, -1474, 244, 1266, 576, -1087, -437, 1044, 271, -1154, -1472, 597, 1676, -243, -1806, -945, 1022, 1059, -606, -1222, 167, 802, -691, -1271, -14, 1302, 171, -1135, -1060, 294, 1111, 377, -785, -589, 442, 559, -214, -399, 448, 908, 92, -1180, -207, 1518, 1526, -911, -1293, 313, 1192, 57, -938, 280, 1000, -66, -583, -246, 799, 354, -349, -877, -248, 375, 723, -27, -448, -456, 453, 279, -844, -266, 872, 292, -1091, -657]
3181f57J055L04j492j42J009O20j027l48R88J38j020M6Q75K51o09j54K54L16k35
3200A72K49k04j20k23M32j01m09M6Q47l88r68N62J246k85j633J68J468L1j123
3219b33o95J665n2j481J47J118L53q53p00J88R68N5k45m46n29O29L82l02r51P78
3239b04R11q83j190Q52J686m8k386k43J910Q33j512q43J646p2r97o37R77J413
3257A213l60j363m61N54J018M41q56r46J34J649m71j203L99J727r42j900L7K355
3275A025R84k287j530J653J664j095j436O92P86m38q04mR55R17p22j310l89J111
3293b28J508q88j553K45J184M68j233n61J556J080k236j456K068K462j476k665
3309a725M27K061M96j480n07J130M09l69j027K12J206M17q21j275J80J700M13
$$ y = [-657, 398, 702, -790, -932, 77, 697, -330, -678, 310, 448, -572, -526, 349, 600, -9, -163, 91, 407, 172, 421, 217, 97, -126, 306, 205, -204, -158, 689, 301, -667, -105, 1141, 856, -777, -609, 859, 890, -233, -928, 737, 685, -796, -649, 469, 822, -31, -731, -543, 425, 480, 235, -211, -740, -111, 271, -31, -982, -204, 707, -176, -1366, -514, 1172, 1124, -1262, -1505, 405, 1238, -274, -1117, 529, 457, -540, -1177, -200, 1213, 853, -510, -971, -417, 601, 1042, 186, -760, -626, 1023, 552, -651, -252, 1475, 533, -1367, -1330, 1025, 2009, -278, -1808, -155, 1509, 414, -1022, -330, 456, 18, -786, -790, 165, 1082, 360, -950, -1339, -228, 1280, 392, -1161, -916, 268, 736, -497, -1058, 498, 1578, -658, -2114, -46, 2416, 940, -1725, -1298, 763, 1259, -221, -728, 402, 811, 442, -585, -373, 833, 1250, 429, -846, -666, 1034, 1447]
3326A447k056q63J481J519j633j245J328J712j118k369N32K840p2k467p15J282
3342c97J389m92j304L21O73j37n57j80O72M77q1j094o98J733J675j881j712J015
3360e78J728j03k088j4J856L26j794r01K220J066j509j671O82J858j86q99l62
3377c69R2P1N57k80j54K34J72n14o52L71J851m30j817p22J606J458j494j247J394
3396A27P66j088j247J140J626j375j095L95Q62L18p36L09j8o39q2J125q6l61m
3415f3L41p62l18J241J232j803j581J260J714o10j355N60J299r49j099R76J000
3432A083k64j887N96R75m80o7K07L52p36l72Q89p4n54J24P19o45p79J091Q59p68
3452B69j615N12J654l00j258N16P72p30j337J116J486o61j839K46K012k73q16
$$ y = [1447, -609, -1472, 9, 1528, -105, -1350, -22, 1690, 572, -1797, -1265, 1575, 1503, -964, -1679, -397, 992, 500, -804, -483, 190, 53, -504, -684, -12, 465, 384, -710, -1408, 325, 2000, 119, -1593, -578, 1150, 1047, -1041, -1055, 801, 1127, -667, -1568, 652, 1718, 209, -1462, -780, 1078, 892, -7, -369, -277, -206, 351, 71, -83, 151, 323, -191, -843, -472, 1379, 949, -868, -1590, 16, 1474, -20, -1267, 127, 893, -195, -1442, -302, 1324, -51, -1146, -751, 111, 429, -307, 2, -16, -655, -737, 388, 302, -59, -63, 278, -484, -802, 439, 1671, -132, -1713, -453, 1261, 651, -704, -144, 1155, 206, -893, 83, 1083, 819, -1068, -472, 503, 23, -44, 163, 515, -221, -593, 296, 222, -332, -208, 511, -134, -913, 178, 1037, 269, -1346, -834, 820, 520, -738, -222, 550, -180, -1517, -401, 1085, 424, -1415, -1169, 843, 570, -246]
3469b46k16O47n97o5L88O30o44j81K60M6o14N06J057o42j599P59J680m15j451
3488f97P26J363j007j607N68K374r19j833k03J678P42j045k11K42l45l73L50O46
3506D49l81l21L73o65m73J019J244o60k310O79J624M62j801J9J484L5k124l5K031
3525F49O55j525j204R02J231K90j016k92L4N71j15J00k25L04L53m92j340Q54J914
3544A648m10k445M6J892O21j567p60R49J348j292j444J163J477l86j369o45J069
3561a05L65J49n76k65K62P38o61n02N16O82j77j254l63K170M11j706j287J085
3579e18J544j85j622J7J379j12j399N4J234L85r74l97N07Q95r1o59n19J44R20
3598F03K7q93k86P74L98q19q23Q60J855q15j908j65J910P45j840r04J313N88o43
$$ y = [-246, -462, 185, -412, -477, -89, 541, -103, -284, -24, 22, -592, -86, 971, 329, -1270, -511, 1169, 754, -697, 29, 1392, 385, -1222, -654, 1720, 801, -1032, -1235, 443, 1185, 140, -71, 171, -174, -547, -197, 449, 68, -253, 120, -545, -1018, 1, 1245, 585, -1725, -1046, 578, 1040, -761, -742, 742, 777, -1347, -1382, 649, 1304, -221, -1425, -523, 708, 998, -18, -310, -276, 295, 180, 280, 55, 359, 712, 220, -1120, -266, 1648, 1238, -1207, -1161, 731, 1352, -215, -975, -26, 1322, 30, -1414, -251, 1226, 840, -529, -1174, -105, 260, 409, -167, -432, -170, 568, -93, -595, -79, 603, 426, -828, -1191, 979, 1390, -316, -1603, -518, 1026, 841, -781, -764, 615, 503, -896, -842, 392, 777, -197, -594, -87, 808, 717, 58, -461, -317, 603, 630, -263, -549, 225, 623, -196, -1019, -159, 1696, 881, -1027, -1192, 718, 1463, -377, -1281, 32, 620, -23]
3617b3p28J049N72j037j051L51J129O65r75m72k37R42O82o39j008K21J329l85
3635C85j251L75J338j27j419m00J129J364j133j144R20N00o36n69Q48L96j08r22
3653d54M1O08P83k85j110J03J94N76j18l36l5J18N01p49m31J120N47j329p80N26
3673e10J509n91j052M18M57j30l73M13M83m65n36J07N33j52K20j29m51l83M88
3692a44N54j48l84J50J89m43m53R09P36j062j113O61J386n46r31N98M07l96l68
3711c98K09N61K26j028J59L99N4Q0k84K8k56J05N72j50m56L22q0m76r6J054L16
3732H61p45r34J38J416R6j058k41P41j20n55m8N57J11n73k65K94M77N81r73l72
3752f12K95N78j01k77k83N09N06p66p27J131J008q92j085m0J287M33r07n85P18
$$ y = [-23, -751, 298, 870, -167, -1218, -867, 262, 927, -48, -520, -757, 185, 867, 228, -780, -559, 770, 385, -866, -491, 847, 720, -699, -1099, 30, 1394, 261, -883, 37, 537, -99, -668, 180, 576, 468, -454, -413, 195, 978, 693, -417, -314, -120, 456, 338, 2, -33, 85, 586, -163, -594, 526, 1073, -256, -1036, -510, 999, 408, -644, -226, 231, 101, -272, 141, 624, 159, -377, -270, 263, 111, 331, 202, -249, -632, -144, 410, 262, -122, 28, 217, -226, -679, 230, 966, -96, -1209, -548, 838, 292, -639, -41, 366, -30, -398, -189, 372, 598, -430, -271, 128, 182, 262, -22, 6, -250, -145, 427, 277, -179, 143, 63, -413, -509, 545, 861, 116, -818, -680, 736, 832, -226, -467, 274, 154, -401, -449, 108, 219, -354, -619, -325, 152, 733, -240, -612, -317, 261, 160, -117, -400, 109, 615, -151, -878, 253, 1261, 369, -716, -756, 531, 964, 57, -528, 190]
3771A90N63q59k45L28Q58o57n97l04R66P11l02r35m75P41R26p46n85N37K00m02
3791h7p80L10J068K49j406o03J408P15o11j223M94J056j26q71k87J148N24j378
3809d00o61O66J218J49q93j021P27J023k70r98j3R74R6j065n2J079L46o20j290
3828a005L81J317N64j706j81O42R51j059o30O99N11q3q67j11J030L32n27j027
3846g69M11M80M92l61r41O13K59m4r68Q40O72Lj288l93P96J262o16j310M93R22
3866E53r5o09m7L55K02k62p99O32Q24k60p54m28L99R42p5r23k52O59N51j102J1
3887d78R31M47r31m72L34Q59k35n78m49P75J75l98n4K47r2l56p8K78L2P48n86
3908A19p76J00Q15M56q31r34Q89L78k55n88J052M82r36p86N41J151n04q99L38
$$ y = [190, 753, -106, -351, -23, 835, 178, -419, -723, 243, 954, 652, -283, -758, -17, 909, 163, -422, 115, 315, -87, -867, -557, 511, 760, -646, -1249, 159, 874, 263, -960, -466, 590, 464, -407, -694, 454, 978, -400, -1061, -395, 823, 972, 79, -942, -215, 808, 538, -460, -473, 501, 597, -468, -520, 559, 905, 285, -1005, -624, 693, 1257, -449, -630, 12, 963, -96, -726, -27, 484, 401, -466, -577, 453, 785, 258, -769, -358, 122, 614, 253, -688, -75, 184, 140, -828, 12, 684, 687, -601, -994, -198, 1064, 448, -862, -369, 553, 458, -151, -198, 157, 359, 97, -702, -70, 754, 494, -260, -688, -289, 653, 578, -345, -597, 62, 613, -489, -478, 453, 900, -31, -503, -169, 690, 455, -123, -572, 203, 378, -20, -74, 173, 81, -275, -353, -75, -43, 705, 119, -657, -557, 258, 714, -117, -1051, -162, 216, -39, -627, 425, 907, -29, -815, -274, 877, 373, -526, -188]
3927a88J17N23k81q4J0p1l02R6J87K49J58K59r27j52N39P01q67n67O16N63q91
3948c12j08N84N60m35q12J57Q58l38o92K37O7L83n82M00M42m99k1J55m5k06O37
3969D30j78q78J21O91K34l30n59J93P39l91q58Q08Q36p72q34N38Q00l0o42l60
3989d42N54M57m60o9K94n36J17J97k44m1L27O14p21o83R60O81r58p72P52P75p18
4010H4l46j09J048k83r63k08J185K5o27k53M29r1K55l48P7M8R3J14l03j48N88
4031B67L85r23p50O46J439o49j065k80J231K60r84j10Q52J26l77n88M33M95p1
4050C37o00J97L12J69m19j15J36K78L98p59m94L91P40j50j228J85J200K66r17
4069g3n15Q67M97p37p70P91N29m72o82KJ121M6o14r72N88O76j64j97l24L54L18
$$ y = [-188, -71, 452, 171, 87, 97, 26, -276, -180, 7, 256, 414, 673, -254, -406, 133, 834, -33, -600, 16, 579, -312, -420, 164, 724, 289, -523, -366, 492, 154, -538, -301, -234, 149, -433, -33, 409, -90, -111, 44, -1, -207, 430, 252, -626, -505, 186, 420, 90, -469, -276, 463, 72, -786, 22, 858, 86, -748, -210, 590, 560, -82, -442, 112, 569, 109, 40, 334, -202, -85, 112, -132, -173, 154, 768, 47, -636, 324, 1005, 47, -725, 27, 802, 84, -262, -371, 677, 394, -569, -777, 408, 433, -194, -447, -18, -109, 146, -202, -125, -77, 16, 130, -173, -321, 267, 652, -271, -1021, -375, 1064, 415, -650, -930, 301, 561, -423, -533, 319, 445, 68, -520, -87, 408, 337, -263, -66, 246, 415, -4, -119, 17, 295, 693, -66, -560, -169, 571, 421, -807, -622, 578, 844, -73, -588, 279, 776, 39, -731, 60, 589, 117, -565, -563, 558, 604, -10, -982, -394, 282, 118, -79, -403, -49, 269]
4090B69L40q69q9P85J54j023n33J201K16l6q65J8J114k60r19N5R16K03j107P4
4110c56M63N24n73j01k72K42N04j87l88j6K79L41n50n66L74J251p58j250N60J252
4130G73l04j002L0Q96l77l54k81P40J99l96l25K01O69l62m18K90j99K58N17m88
4150F7n87L90O21l23m58L47M38k80j97l65J065P3r24m49R67K37q51R0O00k30l35
4171a04l20K05L98p4k81K15j5r5K86Q9n75j66L91L29o82m5O97K01p74m85R72L31
4193D98q36j82M09N07m53n22Q34K00n38l04Q18l57j43K39j31j72l0L83j25k02
4213a07j19L56K06k63m42O53K63q62n31R67N40o64k02L93J08j18l35J86N00l23
4233B06n67O1M17o1l06L60k85j38M59p4o60K35O59j13m79K69J55L50o77o01N94
$$ y = [269, 609, -260, -349, 436, 590, -433, -966, 235, 451, 415, -450, -432, 682, 422, -497, -442, 474, 677, -430, -356, 107, 631, 58, -43, -315, -73, 431, 244, -144, -160, 119, 460, -90, -656, -282, 969, 211, -1039, -479, 773, 469, -533, -503, 393, 16, -338, -619, 121, 320, -76, -401, -200, 469, 107, -311, -21, -220, 38, 555, 67, -520, -130, 491, 168, -290, 57, 495, 215, 18, -347, 718, 791, -133, -582, 385, 622, -229, -139, 461, 231, -104, -424, -219, 179, 105, -176, 39, 24, -71, 215, 304, -271, -437, -46, 283, -399, -444, 253, 454, -320, -805, 167, 498, -338, -520, -111, 396, -57, -579, 255, 455, -83, -387, 431, 74, -69, 170, 39, -133, -163, 220, 95, -107, -226, 130, 336, 73, -369, 284, 547, -315, -846, 121, 661, -3, -205, 188, 296, 178, -157, 29, 529, 206, -361, -300, 117, 56, -250, 110, -175, -313, 146, 72, -588, -353, 306, 193, -286, -17, 138, 488, -189, -790, -196]
4254a96J072r37o29M01Q47o09j17j12K32K56k53j19l93O60K11n29q0K20J03M09
4274D37o80k23Q83K21p69m31N16P14p01o52N61O42j49o69k2M90K87p25o24J211
4294C17N6m82k90L0N10J9qn33L16M81l29J4m12j61O97l42m69J48P32J06n64l08
4316d72Q17N29q04n85L86O89k17q96O18K04m3m07k58N37K20k2m89j44L31M62k35
4337B21o02P1P00J63o33k96M24P09o50m87J70P23k97m84o1M94J48m85j42J25M90
4358C01O3r82N41K58k04k38J21k56P03q5l95l42O40K62o17n14N71N46j06k46n92
4379e71J085J95p62m19Q03p4mk75j23K34L08n15k02K95L01L2l39m65K53N17k7
4400B47o43P0Q99j7j232L38P12k54m63J48QL36k49q4O1L73j29p90N27M99m02O2
$$ y = [-196, 876, -61, -690, -289, 558, -51, -168, -280, -48, 208, -45, -164, -557, 103, 314, -215, -295, -75, 28, 437, -243, -466, 417, 638, -131, -562, -46, 668, -33, -685, -124, 518, 369, -300, -322, 168, 455, -270, -894, 317, 373, -109, -399, -369, 141, 160, 152, -381, -65, 416, 87, 101, -311, -472, 225, -117, -586, -438, 294, 400, -164, -472, 345, 874, 70, -515, -129, 560, 343, -553, 65, 269, 226, -181, -439, 98, 318, 296, -193, -337, -6, 456, 221, -381, -310, 390, 553, -80, -376, 48, 757, 107, -380, -210, 513, 216, -268, -329, 165, 313, -172, -314, -189, 301, 364, -618, -77, 181, -23, -261, -140, -396, 307, 222, -173, -515, 125, 387, -230, -744, -173, 373, 267, 21, -571, 514, 709, -53, -472, 331, 257, 253, -22, -145, 89, 397, -118, -320, -25, 276, 308, -31, -496, -243, 274, 247, -396, -326, 573, 556, -676, -338, 374, 120, -343, -195, -187, 149, -100, -184, -123, 250, 121, -669, -142, 357, -45, 17]
4422A7l7j45K08M76m25l86L49K9j45N0j77L48R4m65l51P25J26m73j58M84J13l16
4444e9j73M1K65J91j46J26n8mj75o25M15L56j16K74o30L97J45r8n74N30L6l2k80
4467a94J93q2N81l43p06M94L91k65k96J95J50K5l57K66j10L71p4m10k28Q67l92
4488G6m12K55r0L44l8j71k77L24L96o22j97O14r9k0m81M50M38k78j92l81J75Q58
4510F72p64l43L83K88mj00o11L91N43l43l15L4M25j56j85k44M27J63l31k18q1
4531c69P98J04p45k68M47r%k23j1N93j2o51OQ46R2q36r0L46R2L38m30o48O35L04
4555C09m69l6M59j24N04p61k88M63M24k96p71N82O19o21m89J92M73O7l55QJ42
4576C2K20J7n83J60J38P5k4m60j41Q97P8p61MN20N8m95k89M61O10n14k69k95R31
$$ y = [17, -20, -165, 43, 519, 94, -292, 57, 86, -59, -9, -186, 162, 256, -209, -560, 165, 291, -182, -340, 144, 257, -59, -232, -191, 74, 265, 119, 245, 187, 183, 8, -617, -202, 154, 38, 312, -318, 79, 224, 126, -448, 82, 118, 86, -194, -1, -83, 498, 155, -551, -57, 334, 69, -227, -32, 118, 143, -214, 52, -58, 313, 239, -171, -399, 468, 76, -336, -81, -171, 173, 135, -36, -313, 11, 407, -215, -412, 202, 103, 83, -398, 52, 490, 212, 20, -361, -186, 672, -92, -435, -52, 236, 232, 132, -479, -88, 455, 112, -203, -169, 256, 100, -85, -329, 98, 261, -70, -288, -369, 429, 533, -212, -480, -33, -42, -42, -265, -276, 317, 305, -346, -340, 506, 598, -238, -328, 18, 110, 448, 18, -630, 5, 309, -160, -196, 263, 139, 643, -118, -406, 57, 481, 185, -586, -4, 615, -6, -495, -303, 170, 237, -118, -110, 32, 252, 269, -314, -154, -16, 59, 35, -425, -566, 331, 409, -352, -348, 172, 230, -265, -554, -93, 517, 3, -266, -561, 370]
4599C70j39m90p0N80J22n13J1K58j02J34j71p62K79J043n7o36k30N96Q9o3n72
4620c23K29P58n22n03L63N44K1p42j27O58k47K93m25J6m7K76m83J53J31m2R1k46
4642a74n6L44L17n41m35L57Q16q46j12J21K74Q7m85j79Q65j8n67n8L41L57l11
4663I7J28o1m8R8k60q5J21J31J6j69m80N66N80n85k95j30P91m31j80L92J26l87
4685f5j77j25M63J33l79j22Q1Q28n57l63k2K97j84M80n12K59J76om24j27K21M75
4707C50k89m11J58K25J65m32Q7L26J54o75N7P75L7n13j84J46j84K77j5j29L47
4728B72k6n52P0J71j14L79q4o06L44M07o2o19L12M19j02m14L0j60L74j74m12M10
4750a37N72l70l58K41R5q6J02r5k52K27J56k08LJ25K00k90j35m8K62K71j93m79
$$ y = [370, 231, -259, -329, 251, 373, -140, -129, 129, 27, 161, -10, -772, -493, 550, 493, -143, -373, 223, 312, 249, -323, -94, 664, 142, -361, 2, 546, 567, -175, -302, 356, 109, 402, -23, -7, -54, 222, -261, -108, 23, -19, 72, -174, -230, 114, 431, -110, -545, -188, 628, -218, -330, -209, 65, 152, -333, -512, 353, 335, -232, -290, 51, 408, 97, 225, 164, 116, 214, -46, -131, -10, 121, 137, -32, -512, 54, 634, 49, -246, -376, 415, -16, -196, 196, 322, -65, -242, -367, 96, 229, -150, -272, -191, 637, 80, -283, -305, -8, -192, 288, -224, 35, 211, 205, -219, -346, -125, 350, 61, -350, -192, 33, 198, -234, -147, 179, 333, -342, -285, 490, 527, 14, -170, -24, -208, 69, 54, -75, 272, 246, -306, -236, -65, -179, 200, 116, -490, -146, 261, 199, -420, -108, 311, 209, -205, -175, -335, 39, -135, -547, -137, 435, 65, -293, -52, 43, -43, 59, -36, -288, -61, 95, -113, -110, 15, 215, -75, -210, -258, 4, 275, 82, -397]
4772c97M66J83k50m24Q23l89jj21j77M81J09k02o20N93K22Q6l98j26K67L54k99
4793A80k25k00L61L94r08k3N21L79o88m35K27M56J42o87R9J013n72n04M06K58
4813A94L09n91N2j00K89J04k45m81M12l8K90K2m52K92J52j43m29L13N14J1j025
4834e50O01K94m0k79j54J92J48j84m75K95P43r02O2k91P02J71m7N7p75L56K43
4855A67m07N5L21J00o4m91j49P19J57n63m17L44Q11o19k90J29L33k05m83P4P22
4876B44Q4p17OK96j1J63K03n15o5L74ll47L45J96l04J75l42L17M06k19p19Q8O06
4899B61K2o27L27L96k57l69L13L42k77j40k73K28J93J25m13Q9k94N03k10rj73
4920b43j18M93l23q2M49K12k71l76K8J73Kj7J65K61j84k13j80L97n7l7k06k7l8
$$ y = [-397, 69, 252, 2, -422, 401, 12, 11, -110, -287, 194, 303, 101, -519, 74, 296, 382, -16, -142, 125, 479, 180, -45, -245, 116, 510, -398, -421, 100, 479, -209, -644, -417, 39, 181, -506, -407, 606, 34, -470, -64, 194, 503, -88, -36, -136, 153, 257, 12, -469, -57, -95, 195, 217, -235, 57, 209, 66, -363, -50, 464, 475, -550, 51, 345, 305, 26, -128, 64, 212, 28, -447, -152, 591, -311, -249, -540, 162, 333, 286, 343, -432, -76, 167, -240, -185, 136, 236, 172, -319, -468, 251, 408, -155, -572, -228, 583, -36, -326, -197, 136, -69, -552, -478, 244, 328, -389, -383, -87, -98, 65, 268, -247, -312, 62, 59, -288, 57, 253, -51, 124, -218, 99, 505, 286, -433, -345, 261, 283, -344, -17, 379, 122, -247, 66, 408, 131, -9, -282, -54, 139, 264, -149, -60, -354, 149, -61, -70, -243, -361, 132, -191, -273, 176, 388, 117, -259, -231, -58, -56, -73, 92, 353, 169, -44, -224, 173, 116, 79, -127, -154, -192]
4943a92L24J65l38r2J23j37K51m99L33K36Q2o46L30P12m02o48N4Q28n96Q9j2j00
4965a35O68p01O0r0L43k40Q0r0K06J12j86L9j52j63L87n7m04N47P8n18K04j24
4987a36K29N0q0o28O92kk68l4L18J38l65K19l28K15L59m41o7QM40k78j2l4j21
5010a26M83L3l20P4L30o50l22K70N14n5m71K25j32M34j17l78J89J01J83o05m6
5031c86P54o0p0n07j59P08j17k85r5K21M6l69L70j10j45L62l05l85O87M9l38k30
5053c64K18k0K01o1J51j2L32k71l86J69K12q9j14P1k66O76l97m32Q9M59o5K71
5075C72l88o3J42p8k29n8L96K57o31l96Q29M3n56J6L80j58J32j35k73N42k3J41
5097B62m40M11j43j6j30l85J66L22nk90J91n6J17j31p2J46K95p8o50M65L36n2
$$ y = [-192, 132, 297, -41, -133, -10, -147, 104, -395, -62, 174, 256, -390, -60, 652, 250, -398, -344, 484, -112, -23, -35, -135, 533, -168, -108, -198, 145, -95, -15, -105, 101, 213, 27, 66, -86, -249, 138, 81, -323, 224, 302, -216, -12, -136, 93, 143, 63, -565, 127, 125, -143, -177, 141, 279, -86, 133, -195, 20, 379, -62, -129, -121, 319, 41, 29, -5, -126, 357, 390, 70, 144, 474, -176, -498, -228, 286, 231, -240, -15, -147, 287, 170, -208, -19, 82, 265, -340, -386, 368, 308, 238, -269, -428, 280, 163, -122, -217, 4, 50, -319, 51, -59, -204, 158, -147, -532, 155, 204, -134, -364, -146, -166, 35, -26, 125, 113, 445, 174, -212, -43, 169, 80, -34, 37, -229, 447, 50, -382, -293, 166, 101, 372, -16, -79, 63, -15, -244, -302, 94, 351, -280, -676, 153, 196, -360, -344, 36, -122, 10, -125, -398, 144, 121, 262, -178, 233, 90, 74, -56, -441, -275, 47, 42, -248, -57, -113, 4, -127, -199, -53, 242, 164, -486, -21, 315, 263]
5119B63l82k68L87k7j40N12l82K6m9m17M28J05M35q51K01j17K67L53m12k77M96
5140A51J0m43j51L55P46k81m51j36K92j83O1k42K46K75l18Lp3M11m3q4m11K45
5162b1L03o7l72P5J26K94j60k14Nm3M16p43L99J31J86p70M34K28k30JK20m43K47
5185BK44l20J56Q1j60j13J72K9J3p6l2n23M83M98o32j34K58j70J46q0J74o1J8
5208b7k06k15O90k39lRok12L59j95K96k04J10kj44O9OM29o00J89l19J00O59o84
5232a40J14L30j37l17R7J63K30l60j86k4N91M2n63Q9l1K16J35l85J6J19M5J33
5254A77n88K04M77j48l83J80K90k05q3k31K06K07l88K43K27j23j30l48K77N35
5274C96k85k13K39l36M52J52l32j70K08j7j09l21L22J44L11n55j8L56J18k84Q9
$$ y = [263, -119, -387, 0, -27, -167, 345, -37, -11, -60, -477, -49, 56, 491, -360, -159, -276, -9, 344, -68, -345, 151, 161, -282, -433, -78, 668, 387, -64, -200, 92, -91, -30, -272, -26, 249, -69, -66, -139, 272, 229, 145, -266, -21, 282, 215, -157, -82, 44, 338, 178, -36, -31, -74, 342, -401, -2, 129, 315, -455, -21, 207, -23, -22, 198, -245, 2, 246, -74, 82, 163, 3, -110, 62, 91, 104, 28, -4, -527, -44, 454, -178, -312, -54, -224, -78, -158, 16, -45, -27, -233, -448, 242, 3, 0, 9, 3, -209, 150, -45, 251, 47, 157, 155, 11, 80, 86, 515, -85, 104, -215, -115, 544, -140, -26, 304, 167, -150, -53, 110, 340, -20, -206, -230, 361, 403, -160, -71, -102, 114, 249, -136, -120, -1, 44, 177, -411, -207, 270, 122, -261, -81, 209, 4, -79, -310, -104, 103, -285, -42, 185, 62, -68, -416, -139, 396, 111, -102, 137, -199, 253, 405, 73, -97, 111, 94, -15, -336, -14, 130, 441, -114, -132, 224, 342, 58, 147]
5295A47J26k69r3K1L13K39n33l2l80P00j28j0k52K42qPP2k45J89K48p72N9J7N10
5319A68l15J92m15K96K00J22o83M66J98j82k75J41L70j51k38J49L96n14L31o54
5339c98L21K70k08K51kj18n3K09n65J84L47L43p05J26m8L25j80k99j79O08J63
5360C92m05J5J42j84j95n7K53N8n8m4j77J40M21k51j65m7J04J30j13k90J94M72
5382C35m05k11K44M81j34k89j93J92J71j65k80L9M59l67j1K50K5M5j1j08j08J0
5404c1J68l02lM05l32K24l32Q1K94R1m96J26L19J97m21j83N10l82j83L22j04J14
5426H2L08l36l20K62L51l93n8k95L12O5L48m27k77N54K41q28L08J07J04q7l53
5447c32K13L35J13l75k11K26K28k83K87L9k24N7r6j2K22j60l70k9K58K63Nj8k81
$$ y = [147, 273, 4, -89, -68, 245, 484, -49, -81, -461, 239, 111, 101, -151, 91, 83, 90, 162, -83, 106, 354, -418, -359, -342, 168, -147, 45, -370, -74, 126, 248, -435, 31, 229, 47, -228, -87, 283, 132, -106, 43, 439, -75, 256, -398, -77, 193, -15, 236, 234, 116, 63, 272, -293, -109, 238, 581, -124, 2, -46, 279, 99, -200, -379, 229, 392, -13, 2, 144, -40, -235, -292, -39, 19, -39, -83, -260, -120, 301, 50, -115, -162, -58, 72, -41, -331, -137, 335, -70, -281, -37, 444, 310, 21, -172, 20, 191, 26, -254, -215, 244, -123, -134, 116, 141, 186, 175, 67, -41, -31, 137, -165, -168, 237, -95, 129, -203, -122, 172, 263, -233, -107, 212, 409, -12, -195, 315, -67, -250, 72, -32, 82, 390, 54, -266, -4, 347, -46, -104, -399, -87, -22, 326, -101, -378, 176, 417, -411, -103, 4, 108, 21, -332, -119, 216, 329, -46, -257, -31, 197, -86, 201, 240, 16, 73, -23, -35, 187, 27, -343, -372, -114, 149, 154, 136, -145]
5470a45k10O51k75q6M00M0m23k86O16jo3k82k02K66n8K68k46L9K25k57j76J78
5492b7J00J03l26j74j6J62K95j52j23j26K11p0K15P7j65j8k83K53M89j40k52J52
5514A85j15J34j8j32k46K12M56o58kJ39J14J17j49M6j12J61l38L37k87K87k04
5535g3J1K66l53K41k06pJ94L72n15j82M29l39J09k42J45L74k41pP0j58N72k09
5557B51m37J2M5k5L20k54r7L09q5k51J95K30k15j9l03L93K78J74n57o70O32K61
5579A87m78L71J21K4j03l05K94l35M20k24l93K17K79r2l91K06p5L02Q5k12p3J87
5601A2J02n60O14L13n54Nm8n9L01j1j85q2L42k41J4k19M05L9k13l54J89L84L77
5624E71o33j92J96J48j55j48P20l99Mj89k73O69J04l05m63N05J63l31Q1l78L28
$$ y = [-145, -355, 296, 21, -65, 335, 375, -48, -334, 282, 281, 218, -64, -266, 0, -58, 210, -36, 3, 228, -29, -205, -27, 73, 176, -150, -324, -340, -178, 117, -35, -158, -284, -73, -143, 72, 149, -16, -34, -317, -64, 425, 285, 33, 185, 70, 204, 186, 54, -192, 20, 476, -182, -184, -45, 69, 186, 37, 83, -29, 132, -206, 131, -156, 131, -73, -62, 204, -149, 92, -114, -121, 73, 445, -70, -252, 177, -162, -53, -295, -150, 224, -17, -24, 46, -112, 460, 251, -186, -174, -129, -154, 166, -88, -185, 124, 39, -212, -17, 213, -2, -21, -324, 69, 347, 521, -36, -706, -74, 187, -291, 80, 201, 225, 122, -183, 111, -224, 196, -28, -421, -204, 75, -17, -408, -202, -277, 25, 110, -102, -175, 12, 114, -446, 168, 481, -73, -68, -116, -175, 126, 115, -70, -152, 190, -51, -37, -256, 149, 188, -25, -379, -190, 194, 571, -62, -254, -58, 90, -65, -213, 507, 108, 112, -77, -350, 319, 423, 118, -345, 160, 323, -8, 73, -305, 23]
5645B3J33k72k6J87K68l00P7l29P1J47K36l32j93M22J18m76K76K00l51j02K68
5666D5J65m9ol80K69j6l4j9J21j20j30K29Lj71K41K8l09L9J2M74j95j45m75M41
5690A8J44n02L22L80l3m78K41l6Q2k2j53j89J06J89Rj72J56j68K48j47j72j23
5712c00K11O5l36K12L68j73j94P0L32k77k8Qn6Q0j46R8K5L26n0j11k86n7M16K32
5736D29m66k08K14K78m41K85J02m88K50J98k53K87J25k88k50Q8K18p3k68J15J95
5757D9M0q8l24K14K35k8k72J86J79k7MM1k35J53k0p3n4L21p8n83K91K2K61j0r9
5782A05k79K15L10m84m7K33j08k29N54r8o4l7j63K44J24J31o81K44K20n4n07L38
5804c3k31J94N2J72j70k0N23n71O7j36Q3K92o08J04N58m2k90k68N53j35J8l20
$$ y = [23, 156, -116, -142, 45, 313, 13, 90, -239, -168, -21, 215, -117, -310, 112, 230, -246, 30, 230, -121, -223, 45, 210, 161, 155, -225, 44, 28, -6, -25, 96, -24, -154, 75, 78, -93, 148, 176, -133, -94, -82, 392, 197, 52, -423, 18, 162, -340, -18, 362, 329, -149, 92, 56, 138, 116, -37, -226, -120, 69, 78, -94, 62, -106, 142, -5, -177, -300, -89, -24, -360, -148, 220, 47, -147, -77, 255, -22, -50, -42, -98, -18, -164, -66, -41, 285, 235, 124, -162, -219, 197, 429, -37, -245, -31, 247, -194, 91, 193, -295, -45, 153, -100, 187, 312, 24, -226, -138, 80, 7, -261, -146, 49, 89, 1, -323, -109, 126, 98, -174, 12, 191, 164, 168, 209, -26, 127, 107, 34, -20, 301, 223, -360, -69, -47, 214, 204, 105, -174, 41, 351, -133, -180, 53, -55, -284, 270, 172, 108, 71, -92, 152, 276, 407, -274, -30, 190, 136, -371, -33, -264, -70, -18, 154, -16, -36, 487, -84, -17, -153, -70, 222, -386, -282, 276, 234, -56, -324, 229, 94, 112, -208]
5826b08q8k4N93l68j09l4L61j54J28K40n89M48m14K49o3k2K86k67J18K8J05m1
5848A75o2r6p0L79l04n8O4L21m81k24O03j23M5p9mk14J62o1r3K94m2L8m10K49
5872Ij19L57l20k80K76K92m95j59J34J94o6K99k86R5K18O1j59Pp6J63r1K15o60
5895c91L50J38j50P8P3J29m72P2M18p8j72m8k36M42P1k69k46M56j61l9j41K70
5917I4j74J64k63L2q2L91k70q1K61O6l84J97K44l53L02J17l14L21k16l5o4o8J21
5940Fj07J83j85j09M15q1k84L68j2L5l95K21K16l43J88j71j03J27j52J21k0J5
5962f7Q6j1O4K2K3J2k11r3N48k20j82M7K57l73j25J59k06J4M57j81o80O09K02
5985A51k70J54J49m15N50k55k03J3L07n44K20L71k57J18j91n8N3M19j72k79J84
$$ y = [-208, -296, -320, 273, -95, -204, -238, 123, -31, 97, 337, -252, 196, -218, 31, -32, -54, 232, -35, 83, 111, 216, 175, 113, 17, -53, 326, 22, -36, 28, 349, -132, -356, 247, 124, 169, 90, 86, -128, 34, -27, -120, 174, 132, 170, -240, 9, -110, 247, -73, -353, -77, 215, -280, -439, -305, -111, -177, 122, -164, -69, 149, 210, 51, 58, -18, 145, 54, 269, -391, -41, 97, -53, 25, 98, 227, -245, -173, 245, 167, -5, -53, -289, 153, 224, -45, -291, 165, 4, -35, -176, 94, -80, 84, -179, -147, -229, 162, -108, -189, 72, 138, -246, -49, 195, -158, 144, 261, -53, 268, 52, 17, -47, -115, 6, -101, 82, -103, -212, 203, 122, -162, 206, 194, 229, -166, 55, 271, -72, 116, -55, -158, -31, -183, -62, -82, -67, 19, 8, 72, 94, 117, 129, -82, -175, 373, 153, -29, 18, 275, -98, -223, -64, -270, -256, 201, 20, -660, -51, 151, -119, 35, 184, -231, 319, 64, -139, -126, 181, -363, -143, 228, -29, 89, -102, -160, -107, 312, 140, -139, 45]
6006D5M5r1j58P5J79r8P2l62M5M73p8o5Kj4k1P6k03r8mL61m20J73M35k28n80K66
6032a73L83j09j81K30k98p2K07Q4n57L81J81k00rK06j98K54r9n5Q8j22K47l19
6054a31m9J17OK1m7n42P72K90r10L58J5J35L3J71K8p7l07O4L8L3L01n66J73L19
6078B45l70k8K71k47N02Nl80J30k29L13k62j68K36K63N0p48P7M04K20n80K77j2
6100c1j37K20J93j22j74R1K4m15M84j49j67L4p2O2O4N3K17o01O48l09j2l9L47
6123B09l73J16O8m21O04k75L31m95L17K87K0l58j71J7Q6j41J76k72L04J87l95
6144a79M84l17J98k35r7o3J28J31j92L73K4l30o00N17K70J00l54K7K34j70r2L26
6166A83j99N5J38l02K61KJ23P6n93j12L18M13k80nj79K72K3k66k90K51K47k03
$$ y = [45, 90, -1, -159, -84, 95, -3, 69, -293, -248, 225, 147, 82, 84, 70, 49, 125, -78, -176, -180, 181, -239, -66, 369, 141, -439, -173, 210, 101, -80, 150, -148, -220, -13, 71, -486, -105, 76, -124, -133, 73, -125, 129, 30, -25, 63, -59, 188, -131, -180, -63, -57, -36, -83, -625, 147, 437, -473, -115, -100, 35, 68, 239, 267, 190, -117, -53, -15, 18, 319, -247, -74, 245, -125, -153, 118, -129, 373, 378, -2, 128, -101, 212, -50, -218, 18, 281, 331, -417, -340, 64, 284, -296, -19, -31, -168, 52, 245, 123, -51, 40, 64, -351, 133, -16, -183, -149, -221, -159, -95, -42, 175, -426, 222, -87, -99, -138, 209, -164, -48, 20, -401, 203, -72, 259, -236, 81, 368, 388, 30, -141, -124, -38, -179, -3, -275, 29, 216, -179, 305, -12, 186, -49, -146, -209, -81, 50, -142, 231, 255, -75, -675, -158, 112, 212, -142, -115, 119, -51, -143, 183, -16, 39, 177, -125, 136, 138, 261, 337, -256, -368, -50, 363, 83, 78, -101, 171, 194, -72, -362, -111, 136, -67]
6188f7j95K86K75l24j48k82N33K96m20r7P8L3m3J81l4Q9j53n4L10l33K28J71o71
6211c41M58l4j4l40oP0L60k77J29q1L59j44m14j6L67l64J36K85j86lK42q8k86
6234a88L93l22J20k76K19L28k26J18j98j12L72l89K35O1J06q00M08J35nlK26k6
6256A76l51K06Kk15M81o65J61K18j62O4j25J84l83L73J70o1J85m37RM37j70j35
6278c8j23M57j29o31L86J75p7l6K36P8o76L49K3l24K79j10P2L57j80K30m11J54
6300F1l86N26j90p9m3%K78k89M72o46L95J1K17p96O07L12o54J79J32J11j7k99
6322i8nK02j25P2K1j36Q2k26n5L08j68L34q4m59J50L26m4q2K8O3l06J22N1L05
6346B76l01K57n70J05L61M1k78m1J19j33N13m37j70M65kk44JK52l23R4j12J98
$$ y = [-67, -262, 24, 299, -25, -173, -455, 78, 374, -46, -143, -65, -32, -75, 106, 72, 161, 8, -46, 264, -69, 159, 330, -341, 117, 83, 69, -271, -277, -207, 153, -124, 5, -76, 283, 139, -275, -291, 76, -288, -152, 133, -53, -56, 186, 98, -188, 205, -117, 3, -273, -54, 274, 48, 166, -32, -144, 228, -161, 74, 135, 241, -559, -151, -16, -21, -24, 202, 176, -175, 31, 33, -182, 299, -366, -205, 13, -149, -85, -210, -26, -409, -36, 134, 73, 258, -179, -170, 267, 97, -38, -161, 296, 167, -464, -78, 97, 20, -16, 220, 298, -378, -29, -6, -330, -51, -161, -89, 268, 88, 318, -93, 61, -325, 201, 11, -68, -111, -111, 167, -122, 350, -296, 99, 110, 327, -469, 138, 450, -204, -25, 107, 218, 201, -98, -103, 99, -26, 46, 67, -69, 13, -213, -268, 40, -128, 206, 122, -337, -187, 139, 95, 13, 41, 104, -202, -80, -29, 276, -25, 232, -338, -233, 128, 169, -109, -150, -31, -164, 349, -88, -258, 207, 205, -39, -38, 214, -109, -15, -127, 71]
6368G1k65O2P4j93J28K34Km11J61K33k52j67J44L59J01k43j15K50l30j85M58L9
6390A55j04J9J2k84K48L50j96k55m9l8J17J87M8l50L7M6o2L36k12J99l88J84L2
6413C2j6M9P7j38k2J76k29N3K48l55K65j59o4n3L90J18p20J54M72j30Pr7j18J07
6437D7p3K06l66N25k60k07o7Q4J39kOj14LK39l9j63R4J88l55p7L6J32K98l79J62
6462E7J23j37j39K79k08j4j54K25q9J64m30K81p6L9K57r6j25p1j7K78N3o6k77
6485a43L50j10m02N03j88k36j27K07N2L15Lk84k21J42j8O9L11L6k40L8j32J5K05
6508A45J59k85j03k7j4P0P1l6r5j02RK75K39k58k1k25J65N1L5qm9P0m1R1k57L38
6534A97J3k79k86N04M1k35K39k79O4L63l55j61Q4L40k96R8Q8k60M14q4n84L67
$$ y = [71, -194, -132, -58, -251, -123, 111, 113, -298, -137, 96, -156, -323, -179, 180, 281, 38, -77, 173, -157, -342, 116, 155, 51, 70, 82, -202, 46, 396, 200, -55, -104, -142, -25, 162, 210, -140, -103, -57, -119, 217, 5, 204, -184, 0, 32, 16, 65, 142, 4, -18, 158, -71, -18, 230, -125, 140, -19, -83, -136, 254, 372, -348, -194, 278, 148, 155, 58, -60, 47, -26, 180, -186, 339, 79, -128, -195, -111, 28, 26, 32, -82, -79, 160, 121, -42, 52, 240, -115, -192, -156, -24, 274, -105, 57, 180, 43, -96, 183, -25, -39, -193, 32, -57, 107, -323, -42, -118, -79, 178, 82, -43, -114, -131, 147, 200, 134, -143, 207, 97, -305, 198, 10, -226, -353, -146, -94, 221, 224, -60, -281, -139, -157, -88, 223, 259, 19, 57, -75, -60, 145, 304, 19, -84, -111, -125, -55, 16, -20, -115, -217, -208, 67, 306, 48, 27, -198, -33, 18, 53, 45, -4, 66, 25, 116, -141, 197, 210, -69, -355, 149, 190, -45, 194, -85, -21, 342, -13, -174, -90, 250, -46, 52, 140, -120, 294, 210, -374, -7]
6556gK82k42l27J76J43j84J47l1O4J64n6j55Q1k5K88l40K00J23l25K93k62l03
6578b96K56K65j88k3K42l97O8K78l92r7K90L0k36M3K62r8Kj02K35m4LM0l43J14
6602h8K10M8P3k17n3J40k44K38Qk41k0J33J07j13l09L10K5q1NK48n40M30J10k79
6626a00k02M52K1k69j00L28j33J43k10j29K03R0q2p8r8N90o44M0j1R2K85L8j94
6649C2k08M4P9K6j26K61l8Q7n7l58M59rj64k67K79P0m62M6J77K25j20r6O9R5n
6674C9p8l1L69Q1n22N7K14N6j39M79o74J94o7O9Q1q0m72N43j07o6M8Q7l09K65
6698C7J00j30K3p9q2O1J21N3m3r8L74l95L19k31j06M2K76m76J5J78J46m8J8k23
6722a48q7J10J07j44L36K1m01j01K94J17K6J0k85J84o5J41p8j42K77j64J20L5
$$ y = [-7, 275, 33, -294, -118, 25, -159, -12, -43, 21, 185, 129, -26, 55, 30, 318, -22, 178, 301, -24, 269, 7, -296, -40, 225, 37, 14, 256, -141, -73, 205, -187, -284, 6, 36, -200, -157, 105, 7, 9, -93, 142, 98, 101, 141, -202, -88, 122, 170, 243, 26, -27, 113, -131, 107, 115, -126, -146, -13, 94, -19, -328, -18, 7, -74, -69, 179, -361, 69, 179, -100, -302, 150, 171, -98, -198, 130, -3, 140, -70, -199, 4, 94, 12, -66, -164, 426, -218, -178, -189, -97, 188, 226, 32, -176, -132, -53, -27, -153, 108, 70, 157, 100, -258, 201, 192, 28, -239, 40, 110, -352, -306, -129, 96, -24, -120, -51, 44, 39, -39, -70, 299, 380, -142, -85, 129, 185, 46, 525, -149, 45, -22, 47, 128, 48, -424, 119, 12, -54, -6, 81, -228, 37, 137, 7, 30, -49, -131, -70, 51, 104, 61, -37, 337, -58, 261, 30, -76, -34, 242, -234, -219, -41, 105, 57, 75, -148, -235, -125, -18, -162, 174, 195, -206, -307, -13, 104, 130, 140, -145, 39, -26, 115, 37, -105, 172, 8, 128, 163]
6744A63k42P8j97K30M8k3L42m10j01M13n19M31J10n97J97J88m53M36l3J29l92
6765b02J17q7K0K44j17k9j57K39j20J35M3k81l41O41K78m75rK89J60m56K09j61
6787f0J18k1kk09L08k25K29J23j93j74J47om81K01M11K07l66LN0l15P6J47k8q8
6811a48M93n30J20N8j77K48j80N4nL84k58j73j02K31j97P7q1K65j81L29m27L28
6833A28K29o0k21q6J4o3mp4k6m9N5J36R3QM0k7lk11L01J3l63J87Q8J36nm35K49
6860E0j06m5K07k65Q9J72k40j1Q9KK49j47k0j00J17J53m34k04N07K34p9q7o7k81
6884b17K86m30K01K45J85l12r3J69L24n63J41K12k30l5J90L7j80L85m45k53O55
6905B72k72O5K62k90j52J5L82l70Q7N5J23l93N40o4J94m33M5m16L14Kl0J61N9
$$ y = [163, -79, -1, -198, 32, 80, 57, 399, -11, -112, 301, -218, 213, 323, -274, -77, 111, -342, 94, 61, 190, -202, -85, -172, -152, 92, -25, -54, -211, 28, -92, 43, 86, -195, -536, 105, 383, -92, -101, 188, 348, -108, 101, -60, 58, 37, 35, -174, 134, -91, 138, 261, 68, -106, 41, 35, -446, -245, 166, 373, 7, 10, 60, -255, -179, -32, -60, -148, 345, -185, -65, -7, -184, 64, -116, -62, -67, 317, 59, -114, -216, 15, -182, -105, -186, 79, -102, 227, -200, 128, 357, 297, 76, -10, 4, -59, -63, -137, -163, -212, -157, -21, 72, 80, 120, 93, 90, -121, 180, 193, -170, 17, 105, 241, 236, -199, 50, -56, -101, 106, -159, -70, 102, -138, -149, -60, -58, 191, 44, 24, -76, 41, 194, -240, -444, 63, 297, 218, 131, 64, -217, 69, -361, -160, 85, 270, -42, -135, 34, 358, -205, -64, 148, -82, -117, 73, 110, -70, 315, -130, -383, 272, 0, 65, 327, 37, -115, -100, 282, -88, -1, 54, 177, -216, 324, 260, 454, 21, 66, -350, -36, -34, -64, 97, 156]
6928A56m63N10R8l44M3j34J3K7K89J40m80mN1N9K83k03q0j44L05m20J82J69J39
6951A92k57K8L5J19o4J00k12J84k71J40J05j70J2O7J7O1n28K08J51K14l29M23
6973B25j93K41r5j18L6o8m22M06j58K27k33j75L87n1K26rj70j11K54l83L02J5
6995A33j13m83L41J97j53M5R4J40l81N41n23K84J64k62k1o0R4J48k55j90j92N65
7017A13m6J35j67K23m42j07M00l38N7Q8R3K08o1K8l43J46Q4k02M43k89P4k39L29
7040A87m62L00q6J70j23l48K53p2L83k3p0j63R2j17J1K60m01k87K47O4J60j63
7062a88J44Q7r2Q5q1MJ85m16L05L3m9k81M4O1L13k91L49n10M08Q6j34m5k9P7j24
7087e9M48k73k62K62r7O7k47L19m73L00M37l14m05L58l8k0j15J44J09j22P6n47
$$ y = [156, -307, 203, 301, -43, 0, -134, -121, -94, 195, 335, -145, -149, -98, -39, 244, 41, -39, -183, 122, -298, -116, 53, 192, -65, -37, -2, 117, 53, 153, -59, 125, -146, -6, 99, -71, -59, 8, 25, 86, -442, -234, -83, 131, -198, 225, 32, 273, 178, 60, 96, 28, -394, 12, -146, 81, -152, -327, 60, 9, 235, 226, 56, -55, 199, -184, 118, 133, 20, -463, -122, 75, -78, -33, 61, 201, -180, 361, -162, 122, 286, 24, 3, -57, 37, 185, -70, -260, -452, 113, 67, 202, 35, 258, -184, -291, 109, -229, -172, -84, 9, 217, 156, 184, -159, -13, 71, -131, 312, 23, 97, -142, 187, -275, 25, -61, 109, -14, -362, -109, -181, 202, 179, 109, -54, 38, -79, -68, 192, -209, -496, -249, -185, -25, -188, -44, 43, -49, 36, -45, -41, 144, -272, 33, 66, 17, -264, -220, -159, 154, -137, 212, -298, 110, 196, 62, 17, -12, 65, -59, 389, 116, -146, 116, 19, 86, -161, 158, -315, -15, 422, 108, -297, 61, 23, 3, -112, 32, 141, 19, 95, -452]
7109d52N48m1J27k86J88j49p7L16p9N8j35J15j74J28L4k27N45l96j97k73N38j28
7131a7l20M51rM6l15K21O0l9J4Lk28L85l15O1j87K19M2n14L22k7L37om90K96K86
7156B76p0k11Q5K13P0k50l00k67O81j5r9j62K37k6l08p3K03p7J42J07q1J14k54
7179f5j29j16L89m8k13o1K84k47L11J30k62Q8j01K48l7j88K6K8j15r2J39R6O7
7202A32l45L16k20Q0r4J03O8k06K55l16j26M13J03l43J50K99k47j5P0n27L80L06
7224B36n22K91K2r2j9K55j3O3K5n22J71J60k8o6J94j23j48R6L06l32J16Q3j06
7247D7j85M59m8k36k3N8j3j15P9l10M34O2j56J4j60Q3j02P1O8J85m97L35p8j72
7271b00K57j12L0j10J40R1R5j2l11J43O7j38rJ36j09P1Q3l69MJ15J43q5L86j66
$$ y = [-452, 96, 55, 182, -104, 84, -65, -142, 174, 95, 153, 18, 133, -41, 87, 121, -106, 439, 43, -154, -427, 111, -17, -337, 114, 105, 151, -164, 57, 117, 78, 92, 95, -133, 252, -63, -2, -189, 30, 72, -442, -120, -147, 190, 184, -306, -10, 276, 206, -5, 80, 293, 363, 113, -187, -454, 227, 212, 113, -49, 188, 162, -146, -219, -16, -93, 49, 156, 75, 189, -65, -194, -310, 79, 31, -182, -243, 41, -206, 105, 235, -27, 61, -40, 208, 171, -17, 9, 37, -78, -170, -31, 65, 132, -213, 103, -117, -37, -131, -28, 40, -166, 89, -227, -353, 60, 163, -180, -30, 269, 22, 7, 77, -450, -70, 236, -286, 5, 27, -65, -84, 171, 158, 221, 246, -276, -105, 55, 27, -39, 155, 32, -116, -20, 286, -46, 70, 153, 47, -138, 321, 273, 37, 14, 72, 59, -56, 23, -287, 147, 209, 53, 67, -93, -10, -112, -41, 27, 212, -285, 50, -28, -200, 57, -55, -25, -135, 5, 96, 191, 179, -132, 11, 78, -60, -69, 67, -42, 29, 112, -257, -253, -138, 5, -80, 306, 140]
7295A40l38J97M06k84l40K77M3m41K89K0R7j63K07j92M27l98r6K83n80K13M33
7316B00K00j50l12J24j08n7K11l4O0l90K33j4K3J92k10k16K31K60k60k4M8j59
7338a52K79k85R7J29K39m05N76n76J3j44L74p3l42L17J30k14l7j79J80j71j23
7359c67K19l24N85r9j1J36l53J83n0k15L93J23m27L96j53j22J52l59L07Q7o9K06
7381B38k40n0KJ2J51m9j28J60j42m8P0L8k0j21R2K88k21n6q8J24k5o4L36l91J61
7406B9n6J43j79k13L98n4j61oJ28J43L1r3j07J69O4k07o1L36R1k60r1j81J46K76
7430B85m32K9L47k71k35L08J80l23r3J67j26M05K5l29k24L92q8k70L10m8j83K2
7452a52J77r9m5jK45j57j77j0L50j00j89j63K29l2k75M59k73Q1J2Q5L56l75L84
$$ y = [140, -198, -1, 405, 121, -219, 58, 101, -340, -51, -31, 66, -97, 110, -82, 345, -53, -149, 134, -446, -233, 200, 400, 250, -62, 62, -46, -103, 108, 74, 134, -256, -23, -37, -14, 178, -32, -248, -17, 243, -17, -41, 7, -152, 127, -158, -61, 68, 307, -98, 478, -98, -85, -229, 145, 72, -270, 47, 177, -37, -74, -253, -73, -244, -367, -148, -472, 113, 14, 3, 139, -214, -31, -81, -296, 97, 220, -207, 189, 36, -86, 66, -293, 14, 101, 32, 238, -2, -52, -50, -38, 113, 64, -64, 96, -46, -94, -24, 14, -6, -127, -35, 253, 32, -24, -112, 12, -13, -77, 259, -132, 29, -27, 116, -63, -276, 122, 68, -93, -99, 29, 172, 203, 110, 3, 172, 236, 29, -32, 304, 395, 135, 44, -137, 9, 285, -147, -118, 229, -42, -277, 31, 211, -112, -205, -38, -164, 241, 266, -63, -287, 105, 17, -253, 57, 9, -174, -152, 25, -74, -119, -120, 125, -32, -209, -219, 131, 31, -158, -321, -92, -124, -399, 60, -213, -132, -120, -35, 321, -54, 330]
7475C30l22j6R9k93j31O90m04mOO6J12o4r3j59J00L16k56j67L93n1l76L19KJ72
7499B69k69Q5k04J37J92M5l48KM21o85K69J26K12o4n9k59m3L91l21J90k54LJ3
7522a51K62L1l28J35J93J9l14L95l60J05K47m52M01l6m3O0J6Q2o7j15J24r0j8
7545I6l44L95l52N29o1k88j20J34P0J94j42m22M98j0k67P9M19k35m07j8K27J43
7567A18R1m4k38l73N56j08k37L93m77M19l8k80m0K48L25n54P0M97j1m06J94k88
7589a83K53J71k82j48L80l06o4K16o9m5K96k86l22K37L44k00j17K57q7j74J62
7610C3K0r9K09l63jq9M11k94j1L55o30L85K27J03j01j95j81K33J44j49M9j00j10
7633a54J11Q4P3k06K2M1n5l89M11LPK96k79L3K53L02o07J33J67j19k02K57l35
$$ y = [330, 8, -8, 91, -202, -333, 357, -47, -51, -45, 21, 133, 69, -24, -183, -83, 233, -23, -190, 203, 152, -224, 95, 97, 269, 0, 85, -119, 18, 210, 255, -93, -91, 330, -355, -86, 40, 252, 188, 129, -130, -173, 218, -103, 87, -167, -164, -151, 111, 142, -186, -51, 142, 161, -153, 242, -118, -13, 234, -218, 183, 147, 104, 164, 180, 262, 195, 80, 204, 114, 96, -248, 147, -205, 324, 263, -25, -145, -11, 59, 253, 111, -311, 187, 177, -90, -11, 408, 173, -234, -252, -25, 118, 209, 165, -73, -446, 110, 2, -235, 158, -319, 100, 62, -218, -258, -10, 315, -239, -169, 328, 317, -89, 105, -183, 70, 241, -41, -189, 191, -115, -179, 37, -32, -77, 219, -67, -389, -152, 192, -8, -125, 132, 45, -129, 33, 53, -46, 163, -200, -201, -290, 121, -173, -184, 171, -459, -74, 153, 256, 155, -40, -221, 12, 156, 7, 56, -44, -154, -43, 41, 114, -92, -70, -29, -84, -473, -62, -59, -52, 244, -35, -2, 251, 553, -54, 79, 246, 127, -75, 182, -153]
7656a53j2L15q1k02J95m2j47J46l65L18K1r3j53J02M0L86k33J11L0J39j58l62
7678a98K07K61q9m41M1J86J44k77L46l75J67jk7K51j40l5r4J77L9l07Q5Q8P1m11
7702c32N15rr3l68N19m58J40L13l1n12N61m40q4N51k26J8%j07R1k29L34k79N7
7725f9K41k67j53N06k50o8J45r0r6M64l98OK47k56l21K58M56k58k56K78k76l6
7747a93J67K44n58O15o6m5j39k16K89k32J01J86o3P2j18l14j59P89n48J69K79
7768B60l28jn0O25o35P0o2J17M0l41J92L10j74m9k43J84J9k3J6n5J38O6m04K40
7792h8K46K9k59r7O8J0K5K03l21J67k14K86P7Jo4k7o9L6J16j37j7m0r8K75l32
7817b24J72O8J71l88o3L51l08J90O3j40K71p0k04P9J72o50J76L21J63l35J17K15
$$ y = [-153, -165, 150, 69, -133, 62, 20, -127, 19, -346, -28, -7, -100, -253, -151, -111, 275, 42, 153, 183, 322, 164, -198, 9, 270, 181, -260, -219, -33, 111, -166, 180, -195, -28, -29, -56, 195, 55, 20, -74, 103, 142, -165, -80, 8, 79, -332, 183, 174, 81, -287, 232, -226, -86, 227, 196, -316, 245, -195, -279, 272, 46, 64, 64, -43, 48, -181, 153, -126, -69, 172, -95, -248, 258, 8, -60, 85, -5, -101, 363, -35, -29, 218, -38, -359, -101, 355, 97, -159, 119, -157, -193, -26, 218, -340, 275, 209, 164, 25, -191, 98, -134, -33, 153, 90, 162, 44, -270, -429, 360, -188, -19, 260, -68, -69, -119, 506, -129, -59, -121, -4, 36, -305, -113, 197, 23, -26, -269, -85, -66, -89, -73, -128, 10, 76, -328, -88, 158, 187, -72, -169, -101, -91, -66, 137, -184, -17, -231, 55, 132, 133, 69, 42, -27, 9, 125, -12, -29, -69, -167, 108, -224, -52, 16, 187, -201, -264, 87, -221, -31, 32, -108, 163, 93, -111, -32, 140, -510, -334, -13, 150, -185, -68, 147]
7839A47k20M5l3J77l22M47l48R9J0j93R7l55N13j04K33j96r1r4O5J40j22K00K01
7862B96l99j37K98J90j59J90m33r4M20K24o93K67Qj25J43K24l44K09j3j20j82
7883b30J48P5l4J16j36m42P46k26k86P29l32l40K43n1K27j27L5q7j36j5J17k25
7905b31M48l15l9L80k01J38j41k75j38L13j12K24J26j94j06p4K93N8J5j85J04
7926H8j85r8L57Qj06j6o0j81K73K02o42M31k47P5K6K36k23j69K80r3K24l5k59
7949a14N0J09j52L0K65j96r0N5o0j31L16R5j05n8l37L60m1j40K3J91m8l01M53
7972A74R7l2k39m33J91J91%K7J1k03K3K16P3l03M46k88PK3n1MK06k57j31J92j88
7997b44K86L55n11k9J6o3JK28R4l24J31P1Q5j73M2o1m4L00L08o45J48M50o95L98
$$ y = [147, -73, -28, -61, 116, -206, 241, -107, -8, 2, -191, -94, -449, 64, -40, 193, -3, -94, -188, -123, 17, -105, 95, 296, -103, -240, 58, 248, 89, 279, -154, -248, 172, 396, -297, -30, -22, -147, -4, 220, -124, 85, 72, -48, -230, -82, -7, -41, 75, -61, -503, 243, 17, -269, 460, 128, -212, 31, -20, 207, 80, 115, 28, -108, -123, -6, -231, 217, -98, -137, 243, 42, 180, 39, -236, -374, -61, -173, 51, 177, -17, -123, -197, 96, 154, 169, -16, 88, -97, -195, 162, 170, 64, 48, -12, -193, 80, 282, -360, 71, -176, -101, -75, 161, -62, -231, 49, -44, 180, 145, -114, -64, 45, -107, -77, 188, -8, -98, -43, -103, -234, 82, 177, 72, 14, -323, 37, -4, -144, -121, 70, 22, -279, 174, 271, 239, 0, -433, -242, -51, -51, -24, -13, -216, -193, 23, 96, -207, 239, -49, -42, -19, -70, -66, 140, -117, -248, -56, -244, 42, 397, -114, -143, -127, -190, -189, 39, 133, -191, -60, 11, 96, -77, -35, -96, -140, 160, 468, -177, -29, 421, -274, 124]
8021A24J10l07J57qm7J52j58Q5k72J31L4j5R2m5j26k0K05j39j10K08L0l8m9j4
8045b0M71m69j40K84k46J94k15J62j71J79k75J86K21j14k03K5L3K0K00p8j80J28
8067hK74k75qj66K41L5R6l8l25K49q8m62L49J98n6q7k94N08j16M6j76N5mj85J05
8092a32J48j9n13N49J84k68J84J1j27k49L94j44j01J22r4m5K97j27Q8j27k78K36
8114a1p9L75k89Q7k07J13N9K55l20k82L53j2k55L46j28p0m7K92m04o3J99J50k99
8137b37J63n8J09rj23K77l71K49J72j35R1l12J53O2j40K28J25l29N3L29j40l45
8159a88J81K76m55K92Jl27P8K56p7n10L58K12Q7j88j90j57K72J55j94P2J90k24
8181h0k33N04j78l2K21o91L19J34J28m36
$$ y = [124, 234, -73, 84, 76, 29, 181, 23, 108, -164, -33, 1, -14, 78, 33, -93, -113, 92, -47, -157, 51, 81, 43, -6, -20, 451, -18, -158, 126, -120, 74, -141, 21, -150, 29, -246, -60, 161, 47, -156, -131, -98, -78, 122, 44, -136, -8, 266, -9, -17, -183, 58, 93, 189, 151, -174, 75, -13, -475, -126, 72, 16, -71, -365, 143, 27, 73, -103, -48, -52, -237, -132, 16, -3, -516, 33, 217, -51, 133, 144, 17, -232, 162, 18, -83, 39, -55, -100, 197, 70, 158, 31, -247, -11, -90, 285, -4, 83, -124, -11, 48, 303, -17, -299, 54, 42, -213, 133, 5, -65, -112, 180, -224, -287, -88, 62, -237, -74, -132, -23, -32, -155, 122, -249, 0, 172, 37, 128, -184, -31, 31, -109, 119, 244, -85, -32, 297, 157, -188, -7, 269, -186, 106, 107, -220, -142, 114, 37, -473, -115, 97, 184, -4, -194, -351, -79, 76, -118, -46, 144, -80, -313, 191, 13, -19, 202, -489, -170, -36, 92, -344]
8191c44
$$ Imaginary data points
##PAGE= N=2
##DATA TABLE= (X++(I..I)), XYDATA
0@%%%Qj6QqJ6k4L2l2M0n6P1q4J01j20J43j71J99k34K75l15L59m15M77n46O18o98
29c72P93q93J001j122J258j404J562j739J931k142K374k628K909l220L567l953
45b078M383m870N427o064O804p680Q733j0026J1656j3787J6708k0968K7782m0409
59b4389P1409k79614m19954O72595L41057l65151k39382K52987k1006k57751J23246
70a45953L48191j17442l02975O6311J80762j34961o0835K39533M0412l15190n1107
81b53254K76907o75k49608J01408K78261j38545l34595P9715L21635L6752j99296
92h1295q9045K6288K8611Q9773J18647m5395j80111n9626J11549R9319R732l8465
104a0018p4059l6854Q0822P4765n4944n6461K8873j3069l5616Q7287P0511j28034
$$ y = [0, 0, 0, 0, 8, -8, 0, -8, 8, -16, 16, -16, 24, -32, 39, -45, 56, -64, 79, -92, 107, -127, 148, -167, 192, -223, 254, -292, 326, -372, 421, -472, 529, -593, 665, -739, 823, -916, 1015, -1127, 1247, -1381, 1528, -1692, 1875, -2078, 2305, -2565, 2862, -3202, 3602, -4078, 4655, -5371, 6285, -7502, 9206, -11762, 16020, -24389, 47020, -232594, -652548, 20047, 361104, -4047, -243429, 9558, -11448, -269199, -145953, 202238, 84796, -218179, -151868, 28894, -106067, -166902, 72631, 113043, -202147, -253254, 23653, 22978, -226630, -125222, 153039, 14494, -320101, -240386, 81249, 118001, -81295, -170340, -144052, -115441, -25668, 92979, 47584, -132527, -192153, -80604, 18715, 28447, -10018, -84077, -120931, -40109, 34656, -20288, -76749, -47876, -60945, -96561, -9274, 61237, -66797]
116f6797q6432J65245J02738j91058j26080J95266J51192j56720j23775J36399
126b2Q0470j15986l925J25524p6550j59918J31519K04021j25330j90993J04243
137b6947J19709j15871k8074J71636m1835k71495L5060L53767M8343l42026j16600
148b14333K47286Q9299j67540K335J60952o7022j81156P8713J84237n0128j38592
159e5949L3233O6469o1927l4800R6801N5247q1792o2632K7769o134m2505P2002
171E782J17288p1635j90470r296J72197Q1899p6699q0253k6533j7084K6443J08907
183D0546P7164r1670j64336k450J50055N8004q1174k8702M6040l2109p2042N5450
195d5224J18080j8604j27080m0800P2361L8576k6934J6037N1064m0388j01427
$$ y = [-66797, -153229, 12016, 114754, -76304, -202384, -7118, 144074, -12646, -136421, -22, 80448, -35538, -39463, 86061, 9511, -150407, -18888, 185133, 59803, -131190, -26947, 92762, -23109, -51183, 120453, 78618, -192877, -157817, 195950, 244293, -97733, -214333, 32953, 122252, -45288, -42953, 117999, 50977, -130179, -51466, 132771, 82643, -55949, -22716, 43753, -18174, -52974, 43827, 99074, 17282, -45350, -17581, -23715, -66220, 5782, 123070, 51435, -139035, -148331, 23866, 105765, 29066, -51187, -77720, -94804, -68361, 40546, 117710, 26040, -138296, -140746, 9309, 67313, -13861, -42563, 3477, -28632, -100674, -45224, 72856, 54252, -72828, -113628, -41267, -2691, -29625, -13588, 37476, -2912, -104339]
206a04339p329Q8544N8823m527m5683p6232k4057R8172J06112l7557j20728l9703
218a08504O1313N7953N529l534M741l4465n9517J7827R2226K7222p8912n7652
230g5773L9412N8197m835l0571J0677J7232m3506l8145N4710O3882l4885m1556
242b5161L5954K594o4157K4893J06602j8342j31448r604J30267M2743q6933l0630
254b3222N1808j7766o2419N2841R4079m6668r5462K5424N8635j7703L913L7535
266F0995o3340q9333Q0476J31642n6037j28424M4756J03173o6524j06297Q8020
277h93J30699q0231j46708M8593J29158j2779p6980J162R974k8204J4151M5415
289C3357j103j5721M523l7629n4221M9524J06850j6315j27903l4175J01352N7812
$$ y = [-104339, -111668, -23124, 35699, 31172, -14511, -90743, -114800, -16628, 89484, 51927, -68801, -108504, -47191, 10762, 16291, 12757, 17498, -16967, -76484, -58657, 33569, 60791, -18121, -75773, -36361, 21836, 17001, -13570, -2893, 14339, -29167, -67312, -12602, 51280, 16395, -25161, 10793, 13387, -50770, -25877, 80725, 62383, -69065, -78669, 51598, 94341, 7408, -23222, 28586, 10820, -51599, 1242, 95321, 48653, -46809, -21385, 37250, 19547, 23460, 60995, -2345, -91678, -11202, 120440, 64403, -64021, -19265, 83908, 17384, -88913, -893, 129806, 49575, -97133, -48540, 80618, 67839, -9141, -7979, 1995, -26209, -12058, 33357, 32254, 16533, 21056, -16573, -70794, -21270, 85580, 69265, -58638, -92813, 8539, 66351]
301F6351n1333l1657K3898j8694m5891K6609O5367J2099l0387l7078l8114J5407
313d3423P8121K5740p2135m8521L4773L1426q607J1925K7244k9355o5057l998
325f1867N7527L3878l706p465l6958n5870L1149J01605K039j03788k7438O7683
337c211J3197l6741K8268M9084m1957q0512L68O9512M4204j2304m1206l9098N74
350d9822N6272L9944m5141m9323L3945K9417n2231j0329R5992L3917j09948p5642
362a02949P1432Q3962j9133n3371k560K1716k405j0279J3625J8523p627k9117
374a8183k4039J1478N6961L8338n0270p1037K1108O3913n841l7565J5237K4599
386B4699k5068k5181K7871L9197j0043m4574k0238K2445K8801J0865l682j9586
$$ y = [66351, 15018, -16639, 7259, -11435, -57326, -30717, 34650, 46749, 16362, -20716, -58830, -43423, 34698, 60438, -11697, -60218, -25445, 5981, -2626, 9299, 36543, 7188, -57869, -61867, -4340, 29538, 25832, 18367, -18591, -74461, -43312, 58293, 60332, -43456, -70894, -3211, 9986, -26755, 1513, 50597, 8640, -71872, -71504, -1992, 42212, 29908, -11298, -50396, -49822, 6450, 46394, 1253, -48070, -14125, 15292, -36939, -47268, 48724, 82641, -27307, -102949, -31517, 52445, 33312, -20059, -22619, -903, -3308, -13587, 38, 18561, 10934, -18183, -42222, -30744, 26217, 64555, 14285, -56752, -35644, 28269, 22428, -15137, 100, 24699, -369, -25550, 2321, 41518, 31475, -13099, -33337, -10892, 17909, 28774, 25092, 5506]
398E506k3343N621K5837N328j2524n359n242m966J5656K0791j979j6364j4961
411e999j0495Q879L1326J9970j6445l3341j0125K8324L1540j1997l2467j601J5473
424A3042l215k04K5348J4330k9585m4693m116M7812L9893k2181m5350l927K4381
437A1535Q690J44N829m124k1106k0475Q963M3438L3994k7103n6723j3652L3537
450B947K8102K119j1124j3067j2748q871J1883L3567J1885l8868m1627M304K9438
463b060K3584J3566j1305l9836k6898J6540L7672J9303j5793l1582j2401J4919
475a4291J7928J2499O732j6821l4520j4504K2029L9828K3598k5896n5578j2162
487e1158M4951K6511k4504k0231J5038O459k8188j2877M4324M2501m2501p4313
$$ y = [5506, -17837, -12216, 13621, 18949, 6425, 1066, -4176, -9142, 6514, 27305, 25326, 8962, -5999, -16494, -7615, 23711, 43681, 27236, -6105, -16230, 12094, 43634, 31637, -830, -2431, 13042, 9827, 9623, 34971, 49301, 19716, -24977, -29093, 18719, 58612, 36431, -8919, -12846, 11535, 20225, 20369, 26198, 22074, 968, -19507, -10544, 32894, 66888, 39785, -16938, -30590, 2947, 31049, 33168, 22044, 8977, -3771, -12642, -759, 32808, 44693, 5825, -35802, -31498, -2060, 21524, 35090, 23785, -16051, -42949, -26409, 11263, 30566, 14773, -16809, -29210, -14291, 3637, 16136, 22868, 6047, -28473, -42977, -20948, 18880, 42478, 16582, -38996, -51158, -6207, 20304, -4200, -24431, -9393, -2934, -31122, -43999, 325, 42826, 325, -73988]
499g3988J0552P1118J7299l7813j0849J4988o694j5387R885K1939O430j7544k4545
512c4609l196K9970L5000q765n5818k5918M8596M1407l7304l5298L9562K8613
524B2240m7714k8059M8405L1296m0930l3811K7128L2760o049j2803L934l237j3296
537b0136R762K1869q760j5724J8894J1081k9279p748M1053J3310m5261l1166K5870
550a6235M3548R590k9101l2713K680K6615J0508j1524p185M950j204j0612M113
563f570K8370J2007l3353l3663J1146L4725J9336p019l0363j7234K8444K2520
575B8346l8112k3472N6069L1350p6544n4636P6302P9631n2975q5205K1322N5538
587A7614k2666k7094N1033K6112o7680l9733N3679L5307k2792k970J957m6536
$$ y = [-73988, -63436, 7682, 24981, -12832, -23681, -8693, -15387, -30774, -20889, 1050, 7480, -10064, -34609, -37805, -7835, 27165, 18400, -37418, -63336, -14740, 26667, -10637, -45935, -6373, 22240, -25474, -53533, -5128, 26168, -14762, -48573, -21445, 11315, 5266, -7537, -3603, -6840, -20136, -10374, 11495, 2735, -12989, 5905, 16986, -12293, -20041, 21012, 34322, -10939, -42105, -16235, 27313, 36903, 7802, -24911, -22231, 4384, 14892, 3368, -3817, 1133, -71, -10683, -6570, 21800, 33807, 454, -33209, -22063, 12662, 31998, 24979, -5384, -22618, 5826, 28346, -9766, -33238, 22831, 54181, -22363, -76999, -697, 78934, 25959, -59246, -37924, 17614, -5052, -32146, 18887, 44999, -22681, -62414, -8735, 26572, 3780, 810, 2767, -43769]
599d3769o278Q5031L2674r0156n0155P3289L9424p2897k6747Q6078K8329r1486
611c6663l6424P6402K6880n9010m278M6855k5034n0447L9033N8329k6728m6423
623c7508J1794J2952k1591J1988N1196l622o7020j9089O1232L6741l5241l5764
635c3932N961J3924J0349J2061p381j8311M045J0978j0651n846J5880L612j1274
648a0585L129Q742n906l548Q279j48p745M919O589j2174m03L7499J1832o1421
662b0941l6080P1611N9599o5984o6687N4425N7606m2010l1724M2890L107o1327
674c5515M881P5804M909p1428j1158N5187L410l8174J7583K7783m5078l0164O6353
687B4393L9634o8547l8052O5030K7517o5452k1342O0388J7899m7619n837L7020
$$ y = [-43769, -50047, 34984, 67658, -22498, -72653, 636, 40060, -32837, -59584, 26494, 54823, -36663, -73087, 3315, 30195, -28815, -33093, 13762, -11272, -61719, -22686, 35643, 8915, -37508, -25714, -12762, -34353, -22365, 28831, 25209, -41811, -60900, 332, 37073, 1832, -33932, -27971, -14047, -3698, 8363, 982, -17329, -13284, -2306, -12957, -18803, -2923, 689, -10585, -7456, 1286, -4620, -8168, 111, -37, -7782, -2863, 3726, -8448, -8851, 28648, 40480, -20941, -57021, 14590, 74189, 8205, -58482, -4057, 53549, 11539, -20185, 22705, 25812, -35515, -30634, 45170, 50079, -21349, -32507, 22680, 26090, -12084, 5499, 33282, -11796, -41960, 24393, 64027, -4520, -42572, 22458, 49975, -15477, -36819, 23569, 41468, -6151, -11988, 25032]
699B5032j4932m1437L1415N6332l8531p7528K4968Q1545k613n8243m095K3939
711E852j6872j3803L8984K8029m0139m8420K1693N5283K833m3934j6591J8694
723h391P415m105Q362K373j5340M9J5125j0845k7932J1393M0772J713m7084j8840
737d5335M0426K3624k9719j3383K8428r865m7060J7799P3805J944p7432k9127
749f5895N3343L6936k3308k2150Q477j89j1622J9542K7766k6211m0563K3588M1251
762B0965k3704l7058K6625L9407k1339l7452J3100K8496j3822k1276K3827K6026
774B3795l1045l4655L3309M3062k3626l9820Q968J8797n004J1369K1393k5854
786F89m4172K5252O1579j6831p2396O125P4653J417o8958M853O4986j6654o7277
$$ y = [25032, 10100, -31337, 78, 56410, 17879, -59649, -34681, 46864, 44251, -13992, -18087, 5852, -11020, -24823, 14161, 42190, 2051, -46369, -24676, 30607, 33440, -10494, -27085, -8391, -976, -5081, 3281, 5654, -9686, -9637, 5488, -5357, -33289, -21896, 18876, 20589, -26495, -45335, -4909, 18715, -11004, -24387, 4041, -5824, -52884, -35085, 38720, 40664, -36768, -65895, -12552, 24384, 1076, -21074, -12597, -12786, -24408, -4866, 22900, -3311, -43874, -20286, 20965, -2739, -39797, -13172, 26235, 4896, -32556, -19456, 9040, -4782, -26058, -2231, 23795, -7250, -41905, -8596, 34466, 10840, -28980, -20012, -1215, -6219, 5150, 26543, 689, -43483, -18231, 43348, 26517, -45879, -39754, 34899, 36316, -32642, -27789, 37197, 20543, -46734]
799d6734K4938O9564k7348o8761K4722O5458j3903n1209N057K8180q909p159K1989
812A5885o929l5894J9835N2723k8233o6508K7621P0999k4145o5178K2577N4345
824C7098k1980m2028K8193L5217l6097m1511L1424M9123j4124l8431j630J3783
836i63J353R770Q683k3210k2469K1990K7988j1025k1689L150J2452k060j2706
849h736n722J4965J8237p867k3799j071J8075L703j4272J054J6896p406k7195
862b3138O767L9685N676l7953j6648J5409P733P921J7532j4546l9089J1533M7722
875B8604r448m8134J1005M7895j6312n1565K0538N9944j5829o0239J1237N1545
887B9241j7893m2440K5557M0601k4115l2237J5949J4304j2011O703J5497k4594
$$ y = [-46734, -21796, 47768, 20420, -48341, -23619, 41839, 27936, -23273, -18216, 9964, 1055, -6104, 15885, 8956, -26938, -7103, 45620, 17387, -49121, -21500, 49499, 25354, -39824, -17247, 37098, 15118, -26910, 1283, 36500, 403, -41108, -9684, 39439, 25315, -13116, -14746, -963, 390, 10160, 18843, -4367, -26836, -4846, 23142, 12117, -9572, -6422, 6030, 3970, -8736, -14458, 507, 18744, 10877, -12922, -13993, 4082, 7785, -6487, -5433, 11463, 4057, -23138, -16371, 23314, 28990, -8963, -25611, -10202, -2469, 5452, 22984, 8438, -30651, -19118, 28604, 19156, -28978, -17973, 29922, 13610, -37955, -17417, 42527, 26698, -33541, -22304, 29241, 11348, -31092, -5535, 35066, 10951, -21286, -5337, 8967, -3044, 3659, 19156, -5438]
899e438k6795K9989L9022k3975m0263J7321L1665k2690k5416L0209K4944l2038
911c465k1076L0155J4518k7482p989K2558L095j6100J54J2018j368n065M427J722
925F102j1236o279J1479J1392m448p930j099n27K908O519n454j1223Q850J3556
939A2610j0940j1999J4211J0098j3749r150J0057M449p606J170R398O87p921k404
953a089j29l626M791J4532m740k5322K067L1238R04l2317j706K7093l817k4450
967a6571O550K5099k810k0447l84J1815k738p953R097R033j2030q348J4100O136
981A0549j4168j042J5431o232j9397O606K1892N16j5889n155N232K687j819L96
995c93K046k373j383M070k26p167L604J2228p774j8914O811K2290l20j8538l085
$$ y = [-5438, -32233, -2244, 36778, 12803, -27460, -10139, 21526, -1164, -26580, 3629, 28573, -3465, -24541, 5614, 20132, -7350, -15339, 7219, 10314, -5786, -5632, 6386, 5018, -47, 4380, 6102, -5134, -11413, 66, 11458, 7010, -920, -2019, -2546, 362, 6881, 1427, -9796, -946, 12610, 1670, -10329, 3882, 13980, 231, -8919, 1138, 5587, -2019, -849, 8549, 9236, 1315, -1089, -1218, -4844, -53, 14479, 9739, -15583, -13516, 17722, 18626, -13691, -15397, 11696, 7879, -16571, -10021, 15078, 12268, -8179, -8563, 3252, 514, -7439, 1658, 10691, -1339, -9687, 4413, 10549, -3619, -4661, 10770, 4538, -14859, -8253, 13639, 14155, -1734, -6889, -1657, 1030, -789, -393, 1653, -720, -2103, 1967, 1741, -5426, -1822, 10406, 2632, -16282, -9471, 12819, 12499, -6039, -9124]
1010i124J4615M430j6772r588J7652J6993j3888k1734P038K0874j52j7903p768
1023a5327J0052J1423n074j4139L623J8420J191k0701j0331J4607J6624m845j7672
1036a2149l71J9281M564j9792p861J8771J0488j4468j5127Q212J8876L219j6928
1049c285j0831J0384J0099q219q285P337R534k777r825m945Q224J0510l896j2844
1063h819k315J0678P897k727p937j268Q205R32j2998k354J7165Q121j3965j1755
1077a1140O243J2237J189j0725p373O536R599l332q658J746J0101K514j2652j2863
1091a6578J1874K1986n160k4117Q07K3449L177j9866o747J5060J0428j0529j3121
1104i337P051J7152j78j7881p211J1400J0722m875j2680p94J5937N955j8172j0610
$$ y = [-9124, 5491, 9921, -6851, -16439, 1213, 18206, 4318, -17416, -10378, 10496, 10344, -7559, -15327, -5275, 6148, 1074, -13065, -9442, 8978, 10169, -10532, -20863, -6256, 10368, 5523, -12149, -12520, 6761, 11325, -8467, -16328, 2443, 12931, -1537, -16664, -8452, 10424, 13643, -3285, -14116, -3732, 6367, -1852, -10137, -2800, 6734, 3957, -5868, -10813, -2589, 7921, 4025, -8819, -11134, -456, 7441, 4714, -3223, -4491, 3714, 4646, -8352, -10706, 6459, 14580, 615, -11140, -4897, 7340, 8529, -2196, -9569, -3033, 6566, 3234, -5424, -3678, 6423, 8937, -3715, -16578, -4704, 17282, 12122, -11995, -11188, 12261, 15438, -4428, -11175, 3885, 14313, 3784, -9337, -2286, 14866, 14688, -3193, -10404, 996, 11718, 6843, -5837, -6631, 9306, 15261, -2911, -13521]
1118a3521J5626J1764j2776j3246Q807J4304j772j3644l518J1302N816j0812p852
1131i522P772Q505k606n436j888L206K734m370o205M331P608j761p607j031L738
1146b532M296k81p073m916M920O500j526k127R07j3j139k721j300M544O480l073
1162I46p762k03O186L953j339o926m684N952N016m398k214P770K049j0221q037
1177a3912N278J2170L527j2268r479Q331J1323l880p188K311K318n090k637O044
1191c152Q681k80j0105n173O039L789j026J147k35n546%P402m0m147K889J446
1207A689q925m024J0218J0177l628r591k179M617L10N45O928r88j3781q16J7341
1222G893L706j4897j048J1138n259j3529Q448J8940l983k1095j856J8719L852
$$ y = [-13521, 2105, 13869, 1093, -12153, -3346, 10958, 9186, -4458, -7976, 3326, 9142, -1670, -9522, -1750, 6755, 4149, -1287, -3175, 31, 2765, -1605, -7810, -3479, 4129, 2368, -5239, -6270, -2532, 1764, 1483, -5590, -10506, -5586, 914, -612, -2739, -1832, -1845, -2984, -5705, -7005, -2461, 4019, 946, -6816, -7019, -833, 3120, 1781, -5145, -9829, -3877, 1139, -3259, -5473, 2297, 4346, -5875, -13912, -8634, 3536, 7063, -5205, -14684, -6353, 4970, 1090, -6098, -3787, -1469, -6559, -9196, -3152, 5529, 5249, -4856, -10029, -3990, -201, -1227, -80, -315, -5861, -5861, 1541, 1501, -2646, 243, 1689, -7236, -11260, -1042, 9135, 5507, -4084, -6263, -1646, -1336, -791, 6137, 5149, -8632, -9448, 7893, 11599, -3298, -4346, 6792, 1533, -11996, -3548, 15392, 11409, -9686, -11542, 7177, 11029]
1235A1029j6491m057J4306K528j2479j376Q670K157j490r85q552m915J2548J2246
1249A3139r578j5113N333J4874k984j6062K997J7566m725k0769M883K4780m24
1262A3917k4761n389J7767Q875j0543q839M622P898n00m026l14r48j829M359K599
1277B888o869k176J1583K431j3897m385J3304N799j2210p593J1489R836j1033
1290h33j1749J1926J5273j3082j8737P583J7081P50p417m251m095l01J2093P195
1304A1436j2285j4433Q236J6918n132j5541R427J7385j5800k4750J6322L1798
1316B3581j1247l0285N970K5359l433k1026K457J9381K44j7226m374J1140N994
1329F535K069R95j2612j5549J3232K5846o494k4375L348J8372p946j5384J4473
$$ y = [11029, -5462, -9519, 4787, 7315, -5164, -6540, 2130, 4287, 2797, 1812, -6740, -11655, 893, 13139, 3561, -11552, -6219, 8655, 5671, -10391, -7394, 10172, 5447, -15322, -10439, 14341, 13917, -10844, -16233, 1534, 10409, -134, -8973, -4351, 3547, 3047, -979, -1293, -2241, -4070, 289, 2888, -3981, -6157, 5426, 7857, -6040, -10425, 2879, 8678, -3532, -11125, 364, 10200, -833, -12582, -656, 14617, 1535, -17202, -9619, 7462, 8212, 795, -3456, -7551, -7852, 4241, 11436, -849, -15282, -7046, 9872, 4740, -10801, -1374, 16011, 211, -24539, -8217, 23581, 12334, -17951, -11981, 13378, 9945, -11081, -8624, 10757, 11001, -6225, -10599, 541, 6535, 8604, 9599, -3013, -18562, -5330, 20516, 14022, -10353, -7005, 11367, 3421, -11963, 2510]
1342B510K0966j7814k9815J1047L4655o15k9367l724J9580j40j4219M441J1428
1355H933m638n990L467q81o263N702J2509n640j8620q53J8992P154j3178m842
1369d148Q916l180j3211P089J9476k634k0854n255J4886J1663n298j1184k808
1382f542M340L968K492K009o051o491P778Q010r130r681Q979J1545p566j2557
1396h897O627J3441n526j5564N056J6352p454j8590J0437K1413r646k3465N747
1409a0069K0235j695j3796k30M696k321K760J1002k857k0671k484K2000P107j8469
1423d792l512J4953l980j6231J2051K0203j3882k4771R781K3153n453j6887O732
1436b635J3905j1321j4404J1616J4992j1321r200J2723L587j8733l82K4594N123
$$ y = [2510, 23476, 5662, -24153, -13106, 21549, 20934, -8433, -12157, 7423, 7283, -6936, -2495, 8933, 4295, -1695, 1772, 891, -5372, 330, 12839, 7199, -11421, -12274, 6718, 13872, 694, -4148, 4768, 1588, -11623, -4534, 14942, 12308, -8546, -13801, 1085, 12748, 7450, -3734, -6542, -2202, 1766, 4258, 6267, 216, -6275, 1503, 9513, 383, -9298, -319, 11226, 3660, -8897, -2270, 11171, 5645, -9919, -4863, 11489, 4035, -14555, -4118, 17295, 7649, -15816, -10069, 10166, 8471, -5325, -5555, -859, -3180, -420, 10582, 7725, -12946, -15430, 6570, 13677, -4792, -8304, 6649, 2669, -13562, -1511, 18692, 4810, -19961, -10180, 12973, 7520, -9367, -2635, 11270, -51, -14455, -2839, 12153, 832, -8368, 4355, 7942, -10791, -11173, 13421, 18544]
1449A8544k4971j2346J4896J4093k551n017L41o305q265Q010J5717k472j4973
1462e299k758P042j66J052Q785j258j6164n874J4332J0825p384j0413O196R623
1476H539r745j3612J0744K0199n988k1030j735J5137M757m871m96M80p367o015
1490a1003R670J4043m356j3741r37N784k099K997J1010n099k0191J760K3606L723
1504A5167k0633n390J6680L956j6396l015J7761M739j6436m020J2220o1r367O453
1518A658P799j2587p950J4832Q099j4211n645J3526J434j7973q64K4709M413k8462
1532a1222j0153K7503J4780k2250j4352J3623R112p397j119O246k753o325K112
1545b195M218j820M02M593l870j0806L710J8144k47k1041m255J9067M008j7166
$$ y = [18544, -6427, -18773, -3877, 10216, 7665, 2648, 2989, -3316, -11581, -3571, 12146, 9674, -5299, -8057, -1015, -1181, -129, 8656, 7398, -8766, -14640, -308, 10517, 3133, -7280, -1084, 8539, -1206, -14818, -4074, 16125, 10137, -10893, -12628, 2509, 7266, 2395, 1899, 2379, -4988, -11003, -1333, 12710, 8354, -5387, -6324, -540, -2639, 358, 11368, 6269, -13922, -12162, 11444, 15167, -5466, -10856, 5824, 9780, -6616, -9631, 8130, 12869, -3567, -7587, 4633, 4572, -4795, 1658, 9457, -3130, -11080, 3752, 11851, -2360, -8005, 5521, 6955, -11018, -11882, 12827, 17240, -11222, -21375, 6128, 20908, -1342, -15694, -2071, 7041, -356, -1475, 4771, 2018, -4307, -2195, 2023, 203, 605, 5198, 1328, -9478, -5768, 12376, 12129, -8912, -13167, 5900, 9908, -7258]
1559g258j928J8231L795j8146j0689J2964J5845l193j4730m567P728N171N53K14
1573C990k198m548k512K86L829P730K043r044j0825J942J2013Q128o781j3902
1587i849j043J2394L005p978R83R051m228j3568n82J4471R039p324j0956q94M335
1602c144L528M154J777q013p227N539N856k400K382O974q467j6668M411K2226
1616A0928M124j7452j0062J0190Q484o429l614P957J345j0768m213Q700P392r41
1630E641l279o178m777N967J0155k579q549O03M676j535m810M178Q958m687j3698
1645i914p24J4351N859q135o742J284K490J293J167j68q81r02j582L31M560K061
1661D348l632m184p96L539L905N40k952k591l18J053L058J177l608k455J945K13
$$ y = [-7258, -9186, 9045, 12840, -5306, -15995, -3031, 12814, 9621, -5109, -9676, -1948, 3223, 3776, 3990, 1792, -2756, -5268, -4982, -1153, 6577, 8620, -424, -11249, -9307, 2706, 10834, 4053, -9849, -10892, 1502, 4507, -3471, -2488, 6563, 2335, -11233, -11815, 2656, 11695, 4371, -6585, -7479, -3144, 384, 4538, 6315, -1698, -8925, -3386, 2470, 70, 2452, 9426, 959, -15709, -11298, 10928, 15052, -2400, -12462, -2272, 6212, -217, -3831, 4126, 5471, -5297, -9510, -810, 6582, 5641, 2362, -3816, -8593, -2626, 7529, 4950, -3599, -2996, 1680, 145, -4665, -487, 8471, 3784, -9914, -10638, 3713, 9572, 1437, -5305, -4021, -1531, -238, 929, 761, -120, -1022, -2604, -2273, 2287, 4348, 716, -3468, -4264, -725, 3180, 3720, 768, -1823, -2141, -1088, 1970, 3147, -461, -2916, -971, -758]
1677g58k89L847J992o333m857L191M239K286o06l384m033L05N183M134k671n578
1693c332j411L358O77o23M884K187r949p545Q561R820k091o894k110J175P59K005
1709e29L174N81m596n448J405N251L222J964j538q793m647Q242R570k939o834
1724a915k068J467J124K269L651Q52n321o937M57P661N702j015m724p220j721
1739g738P880Q070l944p617q1K747n23L0N237L065o022j0211L18J2635P240p531
1755C555q598j05M445K111O64r99L79p50m381k065P272Q540l886j1940m104Q467
1771a395R330j853q832o63O191r69n722K642Q166r83j0028m048P998J0155j823
1786H166j1158l767O926M634l073j811J349J046j688l027L48O223K769q015p555
$$ y = [-758, -1047, 2800, 4792, -1541, -6398, -3207, 1032, 3318, 2712, -672, -4705, -4400, 783, 4917, 2246, -3332, -4743, -1385, -708, -1331, 3553, 5740, -4209, -11754, -3193, 6627, 4536, -2358, -4468, -3293, -2534, -529, 2645, 3226, -1370, -6818, -5413, -162, 3060, 5024, 3486, -5307, -9954, -1712, 7858, 4919, -1915, -3983, -2516, -1392, 877, 4528, 5380, 59, -6878, -6421, 1240, 6942, 5927, 1203, -6017, -7738, 142, 8212, 4268, -3349, -3430, -683, -1206, -1176, 4061, 7126, 1104, -9107, -8789, 3846, 11086, 3555, -5043, -5148, -703, 1408, 2072, 1073, 1452, 702, -3679, -5744, 1528, 10068, 6182, -5758, -9862, -1395, 7935, 6082, -2750, -3413, 2778, 1809, -3913, -1271, 6895, 5912, -4116, -8164, -166, 9989, 8166, -2992, -6759, 167, 4801, 1728, -83, 1266, 2312, 624, -2403, -2055, 4168, 6937, -1078, -8633]
1801h633M276J0751J940q148o974L942O413k067m426L072L696m608m856L083O537
1816C998J583m845p202m08P990N958l301p060j453M197K434k451j228N403L00
1831C915r547l175J1301Q964o920j1350j223Q229N723k769m102P05J450l035k368
1846d202M594N796j088p873o358N162J2085R70j0682n984N072M597k161n93L808
1861C143J828o666q064N431J2486R14j1474o943M941O791J857j919k611j442j221
1876b949o64K917M898P61n183n039j13O787N590k344q096j946M851K235r05J377
1892B177J491k944n154O4O237N312k977p199j306L439L153J684m62m827l552K813
1908b051M488L70j157o88j956k572R20M803L568m433p486J933P902N97n235l37
$$ y = [-8633, -4357, 6394, 8334, 186, -6788, -2846, 3567, 1500, -2926, 146, 3842, -766, -5622, -2539, 3998, 5581, 736, -6466, -6874, 1116, 7074, 3773, -3287, -4740, -543, 1891, -560, -1788, 3615, 3915, -5632, -8807, 2494, 11458, 4538, -6812, -8035, 194, 5917, 3148, -954, -249, 1201, -1834, -4202, 392, 6188, 5100, -2773, -9131, -3969, 8116, 9086, -1596, -7580, -2508, 2089, -72, -665, 3143, 4971, -1695, -9759, -4328, 8158, 9072, -2402, -9345, -4404, 2387, 4244, 2325, -286, -1728, -2949, -3613, -696, 4202, 4963, -220, -5259, -5372, 1415, 7005, 4661, -3435, -5381, -530, 1705, 800, 2177, 3668, 724, -4430, -4366, 1871, 7183, 4206, -2993, -4299, -860, 2293, 3977, 3515, -1312, -4864, -2051, 2437, 2807, 1650, 962, -994, -3566, -2646, 2157, 5725, 1292, -6194, -4261, 3641, 4238, -997, -1334]
1924a334J927j926j981L221L956j557l660j884J889J486J174J832k130n879N8
1939d808P748K747n282l108K171q35j143M074M836m170p815Q64P423K533m056
1954A179j703J024l279j187P469N017p768p714M761N723l161k209M884J474p242
1969b732m650O847P332k932p164L04J496n14K917N211l221p297n41M397J460P05
1985A618L265k237r083k463J1590R244q858j2512L541J0189j834o344N465N057
1999F638p565p695N425Q914k32o179k274J241N13J676L756p85n678p70L386k71
2015A00j796O223L974j0045j0163P771J3968j540j2628l534P640L526m193K99
2029c98M605k648p682J043Q021J506m171j374r37j752L018N701j889p382q15P832
$$ y = [-1334, 593, -1333, -3314, -93, 3863, 2306, -1354, -3238, -1349, 137, 1311, 3143, 1013, -4866, -4808, 2940, 5687, 405, -2703, -532, -1367, -2510, 1564, 6400, 2230, -5585, -4721, 2702, 5235, 1179, -524, 500, -2779, -3966, 3503, 8520, 752, -6962, -2201, 3522, 361, -1848, 3036, 4510, -2732, -7382, -535, 6797, 3865, -3299, -2995, -1499, -2013, 904, 6115, 2894, -4403, -4944, -547, 913, 1618, 4883, 2646, -6437, -8900, 2690, 11934, 3076, -9436, -5895, 4294, 2460, -3884, 1581, 6638, -927, -8622, -3197, 5717, 5485, -694, -2968, -1727, -1214, 462, 4218, 3433, -2245, -3015, 371, 100, -1696, 4527, 8501, -1544, -11707, -3936, 10032, 8492, -4136, -7670, -30, 3496, -697, -398, 4207, 1559, -6123, -5080, 2941, 4447, 276, -1098, -2035, -3787, -769, 4932, 3043, -4339, -5154, 2678]
2045B678J263p613l96J0335N71j4035l581J4725P342j0899q141N768N708l123
2059F02j924L517Qn327q94N352K289k062j86k089n118K279J1633M98j4417m307
2075a0146J3793O134j1276n727Q908N539r771o197R477Q333p413q397L717M769
2089A743j835j75K206j902l714J851K598p70O84K123k816o948J089J1076M679
2104I889j0423r088N697R244j582n814R52K569k812k670M156N032j660o436k716
2119e662M455M058j017q48m09k792m83L767J357k439J57J834k573m888L232R585
2135G334J60j1618n678Q834P887n103m042L089j87n919K037Q318K39q216k656
2150e521M113J792j0K523l95o208k571O847M735n827l665N938J798q024q98R760
$$ y = [2678, 3941, -3672, -4068, 6267, 6838, -7197, -10778, 3947, 11289, 390, -7751, -1983, 3725, 602, -1322, 2195, 2203, -3124, -4018, 1334, 3623, 1561, 1375, -714, -5832, -3553, 8080, 8578, -5839, -10146, 3647, 9781, -1495, -7222, 1686, 7225, -2546, -8743, 734, 9067, 1654, -6743, -3026, 1743, -92, -267, 1939, 37, -3677, -1826, 772, 2, 686, 2809, -7, -6955, -5866, 5210, 9889, -534, -9622, -3925, 5319, 3737, -2077, -1125, 1444, -1368, -4038, 118, 5150, 3490, -2946, -5662, -1207, 2851, 1834, 986, 577, -2215, -2698, 1069, 2426, -13, 144, 1978, -595, -5483, -2251, 7334, 7494, -4124, -9802, -968, 6919, 1816, -2226, 863, 676, -5243, -3206, 5112, 5351, -2865, -5521, -1408, 384, 374, 2897, 2502, -3706, -6277, 570, 5305, -522, -4187, 1751, 3549, -4475, -5373, 4387]
2166D387L006r501m222O273K898k870L78L216k289o194J026P759J690n924k671
2181c038K437L70j4L407N11n092l654L772M884o11l083j266J141l02n92K197J587
2198B654l073l020L253K169k140p41K950o49m470j402O185L791n219n113K991
2213a834M477k741k201M577R74o919k144P659M041m083m573N06R79J240K366J672
2229C996m379m707L874N535k466m596L719K549n745l223P842M957o428o089K885
2244b276M956j684k169K564J662m582k592M058L202j615j131j062l270n5P079
2259C085M210p170o842L384O818j030m665J586L936l726n788L913Q663j986q167
2274c779j712M852K974p49p77j237m50N1M77k33P57K675j75n296l367O330P715
$$ y = [4387, 7393, -2108, -6330, -57, 2841, -29, 349, 3565, 1276, -4918, -3892, 3867, 5557, -367, -3038, -601, -231, -245, 3162, 3673, -1419, -5073, -1301, 3583, 2972, -111, -1377, -236, -538, -1130, 1067, 2654, -419, -3439, -186, 1983, -157, -898, 2052, 1403, -3067, -4469, 1716, 5507, 288, -4825, -1834, 2643, -98, -2299, 2278, 3252, -3667, -5811, 1848, 5889, 1806, -2767, -2261, -1282, -42, 2324, 3996, -383, -5090, -1216, 4319, 1853, -2743, 976, 3525, -2220, -5443, 2399, 7356, 928, -5161, -2276, 2680, 996, -1173, 1391, 3053, -1529, -4121, -63, 3139, 1524, 393, -669, -3939, -3994, 3085, 7295, 125, -6717, -3333, 3485, 2455, -2210, -624, 3312, -414, -6202, -2289, 6374, 4388, -3779, -5491, -639, 2335, 1586, 809, -428, -878, -827, -350, -583, 174, 2849, 2674, -2622, -5989, 341, 8056]
2291H056l995r858R34Q094N18n403N46M902j536o016k40O249L368m606n103N92
2307c498M004L171j442l470j360K627J730k544j558L548K368m670l955L164N903
2322D018l64n798k739M440M134k923l166J994K316k028k748J522M052P68m729
2337a251l435L332M553j34l537k265Q71L429J282k808j681K535J035l570j295
2352b939M528L454m297n647J965O474O65m910k271L117J212j936j83K115Q94k005
2368B36k529p34L046M066j737n568j041M586L318k515k898Q35K049k469j862L800
2384E83L440k425m969n05M097K893p67l336j345J824J682j067L43J351k40l308
2400a749j646L280L721q03l548j405J365J544J115l3j929j244P34L55J18J599
$$ y = [8056, 4061, -5797, -4863, 3231, 3749, -1654, -1108, 3794, 2258, -3758, -3998, 2251, 5619, 1013, -4090, -3498, 506, 3677, 2235, -1235, -2595, 32, 1762, -782, -2340, 1208, 3576, -1094, -5049, -1885, 4018, 3654, -2144, -4883, -443, 3691, 768, -2398, -404, 1912, -116, -2864, -1342, 2710, 3478, -1251, -4686, -1354, 3199, 3065, -472, -2737, -1866, 1563, 2845, 37, -1644, 891, 1926, -1644, -2939, 1589, 5043, 746, -4901, -2936, 3538, 4203, -707, -2978, 139, 1351, -585, -768, 1347, 2241, 236, -2293, -3027, 19, 4085, 2348, -3220, -4261, 325, 3643, 1128, -1770, -935, 1114, -1355, -3217, 583, 4023, 1598, -3371, -3876, 221, 3114, 2347, -989, -2334, -510, 1172, 105, 448, 1799, 1559, -1749, -3395, -115, 3606, 2803, -745, -2150, -785, 759, 1874, 1841, -88, -1332, -598, -243, -125, 1474]
2416A474J413l175l431K010L953K75k496o84qm30O7K247R89k354k309J266J682
2433D89k17j35J218j373k830J117L539r1k179p04M70l20Q52J544J75k185j798
2450b428J526K195m73o42J006p09k214O63L054K13k288j028O76J035N47J07n34
2467G06j112o91P19R04O51j60n25q21j569J380L002m46l609j014K325K305j158
2484H87j893M26J471j571j011J498K844r63l712o19K895J693p49j588j494Q54
2500a032J608K9j160N0J584n63k603k24M112K670m351m335K520N270r73l962J79
2517a181K551j66k656L87L233P09k858k728J202K825J735j979l134k01L393J435
2533B567l026j648L005J266l914j973M057L856k630n242K09M661J674l486j630
$$ y = [1474, 2887, -288, -3719, -1709, 2244, 2519, 23, -661, -669, -1099, -1032, 1215, 2204, -150, -2459, -1193, 489, 272, 137, 1355, -18, -2848, -1731, 1808, 1717, -462, -1166, -696, -1016, -164, 1380, 1555, -630, -2428, -902, 1293, 820, 178, 1184, 475, -1739, -1076, 1978, 2191, -97, -1125, -449, 586, 1133, 1240, 706, -406, -1097, -378, 526, 1177, 1017, 492, -329, -1898, -518, 2484, 2038, -1571, -2585, -260, 2045, 887, -1006, -580, 891, -680, -1691, -193, 2651, 1688, -2024, -2643, 252, 1945, 1196, -392, -1886, -1032, 576, 605, -555, -505, 1079, 516, -2087, -2311, 1801, 4471, 120, -4215, -1695, 3575, 2602, -1360, -1181, 1370, 1204, -1452, -1065, 2168, 2877, 19, -2709, -1507, 1318, 3053, 1074, -2060, -2261, 1132, 2567, -459, -2107, 898, 2164, -1750, -3723, 334, 4190, 1560, -3682, -3473, 1188, 2862, -624, -2254]
2548b254K166J019j352r48R64K141l23k827j853K101L899J05l954k599K961L514
2564B760j469l396P33M173j256l870J66N194M66m531k106K128L590p00k821p30
2580a669K507J92j142p92J151J484n44k768j016L345L223k585n173J042M797O75
2596B727l829j593L154J691k902k267K883L385k846l461J140L348J141k653j836
2611a918Q19J981J32j570m51R96J212q38k107K12L417Q77m083k564L631L443k050
2628A139k995J130K374o17k570J204K739o78l213m74K812J491j682j183n71K53
2644h41J593P01j140j137L26J212n16j562J271J983r14l383k8M087M36l420p36
2661b068K755J6k065J47K735L97l178q18K103J107n88l38j19j119m46K407J599
$$ y = [-2254, -88, 931, -421, -1369, -405, 1736, 1413, -1414, -3267, -1166, 2733, 2838, -1116, -3715, -754, 2760, 1291, -2105, -1372, 2801, 1545, -2325, -2159, 3035, 3501, -1030, -3136, -1008, 2582, 1882, -939, -1669, 838, 1030, -112, -904, 247, 1731, 1187, -1581, -2597, 748, 3971, 1386, -3787, -2745, 2052, 2727, -1102, -2695, 459, 2150, -752, -3019, -136, 3249, 403, -3058, -1918, 1430, 2571, -82, -1918, -1099, 882, 1014, -556, -1007, -11, 1201, 363, -1744, -1532, 1885, 2762, -1321, -3885, -254, 3189, 1139, -1856, -726, 1648, 1031, -1539, -335, 2404, 1726, -1487, -1961, 851, 2342, 660, -523, -1094, -841, 752, 1453, 313, -824, -498, 714, 198, -1364, -93, 1890, 976, -2407, -2435, 1652, 2088, -1332, -2068, 687, 703, -1362, -1215, 1520, 1917, -1261, -2079, 24, 1131, 543, 205, 86, -1033, -1479, 928, 2527]
2678B527k307k302J940J591j611q49K486K12k983m33L022J140l137r72L182K1
2694A527l107m0L488L86m064m7K923L34k438N38K071j464k636J540K632m07k280
2711a044mJ524r41m62K085n6l133m7L717L63l703l34L365K28l229k74L566Q74
2729B495l749j394L763J432l493j100L054J125k754q33J939M38m57m32P4m17j9
2746c28K058J87l393j187L636K209l672k092L428J995l759j988M136K005l811
2761e76l288L315L712k371l405J184K355q23o93N93k10q23J423Q06k288r91L020
2778I40K106m094k642L695L549l140l906K835L886k588l819K991L740k162m246
2793b855Q31L527N04j930j287K08Q02J250J83j504j276K358J223k391k680L207
$$ y = [2527, 220, -2082, -142, 1449, -162, -1011, 1475, 1687, -1296, -1729, 1293, 2433, -704, -1676, 1506, 1527, -1580, -1620, 1868, 2254, -1810, -1857, 1066, 1400, -1038, -500, 1571, 107, -2529, -989, 1643, 1236, -1044, -1048, 476, -465, -927, 1158, 1102, -2031, -2078, 1639, 2002, -1701, -2035, 1330, 1558, -1671, -1945, 1621, 2495, -1254, -2648, 1115, 2547, -946, -2046, 1008, 2133, -621, -1454, 485, 923, 466, 34, 108, -309, -328, 1730, 1917, -1476, -2663, 973, 3182, -490, -2582, 846, 2841, -918, -2906, 1230, 3235, -576, -3864, -549, 3163, 792, -2613, -1429, 926, 103, -590, 3, -207, -1030, 393, 1199, -1089, -2080, 940, 3046, -1048, -3690, 5, 3554, 414, -3492, -657, 3229, 641, -3178, -187, 3553, 1391, -2855, -2024, 1503, 2007, 77, -1210, -1002, -200, 1050, 1233, -271, -1547, 811, 2034, -357, -3037, 170]
2809A70L830l233m231K003M796j320n054P34M828m49m398n79M115J806l644k152
2825b778J798K042j5r75j562J58J437J253j644j695J650K511j450l385J216L740
2841B301m5m645j00M312R72l975j470L372J833k121k706J249K668k70k166j82
2857i73Q30R34K23p65j185M88J899m38k046k17K279J096l048j477L147J511k587
2874c29k255K167L065j724l555J014L106Lk667j12J333M41p56m1P4l9L69L81o03
2893a28j098J383J250j370j889J499K372j570k646J573K882j030l261O93L164
2908A824l05k721j01K199J39j329J99R43j074m43J094O2p81j54R78l11j099N65
2926c15J692r47j357N50J345k30k030O30J728q7k193j35K230J55j629k42J207
$$ y = [170, 4000, 767, -3464, -1461, 3335, 2015, -3039, -2305, 2523, 2074, -2324, -2903, 1212, 3018, -626, -2778, -980, 1062, 1047, 72, -1490, -1332, 105, 1358, -286, -1981, -331, 2180, 730, -2655, -1439, 2301, 2256, -2389, -2489, 1823, 2795, -1180, -2650, 722, 2555, 434, -2272, -1023, 1645, 1375, -791, -973, -143, 791, 1014, 249, -936, -448, 1451, 1013, -1033, -1250, 1029, 2125, -923, -2400, 747, 2258, -329, -2584, -417, 2648, 924, -2631, -1617, 1489, 1492, -1175, -1287, 46, 487, -269, -310, -236, -275, 94, 475, -128, -1226, 157, 1407, 37, -1852, -353, 2019, 449, -2197, -624, 2258, 1228, -2033, -1340, 1824, 1519, -1202, -1303, 896, 1035, -294, -95, 848, -226, -669, 425, 487, -294, -448, 530, 219, -880, -315, 1377, 430, -927, -377, 968, 738, -1292, -662, 1066, 979, -1214, -1349, 881, 1036, -593, -835, 372]
2943C72l8j066k5J396J22j680j61J448K24r86j80J080l53n30L80O67p35m95P65
2962B05M72j468Q4J454N02j919k22J833M81k371m01K728L20k760o66K723P18k423
2980g10k80Q93J009j024l73M67J18j24K61k58j048K09J846k34k207R5K476J89
2998A305k438m14K564L56k628p66K455J579j933j853J253J374k50p80m88J97J331
3015H64n28p99q2J156Q28j249j519O97K503l94k494l90K355O85j995j186K079
3032E31J704j641k470Q21K509J88k510q50J625J418p24j652K57J483J46j354p17
3049a236P74J784m87k432J44K153R95k139j593J447K504j379k246J81K552L18
3065A340k112r45K026J081p24j818L9K047N85j619j312J025J725m78j628l50K114
$$ y = [372, 334, -732, -757, 639, 761, -919, -1080, 368, 592, -394, -574, 506, 153, -377, 3, 670, -65, -560, 205, 677, -791, -707, 747, 1249, -670, -892, 941, 1422, -949, -1350, 1378, 1698, -1062, -1728, 995, 1713, -710, -990, -97, 912, -112, -485, -18, 100, -24, 237, -21, -1069, -860, 986, 752, -1455, -1360, 1116, 1305, -1133, -1547, 1017, 1373, -1255, -2021, 434, 2013, 80, -1773, -520, 854, 604, -176, -664, -467, 864, 336, -463, -545, 611, 1439, 190, -1329, -632, 1871, 1477, -1017, -1407, 948, 1633, -362, -1548, 531, 2235, 594, -1876, -1055, 1454, 1642, -868, -1718, -93, 1325, 601, -1051, -794, 689, 835, -519, -1236, -462, 1322, 835, -1597, -1453, 700, 1695, -444, -2037, -590, 1914, 535, -1711, -1530, 1022, 1340, -772, -1717, 309, 1390, 666, -1152, -1113, 934, 1519, -100, -1412, -387, 1338, 860, -768, -1118, 996]
3082I96P35j978j289J384K170r44k355J88K026R61j870j612J204J800q64j612
3098a060K66J615J22j617q71J469J727r90k047J07J602J253j621j143O95J631
3114A138q18j587k09K214O83k150j307J607K207m92k297j34J703O15j723k37J486
3131F99P29j181j305N79J780J5j613p66J015Q06J06q31q1N31J86p28j023R70J721
3150A609q70k197K29K129Q6j302n29J115K64j097l36J176N83o63r45K68N06O0
3168H6J84m31n46J69P53K57o62J75K80l07p34J43J498P2j493l13J484K03j003
3187a85j73Q27R6r49K31Q17j88m31l30M00J14o5j03L24o43L00L09q9l07Q4M33
3208D72l25r08K29J492o64j325M85J038K06j088m37J016L78j077l12J317K26r69
$$ y = [996, 1731, -247, -1536, -152, 2018, 1074, -1281, -1093, 933, 1894, 24, -1588, -384, 1416, 552, -1060, -794, 821, 943, -674, -1545, -76, 1651, 661, -1386, -1279, 323, 1576, -45, -1188, -493, 1138, 320, -1267, -1476, 738, 1421, -729, -2036, -429, 1778, 1286, -1011, -1145, 558, 1173, -550, -787, 699, 1428, 247, -1058, -479, 1301, 1316, -297, -1063, -48, 758, 864, 33, -48, 483, 669, -59, -1082, -112, 1609, 739, -1458, -1229, 900, 986, -316, -845, 270, 534, -563, -899, 277, 860, 197, -748, -480, 26, 86, 270, -161, -707, -538, 215, 472, -190, -15, 265, -42, -776, -633, 865, 937, -556, -869, 615, 818, -185, -358, 469, 565, -384, -153, 664, 476, 45, -285, 115, 229, 164, 61, 385, -258, 42, 351, 262, -45, 39, 472, 147, -761, -532, 960, 296, -1029, -544, 494, 700, -388, -825, 191, 569, -508, -820, 497, 723, -246]
3226b46o65Q10M57J71k50p95l71P32P97n72o25L94O83l27j359P88J760l69j897
3245h84n48K227L51j597n23J597J66j144m11Q25J398p91j314k99J258O67pj406
3263d35n74L41J594l65j534O65J370o51k074N23K855k82k235j387J932K167j816
3280I4j182Q74R72p29j017N90Q97J27p01j239N10J082J066j056j545M02J794Q
3298I47j537m10J824K68k233m48K385J589k024k251R72K260p2j727o81J484O43
3315I89j015n16N39L68K33j053r97J316J169k5k190n49K041J187j398j389R17
3332c73J505p86k310J178K466m00k657n72K267J049r20j744P35Q97K02r45N0O72
3350C14j70J91q56l6J210O05j044j776J205J976l57k200l28J952L79j455j135
$$ y = [-246, -911, -101, 356, 527, 277, -518, -889, -157, 640, 68, -557, -163, 520, 193, -1166, -378, 1382, 1013, -884, -1432, 795, 1146, -451, -974, 623, 789, -355, -766, 59, 1457, 666, -648, -947, 311, 978, 971, -435, -1009, -668, 926, 561, -973, -308, 1062, 411, -1663, -1140, 1715, 1433, -802, -2189, -257, 1910, 94, -1088, -214, 758, 29, -988, -398, 499, 626, -75, -1314, -804, 278, 1344, 288, -1257, -855, 939, 947, -590, -1000, 824, 1092, -1141, -1589, 796, 2385, 361, -1890, -918, 1342, 1270, -457, -1138, 346, 989, -26, -542, -3, 365, 598, -455, -1452, -136, 1033, 1008, -1182, -1731, 310, 1497, 99, -1290, -373, 1132, 346, -1964, -786, 1680, 1280, -1377, -1949, 318, 1367, 447, -1297, -562, 335, 537, -408, -358, 314, 144, 335, -521, -557, 653, 1258, 214, -1562, -357, 1619, 1262, -938, -1266, 686, 1065, -390, -1525]
3367a525K242J072k027j433J229J684m90r61n96N49M33O4J5k35m0K83l41o32J72
3386e37J738n45j682r05K524R92j683j360J371J023r43j165J342J288j141j667
3402a350K85J685K7q92K07K04m69L68M61N1p83K23K11o42q1J296M16j267j270
3421a320J327J556o92j867K05J872r25r08P78J266j241j226Q14J138n69o18J4
3438c96O44o33m46P21O92p55m46P86k62n31Q52Q67j113j690R49J512O5j547L67
3457c64J116q02j351J343J452o22j904N35J502k99j053K69N65l04l17M88K25m84
3475em56P56K41o75K48Q52j032j196J034J524m12j701N03J457n39j815O43J867
3493A294m15j846j83J614O83j241p30R48j73o31P30N00n86k62J95j66m05P77J141
$$ y = [-1525, 717, 1789, -238, -1671, -442, 1242, 752, -209, -805, -256, 177, 241, 256, 21, -19, 264, -77, -709, -537, 1201, 656, -1026, -1931, 593, 1585, -98, -1458, -87, 936, -7, -1172, 170, 1458, 317, -1350, -1065, 620, 647, -245, -38, 166, -303, 65, 526, 577, -206, 17, 228, -414, -495, 801, 1217, -50, -1320, 7, 1563, 871, -996, -791, 1081, 156, -752, 26, 1292, 51, -1175, -361, 777, 208, -410, -396, 248, -385, -831, -110, 582, -173, -619, 167, -95, -626, 226, 1093, -20, -1710, -761, 751, 816, -731, -364, 752, -50, -1401, -58, 1394, 772, -1132, -597, 905, 606, -447, -178, 387, 83, -234, 254, 479, -5, -461, 295, 536, -139, 109, 961, -71, -1267, -233, 1291, 879, -822, -319, 1138, 599, -1216, -573, 1294, 879, -967, -1150, 464, 1147, -94, -824, 124, -49, -680, 50, 550, -36, -298, -103, -269, -674, 103, 1244]
3512A244r75j864O71K052J26k236n0J853L48k371O6K143L74j664j309J644J251
3529A303p49p44j82K93q9N87k5l35k5K81m09j099J334J437o69k545O8K290R18
3548A640j868j269J687J074j303j137J177J102p19j518o5J513M76l97j132M9O96
3565FJ27l88k02M24N01l30j184J43J549J152k288j217J568K026j422j842Q39J472
3583I34p73q00j4J393K67j733l55R34J006j59r37n17P00O89k97p16j78J119q8
3602D75q76l04R11J144j047j587J5K563j08j584o95J189P36j055k44L60M18o88
3620c77n79L65J044K67j165n32M41N87O06m17p62J03J037J1j124K31J083n5j709
3639i45l16J951Q60j124j392O00R37j31p64M39M78l68n60k24O99O81m47p07l59
$$ y = [1244, 269, -1595, -924, 1128, 1254, -982, -1032, 821, 1169, -1202, -1136, 1007, 1381, -283, -1592, 52, 1303, 554, -190, -372, -79, -168, 419, 394, 59, 34, 315, -94, -1193, 141, 1578, 909, -1636, -1568, 722, 1640, -228, -1497, 190, 1264, -39, -1176, 1, 1103, 384, -1134, -1199, 314, 790, 393, -739, -690, 6, 133, -255, -457, -33, 468, 138, -1046, -903, 646, 1798, -490, -1707, -139, 1887, 465, -1377, -538, 934, 161, -639, -653, 740, 1007, -726, -1081, -147, 859, 700, -237, -754, -54, 635, 338, -378, -556, 563, 475, -401, -705, 206, 1350, 303, -1284, -1269, 1294, 1186, -398, -1093, 96, 832, -223, -467, -107, 311, -377, -956, -591, 453, 720, -445, -977, -536, 51, 657, 240, -522, -419, 618, 629, -495, -264, 819, 764, -945, -1261, 690, 1550, 426, -966, -366, 571, 440, -324, 115, 593, 225, -335, -559, 140, 821, 374, -333, -692]
3658f92M44N96O07j079o16O39L96p32j57P43O66j202q11R63J074l92j097K79N36
3677A65N8p86M84O63p52m21l68J379K09l01l10n28L16K09O43n59l79LL07q0q4
3698a32M46N32o94r18L73J545o93r45M29N88l31o65M38O00k7r53k61J210m1n01
3718@j91k5k23Q10N5l54k99K12L98j119K17J018K79r02r32M81J399j25j302L0
3738e73R62j65o82N21J47K4o23j27M14L94M43r67l40N02P25Lo67l24L70K57n52
3759b58j41O75N84q01j042L31J746k94j035n02Q30M13j91q22O78K97o09r67P15
3778c93Q54L25m47j127k3J038P77j176l06N48J86l55m62K99Q89J74j832R1J355
3797D15J60o76n57J03R57j16o78l28J242j9p84n88J029O60k94r16l83Q50O74J7
$$ y = [-692, -248, 348, 955, -124, -740, -101, 295, -437, -594, 149, 815, -387, -1198, -235, 839, 447, -650, -371, 165, 223, -563, -79, 584, -168, -589, -957, 422, 631, 330, 20, -508, -192, 17, 660, 101, -278, -275, 32, -48, -132, 314, 846, 152, -766, -393, 1152, 459, -486, -57, 531, 200, -465, -27, 573, 546, -407, -668, 542, 501, 0, -191, -216, -439, 371, 426, 72, -227, -15, 383, -736, -519, 499, 778, -124, -1056, -575, 824, 699, -603, -573, 389, 224, -458, 63, 210, 234, -389, -516, -102, 292, 735, -232, -572, -70, 655, 658, -9, -333, 37, 294, -258, -399, 276, 860, 59, -983, -652, 1094, 800, -235, -737, 93, 506, 315, -507, 171, 468, -141, -1108, -393, 461, 786, 339, -788, -811, 227, 1004, -172, -478, 70, 256, -99, -561, -262, 627, 801, -1031, -940, 415, 575, -101, -658, -555, 402, 286, -392, -720, 522, 503, -281, -869, 160, 820, 526, -390, -773, 77, 751, 768]
3817G68j393K76J019j09q39j8O58O02r86j138O65J360K10j525p21J378N67q52
3835g8m13L34N55k09r81j31J375K44p49q17M95M64O13j067l53Q32O91o99m28L36
3855A4N61K9j599L09J140M08q31q85J61J519Oj159J40N90M06r63m04O59O34j81
3875E54j311M39M31L87k52p82J78Q18K26j030j34O76K67r29l25Q89M80k32j063
3894g13K58O87j06l89k86P22m9l86n9M16l8K69k69q31M82O35K12r87j54L60P43
3915E17m16o31N77K96m63m62N82Q43q02l33QM35R6l11L41l69J06J43l3j6j38K49
3937B19m7o71j09Q79K84r77m05O95N74o07q1M70K59l31q16N62L14j20p41R2P68
3958B11m72r2L60J26k32j08J92j80R4N47k18p23R0L36O53o00p80N28O72k71n92
$$ y = [768, -625, -349, 670, 561, -278, -296, 362, 964, -22, -1160, -495, 865, 1075, -450, -1171, 207, 774, -78, -491, -157, 398, 189, -792, -923, 452, 696, -53, -870, -375, 89, 702, -365, -718, 114, 805, 106, -322, 14, 575, 604, -995, -686, 454, 862, 31, -854, -693, 826, 832, -327, -187, 403, 809, -154, -558, 101, 735, 554, -757, -318, 113, 500, 248, -534, -356, 462, 688, -342, -476, 200, 467, -462, -787, 102, 582, 350, -713, -455, 232, 126, -263, -549, 173, 124, -262, -321, 95, 57, 326, 57, -774, -292, 343, 555, -432, -586, -226, 517, 101, -530, 47, 343, -120, -582, 0, 843, 41, -292, -284, 151, 247, -64, 277, -92, 14, 157, 124, 108, -30, 219, 172, -499, -608, 271, 555, -422, -827, -132, 442, -165, -246, 224, 483, 152, -664, -102, 212, 92, -649, -557, 211, -261, -353, 7, 133, -99, -207, -15, -195, -101, 446, 228, -495, -405, -69, 584, -16, -796, -268, 404, 133, -459]
3979d59M57J014p53j244J053M28J00q44k2J84M70l02k20J02J85j98k40m6K75J70
3999A10M78r12m48J213M47r17q63O67R23o87n38J89Q13R7j384n6J254p1l44m12
4019d41KQ01k72M0l55J74J82k3n05j5Q77q5n71k14K52Q87j50j338M26R11k88r50
4041f55N04O42K80j022n26O57Q74m48r35N95K49J25Q0p27k45Q36J20p89j55Q05
4061B65M12n17j125L67J238J25j325l54P71J149j251l91O95P20p61m73K55K90
4079I0N53o58n17K25R01m33j23l50L17Q3Q2n76L4J330n03j044j53J355M65j081
4099cp74M14R22k65p59M6J115j87j005k38Q01M04l10n10m2O20L87o27k35k13M64
4120EM69n72o35N39O46m66q22L04J063j10j323J64P82L38r68J95Q49J47r77r9
$$ y = [-459, -2, 1012, 259, -985, 68, 496, 596, -248, -270, -86, 384, 82, -138, -36, 149, -49, -289, -335, -60, 110, 588, -324, -772, 441, 888, -29, -892, -225, 698, 11, -527, -338, 475, 572, -812, -868, 386, 315, -29, -441, -439, 362, 90, 130, -225, -51, 131, 108, -397, -412, 465, 380, -191, -405, -153, 734, 584, -754, -328, 583, 295, -655, -151, 491, 771, -251, -777, -120, 754, 306, -629, -34, 215, 340, 420, -307, -552, 284, 404, -385, -540, 265, 677, 160, -965, -598, 640, 765, -560, -914, -143, 1006, -245, -636, 59, 779, 18, -455, -200, 90, 643, -15, -532, -307, 594, 161, 38, -312, 5, 88, 170, -406, -372, 958, 455, -589, -742, 613, 1078, -3, -777, -363, 559, 294, -465, -419, 696, 509, -496, -734, 67, 471, 161, -349, -391, 229, 616, -11, -246, -459, 5, 474, -98, -733, -194, 452, -14, -836, -532, 531, 421, -902, -738, 44, 382, -586, -391, 458, 605, -372, -471]
4140d71N75N76m91m07K70k9M8M82l11n18j8N87j17n52M97L64k03o84k07J296L66
4161A053j427m87R79M99q76j11O11K16o47j14J22N36l17k44q9J67O1J32j78k29
4181c43l66R12L99j068L98M87m8r05r6P32M92o31p54P73M75n30q03Q22N18p22
4201b58J9K87J91j39J28l49j03L60M0j73Q8k26K30K48m96J3J55L95o66n47Q24
4222B1M90q72m83P93N07j90n36Q3N58k98m40j00P18k37k53J73j65J30J69Q7n80
4243d25L31L38O7m74o0L36K70n71p63J011P97p11q85P41N73l13n79R3M45J86m08
4264aj99K06L54l46k40j41K21M57k73Q0l83L57N23o85l15M12Q60n48q47J68O21
4285B81P7m46o91R39O03j101j20M67P9k17j26k12J91N78o54k83R13J68o2m95j53
$$ y = [-471, 104, 680, 189, -218, 52, 23, 71, 553, 242, -276, -294, 293, 176, -376, 121, 485, 282, -402, -609, 687, 1053, -374, -861, 118, 617, -259, -370, 241, 457, -190, -304, -182, 354, 37, -207, -296, -129, -68, 64, -114, -343, -709, 203, 602, -466, -68, 419, 371, -534, -630, 102, 594, -37, -791, -18, 457, -73, -876, -54, 464, -258, -239, 48, 239, 100, 228, -121, -224, 136, 176, 3, 91, -135, 95, 343, -153, -140, 15, 410, -256, -803, 21, 511, -361, -844, -51, 456, 266, -270, -187, 371, 73, -367, -467, 251, 14, -239, -66, -231, -101, 68, 155, -425, -94, 244, 311, -163, -223, 113, 383, -188, -951, 60, 857, 146, -739, 2, 575, 262, -317, -224, 221, 407, -1, -200, 6, 360, 14, -226, -367, -146, 311, 38, 118, -265, 92, 615, -70, -385, 27, 887, 339, -508, -340, 281, 358, -88, -779, 160, 763, -338, -458, 9, 88, -129, -255, -467, -276, 302, -352, -635, 278, 446, 384, -111, -264]
4306b64M86J02l84o07M82O50q0j034Q5J013L1o83l14O81M12k72q66K91Q36j91
4326C74n43r7O04K28k55n06k04M83P87n70o23J07N23N7p24l36O15K02K14j028
4346f92K25J147l89r17L19O33k6l31l27L47K33j0n91k57J038k20k85M7j04M15
4366B55J66j72q26P23L33n94l20L72O00k99p42QO58K94j76o81N14J91n71K79k18
4387b06M27m65L00k41K36K63l43n1p8J37N25l67n02K48M91j81q47P3Q80j96k36
4408a33j80M89P5j42o54N02J60Q8n79J39P1J48J49j55j8K48k00J00m30K56K81
4429B15Pl94M2O87l99m52m54J256K69r16k85M09K53l56M2J37J13j45j82K58j73
4450f8L85n52j97N53j29K10k56j16j49P72j93j075O47N31m88J89k19J93n9l85
$$ y = [-264, 222, 324, -60, -667, -185, 465, 385, -649, -564, 449, 480, -203, -517, 164, 576, 304, -562, -271, 565, 374, -169, -266, 338, 566, 311, -195, -399, 84, 871, 301, -322, -215, 308, 365, -359, -695, -80, 122, 336, -692, -467, 680, 291, -626, -307, 326, 300, -31, -358, -11, 222, 212, -379, -636, 402, 182, -103, -56, -160, 255, 421, 249, -577, 146, 479, -115, -435, -63, 537, 238, -504, -496, 162, 456, 280, -401, 113, 304, -267, 12, -206, 221, -244, 56, -185, 51, 314, -29, -80, -158, -21, 504, 137, -365, -117, 374, 193, -654, -581, 299, 103, -133, -313, 176, 251, 109, -545, -43, 117, 205, -374, -235, -164, -16, 133, -22, -40, 208, 8, 108, -322, -66, 215, 222, -172, -130, 557, 158, -294, -748, 508, 777, -139, -424, -15, 238, -118, -76, 61, 174, 29, -153, 105, -68, 317, -235, -432, 121, -8, 202, -54, -170, -319, 453, 260, -815, -168, 363, -125, 64, -155, 38, -21, -406]
4470d06J50J42K96j03n04M91K17k19m07L41K64l77N14m19m4L71Q5m81K23k17L39
4491B56Q4m78K8L83O9j77n19N89K89o39l02L04N01j51m78l5P70j79m00j72L51
4512I4N7k70l8J6MN78k26p89oQ93M0o07J47N8M89m37m23J39J069o72o14Q5N49
4535A36K52m93j32L10N2j3p06K38Q24r4l78k36M56K18j40l91k84N80L94p03o8
4556a78O24p4P6n75p4N19K4m94k43K31M45j42q46O33N80j95o24O8L43J84l23m46
4578d87K83J31K75j96n34K19O48j00n70j3P93q5n51j82M80j73O7j12j71L26N00
4599E48n41l88M93o8K6K5Lo2L62o54n28R81K38k32r14L32L41L57k25m75L15M83
4621D17k86o84K50R67o70o59L60Q39l38q1l74P6L80k03j22J01N3J62l09P6l23
$$ y = [-406, -256, -114, 182, 79, -425, 66, 283, 64, -343, -2, 262, -115, 399, -20, -64, 307, 392, -89, 134, -83, 256, 340, -138, -110, 273, 342, 165, -354, 235, 524, -115, -417, -113, 388, 237, -241, -276, 494, 315, -85, -257, 94, 151, -119, -157, -141, -137, 441, 215, -574, -580, 313, 353, -254, -107, -49, 440, 3, -420, -281, 788, 116, -498, -413, 136, 388, -105, -237, 73, 125, 112, -594, -356, 468, 374, -4, -240, 216, 434, 294, -97, -381, 199, 593, -110, -178, 446, 372, 448, -127, -201, 318, 342, -152, -395, -164, 281, 139, -707, -74, 506, 311, -313, -245, 98, 282, -41, -487, -204, -73, 202, 6, -528, -309, 339, 239, -331, -344, 449, 364, -187, -369, 111, -62, 5, -107, -278, 48, 548, 7, -381, 112, 44, 70, 95, 98, 36, 398, -256, -784, 197, 435, 203, -711, -379, -38, 319, 94, -381, -66, 417, 131, -553, -303, 664, -6, -665, -305, 534, 196, 115, -259, -183, 197, -6, -128, -27, 26, 188, -121, -45, -368]
$$ [...]
8191a63
##END NTUPLES=NMR FID
##END=
