##TITLE=1H_Ser 3511-Val-2
 CDCl3, 8 sc, 
 4.7.2019
##JCAMPDX= 6.0         $$ Bruker NMR JCAMP-DX V2.0
##DATA TYPE= NMR FID
##DATA CLASS= NTUPLES
##ORIGIN= UXNMR, Bruker Analytische Messtechnik GmbH
##OWNER= root
$$ XWIN-NMR		Version 3.5
$$ Thu Jul  4 13:53:13 2019 Russian Standard Time (UT+4h)  she@DPX200
##.OBSERVE FREQUENCY= 200.13155
##.OBSERVE NUCLEUS= ^1H
##.DELAY= (6, 6)
##.ACQUISITION MODE= SIMULTANEOUS
##.ACQUISITION SCHEME= undefined
##.AVERAGES= 8
##.DIGITISER RES= 18
##SPECTROMETER/DATA SYSTEM= spect
##.PULSE SEQUENCE= zg30
##.SOLVENT NAME= Pyr
##.SHIFT REFERENCE= (INTERNAL, Pyr, 0, 15.7039)
##AUDIT TRAIL= $$ (NUMBER, WHEN, WHO, WHERE, WHAT)
$$ ##TITLE= Audit trail, XWIN-NMR		Version 3.5
$$ ##JCAMPDX= 5.01
$$ ##ORIGIN= Bruker BioSpin GmbH
$$ ##OWNER= she
$$ F:/spectra/data/she/nmr/H-F/1/audita.txt
$$ ##AUDIT TRAIL=  $$ (NUMBER, WHEN, WHO, WHERE, WHAT)
(   1,<2019-07-04 13:51:21.95 +0400>,<she>,<DPX200>,
      <created by zg, POWCHK disabled, PULCHK disabled
       configuration hash MD5:
       00 E9 B6 7A A2 85 ED C7 34 08 36 98 17 FE 4E 26
       data hash MD5: 16K
       EE 3F BB DF 29 A8 EA 5B 94 FE 86 DD A0 B1 1D B9>)
$$ ##END=
$$ 
$$ hash MD5
$$ BE E6 DB 28 31 C7 69 5B 21 B5 AA D6 4F 7C 5D 78
##$RELAX= 
##$RELAX= 
##$RELAX= 
##$RELAX= 
##$RELAX= 
##$RELAX= 
$$ Bruker specific parameters
$$ --------------------------
##$DU= <F:/spectra>
##$EXPNO= 1
##$NAME= <H-F>
##$PROCNO= 1
##$TYPE= <nmr>
##$USER= <she>
##$AMP= (0..31)
100 100 100 100 100 100 100 100 100 100 100 100 100 100 100 100 100 100 
100 100 100 100 100 100 100 100 100 100 100 100 100 100 
##$AQSEQ= 0
##$AQ_mod= 1
##$AUNM= <au_zg>
##$AUTOPOS= <>
##$BF1= 200.13
##$BF2= 200.13
##$BF3= 200.13
##$BF4= 200.13
##$BF5= 200.13
##$BF6= 200.13
##$BF7= 200.13
##$BF8= 200.13
##$BYTORDA= 1
##$CFDGTYP= 0
##$CFRGTYP= 5
##$CHEMSTR= <none>
##$CNST= (0..31)
1 1 145 1 1 1 1 1 1 1 1 1 1 1 1 1 1 1 1 1 1 1 1 1 1 1 1 1 1 1 1 1 
##$CPDPRG= <>
##$CPDPRG1= <>
##$CPDPRG2= <>
##$CPDPRG3= <>
##$CPDPRG4= <mlev>
##$CPDPRG5= <mlev>
##$CPDPRG6= <mlev>
##$CPDPRG7= <mlev>
##$CPDPRG8= <mlev>
##$CPDPRGB= <>
##$CPDPRGT= <>
##$D= (0..31)
0 1.2 0 0 0 0 0 0 0 0 0 0.03 0 0 0 0 0 0 0 0 0 0 0 0 0 0 0 0 0 0 0 0 
##$DATE= 1562233881
##$DBL= (0..7)
120 120 120 120 120 120 120 120 
##$DBP= (0..7)
150 150 150 150 150 150 150 150 
##$DBP07= 0
##$DBPNAM0= <>
##$DBPNAM1= <>
##$DBPNAM2= <>
##$DBPNAM3= <>
##$DBPNAM4= <>
##$DBPNAM5= <>
##$DBPNAM6= <>
##$DBPNAM7= <>
##$DBPOAL= (0..7)
0.5 0.5 0.5 0.5 0.5 0.5 0.5 0.5 
##$DBPOFFS= (0..7)
0 0 0 0 0 0 0 0 
##$DE= 6
##$DECBNUC= <off>
##$DECIM= 24
##$DECNUC= <off>
##$DECSTAT= 4
##$DIGMOD= 1
##$DIGTYP= 9
##$DL= (0..7)
0 120 120 120 120 120 120 120 
##$DP= (0..7)
150 150 150 150 150 150 150 150 
##$DP07= 0
##$DPNAME0= <>
##$DPNAME1= <>
##$DPNAME2= <>
##$DPNAME3= <>
##$DPNAME4= <>
##$DPNAME5= <>
##$DPNAME6= <>
##$DPNAME7= <>
##$DPOAL= (0..7)
0.5 0.5 0.5 0.5 0.5 0.5 0.5 0.5 
##$DPOFFS= (0..7)
0 0 0 0 0 0 0 0 
##$DQDMODE= 0
##$DR= 18
##$DS= 0
##$DSLIST= <SSSSSSSSSSSSSSS>
##$DSPFIRM= 0
$$ [...]
##$SUBNAM2= <"">
##$SUBNAM3= <"">
##$SUBNAM4= <"">
##$SUBNAM5= <"">
##$SUBNAM6= <"">
##$SUBNAM7= <"">
##$SUBNAM8= <"">
##$SUBNAM9= <"">
##$SW= 24.9336996594482
##$SWIBOX= (0..15)
0 0 2 0 0 0 0 0 0 0 0 0 0 0 0 0 
##$SW_h= 4990.01996007984
##$TD= 16384
##$TD0= 1
##$TE= 0
##$TE2= 300
##$TE3= 300
##$TEG= 300
##$TL= (0..7)
0 120 120 120 120 120 120 120 
##$TP= (0..7)
150 150 150 150 150 150 150 150 
##$TP07= 0
##$TPNAME0= <>
##$TPNAME1= <>
##$TPNAME2= <>
##$TPNAME3= <>
##$TPNAME4= <>
##$TPNAME5= <>
##$TPNAME6= <>
##$TPNAME7= <>
##$TPOAL= (0..7)
0.5 0.5 0.5 0.5 0.5 0.5 0.5 0.5 
##$TPOFFS= (0..7)
0 0 0 0 0 0 0 0 
##$TUNHIN= 0
##$TUNHOUT= 0
##$TUNXOUT= 0
##$USERA1= <user>
##$USERA2= <user>
##$USERA3= <user>
##$USERA4= <user>
##$USERA5= <user>
##$V9= 5
##$VALIST= <valist>
##$VCLIST= <CCCCCCCCCCCCCCC>
##$VD= 0
##$VDLIST= <DDDDDDDDDDDDDDD>
##$VPLIST= <PPPPPPPPPPPPPPP>
##$VTLIST= <TTTTTTTTTTTTTTT>
##$WBST= 1024
##$WBSW= 4
##$XGAIN= (0..3)
0 0 0 0 
##$XL= 0
##$YL= 0
##$YMAX_a= 443282
##$YMIN_a= -800408
##$ZGOPTNS= <>
##$ZL1= 120
##$ZL2= 120
##$ZL3= 120
##$ZL4= 120
##$ABSF1= 10
##$ABSF2= 0
##$ABSG= 5
##$ABSL= 3
##$ALPHA= 0
##$AQORDER= 0
##$ASSFAC= 0
##$ASSFACI= 0
##$ASSFACX= 0
##$ASSWID= 0
##$AUNMP= <proc_1d>
##$AZFE= 0.1
##$AZFW= 0.1
##$BCFW= 1
##$BC_mod= 2
##$BYTORDP= 1
##$COROFFS= 0
##$CY= 11.3945322036743
##$DATMOD= 1
##$DC= 2
##$DFILT= <>
##$DTYPP= 0
##$F1P= 18.9103706918063
##$F2P= -1.10871071338519
##$FCOR= 0.5
##$FTSIZE= 0
##$FT_mod= 4
##$GAMMA= 1
##$GB= 0.15
##$INTBC= 1
##$INTSCL= 1
##$ISEN= 128
##$LB= 0.24
##$LEV0= 0
##$LPBIN= 0
##$MAXI= 10000
##$MC2= 0
##$MEAN= 0
##$ME_mod= 0
##$MI= 1.114404
##$NCOEF= 0
##$NC_proc= 0
##$NLEV= 6
##$NOISF1= 3.799351
##$NOISF2= 2.8
##$NSP= 1
##$NTH_PI= 0
##$NZP= 0
##$OFFSET= 15.70392
##$PC= 1
##$PHC0= -8507.931
##$PHC1= 27.80097
##$PH_mod= 1
##$PKNL= yes
##$PPARMOD= 0
##$PSCAL= 0
##$PSIGN= 0
##$REVERSE= no
##$SF= 200.130013532006
##$SI= 16384
##$SIGF1= 3
##$SIGF2= 2
##$SINO= 400
##$SIOLD= 16384
##$SREGLST= <1H.CDCl3>
##$SSB= 0
##$STSI= 0
##$STSR= 0
##$SW_p= 3612.71676300578
##$SYMM= 0
##$S_DEV= 0
##$TDeff= 0
##$TDoff= 0
##$TI= <>
##$TILT= no
##$TM1= 0
##$TM2= 0
##$TOPLEV= 0
##$USERP1= <user>
##$USERP2= <user>
##$USERP3= <user>
##$USERP4= <user>
##$USERP5= <user>
##$WDW= 1
##$XDIM= 8192
##$YMAX_p= 0
##$YMIN_p= 0
$$ End of Bruker specific parameters
$$ ---------------------------------
##NTUPLES= NMR FID
##VAR_NAME=  TIME,          FID/REAL,        FID/IMAG
##SYMBOL=    X,             R,               I
##VAR_TYPE=  INDEPENDENT,   DEPENDENT,       DEPENDENT
##VAR_FORM=  AFFN,          ASDF,            ASDF
##VAR_DIM=   8192,          8192,            8192
##UNITS=     SECONDS,       ARBITRARY UNITS, ARBITRARY UNITS
##FACTOR=    0.0002004,     1,               1
##FIRST=     0,             0,               0
##LAST=      1.6414764,     0,               0
##MIN=       0,             -800408,         0
##MAX=       1.6414764,     443282,          0
$$ Real data points
##PAGE= N=1
##DATA TABLE= (X++(R..R)), XYDATA
$$ [...]
$$ plain form
2459 -238 3802 2768 -1016 -3490 -2461 663 3342 1843 -1455 -1800 -818 -813 149 3012 2846 -1338 -3598
2476 -3598 -1444 2177 4177 1766 -2160 -3036 107 2401 2199 700 -635 -780 -1422 -1925 1659 4906
2492 4906 1085 -4818 -3346 1819 2952 1433 -98 -2227 -2265 270 2562 1880 -117 -1441 -2071 -1978
2508 -1978 -117 3018 3423 -2047 -5322 -1436 3027 2281 -316 -976 -1624 -2110 147 2150 1589 25
2524 25 -1261 -2877 -2218 1412 4644 2199 -3566 -5174 122 4650 2269 -1084 -607 -223 -2064 -576
2540 -576 3419 4057 242 -3784 -3685 1132 4660 2397 -2176 -3786 -1229 1694 2668 638 -978 -402
2556 -402 -904 -3076 -778 4569 3791 -2672 -5618 -1134 3857 2777 -1691 -2098 -130 -915 -2184 1022
2572 1022 4308 752 -3659 -3611 -273 2371 3171 847 -3717 -3924 739 4117 1906 -2279 -1779 664
$$ packed form
2459b38M040j034l784k474J029L124K679j499l298l45R82NR62K863j66m184k260
2476c598K154L621K000k411l926q76L143K294k02j499j335j45o42n03L584L247
2492D906l821n903J472N165J133j519j531k129l8K535K292o82j997j324o30R3
2508a978J861L135M05n470l275L886M463p46k597o60o48m86K257K003n61j564
2524B5j286j616O59L630L232k445n765j608N296M528k381l353M77L84j841J488
2540e76L995O38l815m026R9M817L528k263m573j610K557K923R74k030j616N76
2556d02n02k172K298N347p78o463k946M484M991j080m468m07J968p85j269L206
2572A022L286l556m411M8L338K644Q00k324m564k07M663L378k211m185N00K443
$$ plain form
2588 664 -78 -1817 1735 4905 -54 -5740 -2004 4097 3039 -325 -1069 -418 -493 -425 1613 2069 -309
2605 -309 -1603 -289 -384 -431 2436 4190 -955 -7154 -1895 5410 3816 -2914 -3872 196 621 -1264 71
2622 71 2997 408 -4826 -3486 2999 4371 -1 -1898 -1988 -1654 229 3360 1496 -2743 -2091 1191
2638 1191 840 -1552 121 3743 1479 -5176 -4127 4579 6131 -1517 -4183 256 1174 -1108 688
2653 688 4047 1026 -4092 -3124 1811 4080 1715 -962 -1660 -2415 -1157 4334 4493 -2077 -5101 13
2669 13 3566 45 -1268 1639 1263 -2946 -3895 1665 4317 722 -3294 -1596 449 -903 -343 3392
2685 3392 1270 -3914 -3293 1108 2166 466 486 -29 -3309 -3333 2314 6424 1383 -5928 -3890 3477
2701 3477 3473 -828 334 1862 -1868 -3084 1399 4421 963 -2677 -1849 362 340 333 2156 1476 -1972
$$ packed form
2588F64p42j739L552L170m959n686L736O101j058l364p44O51p5O8K038M56k378
2605c09j294J314r5m7K867J754n145o199N259P305j594o730r58M068M25j885J335
2622G1K926k589n234J340O485J372m372j897r0L34J883L131j864m239O52L282
2638A191l51k392J673L622k264o655J049Q706J552p648k666M439R18k282J796
2653F88L359l021n118R68M935K269k365k677o98p55J258N491J59o570l024N114
2669A3L553l521j313K907l76m209r49N560K652l595m016J698K045j352N60L735
2685C392k122n184O21M401J058j700K0n15l280k4N647M110n041p311K038P367
2701C477mm301J162J528l730j216M483L022l458l640Q28K211k2pJ823o80l448
$$ plain form
2718 -1972 -2830 1482 2252 -686 -488 2415 -775 -4417 -1061 5077 3160 -3113 -4722 -41 2796 1022
2734 1022 39 387 -1682 -3569 81 4242 1521 -3533 -2550 609 474 -334 2074 1231 -2723 -3710 1002
2751 1002 4219 380 -3412 -89 2650 -877 -2717 1614 3482 -741 -3265 -141 1512 842 1224
2766 1224 1749 -1403 -4056 76 4796 2660 -2969 -2585 1292 499 -1728 2642 3727 -3007 -5996 604
2782 604 6054 1991 -3718 -2663 931 832 -657 462 1552 -1062 -2439 -231 1102 -625 325 1593
2798 1593 -1204 -4012 -258 4165 2067 -2141 -2266 518 275 -1085 634 3642 142 -5508 -3282
2813 -3282 4215 4827 -613 -3074 -1456 216 549 2363 1552 -1372 -2828 73 2779 704 -888 1277
2829 1277 1233 -3346 -2620 4172 4591 -2739 -4209 1362 2130 -2149 -1863 3130 2235 -3672 -4296 1607 3914
$$ packed form
2718a972q58M312P70k938J98K903l190l642L356O138j917o273j609M681K837j774
2734A022r83L48k069j887L650M161k721n054R83L159j35q08K408q43l954r87M712
2751A002L217l839l792L323K739l527j840M331J868m223k524L124J653o70L82
2766A224N25l152k653M132M720k136n629L84L877p93k227M370J085o734k989O600
2782F04N450m063n709J055L594r9j489J119J090k614j377K208J333j727R50J268
2798A593k797k808L754M423k098m208j25K784k43j360J719L008l500n650K226
2813c282P497O12n440k461J618J672L33J814q11k924j456K901K706k075j592K165
2829A277m4m579P26O792M19p330j470N571P68m279K86M993q95n907o24N903K307
$$ plain form
2846 3914 424 -1112 -1016 -2417 -1386 3780 3466 -3136 -4477 878 2475 -861 -818 2518 727 -4061
2862 -4061 -2905 3993 4246 -2321 -4245 321 2511 -202 -771 1481 713 -1433 -815 152 391 1226 1579
2879 1579 -662 -2633 -1130 2737 3631 -682 -3519 -802 2243 907 -714 955 1120 -2083 -2832 1270
2895 1270 3942 873 -3654 -2629 1264 2129 -202 -556 -474 -2047 -1077 1745 1570 -1493 -877 1331 -789
2912 -789 -2797 549 3434 495 -3916 -2321 2539 2209 -1568 -596 2039 -988 -3233 628 3704 1142
2928 1142 -2180 -1333 -244 220 2046 2344 -1134 -3539 -939 3042 2435 -1301 -1187 920 -252 -1812
2944 -1812 649 3620 364 -2859 -1790 1293 1267 603 -166 -527 -988 -1244 -158 1547 1050 -790 -1519
2961 -1519 -1570 -179 854 1790 312 -2645 -2258 357 2356 1216 -1141 -1616 -429 -214 -186 1414 2056
$$ packed form
2846C914l490j536R6j401J031N166l14o602j341N355J597l336M3L336j791m788
2862d061J156O898K53o567j924M566K190k713n69K252p68k146O18R67K39Q35L53
2879A579k241j971J503L867Q94m313k837K717L045j336j621J669J65l203p49M102
2895A270K672l069m527J025L893Q65k331l54Q2j573R70K822j75l063O16K208k120
2912g89k008L346K885k939m411J595M860l30l777R72K635l027k245L861L076k562
2928A142l322Q47J089M64J826K98l478k405K600L981o07l736J14K107j172j560
2944a812K461K971l256l223J069L083k6o64p69l61m61k56J086J705m97j840p29
2961a519n1J391J033R36j478k957L87K615J999j140k357m75J187K15K8J600O42
$$ plain form
2978 2056 -1300 -2981 -214 1926 1032 -87 -257 -714 -964 384 1891 1079 -1019 -1300 722 698 -674
2995 -674 898 2499 -268 -3303 -371 2961 1917 -848 -1133 -472 -143 357 934 870 -826 -1472 -895
3012 -895 504 999 627 112 -1563 -2049 13 2254 532 -1819 -1346 -207 763 -67 -676 175 654 -1177
3030 -1177 -1892 930 2706 -261 -2021 -991 614 767 839 530 -572 -980 -480 1254 997 47 -191
3047 -191 286 -679 -997 1922 3359 -528 -3343 -467 2762 1010 -676 -42 342 -493 -923 691 1699
3064 1699 459 -1246 -1216 -615 80 1711 1055 -1764 -2758 150 2062 249 -907 164 240 -1494 -1651
3081 -1651 829 2344 517 -2915 -2392 1073 2586 299 -1096 -816 -323 -87 187 540 879 206 -1207
3098 -1207 -1345 373 1974 1363 -493 -2095 -1288 2033 1846 -468 -713 824 394 -1503 -287 2359
$$ packed form
2978B056l356j681K767K140q94j119j70m57k50J348J507q12k098k81K022k4j372
2995f74J572J601k767l035K932L332j044k765k85O61L29N00N77o4j696o46N77
3012h95J399M95l72n15j675m86K062K241j722k351M73J139R70q30o09Q51M79j831
3030a177p15K822J776k967j760J030J605J53P2l09j102m08N00J734k57r50k38
3047a91M77r65l18K919J437l887k815K876L229j752j686O34L84q35m30J614J008
3064A699j240j705L0O01O95J631o56k819r94K908J912j813j156J071P6j734j57
3081a651K480J515j827l432N23L465J513k287j395K80M93K36K74L53L39o73j413
3098a207j38J718J601o11j856j602Q07L321j87k314k45J537m30j897J216K646
$$ plain form
3114 2359 1904 -1134 -2509 -92 1866 1282 -552 -915 -512 -276 407 639 -119 -740 182 -495 -1353 559
3132 559 2621 135 -2591 -1652 1028 1722 -375 -1354 -39 404 -861 -293 765 920 -76 -996 -903 -305
3150 -305 1922 1432 -1455 -1860 440 1834 872 -638 -412 358 222 -548 -90 1570 819 -1140 -1193 525
3168 525 1745 1074 -134 -1304 -200 1436 533 -74 0 171 -690 -803 -76 1177 878 -598 -1751 -959
3186 -959 1173 1359 -396 -1475 -878 122 70 -76 344 798 -629 -1674 -467 1737 1244 -456 -1177
3203 -1177 -601 64 951 1094 -517 -1038 -193 -136 198 438 1046 718 -865 -1609 132 2425 941 -708
3221 -708 -1106 -45 359 848 928 -183 -879 -450 -104 451 1083 532 -804 -1352 -756 653 1532 18 -1211
3240 -1211 -1100 193 408 -190 350 179 -105 -1024 -769 367 1035 40 -1220 -611 126 124 587 677 -576
$$ packed form
3114B359m55l038j375K417J958n84j834l63M03K36O83K32p58o21R22o77q58J912
3132E59K062k486k726R39K680O94k097r79J315M43j265N68J058J55r96r20R3N98
3150c05K227m90k887m05K300J394r62j510K26P70j36p70M58J660p51j959n3J718
3168E25J220o71j208j170J104J636r03o07P4J71q61j13P27J253k99j476j153P92
3186i59K132J86j755j079N97J000n2j46M20M54j427j045J207K204m93j700p21
3203a177N76O65Q87J43j611n21Q45N7L34K40O08l28j583p44J741K293j484j649
3221g08l98J061M04M89Q0j111o96M29L46N55O32n51j336n48N96J409Q79j514j229
3240a211J11J293K15n98N40j71k84r19K55J136O68r95j260O09P37kM63R0j253
$$ plain form
3259 -576 -1228 38 983 690 218 -84 -312 -645 -261 1129 1536 -680 -1990 -70 1771 626 -716
3276 -716 72 310 -263 -83 502 501 35 -386 128 -178 -295 579 1149 -505 -1842 -137 1926 210 -1542
3295 -1542 -334 959 -561 -1067 444 1404 129 -2026 -1390 1076 1388 -203 -784 -802 -681 169 994
3312 994 705 -971 -676 775 372 -879 270 1621 -183 -2055 -572 2366 1340 -1579 -1501 1381
3328 1381 1192 -1314 -357 1641 952 -1475 -967 573 782 686 290 -655 -1380 -13 1777 1340 -1220 -1442
3346 -1442 492 835 -840 -412 1923 737 -2528 -1371 2072 1721 -1160 -2096 108 1180 -291 -976
3362 -976 460 488 -757 -526 189 -324 -399 1089 489 -1840 -1340 1602 1918 -595 -1602 327 1303 -593
3380 -593 -958 1328 1633 -1313 -2050 934 2550 88 -1689 -339 415 23 375 785 -527 -781 619
$$ packed form
3259e76o52J266R45k93m72l02k28l33L84J390M07k216j310J920J841j145j342
3276g16P88K38n73J80N85jm66m21N14l06j17Q74N70j654j337J705K063j716j752
3295a542J208J293j520n06J511R60j275k155O36K466L12j591n81j8J21Q50Q25
3312I94k89j676K95J451m03j251J149J351j804j872J483K938j026k919P8K882
3328A381j89k506R57J998o89k427N08J540K09r6l96r45p25J367J790m37k560k22
3346a442J934L43j675M28K335j186l265J157L443l51k881r36K204J072j471o85
3362i76J436K8j245K31P15n13p5J488o00k329N00K942L16k513j007J929R76j896
3380e93l65K286L05k946p37K984J616k462j777J350P54l92L52M10j312k54J400
$$ plain form
3397 619 1074 -9 -846 745 1228 -599 -1975 473 2130 -235 -2239 -22 1358 -356 -1372 311
3413 311 1319 -673 -1965 -595 1705 714 -791 -743 -236 94 526 1274 -193 -1799 -106 1614 471
3430 471 -1046 -378 936 326 -1178 157 1832 130 -1719 -730 1673 796 -683 -364 929 189 -628
3447 -628 -6 876 352 31 147 -441 -615 -77 1606 893 -1594 -1548 1083 1466 -362 -625 552 -168 -1057
3466 -1057 207 1329 476 -1182 -1403 462 947 -144 -351 -119 -471 -852 832 755 -493 -1180 194
3483 194 591 -763 -622 1127 1190 -351 -1447 -151 1313 353 -355 26 189 -581 -365 942 1174 -508
3501 -508 -850 -15 514 475 301 137 -227 -783 375 1358 349 -1387 -711 1254 838 -578 -194 882
3519 882 127 -1046 -717 437 181 -513 -570 463 -107 -827 286 998 -474 -1036 169 326 -743 -639
$$ packed form
3397F19M55j083q37J591M83j827j376K448J657k365k004K217J380j714j016J683
3413C11J008j992j292J370K300r91j505M8N07L30M32P48j467j606J693J720j143
3430D71j517O68J314o10j504J335J675j702j849R89K403q77j479L19J293p40q17
3447f28O22Q82n24l21J16n88j74N38J683p13k487M6K631L83j828k63J177p20q89
3466a057J264J122q53j658k21J865M85j091k07K32l52l81J684p7j248o87J374
3483A94L97j354J41J749O3j541j096J296J464r60p08L81J63p70K16J307K32j682
3501e08l42Q35N29l9j74j64l64n56J158R83j009j736O76J965m16j416L84J076
3519H82p55j173L29J154k56o94n7J033n70p20J113P12j472n62J205J57j069J04
$$ plain form
3537 -639 1228 -129 -1526 -717 1851 1046 -1111 -1278 388 1286 -134 -472 282 65 -533 207 1184 60
3555 60 -372 281 35 -486 -241 914 374 -835 -798 509 838 -602 -1194 683 879 -590 -1245 868
3573 868 1545 -267 -1425 -207 555 604 -246 -30 -102 -600 -121 877 284 -570 -168 415 -451 -964 1036
3592 1036 957 -979 -1835 441 1355 243 -1581 52 1195 201 -1318 -7 1502 166 -987 -444
3608 -444 257 377 608 906 -167 -661 156 1306 306 -558 103 697 -360 -995 579 1826 -399 -2105
3626 -2105 -291 1854 642 -1041 -427 639 201 -448 -77 115 14 -425 -158 -181 -274 140 647 -213 -1438
3645 -1438 -250 1334 116 -1003 -361 891 140 -991 -198 1404 482 -1078 -1343 894 1101 -287
3661 -287 -697 268 186 -148 446 200 -112 8 252 339 -187 39 701 10 -734 -404 944 860 -593 -770
$$ packed form
3537f39J867j357j397Q09K568q05k157j67J666Q98j420l38P54k17n98P40R77j124
3555F0m32O53k46n21K45J155n40j209L7J307L29j440n92J877J96j469o55K113
3573H68O77j812j158J218P62M9q50K16p2m98M79R98n93q54M02N83q66n13K000
3592A036p9j936q56K276R14j112j824J633J143r94j519J311J509j336j153N43
3608d44P01J20K31K98j073m94Q17J150j000q64O61N94j057o35J574J247k225j706
3626b105J814K145j212j683O14J066m38o49L71J92j01m39K67k3r3M14N07q60j225
3645a438J188J584j218j119O42J252p51j131P93J602r22j560k65K237K07j388
3661b87m10R65q2l34N94k46l12J20K44Q7n26K26O62o91p44L30J348q4j453j77
$$ plain form
3681 -770 813 567 -716 -506 434 673 -475 -602 177 555 157 -219 -495 -473 -244 556 218 -520 -783
3700 -783 368 201 -376 -331 382 -100 -704 -458 264 709 498 -761 -545 577 677 -310 -68 519 44
3719 44 -35 81 510 224 -104 -165 -543 -375 704 696 344 -320 -139 526 402 -322 -266 490 -82 -120 128 431
3741 431 374 -482 -929 2 278 332 -124 37 -492 -490 -117 364 -201 -226 198 42 -397 -150 567 202 -435 -561
3763 -561 -482 499 301 -94 -42 559 -99 -107 452 0 -66 36 -308 4 465 665 -221 -384 -281 227 490 271
3785 271 -638 -161 794 76 -514 -346 562 383 -687 -347 256 547 -337 -854 -20 101 315 209 -159 -284
3805 -284 -453 -81 -137 -258 -20 553 -429 -1015 -21 1057 510 -682 -531 176 303 -422 -354 511 266 -595
3825 -595 -203 165 356 64 170 -398 -287 443 865 191 -589 268 354 165 -380 -119 154 196 -759 -558 839
$$ packed form
3681g70J583k46j283K10R40K39j148j27P79L78l98l76k76K2K29Q00l38p38k63
3700g83J151j67n77M5P13m82o04K46P22M45k11j259K16J122J00r87K42N87m75
3719D4p9J16M29k86l28o1l78J68J079ql52o64J81O65j24p24N6P56n72l8K48L03
3741D31n7q56m47R31K76N4m56J61n29KL73M81n65k5M24j56m39K47P17l65o37j26
3763e61P9R81j98l95N2O01o58qN59m52o6J02l44L12M61K00q86j63J03N08K63k19
3785B71r09M77R55p18n90J68R08j79j070L40O03K91q84n17Q34J21K14j06l68j25
3805b84j69L72n6j21K38N73r82n86R94J078n47j192J51P07J27p25O8Q65k45q61
3825e95L92L68J91k92J06n68J11P30M22o74p80Q57Q6j89n45K61K73M2r55K01J397
$$ plain form
3846 839 829 -163 -688 16 482 53 -112 -259 -30 281 -82 -281 167 255 118 -333 -598 -460 601 361
3866 361 -1003 -857 332 901 -145 -525 326 206 0 -683 207 1009 97 -622 -317 266 475 423 267
3885 267 -406 -78 527 143 -301 -10 446 -8 -460 -264 785 696 20 -854 99 788 -200 -628 -4 306
3905 306 -284 -220 197 303 95 17 -744 -204 290 593 57 -851 -508 118 690 -223 -449 4 334 -763
3925 -763 -885 304 400 -181 -602 -136 680 397 -407 -495 122 121 9 -131 106 -285 192 95 -184 -261 406 572
3947 572 -500 -360 144 855 500 -259 -137 269 81 -519 255 691 51 -477 -221 217 305 -71 -17 -472
3967 -472 -162 250 610 144 -156 -420 262 300 -403 -214 228 -389 -853 -324 561 515 -327 -402 -75 -141 27
3988 27 234 366 236 -414 11 211 150 387 133 85 -660 -306 686 683 -112 -740 -242 707 200 -269 19 127
$$ packed form
3846H39j0r92n25P04M66m29j65j47K29L11l63j99M48Q8j37m51k65J38J061k40
3866C61j364J46J189N69j046l80Q51j20k06o83Q90Q02r12p19L05N83K09n2j56
3885B67o73L28O05l84m44K91M56m54m52J96J049q9o76q74R53O89r88m28O24L10
3905C06n90O4M17J06k08p8p61N40M94L03n36r08L43O26N72r13k26M53L30j097
3925g63j22J189R6n81m21M66Q16k83q04q8O17jj12j40K37l91M77r7k79p7O67J66
3947E72j072J40N04P11l55p59J22M06j88o00P74M36o40n28K56M38Q8l76N4m55
3967d72L10M12L60m66l00k64O82L8p03J89M42o17m64N29Q85m6q42p5L27o6J68
3988B7K07J32j30o50M25K00o1K37k54m8p45L54R92lp95o28M98R49n07m69K88J08
$$ plain form
4010 127 -136 -389 112 838 -163 -450 35 34 -239 88 395 -129 -279 -205 354 313 -283 -64 467 75 -821
4031 -821 205 724 176 -1006 -677 512 207 -209 -334 -54 -143 -625 -69 759 56 -342 -125 -33 -427 -89
4051 -89 674 -65 -965 -375 852 608 -560 -253 383 647 -566 -506 671 857 -261 -360 176 599 140
4070 140 80 25 -125 -367 540 503 -336 -431 -10 146 -235 -672 391 632 -1093 -1248 583 1319 -163 -898
4090 -898 -230 368 -216 -440 100 409 -181 -514 -169 246 -6 -244 -5 -212 -938 313 594 -72 -576 -24
4110 -24 626 -313 -491 449 999 -591 -1117 189 1155 425 -672 -224 373 185 -289 205 510 -387 -225
4129 -225 212 296 -28 59 712 -53 -824 33 1036 74 -864 -134 585 140 -711 221 972 52 -916 -748
4149 -748 282 589 -229 -534 -227 -119 110 189 413 -744 -644 62 7 -455 -71 557 -401 -1045 298 1095
$$ packed form
4010A27k63k53N01P26j001k87M85jk73L27L07n24j50P4N59m1n96K19N31l92q96
4031h21J026N19n48j182L29J189l05m16j25K80q9m82N56Q28p03l98K17R2l94L38
4051h9P63p39r00N90J227k44j168L07O36K64j213O0J177J86j118r9N36M23m59
4070A40o0n5j50k42R07l7q39r5M21J56l81m37J063K41j725j55J831P36j482p35
4090h98O68N98n84k24N40L09n90l33L45M15k52k38K39k07p26J251K81o66n04N52
4110b4O50r39j78R40N50j590n26J306R66p30j097M48N97j88m74M94L05q97J62
4129b25M37Q4l24Q7O53p65p71Q57J003r62r38P30P19m45q51R32P51r20r68J68
4149g48J030L07q18l05L07J08K29P9K24j157J00P06n5m62L84O28r58o44J343P97
$$ plain form
4169 1095 493 -788 -712 455 549 -330 -523 290 358 -354 -195 511 162 157 8 -245 -228 6 742 75 -446
4190 -446 -238 343 421 37 -375 384 157 -1008 -297 981 685 -575 -753 34 249 107 -132 -309 -423
4209 -423 -304 -219 346 172 -203 -115 219 -514 -287 241 521 -451 -253 144 265 69 -68 437 -56 -136 -399
4230 -399 331 516 -46 -653 55 163 331 -21 101 21 -309 149 446 436 -108 -350 115 147 -271 55 525
4251 525 1 -612 -288 418 330 143 -279 -398 -78 -67 218 161 274 -580 -300 123 -150 -143 162 -110 -775 -468
4273 -468 458 397 16 -380 8 -291 63 -99 437 233 -524 -519 -5 311 -5 -78 247 138 -146 474 327
4294 327 -347 -432 253 433 119 -187 294 116 -76 -879 422 762 0 -554 -560 144 -101 67 142 -65 -156
4315 -156 -160 -165 277 79 -232 121 -175 -121 92 434 -177 -905 -196 204 36 -399 -117 101 110 -337 77 756
$$ packed form
4169A095o02j281P6J167R4q79j93Q13O8p12J59P06l49nj49k53J7K34P36o67n21
4190d46K08N81P8l84m12P59k27j165P11J278k96j260j78P87K15j42k39j77j14
4209d23J19Q5N65j74l75Q8L34p33K27N28K80r72J98L97J21j96j37N05m93q0k63
4230c99P30J85n62o07P08J08J68l52J22q0l30M58K97j0n44k42M65L2m18L26M70
4251E25n24o13L24P06q8j87m22j19L20J1K85n7J13q54K80M23k73PL05k72o65L07
4273d68R26o1l81l96L88k99L54j62N36k04p57NN14L16l16p3L25j09k84O20j47
4294C27o74q5O85J80l14l06M81j78j92q03J301L40p62n54oP04k45J68P5k07r1
4315a56mnM42j98l11L53k96N4K13L42o11p28P09M00j68m35K82K18Rm47M14O79
$$ plain form
4337 756 98 -311 -654 141 56 160 131 52 -167 -393 453 143 -50 394 59 -399 -650 419 781 207 -528
4358 -528 -370 442 779 -480 -553 518 -49 -605 -139 249 397 -203 -474 -140 -81 104 204 -158 -527 -384
4378 -384 167 223 -552 -347 375 -285 -888 -257 526 618 -386 -802 126 363 108 -531 106 254 -54 -718
4398 -718 468 403 -222 -117 -244 -119 285 756 128 -680 -296 243 525 -253 -233 38 462 -211 -423 658
4418 658 729 -158 -686 -185 620 187 24 99 -324 -254 -99 -174 52 9 2 -181 -277 -20 328 123 -358 -766 85
4441 85 467 167 19 75 359 -87 -32 229 469 221 -461 -230 63 164 116 -129 -406 -56 106 271 13
4462 13 -332 119 -234 -81 101 333 492 -28 -234 -398 198 659 -167 -160 -110 -200 3 203 124 -76 -217 -235
4484 -235 -15 369 250 197 -330 -272 -315 280 522 -79 -417 -49 244 194 -186 185 25 -286 -217 58 399 -115
$$ packed form
4337G56o58m09l43P95q5J04k9p9k19k26Q46l10j93M44l35m58k51J069L62n74p35
4358e28J58Q12L37j259p3J071n67n56M66L88J48o00k71L34N9J85J00l62l69J43
4378c84N51N6p75K05P22o60o03O31P83R2j004m16R28K37k55o39O37J48l08o64
4398g18J186o5o25J05j27J25M04M71o28q08L84N39K82p78K0K71M24o73k12J081
4418F58P1q87n28N01Q05m33j63P5m23P0J55p5K26m3pj83r6K57L48k05m81m08Q51
4441H5L82l00j48N6K84m46N5K61K40k48o82K31K93J01m8k45k77L50J62J65k58
4462A3l45M51l53J53J82K32J59n20k06j64N96M61q26PN0r0K03K00p9k00j41j8
4484b35K20L84j19n3n27N8m3N95K42o01l38L68K93n0l80L71j60l11O9K75L41n14
$$ plain form
4506 -115 -134 -118 -106 208 431 197 229 -101 -17 110 345 -142 105 9 156 130 5 684 178 -230 -145 2 13
4529 13 308 37 96 -287 -103 204 180 211 -102 -132 -104 -180 83 71 56 -288 -550 121 226 -457 -221 86 -128
4552 -128 -268 -133 248 154 -348 -506 175 381 296 61 -478 -115 -385 404 267 32 99 103 -69 -212 313 247
4574 247 252 -446 -560 -88 287 165 -550 215 -74 17 183 553 155 88 -247 -61 78 109 433 -27 -268 -157
4596 -157 287 542 -333 -121 24 154 -168 -533 473 142 -531 -500 6 350 -5 -326 -319 -228 45 -202 216
4617 216 13 -43 22 12 -43 -10 532 306 -668 -406 285 358 26 -623 42 201 54 -236 94 618 -53 -730
4639 -730 119 176 394 -68 -67 -259 -193 514 84 -146 -150 -238 -185 -180 -37 324 567 -592 -784 34 590 89 -519
4662 -519 -113 94 -31 -154 27 116 -16 -319 -130 432 324 -36 147 -414 -383 186 566 -41 -475 -132 119
$$ packed form
4506a15j9J6J2L14K23k34L2l30Q4J27K35m87K47r6J47k6j25O79n06m08Q5J47J1
4529A3K95k71N9l83J84L07k4L1l13l0K8p6K63j2j5l44k62O71J05o83K36L07k14
4552a28j40J35L81r4n02j58O81K06q5k35n39L63k70P89j37k35O7Mj72j43N25o6
4574B47No98j14M72L75j22p15P65k89R1J66L70l98o7l35J86J39L1L24m60k41J11
4596a57M44K55q75K12J45J30l22l65J006l31o73L1N06L44l55l21PR1K73k47M18
4617B16k03n6O5j0n5L3N42k26r74K62O91P3l32o49O65J59j47k90L30N24o71o77
4639g30Q49N7K18m62Jj92O6P07m30k30mq8N3NJ43L61K43j159j92Q18N56n01o08
4662e19M06K07j25j23J81Q9j32l03J89N62j08l60J83n61L1N69L80o07m34L43K51
$$ plain form
4683 119 185 42 55 397 -363 -297 196 766 468 -349 -411 -156 -126 -32 240 334 -309 -56 152 -19 111 234
4705 234 239 -52 -337 -47 460 332 -214 -530 49 290 -538 -24 142 114 -542 -182 355 249 -249 -320 24
4726 24 194 315 8 578 -176 -404 5 536 163 -52 -197 72 4 -88 423 504 -169 -573 81 452 55
4747 55 -150 36 6 4 -124 308 429 -159 -132 128 -111 -385 170 83 177 -416 -329 541 316 -188 -100 -87 -206
4770 -206 -325 -94 262 -180 -354 -184 152 376 -175 -187 139 -205 -170 313 568 -52 -368 134 -51 -564 -87
4791 -87 476 259 -672 -103 256 377 236 -354 113 53 0 148 414 303 23 89 203 50 17 126 272 -340
4813 -340 -406 251 294 222 -450 -159 148 -231 -131 -22 426 -359 -548 -23 292 301 -204 -220 -119 -179 44 349
4835 349 41 -257 -235 328 317 -78 205 240 -223 -393 129 722 22 -652 -477 97 219 -52 -100 29 -8 4
$$ packed form
4683A19O6j43J3L42p60O6M93N70k98q17o2K55L0R4K72R4o43K53K08j71J30J23
4705B34Nk91k85K90N07j28n46l16N79K41q28N14J66k8o56L60N37j06m98p1L44
4726B4J70J21l07N70p54k28M09N31l73k15j45K69o8r2N11Q1o73m04O54L71l97
4747E5k05J86l0kj28M32J21n88K7K60k39k74N55q7R4n93Q7Q70k25n04Q8J3j19
4770b06j19K31L56m42j74J70L36K24n51j2L26l44L5M83K55o20l16N02j85n13M77
4791h7N63k17r31N69L59J21j41n90M67o0n3J48K66j11k80O6J14j53l3J09J46o12
4813c40o6O57M3p2o72K91L07l79J00J09M48p85j89N25L15Rn05j6J01o0K23L05
4835C49l08k98K2N63j1l95K83L5m63j70N22N93p00o74J75N74J22k71m8J29l7J2
$$ plain form
4857 4 22 535 193 -107 118 -109 -177 212 136 -219 -124 -126 225 -12 -165 -222 586 -228 -589 -117 374 28 -340
4880 -340 -226 -255 194 231 -76 174 -377 -172 -82 288 434 -274 -237 -305 -210 118 586 168 -343 -277 389 329 -164
4903 -164 -102 257 -53 -210 22 620 212 -185 -289 102 238 79 -19 19 -191 15 251 363 112 18 -117
4924 -117 3 -209 50 184 190 -262 -481 140 268 30 -457 61 124 -293 113 -134 532 185 -405 -97 -251
4945 -251 -84 12 -42 -150 -284 206 340 -23 -210 105 -22 -315 71 347 553 -102 -327 -133 289 151 65
4966 65 -153 -49 -210 -236 293 188 -52 -180 -284 -47 194 38 89 -6 68 212 -15 324 -32 -215 -105 -42
4988 -42 -432 316 226 -70 -448 -254 29 -169 2 131 -305 -306 -215 80 228 -116 -634 -5 310 -38 -22 155
5010 155 -47 -212 153 57 -2 -167 14 342 -135 -425 -99 137 146 -64 -168 205 42 -276 -166 -43 -362
$$ packed form
4857DJ8N13l42l00K25k27o8L89p6l55R5kL51k37j53n7Q08q14l61M72M91l46l68
4880c40J14k9M49L7l07K50n51K05R0L70J46p08L7o8R5L28M68m18n11O6O66o0m93
4903a64O2L59l10j57K32N98m08l97j04L91J36j59r8L8k10K06K36J12k51r4j35
4924a17J20k12K59J34Om52k19O21J28k38m87N18O3m17M06k47O66l47n90L08j54
4945b51J67R6n4j08j34M90J34l63j87L15j27k93L86K76K06o55k25J94M22j38q6
4966F5k18J04j61k6N29j05k40j28j04K37K41j56N1r5P4J44k27L39l56j83J10O3
4988d2l90P48r0k96l78J94K83j98J71J29m36jR1K95J48l44n18O29L15l48J6J77
5010A55k02j65L65r6n9j65J81L28m77k90L26K36Rk10j04L73j63l18J10J23l19
$$ plain form
5031 -362 -145 85 193 -103 77 -185 88 -88 265 18 199 -218 -348 -47 288 -127 -319 -166 -50 -134
5051 -134 220 214 -140 -93 -97 -48 -44 -329 -60 -46 182 -125 -271 325 -100 -48 -66 96 170 -149 -324 -6 256 310
5075 310 112 -195 244 137 -106 -24 -137 174 474 38 -323 -425 49 -94 -196 -80 -33 -196 -207 -25 81
5096 81 446 -156 -331 23 -1 -91 -124 24 -110 -189 -23 -14 146 -327 -355 -72 -57 -33 465 258 -26 -304 -143
5119 -143 435 26 -32 31 -200 -157 17 90 433 94 -241 -186 269 32 -60 342 -53 -330 111 67 9 82 103
5142 103 171 -160 154 157 210 -118 -165 -234 198 -18 -211 -212 153 52 -70 11 127 142 -398 -358 -224 32 379 -116
5166 -116 99 45 -334 95 -150 -247 -278 171 -55 77 43 190 71 -239 -233 28 44 -87 -238 -78 353 143
5188 143 -131 47 -27 -222 168 28 253 291 8 -50 11 111 -2 298 -3 -152 -356 115 -9 172 154 -360
$$ packed form
5031c62K17K30J08k96J80k62K73j76L53k47J81m17j30L01L35m15j92J53J16q4
5051a34L54ol54M7mM9Mk85K69J4K28l07j46N96m25N2j8J62P4l19j75L18K62N4
5075C10j98l07M39j07k43Q2j13L11L00m36l61j02M74j43j02J16M7j63j1J82J06
5096H1L65o02j75L54k4r0l3J48j34p9J66RJ60m73k8K83J5K4M98k07k84k78J61
5119a43N78m09n8O3k31M3J74P3L43l39l35N5M55k37r2M02l95k77M41m4n8P3K1
5142A03O8l31L14LN3l28m7o9M32k16j93jL65j01j22Q1J16J5n40M0J34K56L47m95
5166a16K15n4l79M29k45r7l1M49k26J32l4J47j19l10OK61J6j31j51J60M31k10
5188A43k74J78p4j95L90j40K25L8k83n8O1J00j13L00l01j49k04M71j24J81j8n14
$$ plain form
5210 -360 -497 -155 321 -66 -137 -297 -178 -187 268 147 -65 -152 156 -13 -3 125 -128 -14 -56 -213 -373 391
5232 391 41 -91 -119 -309 106 -125 -22 13 -307 -53 -51 -71 46 347 -120 -151 -113 -99 450 71 -85 -104 130
5255 130 111 147 -90 -15 -3 130 -142 12 170 -3 -307 -196 177 -310 263 6 -2 -160 115 -85 -121 -11
5277 -11 -331 -241 76 -50 -297 -36 82 -238 13 -110 -178 117 19 40 -230 -91 308 39 348 -47 -97 229
5299 229 154 -73 223 143 -138 -43 32 -57 -169 192 99 43 214 -101 220 -38 167 -217 -187 186 152 -2 133
5322 133 -68 -319 283 15 -395 -50 114 -150 -37 -382 180 156 -67 -290 125 328 -219 -205 -13 -272 -50
5343 -50 -3 377 308 56 -105 121 207 537 5 -149 -48 -285 14 216 -194 -480 145 -176 -118 -71 2 211
5365 211 131 -156 -279 197 -101 -394 -120 -8 -14 199 -75 405 -100 -281 215 -131 19 -261 -1 -21 44 41
$$ packed form
5210c60j37L42M76l87p1j60J19rM55j21k12q7L08j69J0J28k53J14m2j57j60P64
5232C91l50j32k8j90M15k31J03L5l20K54Kk0J17L01m67l1L8J4N49l79j56j9K34
5255A30j9L6k37P5J2J33k72J54J58j73l04J11L73m87N73k57qj58K75k00l6J10
5277a1l20R0L17j26k47K61J18l20K51j23o8K95r8K1k70J39L99k69L09l95n0L26
5299B29p5k27K96q0k81R5P5q9j12L61r3n6J71l15L21k58K05l84L0L73l4j54J35
5322A33k01k51O02k68m10L45J64k64J13l45N62k4k23k23M15K03n47J4J92k59K22
5343e0M7L80o9k52j61K26Q6L30n32j54J01k37K99K02m10k86O25l21N8M7P3K09
5365B11q0k87j23M76k98k93K74J12oK13k74M80n05j81M96l46J50k80K60k0O5l
$$ plain form
5387 41 153 53 -265 -104 148 50 -79 -4 89 -39 -145 143 335 -55 29 49 -106 -85 153 214 -163 -278 -71
5410 -71 6 92 -53 213 195 398 49 -193 395 -132 -145 -287 427 129 -55 -136 112 117 -202 -391 127 62 -320
5433 -320 -154 325 6 50 -48 81 -21 -34 80 88 -151 25 -68 40 -143 -432 403 152 -53 -410 233 192
5455 192 -148 -302 80 20 -58 -74 -52 194 -77 -244 48 32 -67 212 50 -239 -41 199 326 -105 38 -74
5477 -74 -76 -131 44 125 8 -211 -143 162 -101 72 -227 -119 6 -159 -108 -39 254 227 -12 -6 4 111 -215 8
5501 8 86 112 -240 -42 -79 -60 -429 117 -165 64 10 -134 -7 226 199 148 277 -119 150 19 -84 -163 -23
5524 -23 329 -176 -215 30 72 247 -32 -91 29 -15 167 -69 -57 77 129 204 -33 178 -32 -23 -70 -17 45 88 406
5549 406 7 -106 -226 -32 147 -76 106 -79 -325 -53 158 -88 -253 -53 -65 79 109 148 -54 320 -43
$$ packed form
5387D1J12j00l18J61K52r8j29P5R3j28j06K88J92l90Q4K0j55K1K38O1l77j15K07
5410g1P7Q6j45K66j8K03l49k42N88n27j3j42P14k98j84q1K48Nl19j89N18o5l82
5433c20J66M79l19M4r8J29j02j3J14Qk39J76r3J08j83k89Q35k51k05l57O43m1
5455A92l40j54L82o0p8j6K2K46k71j67K92j6r9K79j62k89J98K40J27m31J43j12
5477g4kn5J75Q1j17k19O8L05k63J73k99J08J25j65N1O9K93k7k39OJ0J07l26K23
5501HP8K6l52J98l7J9l69N46k82K29n4j44J27K33k7n1J29l96K69j31j03p9J40
5524b3L52n05l9K45M2J75k79n9J20m4J82k36J2J34N2P5k37K11k10Rm7N3O2M3L18
5549D06l99j13j20J94J79k23J82j85k46K72K11k46j65K00j2J44L0L9k02L74l63
$$ plain form
5570 -43 -51 13 93 -80 -6 162 -284 -167 242 -26 -52 -170 195 15 -76 233 138 53 17 257 -137 305 156 -227
5594 -227 16 85 117 20 265 -206 -36 301 49 -50 37 197 -109 -341 3 -111 100 86 -168 38 -57 -151 -195
5617 -195 58 -179 -133 32 -44 97 387 22 -90 -35 -90 -48 -89 72 -164 -309 561 -170 70 -29 51 -194 -174
5640 -174 15 206 -27 51 -187 161 103 75 -104 353 223 -393 71 228 -37 181 -9 -35 -228 272 183 -328
5662 -328 -147 445 -180 -88 255 -7 101 -194 -157 69 138 -168 63 -10 -132 83 -338 92 29 94 -220 177
5684 177 350 -93 -5 -68 -25 -38 -9 84 79 -416 185 217 17 -323 -176 23 -53 81 -190 53 -68 -134 -239 195
5708 195 58 39 -84 -25 -57 122 184 -249 -24 98 305 -115 0 -59 259 258 -253 248 57 83 -50 174 283
5731 283 244 -53 235 228 -79 279 -313 -167 58 139 -77 420 -150 -357 -38 118 -236 76 -82 -15 59 -251
$$ packed form
5570d3qO4Q0j73P4J68m46J17M09k68k6j18L65j80r1L09r5q5l6K40l94M42j49l83
5594b27K43O9L2r7K45m71J70L37k52r9Q7J60l06k32L44j14K11j4k54K06r5r4m4
5617a95K53k37M6J65p6J41K90l65j12N5n5M2m1J61k36j45Q70p31K40r9Q0k45K0
5640a74J89J91k33P8k38L48n8k8j79M57j30o16M64J57k65K18j90k6j93N00q9n11
5662c28J81N92o25R2L43k62J08k95L7K26O9l06K31p3j22K15m21M30o3O5l14L97
5684A77J73m43Q8o3M3j3K9R3nm95O01L2k00l40J47J99p6J34k71K43j21o6j05M34
5708A95j37j9j23N9l2J79O2m33K25J22K07m20J15n9L18jn11N01j91K6j33K24J09
5731B83l9k97K88pl07L58n92J46K25Q1k16M97n70k07L19J56l54L12j58O7P4l10
$$ plain form
5753 -251 246 37 154 -109 -33 54 -35 -563 295 17 -109 233 -77 -112 70 363 98 -342 155 -80 -122 252
5775 252 -37 256 242 231 113 -99 -8 -67 -46 386 581 95 75 -116 269 -14 -295 -91 239 62 -40 -25
5797 -25 200 124 -109 -66 15 -35 -173 -88 93 -101 -53 91 46 282 65 -209 340 456 -7 -66 -62 3 59 202
5821 202 -97 -113 309 13 -218 -174 62 -189 -101 -273 -354 89 155 -130 78 202 -54 11 -36 34 -247 -116 -156
5844 -156 -22 175 -34 -505 -125 -164 -171 -17 101 -234 115 -110 -46 -91 319 22 111 -18 416 205 -13 273
5866 273 -3 377 110 -98 106 271 49 -129 -144 284 84 22 128 20 -4 54 -17 87 -66 -171 -95 106
5888 106 -10 114 340 37 -301 106 9 133 -130 -98 246 197 -35 -44 -34 -17 89 -231 62 154 -207 207 -154
5911 -154 -78 20 -72 114 135 16 -23 -200 -161 100 -376 -31 -14 -158 167 217 269 -145 113 -175 -127 195 -51
$$ packed form
5753b51M97k09J17k63P6Q7q9n28Q58k78j26L42l10l5J82K93k65m40M97k35m2L74
5775B52k89K93j4j1j18k12R1n9K1M32J95m86k0j91L85k83k81K04L30j77j02J5
5797b5K25p6k33M3Q1n0j38Q5J81j94M8J44m5K36k17k74N49J16m63n9MO5N6J43
5821B02k99j6M22k96k31M4K36k51Q8j72q1M43O6k85K08J24k56O5m7P0k81J31m0
5844a56J34J97k09m71L80l9pJ54J18l35L49k25O4m5M10k97Q9j29M34k11k18K86
5866B73k76L80k67k08K04J65k22j78j5M28k00o2J06j08k4N8p1J04j53j05P6K01
5888A06j16J24K26l03l38M07r7J24k63L2L44m9k32rJ0J7J06l20K93R2l61M14l61
5911a54P6R8r2J86K1j19l9j77L9K61m76L45J7j44L25N0N2m14K58k88M8L22k46
$$ plain form
5934 -51 -123 259 260 431 -147 83 245 -139 -142 -118 -43 27 201 -261 107 105 -153 -12 -147 -3 131 -4 -365 -6
5958 -6 48 141 -343 10 -318 138 107 -177 120 193 192 -154 -151 -108 -34 -226 63 422 198 372 20 -35 11 -51 -147
5983 -147 195 188 97 -221 26 -65 194 93 321 32 -154 26 -47 182 -121 55 -191 -63 -98 190 95 -277
6005 -277 5 235 272 151 -97 -88 8 -21 -35 -59 -18 -30 -56 36 43 -104 -81 -84 -147 62 -181 80 -188 109 52 -25
6031 -25 55 306 -23 -193 130 18 55 -12 -178 -201 -71 113 -284 335 234 449 -129 -73 99 60 162 -85
6053 -85 68 61 44 -414 317 -53 -70 -4 -70 181 160 209 40 -256 -142 -5 95 -106 85 14 183 119 -135 54
6077 54 14 -81 -360 -240 -57 -20 155 -144 -216 113 -53 5 -107 95 -122 -393 39 -119 163 -50 183 -57
6099 -57 -74 3 408 -49 -57 37 -58 312 159 18 -153 -124 -230 81 -122 -93 230 140 38 234 177 246 20 -186
$$ packed form
5934e1p2L82JJ71n78K30J62l84lK4P5P0J74m62L68kk58J41j35J44J34j35l61L59
5958fN4R3m84L53l28M56l1k84K97P3jl46LM3P4j92K89L59k24J74l52n5M6o2r6
5983a47L42pr1l18K47r1K59j01K28k89j86J80p3K29l03J76k46J28l5K88r5l72
6005b77K82K30L7j21k48RR6k9j4k4M1j2k6R2Pj47K3lo3K09k43K61k68K97n7p7
6031b5Q0K51l29j70L23j12L7o7j66k3J30J84l97O19j01K15n78N6J72l9J02k47
6053h5J53pj7m58P31l70j7O6o6K51k1M9j69k96J14J37J00k01J91p1J69o4k54J89
6077E4m0r5k79J20J83L7J75k99p2L29j66N8j12K02k17k71M32j58K82k13K33k40
6099e7j7P7M05m57qR4r5L70j53j41j71K9j06L11k03K9L23r0j02J96n7O9k26k06
$$ plain form
6123 -186 -39 -244 -189 225 -54 184 -55 21 325 218 -28 11 96 85 -80 101 350 -61 50 -131 -228 115
6145 115 165 133 -85 -133 -47 128 185 -148 92 80 -42 42 213 -18 -197 -183 189 239 244 77 -262 -84 413 112
6169 112 -279 355 -95 114 -179 -2 99 102 98 -375 38 -103 -166 178 86 -160 -194 207 97 31 244 -88 -30
6192 -30 27 110 -180 140 265 134 -144 107 275 -62 67 -57 -165 -248 2 222 -30 124 -117 -278 239
6213 239 -67 -20 -42 -232 -89 16 371 -182 -200 -312 99 258 50 -162 -123 283 -142 243 35 93 -212 -39
6235 -39 97 137 135 -128 -243 -247 90 83 16 274 -255 -225 -107 -185 45 167 27 -230 208 66 29 52 149 110 2
6260 2 -157 325 255 354 -141 159 -151 247 304 18 332 21 13 -41 164 228 -74 -51 10 -23 123 -8 -82 99
6284 99 -91 -104 101 318 -18 -15 -44 -380 -59 62 74 81 -35 168 -26 -74 -24 55 61 -416 102 -168 -134 -107 200
$$ packed form
6123a86J47k05N5M14k79K38k39P6L04j07k46L9Q5j1j65J81K49m11J11j81r7L43
6145A15N0l2k18m8Q6J75N7l33K40j2j22Q4J71k31j79J4L72N0Nj67l39J78M97l01
6169A12l91O34m50K09k93J77J01Lmm73M13j41o3L44r2k46l4M01j10o6K13l32N8
6192c0N7Q3k90L20J25j31k78K51J68l37J29j24j08q3K50K20k52J54k41j61N17
6213B39l06M7k2j90J43J05L55n53j8j12M11J59k08k12L9M06m25L85k08N8l05J73
6235c9J36M0kk63j15mL37po7K58n29L0J18p8K30J22j40k57M38j42l7K3R7l9j08
6260Bj59M82p0R9m95L00l10L98N7k86L14l11qn4K05O4l02K3O1l3J46j31p4J81
6284I9j90j3K05K17l36Lk9l36L21J21J2Pj16K03j94m8N0P9Om77N18k70L4K7L07
$$ plain form
6309 200 -15 137 -269 -185 -163 -31 -145 -177 -107 41 329 -71 134 -175 -31 36 -213 -10 -115 64 -131 132
6331 132 -17 279 -119 -240 -61 151 266 169 -292 -44 189 -33 247 293 -62 65 -46 127 155 98 -224
6352 -224 13 -49 -348 -206 262 -266 -143 -374 -82 -15 69 -95 -108 12 195 256 79 40 -164 -28 32 404
6374 404 12 -138 -38 -5 85 134 -11 -54 -21 -16 150 94 203 -30 -214 -110 -267 82 160 181 -216 96 -155
6397 -155 -221 279 -249 16 -40 -63 145 17 9 18 -19 60 -268 193 -301 -134 -22 186 0 37 -41 -38 30 -106 -100
6422 -100 291 416 412 110 -217 86 -214 -214 320 343 -136 -13 -45 71 317 -40 -264 87 307 80 30 89 276
6445 276 -61 17 -235 64 -1 -33 124 -34 89 94 227 -132 -194 -98 181 356 137 142 70 -174 30 -96 349
6468 349 49 -26 26 -30 77 31 -277 17 -295 -260 -144 62 -44 89 278 35 -103 111 0 -100 -12 5
$$ packed form
6309B00k15J52m06Q4K2J32j14l2P0J48K88m00K05l09J44O7k49K03j05J79j95K63
6331A32j49K96l98j21J79K12J15r7m61K48K33k22K80M6l55J27j11J73K8n7l22
6352b24K37o2k99J42M68n28J23k31K92O7Q4j64j3J20J83O1j77l9k04J36O0L72
6374D04l92j50J00L3R0M9j45m3L3NJ66n6J09k33j84J04j57L49P8K1l97L12k51
6397a55o6N00n28K65n6k3K08j28qRl7P9l28M61m94J67J12K08j86L7p8LO8j36O
6422a00L91J25ml02l27L03l00%N34K3m79J23l2J16K46l57k24L51K20k27n0N9J87
6445B76l37P8k52K99o5l2J57j58J23NJ33l59o2R6K79J75k19Np2k44K04j26M45
6468C49l00p5N2n6J07m6l08K94l12L5J16K06j06J33J89k43j38K14j11j00Q8J7
$$ plain form
6490 5 109 58 22 -247 -94 -71 -206 152 79 -59 -228 -21 20 -264 289 81 -11 61 176 7 -41 -38 -43 -79 59
6515 59 38 -16 71 -67 -1 -120 -50 -29 -185 117 -120 -153 -132 119 103 347 218 70 144 -307 162 -267 91 19
6539 19 -127 125 -128 135 6 13 -204 95 -172 -618 132 -135 -208 231 -12 48 46 227 -38 69 225 -2
6561 -2 162 207 68 -167 -207 269 92 -91 -29 87 -46 -128 182 -217 -134 -54 -290 89 6 31 -61 254 -82 42
6585 42 69 -340 -8 -189 42 -83 -173 -171 -152 8 -102 21 -91 294 38 -188 246 59 -279 -170 218 -88
6607 -88 -146 174 88 -231 315 91 118 -208 2 -311 93 220 8 3 116 165 -27 136 -129 94 19 118 -378
6630 -378 143 41 154 12 -176 -219 217 -47 24 244 -140 217 -89 42 -4 36 -154 -27 71 344 126 -91
6652 -91 -151 -263 -198 69 103 -185 -153 -224 105 102 -99 -84 -87 -96 28 -52 -126 -34 -171 85 78 25 16 328 195 -22 158
$$ packed form
6490EJ04n1l6k69J53K3j35L58p3j38j69K07M1k84N53k08r2P2J15j69m8Lnl6J38
6515E9k1n4Q7j38O6j19P0K1j56L02k37l3K1K51j6K44j29j48P4m51M69m29L58p2
6539A9j46K52k53K63j29Pk17K99k67m46P50k67p3M39k43O0kJ81k65J07J56k27
6561bJ64M5j39k35m0M76j77j83O2J16j33q2L10l99Q3Q0k36L79q3K5r2L15l36J24
6585D2K7m09L32j81K31j25r0KJ9J60j10J23j12L85k56k26M34j87l38J09L88l06
6607h8n8L20q6l19N46k24K7l26K10l13M04J27k12nJ13M9j92J63k65K23p5R9m96
6630c78N21j02J13j42j88m3M36k64P1K20l84L57l06J31m6M0j90J27R8K73k18k17
6652i1o0j12O5K67L4k88L2p1L29lk01J5lrJ24q0p4R2j37K56pn3rL12j33k17J80
$$ plain form
6679 158 -225 -227 -166 -162 54 409 239 192 -191 380 -73 -137 307 93 110 -155 62 -81 -32 -186 186 -86 -56
6702 -56 -192 -147 229 237 -59 -293 207 -171 -45 -81 -284 237 -37 -42 408 -134 55 -128 280 25 164 102 -84
6725 -84 141 -211 50 -25 155 235 99 224 108 174 222 -76 -273 21 140 109 6 169 236 -176 82 67 -32
6748 -32 -91 101 -144 -40 -78 151 -33 -44 91 -202 213 4 122 19 -48 14 -225 95 -163 -5 -135 -377
6770 -377 38 -183 162 136 185 204 -49 -151 173 36 -256 -223 102 27 114 95 -154 57 5 1 -57 175 -27 -245
6794 -245 -260 -169 -231 316 22 -67 71 162 -67 80 -9 55 -312 28 -92 422 -3 187 -90 322 65 -205
6816 -205 37 59 200 -133 110 72 -220 -46 84 25 221 23 34 79 237 -353 -194 119 14 -14 -108 114
6838 114 -143 -135 146 161 268 6 -173 -32 -112 46 -148 -247 23 -194 127 5 -54 -226 -110 127 -163 258
$$ packed form
6679A58l83kO1MK16L55j70m7l83N71m53o4M44k14J7k65K17j43M9j54L72k72L0
6702e6j36M5L76Qk96k34N00l78J26l6k03N21k74nM50n42J89j83M08k55J39o2j86
6725h4K25l52K61p5J80Q0j36J25j16O6M8k98j97K94J19l1j03J63O7m12K58j5r9
6748c2n9J92k45J04l8K29j84j1J35k93M15k09J18j03o7O2k39L20k58J58j30k42
6770c77M15k21L45k6M9J9k53j02L24j37k92L3L25p5Q7j9k49K11n2mn8K32k02k18
6794b45j5R1o2N47k94q9J38R1k29J47q9O4l67L40j20N14m25J90k77M12k57k70
6816b05K42K2J41l33K43l8k92J74J30n9J96j98J1M5J58n90J59L13j05k8r4K22
6838A14k57QK81J5J07k62j79J41q0J58j94r9K70k17L21j22n9j72J16K37k90M21
$$ plain form
6860 258 112 -92 -117 50 -41 184 -103 -214 -319 -254 13 -204 105 137 95 164 -255 -13 96 -141 -160 -137 -115
6883 -115 87 201 94 25 -173 -207 -80 151 -136 46 -91 107 72 268 268 -13 -86 29 190 70 206 41
6905 41 -128 -2 274 166 297 -142 -194 240 -297 -161 124 94 -92 -165 -79 131 119 9 -8 -383 -184 151
6927 151 92 -38 -300 25 -249 163 99 37 35 274 -165 74 -110 71 50 14 88 55 330 394 202 6 -38 -240
6951 -240 17 112 207 -7 -70 -84 -94 -125 -226 126 177 -80 -271 -51 -132 -65 -352 60 92 1 62 153 34 -137
6975 -137 133 -134 30 -78 71 155 -3 -250 -111 139 -305 203 -143 -148 -229 -69 103 -384 183 6 -84 158
6997 158 -154 -18 203 70 -139 227 480 21 -164 105 203 237 -144 -402 -74 20 -166 130 -89 -115 82
7018 82 8 27 225 327 78 -8 -324 -51 -141 -141 85 256 84 163 -235 170 -82 15 -77 -161 -38 397 -226 113
$$ packed form
6860B58j46k04k5J67r1K25k87j11j05O5K67k17L09L2m2O9m19K42J09k37j9K3K2
6883a15K02J14j07o9j98l4J27K31k87J82j37J98l5J96%k81p3J15J61j20J36j65
6905D1j69J26K76j08J31m39n2M34n37J36K85l0j86p3Q6K10j2j10j7l75J99L35
6927A51n9j30k62L25k74M12o4o2kK39m39K39j84J81k1l6P4l3K75O4j92j96m4k02
6951b40K57R5R5k14o3j4j0l1j01L52N1k57j91K20q1O7k87M12L2r1O1R1j19j71
6975a37K70k67J64j08J49Q4j58k47J39K50m44N08l46nq1J60J72m87N67j77r0K42
6997A58l12J36K21j33k09L66K53m59j85K69R8L4l81k58L28R4j86K96k19k6J97
7018H2p4J9J98J02k49q6l16K73r0%K26J71j72P9l98M05k52R7r2q4J23M35o23L39
$$ plain form
7042 113 43 -103 -184 -61 -195 -256 142 -36 -179 115 -141 -48 117 -376 29 88 194 199 -81 -38 159 27 259
7065 259 248 119 -206 52 -139 -16 81 -187 -74 173 -277 262 45 130 -71 -84 198 -7 142 9 -39 -157
7087 -157 -156 32 -82 236 65 -333 14 -168 157 166 -207 23 -5 432 71 33 -215 21 -130 -176 149 47
7109 47 181 163 53 -77 144 189 -99 -270 167 305 92 135 36 97 -49 -282 121 14 -236 -78 -251 -110
7131 -110 -58 353 -147 123 -245 -103 15 267 122 -93 -89 13 157 92 69 -51 -267 204 -89 25 414 -82
7153 -82 411 -164 -273 -15 -220 110 -154 -42 225 -223 -120 -139 108 152 -159 168 25 280 126 -149 -131
7174 -131 9 -49 -193 -73 -263 -169 -249 490 -38 190 74 -268 -320 296 410 5 -162 163 -131 197 -284
7195 -284 -23 182 -396 185 -430 -3 149 -58 35 26 -370 31 -95 37 46 235 -15 -176 72 180 68 -149
$$ packed form
7042A13p0j46q1J23j34o1L98j78j43K94k56R3J65m93M05N9J06Nk80M3J97j32K32
7065B59j1j29l25K58j91J23R7k68J13K47m50N39k17Q5k01j3K82k05J49j33m8j18
7087a57JJ88j14L18j71l98L47j82L25Rl73K30k8M37l61l8k48K36j51m6L25j02
7109D7J34j8j10j30K21M5k88j71M37J38k13M3r9O1j46k33M03j07k50J58j73J41
7131a10N2M11n00K70l68J42J18K52j45k15MJ02J44o5k3j20k16M71k93J14L89m96
7153h2M93n75j09K58k05L30k64J12K67m48J03j9K47M4l11L27j43K55j54k75J8
7174a31J40n8j44J20j90R4q0P39n28K28j16l42n2O16J14m05j67L25k94L28m81
7195b84K61K05n78N81o15M27J52k07R3rl96M01j26J32RJ89k50j61K48J08j12k17
$$ plain form
7217 -149 -187 -377 265 200 103 -89 -158 -333 130 -179 -55 24 177 -32 -178 -25 -200 180 -208 -160 49 161
7239 161 -26 -66 14 -126 -142 310 216 79 -97 354 37 -30 -108 113 -57 -225 -111 -94 209 -116 -129 180 -54
7262 -54 -128 95 -130 352 66 85 208 31 37 -285 28 -120 57 -59 200 320 -154 141 -92 -8 248 55
7284 55 -80 -156 -311 28 -81 -23 -191 118 4 -56 141 12 119 38 -211 -33 74 -157 168 36 -196 -238
7306 -238 102 -278 15 72 -241 274 -65 87 -91 -19 17 288 140 118 192 92 -39 293 -86 217 174 -146
7328 -146 66 -31 201 77 -150 -211 65 58 229 -144 152 111 -150 -163 -12 230 144 -110 27 0 -112 87 73
7351 73 142 -155 141 121 16 2 79 74 -114 54 21 127 109 211 70 -35 -123 -70 -111 -193 -138 -234 32 47 -142
7376 -142 -241 -139 -179 -97 168 138 -105 129 -195 216 52 187 -73 -171 -81 -17 -118 -27 46 103 -25 -45 -177 167
$$ packed form
7217a49l8j90O42o5r7j92o9j75M63l09J24P9J53k09j46J53j75L80l88M8K09J12
7239A61j87m0Q0j40j6M52r4j37j76M51l17o7p8K21j70j68J14J7L03l25j3L09k34
7262e4p4K23k25M82k86J9J23j77Ol22L13j48J77j16K59J20m74K95k33Q4K56j93
7284E5j35p6j55L39j09N8j68L09j14o0J97j29J07q1k49J78J07k31L25j32k32m2
7306b38L40l80K93N7l13N15l39J52j78P2L6K71j48k2P4j00j31L32l79L03m3l20
7328a46K12r7K32j24k27o1K76pJ71l73K96m1k61j3J51K42q6k54J37k7j12J99j4
7351G3O9k97K96k0j05j4P7nj88J68l3J06j8J02j41j05q8N3m1q2N5r6K66J5j89
7376a42r9J02m0Q2K65l0k43K34l24M11j64J35k60r8R0O4j01R1P3N7j28k0j32L44
$$ plain form
7400 167 -19 280 31 -222 -32 -505 38 46 230 -161 -71 -186 -83 -121 -14 -364 105 188 3 -55 79 -87
7422 -87 -35 -178 282 322 -94 102 -25 -268 90 70 -138 239 -207 150 -5 -348 -6 16 -12 221 6 156
7444 156 80 -79 -174 -32 288 -39 -273 -308 -158 22 -17 297 283 174 -376 14 141 -39 -52 285 -43 -12
7466 -12 164 38 105 60 30 -94 100 122 102 274 -114 -51 159 157 67 -134 76 -44 188 -283 88 80 -47 192
7490 192 16 -130 -57 132 -252 -56 -24 -12 106 -184 -183 229 222 107 255 95 -7 162 -245 -24 -22 -350 151
7513 151 129 -56 -28 113 49 -97 24 -167 20 95 -69 1 -28 -229 188 74 94 138 193 -93 397 118 418
7536 418 185 -36 251 -165 -161 72 -78 245 -31 -8 -151 -66 280 -81 -3 425 180 -83 -304 -72 87 298
7558 298 27 -149 179 91 -129 -282 -98 112 -176 -40 37 18 -512 -379 79 99 94 45 51 118 -29 -92 -145 -152 43
$$ packed form
7400A67j86K99k49k53J90m73N43QJ84l91R0j15J03l8J07l50M69Q3j85n8J34j66
7422h7N2j43M60M0m16J96j27k43L58k0k08L77m46L57j55l43L42K2k8K33k15J50
7444A56p6j59r5J42L20l27k34l5J50J80l9L14j4j09n50L90J27j80j3L37l28L1
7466a2J76j26O7m5l0j24J94K2k0J72l88O3K10kr0k01K10j20K32m71L71qj27K39
7490A92j76j46P3J89l84J96L2J2J18k90JM12pj15J48j60j02J69m07K21Kl28N01
7513A51k2j85K8J41o4j46J21j91J87P5j64P0k9k01M17j14K0M4N5k86M90k79L00
7536D18k33k21K87m16MK33j50L23k76K3j43Q5L46l61P8M28k45k63k21K32J59K11
7558B98k71j76L28q8k20j53J84K10k88J36P7j9n30J33M58K0nm9OO7j47o3n3pJ95
$$ plain form
7583 43 -109 -34 -176 -30 -131 -17 -85 -254 16 21 -33 -176 -129 176 71 261 335 191 21 -45 -417 7 30
7606 30 87 -8 61 158 -55 -233 123 -42 -64 -34 -94 394 -159 58 -37 63 12 80 -73 201 172 -320 -199 -318
7630 -318 -98 103 -421 22 -327 -203 250 181 -188 -87 131 -111 -93 170 93 21 -150 -96 36 -289 -87 -279
7652 -279 32 -248 155 160 -301 -171 46 -172 284 -219 -105 198 -315 -120 23 421 -28 -76 -184 -96 -185 128
7674 128 201 52 80 6 -35 118 -50 83 159 140 23 -121 93 -134 -92 -195 3 486 526 -260 288 -307 9
7697 9 291 -33 -30 -236 -30 -319 8 36 -74 256 -15 108 -115 -68 42 -328 164 -28 -217 -91 70 -212
7719 -212 -105 -8 74 -158 61 48 -127 -348 -55 299 112 115 18 -202 -230 27 -18 -87 -137 45 395 -248 12
7742 12 108 132 -80 -176 -45 -89 58 14 95 112 219 -112 12 62 21 -34 231 -47 -15 238 -127 -205 -123 -83 -15
$$ packed form
7583D3j52P5j42J46j01J14o8j69K70Nn4j43M7L05j05J90P4j44j70o6l72M24K3
7606C0N7r5O9R7k13j78L56j65k2L0o0M88n53K17r5J00n1O8j53K74k9m92J21j19
7630c18K20K01n24M43l49J24M53o9l69J01K18k42J8K63p7p2j71N4J32l25K02j92
7652b79L11k80M03Nm61J30K17k18M56n03J14L03n13J95J43L98m49m8j08Q8q9L13
7674A28P3j49K8p4m1J53j68J33P6j9j17j44K14k27M2j03J98M83M0p86N48n95L16
7697IK82l24Lk06K06k89L27K8j10L30k71J23k23M7J10l70M92j92j89J26J61k82
7719b12J07R7Q2k32K19j3j75k21K93L54j87Lr7k20k8K57m5o9n0J82L50o43K60
7742A2R6K4k12r6J31m4J47m4Q1J7J07l31J24N0m1n5K65k78L2K53l65p8Q2M0O8
$$ plain form
7767 -15 -33 -182 -57 -73 48 -136 -262 320 71 125 -92 171 135 -68 66 -107 -138 102 -223 -64 -439 -47
7789 -47 -27 -29 191 303 -6 84 -105 -42 84 2 196 96 41 -60 27 144 -164 173 54 -4 -232 133 89 207
7813 207 37 64 -32 111 87 -159 -388 201 226 -52 -79 35 -226 136 -88 34 -40 -118 -15 -293 -140 -43 29
7836 29 -276 -311 -69 -112 59 116 -35 -178 55 -110 -187 154 101 42 -348 -238 118 576 184 40 213 116 -20
7859 -20 -58 187 -74 11 146 101 -78 -171 289 51 -50 -62 -194 72 363 19 65 -59 -89 94 -29 66 152
7882 152 41 21 193 -50 3 139 -108 68 157 173 -179 214 58 47 -305 192 36 -1 -274 -292 156 176 -252
7905 -252 -265 -24 -161 -371 -131 50 -121 -118 -84 -25 32 -4 131 28 -198 -178 291 125 -113 58 -145 66 -130
7928 -130 -355 182 93 -145 -192 255 -104 -46 -1 62 55 66 -38 -93 97 -385 5 129 -214 -120 -105 -97 -410 -132
$$ packed form
7767a5j8j49J25j6J21j84j26N82k49N4k17K63l6k03J34j73l1K40l25J59l75L92
7789d7K0kK20J12l09R0j89O3J26q2J94j00n5j01Q7J17l08L37j19n8k28L65m4J18
7813B07j70K7r6J43k4k46k29N89K5k78k7J14k61L62k24J22p4p8J03k78J53R7P2
7836B9l05l5K42m3J71N7j51j43K33j65p7L41n3n9l90J10L56M58l92j44J73r7j36
7859b0l8K45k61Q5J35m5j79r3M60k38j01j2j32K66K91l44M6j24l0J83j23R5Q6
7882A52j11k0J72k43N3J36k47J76Q9J6l52L93j56j1l52M97j56l7k73j8M48K0m28
7905b52j3K41j37k10K40J81j71LL4N9N7l6J35j03k26K0M69j66k38J71k03K11j96
7928a30k25N37q9k38m7M47l59N8M5O3pJ1j04n5J90m82L90J24l43R4J5Ql13K78
$$ plain form
7952 -132 202 413 91 -191 -79 236 -61 98 120 -121 65 -202 -116 78 157 44 -87 8 105 160 -34 106
7974 106 -251 -260 209 63 97 35 102 -33 -88 -51 164 168 -167 100 -51 201 -3 157 104 310 25 29 64 167
7998 167 -51 146 -24 63 -389 302 66 -384 84 -70 216 -53 176 44 -204 163 42 -136 83 166 102
8019 102 -176 -270 98 -157 21 -55 96 -22 236 39 85 -302 -396 90 146 21 24 165 150 196 -112 62 117
8042 117 150 -129 29 -38 -152 11 9 -22 458 -256 286 5 -287 -184 -162 48 -43 147 101 195 -52 -62 185
8065 185 59 -103 165 36 -151 12 -34 90 295 22 -52 114 -47 -64 -272 -130 -182 -219 -100 -120 72 -173
8087 -173 -214 31 15 227 50 -35 -120 172 40 -265 30 220 -55 280 34 -24 445 -38 -233 -2 -430 16
8109 16 100 -80 -163 -73 -60 -245 81 -118 -106 -115 50 -140 61 88 -83 -113 -105 -14 410 -206 108 94 -141 -184 228
$$ packed form
7952a32L34K11l22k82J12L15k97J59K2k41J86k67Q6J94P9j13j31R5R7N5j94J40
7974A06l57rM69j46L4o2O7j35n5L7K15Ml35K67j51K52k04J60n3K06k85ML5J03
7998A67k18J97j70Q7m52O91k36m50M68j54K86k69K29j32k48L67j21j78K19Q3o4
8019A02k78r4L68k55J78p6J51j18K58j97M6l87r4M86N6j25LJ41j5M6l08J74N5
8042A17L3k79J58o7j14J63kl1M80p14N42k81k92J03K2K10r1J90m6R4k47j0K47
8065A85j26j62K68j29j87J63m6J24K05k73p4J66j61j7k08J42n2l7J19k0J92k45
8087a73m1K45j6K12j77q5q5K92j32l05K95J90k75L35k46n8M69m83j95K31m28M46
8109A6Q4j80q3R0J3j85L26j99J2rJ65j90K01K7j71l0QR1M24o16L14j4k35m3M12
$$ plain form
8134 228 -274 125 118 185 92 -140 -244 -326 -159 167 -41 151 62 -38 -55 -105 8 128 236 47 -64 28 364
8157 364 183 66 -57 243 -50 201 -127 107 76 152 -287 17 -65 130 -276 -41 -191 75 229 -127 108
8178 108 -157 64 68 -58 -106 280 -151 193 232 -296 304 39 240
$$ packed form
8134B28n02L99pO7r3k32j04q2J67L26k08J92q9j00j7n0J13J20J08j89j11R2L36
8157C64j81j17j23L00k93K51l28K34l1P6m39L04q2J95m06K35j50K66J54l56K35
8178A08k65K21Mj26m8L86m31L44L9n28O00k65K01
8191B40
$$ Imaginary data points
##PAGE= N=2
##DATA TABLE= (X++(I..I)), XYDATA
$$ plain form
0 0 0 0 0 8 -8 0 -8 16 -16 16 -24 25 -37 40 -48 63 -73 88 -101 120 -141 164 -188 213 -248 284 -322 365 -413
29 -413 467 -523 585 -659 735 -819 912 -1013 1124 -1248 1382 -1529 1692 -1873 2075 -2301
45 -2301 2553 -2842 3171 -3552 3996 -4526 5170 -5968 6996 -8361 10280 -13175 18016 -27605
59 -27605 53728 -267432 -800408 3683 443282 -17092 -316695 11286 -12804 -354723 -190255
70 -190255 260934 84568 -336019 -217266 78790 -90104 -237653 30169 127054 -219987
80 -219987 -303231 6667 18952 -263095 -148945 173433 14012 -379623 -287343 102201 156690
91 156690 -91511 -218688 -178447 -112082 -2858 115504 58955 -146424 -235454 -104328 69895
102 69895 103267 -23864 -165846 -127938 41564 65367 -65863 -76273 4418 -71292 -145389
$$ packed form
0@%%%Qj6QqK4l2L2m0M9o2P7q8J11j36J61j89K21k61L05l52M01m61N32o06O87p78
29d13Q80r90J108j244J394j554J731j925K137k372K630k911L221l565L948m376
45b301M854n395O013o723P548q522R696j1138J2964j5357J8641k3455L1191m5621
59b7605Q1333l21160n32976Q04091M39599m60374k99603L27981k4090l41919J64468
70a90255M51189j76366m20587J18753K96056j68894j47549K67822R6885l47041
80b19987q3244L09898J2285k82047J14150L22378j59421l93635R2280L89544N4489
91A56690k48201j27177M0241O6365J09224J18362n6549k05379q9030J31126J74223
102F9895L3372j27131j41982L7908J69502K3803j31230j0410Q0691p5710p4097
$$ plain form
113 -145389 21964 121724 -95667 -195644 71967 174382 -134059 -259395 52779 204728
123 204728 -43955 -152967 43138 75507 -72658 21211 169429 -49627 -245361 45848
133 45848 298939 26534 -206679 22990 157544 -68354 -83596 181605 88630 -272743
143 -272743 -155131 297901 249397 -203256 -240333 101563 132285 -89066 -36324 123822 -14460
154 -14460 -161510 21275 174570 9995 -119458 -856 60595 -50309 -62017 66166
164 66166 82943 -24770 -53159 -15466 -54492 -82133 33218 118379 -22550 -196790 -131725
175 -131725 60049 104953 -7642 -115072 -145566 -111503 -25778 70256 80638 -51017 -198633
186 -198633 -150833 42820 92551 -48705 -113898 -35090 -25450 -97740 -45023 86810 42148
$$ packed form
113a45389J67353R9760k17391r9977K67611J02415l08441j25336L12174J51949
123B04728k48683j09012J96105L2369j48165R3869J48218k19056j95734K91209
133D5848K53091k72405k33213K29669J34554k25898j5242K65201r2975l61373
143b72743J17612M53032m8504m52653l7077L41896L0722k21351N2742J60146j38282
154a4460j47050J82785J53295j64575j29453J18602O1451j10904j1708J28183
164F6166J6777j07713k8389L7693l9026k7641J15351Q5161j40929j74240O5065
175a31725J91774M4904j12595j07430l0494L4063Q5725R6034J0382j31655j47616
186a98633M7800J93653M9731j41256o5193P8808R640p2290N2717J31833m4662
$$ plain form
197 42148 -139936 -165500 -19633 28408 -48692 -30042 49537 -31554 -177754 -123243 45771
208 45771 71080 -20344 -81214 -116816 -107029 23259 139110 38122 -154399 -155054 1206 61425
220 61425 4764 4595 38324 -41011 -127476 -25372 124681 65148 -95577 -89693 28331 44903
232 44903 -13153 940 50647 12387 -74765 -66395 30630 67848 19256 -1634 9627 -25046
244 -25046 -40404 45497 101553 10553 -82619 -26759 72525 72821 27679 24223 14726 -33539 -21626
257 -21626 70747 90227 -964 -34230 31347 45916 10409 39553 56847 -36483 -73688 53276
269 53276 125433 9330 -68865 28112 88122 -16035 -72072 41894 106972 -7562 -86122
280 -86122 10504 96354 42328 -21245 -15521 -13746 -15844 21152 42889 17789 5170 303 -37808
$$ packed form
197D2148j82084k5564J45867M8041p7100J8650P9579q1091j46200N4511J69014
208D5771K5309r1424o0870l5602R787J30288J15851j00988j92521o55J56260O0219
220F1425n6661j69L3729p9335q6465J02104J50053n9533j60725N884J18024J6572
232D4903n8056J4093M9707l8260q7152Q370R7025L7218m8592k0890J1261l4673
244b5046j5358Q5901N6056r1000r3172N5860R9284K96m5142l456r497m8265J1913
257b1626R2373J9480r1191l3266O5577J4569l5507K9144J7294r3330l7205J26964
269E3276P2157j16103p8195R6977O0010j04157n6037J13966O5078j14534p8560
280h6122R6626Q5850n4026o3573N724J775k098L6996K1737k5100j2619m867l8111
$$ plain form
293 -37808 -40825 39939 81864 -8825 -104644 -54054 61943 74308 -907 -34584 -22745 -32916
305 -32916 -37634 8424 50415 32559 -21696 -65090 -49242 29988 71497 3500 -69307 -47706
317 -47706 -4072 -442 21412 56017 14038 -73526 -78918 -1753 40775 24251 12201 -4527
329 -4527 -60599 -67549 34388 97378 5462 -92103 -55917 6923 6436 19482 49951 5636 -71155
342 -71155 -64319 -4957 21377 28212 25230 -30311 -89178 -36116 75550 65528 -52914 -79208
354 -79208 1962 11245 -43932 1430 87738 29128 -95910 -83119 28620 64065 12173 -31237
366 -31237 -33602 -13992 11248 20624 7625 -5115 -11544 -30551 -46214 -5520 64623 51916 -45523
379 -45523 -76327 1512 46588 1532 -27042 -1181 4382 -15757 -4985 27801 32483 -316
$$ packed form
293c7808l017Q0764M1925r0689r5819N0590J15997J2365p5215l3677J1839j0171
305c2916m718M6058M1991j7856n4255m3394J5848P9230M1509o7997p2807K1601
317d7706M3634L630K1854L4605m1979q7564n392P7165M2528j6524j2050j6728
329d527n6072o950J01937O2990r1916r7565L6186O2840m87J3046L0469m4315p6791
342g1155O836N9362K6334O835k982n5541n8867N3062J11666j0022j18442k6294
354g9208Q1170R283n5177M5362Q6308n8610j25038J2791J11739L5445n1892m3410
366c1237k365J9610K5240R376j2999j2740o429j9007j5663M0694P0143j2707r7439
379d5523l0804P7839M5076m5056k8574K5861N563k0139J0772L2786M682l2799
$$ plain form
391 -316 -36159 -34530 5858 39588 29740 -3815 -21558 -9351 12478 16438 4475 -5349 -16931
404 -16931 -22453 3611 36054 22929 -11008 -17175 -12882 -17407 309 33340 28309 -15488 -35582
417 -35582 -788 45221 40798 -9097 -33973 -8087 17032 17771 23306 33823 17998 -20871 -38476
430 -38476 -3514 51830 49591 -16361 -52855 -11339 39940 35969 2547 -15265 -14479 -18570 -25178
443 -25178 3079 57022 51415 -31393 -75399 -15193 52021 37554 -11624 -24354 -10020 -5496
455 -5496 -2327 23505 41450 5457 -52513 -56801 -7178 35795 40747 6565 -43163 -54454 -13663
468 -13663 19411 12422 -4440 -22055 -44137 -37064 10465 42850 20076 -26932 -47699 -32232
480 -32232 -4442 21232 37390 19598 -32089 -49113 2495 46118 21828 -17727 -19949 -7323
$$ packed form
391c16l5843J629M0388L3730r848l3555j7743J2207K1829L960j1963r824j1582
404a6931n522K6064L2443j3125l3937o167M293m525J7716L3031n031m3797k0094
417c5582L4794M6009m423m9895k4876K5886K5119P39N535J0517j5825l8869j7605
430c8476L4962N5344k239o5952l6494M1516N1279l971l3422j7812P86m091o608
443b5178K8257N3943n607q2808m4006O0206O7214j4467m9178j2730J4334M524
455e496L169K5832J7945l5993n7970m288M9623M2973M952l4182m9728j1291M0791
468a3663L3074o989j6862j7615k2082P073M7529L2385k2774m7008k0767J5467
480c2232K7790K5674J6158j7792n1687j7024N1608M3623k4290l9555k222J2626
$$ plain form
492 -7323 -4770 1627 22528 36159 9376 -45666 -54794 7147 56821 29256 -21805 -26169 2901
505 2901 17032 11779 11816 17972 4410 -21582 -11797 38496 65621 33698 -17431 -30030 12216
518 12216 57712 40327 -10210 -3111 43575 33579 -9989 8236 55274 31180 -30499 -21687 44213
531 44213 60633 15711 -3453 21306 21794 171 16175 45797 28177 846 15701 34553
543 34553 29383 36672 46362 12918 -24783 4128 65072 68178 14120 -15090 9664 32195 25935
556 25935 23059 22447 -5340 -21307 16483 50826 24097 -7263 3399 7598 -17440 -12383 37108
569 37108 48312 -9262 -41934 10505 50953 3127 -33799 18558 45578 -27523 -62972 23280
581 23280 85941 22071 -56922 -44912 1066 11608 13278 18934 -10772 -51446 -26705 30588
$$ packed form
492g323K553O397K0901J3631k6783n5042r128O1941M9674k7565n1061m364K9070
505B901J4131n253L7O156j3562k5992R785N0293K7125l1923n1129j2599M2246
518A2216M5496j7385n0537P099M6686r996m3568J8225M7038k4094o1679Q812O5900
531D4213J6420m4922j9164K4759M88k1623J6004K9622j7620k7331J4855J8852
543C4553n170P289R690l3444l7701K8911O0944L106n4058k9210K4754K2531o260
556B5935k876o12k7787j5967L7790L4343k6729l1360J0662M199k5038N057M9491
569C7108J1204n7574l2672N2439M0448m7826l6926N2357K7020p3101l5449Q6252
581B3280O2661o3870p8993J2010M5978J0542J670N656k9706m0674K4741N7293
$$ plain form
593 30588 22568 -19148 -13999 -8904 -50959 -36196 59954 69735 -44845 -85018 12711 58197 -17950
606 -17950 -49535 24560 51132 -24636 -55831 15074 53212 4024 -24937 -5542 -14621 -30432
618 -30432 16506 61137 16755 -47565 -39923 5603 22332 16535 9997 -7111 -30261 -18728 33822
631 33822 61586 14233 -46891 -34674 26191 47042 17963 -1620 8221 15270 6247 9623 23286
644 23286 11475 -8246 14764 38726 -1124 -27073 35794 71109 -9621 -62194 12768 62617
656 62617 7 -22675 51282 50858 -54610 -52675 81471 98123 -46268 -88160 35977 86717
668 86717 7711 -14129 28532 -5218 -44535 28359 76335 -12911 -67054 18671 63569 -14522
680 -14522 -41661 32214 29570 -60642 -44350 60357 40964 -67111 -42421 61967 28641 -76686
$$ packed form
593C0588q020m1716N149N095m2055J4763R6150R781j14580m0173R7729M5486p6147
606a7950l1585P4095K6572p5768l1195P0905L8138m9188k8961J9395r079j5811
618c0432M6938M4631m4382o4320P642M5526J6729n797o538j7108k3150J1533N2550
631C3822K7764m7353o1124J2217O0865K0851k9079j9583R841P049r023L376J3663
644B3286j1811j9721K3010K3962l9850k5949O2867L5315q0730n2573P4962M9849
656F2617o2610k2682P3957m24j05468J935J34146J6652j44391m1892J24137N0740
668H6717p9006k1840M2661l3750l9317P2894M7976q9246n4143Q5725M4898p8091
680a4522k7139P3875k644r0212J6292J04707j9393j08075K4690J04388l3326j05327
$$ plain form
692 -76686 -48307 46394 30809 -36216 -28963 2644 -9002 -8588 25102 13373 -51097 -65092 4092
705 4092 55238 20379 -39881 -48484 -16687 8744 10640 -3622 -21223 -32053 -30497 -3539 32600
718 32600 18349 -44086 -54811 5794 23752 -23708 -27666 17359 11250 -28763 -13845 12313
730 12313 -17845 -26436 32341 33771 -60366 -72783 50439 91836 -28491 -84792 6547 36345
742 36345 -39652 -17824 78271 24570 -102692 -51022 91238 63586 -59993 -50462 29853 13845
754 13845 -21582 28923 48536 -31409 -51165 40717 55851 -39252 -42410 58186 55704 -39474
766 -39474 -33424 45578 32031 -25380 1764 40757 -7798 -44679 22435 77840 17946 -53615
778 -53615 -23214 35219 27190 770 10119 7748 -19840 -6795 43443 43051 -18383 -48758 -3276
$$ packed form
692g6686K8379R4701j5585o7025P253L1607j1646M14L3690j1729o4470j3995O9184
705D092N1146l4859o0260q603L1797K5431J896j4262j7601j0830J556K6958L6139
718C2600j4251o2435j0725O0605J7958m7460l958M5025o109m0013J4918K6158
730A2313l0158q591N8777J430r4137j2417J23222M1397j20327n6301R1339K9798
742C6345p5997K1828R6095n3701j27262N1670J42260k7652j23579R531Q0315j6008
754A3845l5427N0505J9613p9945j9756R1882J5134r5103l158J00596k482r5178
766c9474O050P9002j3547n7411K7144L8993m8555l6881O7114N5405n9894p1561
778e3615L0401N8433q029k6420R349k371k7588J3045N0238l92o1434l0375M5482
$$ plain form
791 -3276 49239 32546 -21331 -23515 20836 25498 -11294 -12216 15775 4746 -21328 819 30703
804 30703 6999 -25549 -3785 24572 -197 -27091 -2693 17710 -4135 -3501 25366 -2348
816 -2348 -52495 -5754 70096 17816 -80735 -41371 63992 48679 -35903 -29228 22250 -2307
828 -2307 -39966 10466 56749 -4015 -61818 -8201 49886 12778 -26096 -599 6166 -25569
840 -25569 -8368 37837 17925 -30940 -11659 31284 3821 -41806 -10293 45510 23063 -35103
852 -35103 -26722 19767 18451 -3210 7033 6662 -28697 -29639 24866 48575 5992 -28533 -13061
865 -13061 7477 2790 6748 25901 10952 -32986 -24965 38497 50367 -12070 -37279 8060 29419
878 29419 -6081 -18892 17903 35507 4355 -22305 -7838 12119 12189 9050 8715 -5551 -13472
$$ packed form
791c276N2515j6693n3877k184M4351M662l6792r22K7991j1029k6074K2147K9884
804C0703k3704l2548K1764K8357k4769k6894K4398K0403k1845O34K8867k7714
816b348n0147M6741P5850n2280r8551L9364J05363j5313q4582O675N1478k4557
828b307l7659N0432M6283o0764n7803N3617N8087l7108l8874K5497O765l1735
840b5569J7201M6205j9912m8865J9281M2943k7463m5627L1513N5803k2447n8166
852c5103Q381M6489j316k1661J0243l71l5359r42N4505K3709m2583l4525J5472
865a3061K0538m687L958J9153j4949m3938Q021O3462J1870o2437k5209M5339K1359
878B9419l5500j2811L6795J7604l1152k6660J4467J9957P0l139l35j4266p921
$$ plain form
891 -13472 9523 26500 8198 -4111 7291 -698 -22553 688 45500 31290 -26474 -34153
903 -34153 17605 39814 1235 -26821 -744 21210 1535 -11319 8897 17790 -3212 -14725
915 -14725 -2990 5894 1282 -2325 2671 6958 1235 -6119 -1702 3640 -1108 -1529 5899 883 -7205
930 -7205 5327 19853 4087 -19020 -9070 15058 13224 -7509 -9651 7033 9005 -581 2321
943 2321 3997 -14397 -16476 12828 20399 -9577 -15300 11276 7648 -18967 -7619 24042 9019
956 9019 -30089 -19073 25370 26036 -12108 -18123 7671 5601 -15791 -7670 13802 8835 -4948
969 -4948 -6241 -9541 -10118 8774 15961 -11326 -29574 -7583 14059 4414 -7413 621 3029 -18638
983 -18638 -25900 3386 25987 6424 -19110 -15068 627 7131 7551 1216 -9080 -8368 -3071 -2674
$$ packed form
891a3472K2995J6977j8302j2309J1402p989k1855K3241M4812j4210n7764p679
903c4153N1758K2209l8579k8056K6077K1954j9675j2854K0216Q893k1002j1513
915a4725J1735Q884m612l607M996M287n723p354M417N342m748m21P428n016q088
930g205J2532J4526j5766k3107R950K4128j834k0733k142J6684J972r586K902
943B321J676j8394k079K9304P571k9976n723K6576l628k6615J1348L1661j5023
956I019l9108J1016M4443O66l8144o015K5794k070k1392Q121K1472m967j3783
969d948j293l300n77J8892P187k7287j8248K1991K1642r645j1827Q034K408k1667
983a8638p262K9286K2601j9563k5534M042J5695O504M20o335j0296P12N297L97
$$ plain form
997 -2674 2960 15619 8389 -14257 -19180 -4041 5334 4714 5109 -393 -13687 -15000 4721 16484
1011 16484 131 -16604 -6132 2810 -9082 -5175 19891 16777 -16144 -22797 495 11082 5710
1024 5710 3284 -1275 -8927 -2579 10920 6709 -8116 -3849 8668 -2848 -20862 -750 30882
1037 30882 12319 -27706 -18079 17077 11325 -14515 -6908 14468 8494 -8508 -5528 8676 12425
1050 12425 2417 -6946 -5427 4671 13119 9983 -1095 -3812 8059 10668 -6176 -10538 8097
1063 8097 14549 -1448 -7756 4359 8698 448 -6865 -5134 3007 6092 -1956 -7206 -103 7739
1077 7739 4461 -2983 -5925 -4035 -100 1396 1648 3681 2329 -1940 -2910 -3244 -4960 1389 9269 -2111
1093 -2111 -17710 -6885 14262 9187 -10622 -13067 -2440 -729 -7306 -6220 5962 9386 -4887
$$ packed form
997b674N634J2659p230k2646m923J5139R375o20L95n502j3294j313J9721J1763
1011A6484j6353j6735J0472Q942j1892L907K5066l114l2921o653K3292J0587n372
1024E710k426m559p652O348J3499m211j4825M267J2517j1516j8014K0112L1632
1037C0882j8563m0025R627L5156n752k5840P607K1376n974j7002K980J4204L749
1050A2425j0008r363J519J0098Q448l136j1078k717J1871K609j6844m362J8635
1063H097O452j5997o308J2115M339q250p313J731Q141L085q048n250P103P842
1077G739l278p444k942J890L935J496K52K033j352m269r70l34j716O349P880j1380
1093b111j5599J0825K1147n075j9809k445J0627J711o577J086J2182L424j4273
$$ plain form
1106 -4887 -16534 -9263 5136 9786 1096 -12038 -11959 5198 12656 -1455 -6992 5517 4481 -14545
1120 -14545 -15912 8257 21976 4383 -18719 -13986 7364 10039 -5926 -8719 1687 1051 -8050
1133 -8050 -6326 4969 10813 3265 -12681 -16099 -176 13051 7268 -2704 -3157 801 1925 -125
1147 -125 -581 5309 7453 -2474 -9572 2011 14563 10127 -1147 -6004 -4369 1417 6555 6445 3100
1162 3100 430 493 3067 3461 -410 516 8206 4953 -5855 -1149 13439 12243 -1285 -4882 2979
1177 2979 7601 1961 -3234 3282 12286 6738 -5874 -5232 4493 7483 1033 -6625 -5766 5146 9952
1192 9952 -2424 -10958 -77 8640 -1835 -13212 -6475 6889 6472 -5900 -7838 4519 4731 -11588
1206 -11588 -14180 5298 12318 -3305 -14179 -5834 5978 5376 -4218 -10045 -6063 -2426 -2758 -1398
$$ packed form
1106d887j1647P271J4399M650q690j3134P9J7157P458j4111n537J2509j036j9026
1120a4545j367K4169J3719j7593k3102M733K1350K675j5965k793J0406o36r101
1133h050J724J1295N844p548j5946l418J5923J3227n783r972m53L958J124k050
1147a25m56N890K144r927p098J1583J2552m436j1274m857J635N786N138j10l345
1162C100k670O3K574L94l871R26P690l253j0808M706J4588j196j3528l597P861
1177B979M622n640n195O516R004n548j2612O42R725K990o450p658Q59J0912M806
1192I952j2376q534J0881Q717j0475j1377O737J3364m17j2372j938J2357K12j6319
1206a1588k592J9478P020j5623j0874Q345J1812o02r594n827L982L637l32J360
$$ plain form
1220 -1398 -129 -2009 -2798 -2908 -8835 -10387 90 5794 -3082 -9876 -4422 702 -1517 -3825 -1197
1235 -1197 -92 -7771 -12508 -2498 10137 5152 -6196 -7799 -7486 -8788 1610 11179 -2429 -18960
1249 -18960 -8805 11703 7379 -12488 -12313 5924 4681 -15879 -13286 12505 13303 -11372 -13556
1262 -13556 5221 4193 -10629 -4839 9685 5215 -7703 -7338 2259 4865 4153 3625 -5497 -16601
1276 -16601 -3060 22406 14210 -17724 -15471 15482 12818 -14869 -10281 15198 9136 -14297 -6672
1289 -6672 16193 9128 -13951 -9431 12374 7666 -12816 -7693 10550 5911 -5054 1181 2015 -12019
1303 -12019 -8756 12817 11932 -12540 -17422 6134 16224 -3170 -17648 -3871 8533 -2015 -9910
1316 -9910 1183 4419 -7650 -6161 6837 2182 -14042 -11583 4666 6955 -3415 -5265 647
$$ packed form
1220a398J269j880p89j10n927j552J0477N704q876o794N454N124k219k308K628
1235a197J105p679m737J0010J2635m985j1348j603L13j302J0398R569j3608j6531
1249a8960J0155K0508m324j9867J75J8237j243k0560K593K5791P98k4675k184
1262a3556J8777j028j4822N790J4524m470j2918L65R597K606p12n28r122j1104
1276a6601J3541K5466q196l1934K253L0953k664k7687M588K5479o062k3433P625
1289f672K2865p065k3079M520K1805m708k0482N123J8243m639j0965O235Q34j4034
1303a2019L263K1573q85k4472m882K3556J0090j9394j4478J3777J2404j0548p895
1316i910J1093L236j2069J489J2998m655j6224K459J6249K289j0370j850N912
$$ plain form
1329 647 -5442 -12301 3391 17542 -6294 -31478 -5676 29126 9652 -27164 -13433 17611 5896
1342 5896 -21274 -8914 16141 5006 -17305 -4829 13700 -3016 -18922 963 15599 -6697
1354 -6697 -17940 2241 7250 -7386 -14 13208 -9573 -32248 -2387 33772 10058 -32338
1366 -32338 -18687 20918 12367 -18685 -7832 14630 -3799 -21830 4238 22307 -3712 -19639
1378 -19639 3542 14701 -7151 -15457 5387 12941 -3832 -7819 7327 4615 -13820 -4956 20173
1391 20173 9710 -22590 -17363 17465 22167 -2611 -13340 -3424 3633 1819 3673 6111 -1334
1404 -1334 -9129 430 14462 5047 -10618 -4192 8332 861 -6613 5081 9956 -6415 -11665 8863
1418 8863 16446 -9387 -25155 3448 28909 3191 -27056 -7200 21523 6005 -15244 -3899
$$ packed form
1329F47o089o859J5692J4151k3836k5184K5802L4802j9474l6816J3731L1044j1715
1342E896k7170J2360K5055j1135k2311J2476J8529j6716j5906J9885J4636k2296
1354f697j1243K0181N009j4636P372J3222k2781k2675K9861L6159k3714m2396
1366c2338J3651L9605q551l1052J0853K2462j8429j8031K6068J8069k6019j5927
1378a9639K3181J1159k1852q306K0844P554j6773l987J5146k712j8435Q864K5129
1391B0173j0463l2300N227L4828M702k4778j0729R916P057j814J854K438p445
1404a334p795R559J4032r415j5665O426J2524p471p474J1694M875j6371n250K0528
1418H863P583k5833j5768K8603K5461k5718l0247J9856K8723j5518k1249J1345
$$ plain form
1430 -3899 7795 -4414 -6473 10807 9855 -11470 -11813 9731 11788 -8248 -9260 7890 4253 -8971
1444 -8971 4723 18306 -6548 -26448 2630 28659 3065 -24352 -5964 17398 5810 -8905
1456 -8905 558 5641 -8525 -9549 11639 12944 -11112 -11987 13339 12415 -13667 -12265 11414 9516
1470 9516 -8853 -5458 9125 2345 -10944 -1338 15115 4512 -18879 -14108 11490 16323 -1487
1483 -1487 -10965 -6648 -2979 2461 8407 1036 -11895 -8468 6301 9046 -2261 -6552 2612 4558
1497 4558 -7273 -8770 8891 12857 -6794 -11629 8016 12090 -8512 -13940 7683 16853 -2995
1510 -2995 -17813 -2914 14946 7743 -6741 -5410 -2600 -5992 1997 13725 3266 -14624 -6615
1523 -6615 10577 5076 -7211 -936 6065 -4208 -10242 5661 16495 -1785 -17139 -891 14742
$$ packed form
1430c899J1694j2209k059J7280r52k1325l43K1544K057k0036j012J7150l637j3224
1444h971J3694J3583k4854j9900K9078K6029k5594k7417J8388K3362j1588j4715
1456h905R463N083j4166j024K1188J305k4056q75K5326r24k6082J402K3679j898
1470I516j8369L395J4583o780j3289R606J6453j0603k3391M771K5598M833j7810
1483a487r478M317L669N440N946p371j2931L427J4769K745j1307m291R164J946
1497D558j1831j497J7661L966j9651m835J9645M074k0602n428K1623R170j9848
1510b995j4818J4899J7860p203j4484J331K810l392P989J1728j0459j7890Q009
1523f615J7192n501j2287O275P001j0273o034J5903J0834j8280j5354J6248J5633
$$ plain form
1536 14742 -806 -13647 1755 11430 -2519 -7587 3629 2456 -7414 -418 10104 -1615 -15585
1549 -15585 -1980 18451 7454 -16188 -8941 12317 6373 -10246 -463 13381 -62 -12740
1561 -12740 2196 15463 4089 -9771 -5650 4069 6256 4575 1655 -3134 -5530 3007 9800 -7
1575 -7 -11361 -955 11910 1115 -11540 -132 12661 2384 -11501 -6019 7106 5764 -4329
1588 -4329 -3801 6027 3486 -7851 -5554 7661 6923 -5116 -8029 -783 3931 4674 3282 -2853 -8754
1603 -8754 -6232 4304 8228 -690 -8501 -1856 5281 -1906 -5499 4695 6132 -7374 -9786 3629
1617 3629 9038 391 -3445 888 209 -4572 -1639 6261 3925 -4543 -1891 3931 -2212 -5559 7567
1632 7567 10703 -9171 -17281 3229 16491 1974 -11119 -3538 4493 -1454 -6116 1796 7468 -1241
$$ packed form
1536A4742j5548j2841J5402R675j3949n068J1216j173r870O996J0522j1719j3970
1549a5585J3605K0431j0997k3642P247K1258n944j6619R783J3844j3443j2678
1561a2740J4936J3267j1374j3860M121R719K187j681k920m789k396Q537O793r807
1575gj1354J0406J2865j0795j2655J1408J2793j0277j3885N482J3125j342j0093
1588d329N28R828k541j1337K297J3215p38j2039k913P246M714P43j392o135n901
1603h754K522J0536L924q918p811O645P137p187l593J0194J437j3506k412J3415
1617C629N409q647l836M333o79m781K933P900k336q468K652N822o143l347J3126
1632G567L136j9874q110K0510J3262j4517j3093P581Q031n947m662P912N672q709
$$ plain form
1646 -1241 -8848 -1541 5604 3236 1031 -580 -6217 -4563 6531 7792 -2744 -3830 4162 4273 -4543
1661 -4543 -4488 6758 9112 -2574 -9655 873 11082 4890 -4130 -1916 1659 220 652 4329 4637
1676 4637 1661 -1117 -1448 2283 5947 3823 -180 -1490 -290 3734 7918 4839 -2717 -3208 2239
1691 2239 4321 2208 492 1820 2953 59 -2865 1529 6912 2543 -5405 -4671 2268 4822 4566
1706 4566 875 -3921 -3272 2090 2857 -86 220 2756 1164 -3677 -3113 5871 9950 -1912 -12162
1721 -12162 -2797 10430 6739 -3101 -2052 2335 -110 -3214 -417 5659 4864 -2871 -7484 -706 6417
1736 6417 6061 909 -4309 -5411 -353 5389 3250 -194 1294 443 -4403 -3270 4136 7253 1297
1751 1297 -6905 -6456 3087 7721 2360 -2784 -2567 -2958 -2753 1503 4852 2154 -836 -3070 -3940 -288
$$ packed form
1646a241p607P307P145k368k205j611n637J654J1094J261j0536j086P992J11q816
1661d543N5J1246K354j1686p081J0528J0209o192r020K214L575j439M32L677L08
1676D637k976k778l31L731L664k124m003j310J200M024M184l079p556m91N447
1691B239K082k113j716J328J133k894k924M394N383m369p948P34O939K554k56
1706D566l691m796O49N362P67k943L06K536j592m841N64Q984M079j1862j0250
1721a2162R365J3227l691r840J049M387k445l104K797O076p95p735m613O778P123
1736F417l56n152n218j102N058N742k139l444J488q51m846J133P406L117n956
1751A297q202M49R543M634n361n144K17l91K05M256L349k698k990k234q70L652
$$ plain form
1767 -288 5072 4944 -571 -6212 -5253 3652 9566 2694 -4780 -1994 2564 -648 -1601 4401 7069 1096
1783 1096 -6020 -3767 5952 10048 1306 -5618 -2682 2988 4540 3402 1220 -162 1600 535 -3160
1798 -3160 215 8184 6367 -4495 -7130 2931 10159 3642 -5987 -3840 4287 2998 -2720 864
1812 864 6890 1642 -6069 -3745 2917 5094 2119 -2957 -5369 -261 5646 3821 -1672 -4377 -1296
1827 -1296 1957 -236 -1959 3118 5090 -2945 -7411 601 6555 2347 -3557 -3522 -1347 1405 3963
1842 3963 2310 -1044 -3037 -1903 510 914 1259 3421 2762 -4851 -7383 3105 10539 1566 -8794
1857 -8794 -5716 2401 4550 1806 -357 -602 -1865 -4093 -2635 3201 5162 350 -4528 -5949 -1834
1872 -1834 5790 6181 -3757 -9257 -1368 3341 -557 -1749 3719 4578 -4843 -10584 -1270 10398 6849
$$ packed form
1767b88N360j28n515n641R59Q905N914o872p474K786M558l212r53O002K668n973
1783A096p116K253R719M096q742o924K936N670J552j138k182j382J762j065l695
1798c160L375P969j817j0862k635J0061P228o517r629K147Q127j289n718L584
1812H64O026n248p711K324O662K177k975n076k412N108N907j825n493k705L081
1827a296L253k193j723N077J972q035m466Q012N954m208n904L5K175K752K558
1842C963j653l354j993J134K413M04L45K162o59p613k532J0488P434q973j0360
1857h794L078Q117K149k744k163k45j263k228J458N836J961m812m878j421M115
1872a834P624L91r938n500P889M709l898j192N468Q59r421n741R314J1668l549
$$ plain form
1887 6849 -5938 -7768 162 3709 2249 2740 1241 -3855 -5257 -987 4150 5188 3148 -1988 -5904
1902 -5904 -3737 3768 8581 2754 -6811 -5002 3974 4721 -937 721 4045 -969 -6039 -1897 5290
1917 5290 5965 1026 -3265 -3080 -1794 750 4919 4404 -3617 -7843 168 6030 1684 -1403 1191 -973
1933 -973 -7180 -3581 7485 8260 -3772 -10741 -1802 8060 3469 -4240 -1556 1891 -1519 -1317 3978
1948 3978 3290 -1612 -1428 266 -1909 -1307 3789 4858 -2035 -6197 568 6711 1010 -4906 718 5017
1964 5017 -4244 -7510 5475 11676 -818 -11187 -3644 6070 5237 -400 -1678 -1736 -3411 -306 6510
1979 6510 5417 -5499 -7753 1109 3560 -1532 190 4614 -1253 -7949 -2471 6758 4507 -4995 -5750
1994 -5750 2184 2647 -3724 -1612 6129 3101 -6992 -5703 2038 3362 2813 4029 -765 -8817 -4687
$$ packed form
1887F849j2787j830P930L547j460M91j499n096j402M270N137J038k040n136l916
1902e904K167P505M813n827r565J809Q976P47n658J658L324n014n070M142P187
1917E290O75m939m291J85J286K544M169n15q021m226Q011N862m346l087K594k164
1933i73o207L599J1066P75j2032o969Q939R862m591p709K684L447l410K02N295
1948C978o88m902J84J694k175O02N096J069o893m162O765O143n701n916N624M299
1964E017r261l266J2985O201j2494j0369P543R714q33n637j278n8j675L105O816
1979F510j093j0916k254Q862K451n092J722M424n867o696N478R229k251r502p55
1994e750P934M63o371K112P741l028j0093J289P741J324n49J216m794q052M130
$$ plain form
2009 -4687 8829 11334 -2941 -11301 -1549 7187 1347 -1950 6055 4345 -10213 -9511 8608 13262
2023 13262 -2323 -10462 -1123 5579 321 -2370 2314 3014 -3465 -4024 1715 1758 -401 3756 5057
2038 5057 -6619 -10998 3671 13053 864 -9467 -2666 4271 -603 -3335 5415 7295 -7268 -14221
2052 -14221 2194 14866 3250 -9448 -4272 2477 -779 299 6123 822 -7880 -2632 7912
2065 7912 4364 -5714 -2579 7731 2031 -9515 -2938 11770 6102 -8132 -3813 6815 963
2078 963 -5991 2205 8212 -1382 -9602 -1598 8073 4392 -2579 -2372 -2587 -4311 1949 11270 2915 -13332
2094 -13332 -7597 9785 8108 -6350 -5969 3984 1535 -6358 -1654 8969 4407 -9116 -7965 4768
2108 4768 5772 -3504 -3778 2810 1100 -4333 -1937 2875 1271 -576 -92 -2653 -5409 -745 8988
$$ packed form
2009d687J3516K505j4275q360R752Q736n840l297Q005j710j4558P02J8119M654
2023A3262j5585q139R339O702n258k691M684P00o479n59N739M3k159M157J301
2038E057j1676m379J4669R382j2189j0331O801O937m874k732Q750J880j4563o953
2052a4221J6415J2672j1616j2698N176O749l256J078N824n301q702N248J0544
2065G912l548j0078L135J0310n700j1546O577J4708n668j4234M319J0628n852
2078I63o954Q196O007r594q220Q004R671l681o971K07k15j724O260R321q355j6247
2094a3332N735J7382j677j4458L81R953k449p893M704J0623m562j3523J151J2733
2108D768J004r276k74O588j710n433K396M812j604j847M84k561k756M664R733
$$ plain form
2123 8988 6814 -7185 -11952 1419 10743 2304 -4882 151 1045 -5677 -2209 9822 7200 -7501
2137 -7501 -10935 1746 7790 1180 -2086 1195 -939 -6694 -693 7935 1038 -7467 -1054 5234 -3921
2152 -3921 -7991 4787 10468 -3423 -12773 -2843 7018 2923 -1809 766 100 -7694 -4264 7784
2166 7784 7488 -4458 -7075 -915 203 441 5885 4238 -7527 -9626 2958 9827 1192 -6561 -1739
2181 -1739 4080 -371 -4243 1932 6441 -86 -5774 -1833 3095 2836 1318 815 -1235 -2488 -1543 1336
2197 1336 4409 2397 -2342 -3714 -807 1090 2734 3796 -1268 -7640 -4043 5842 7079 -1768 -7005
2212 -7005 -2473 2628 650 -1070 2182 866 -5380 -3338 4774 3848 -3397 -1990 1984 -1536 -3768
2227 -3768 2976 6074 -1610 -6358 98 4424 -1198 -3361 3637 4726 -5589 -7860 4353 9362
$$ packed form
2123H988k174j3999m767J3371R324q439p186N033Q94o722L468J2031k622j4701
2137g501l434J2681O044o610l266L281k134n755O001Q628o897q505O413O288r155
2152c921m070J2778N681j3891r350R930R861m095m732K575o66p794L430J2048
2166G784k96j1946k617O160J118K38N444j647j1765k099J2584O869q635p753M822
2181a739N819m451l872O175M509o527n688L941M928k59j518n03k050j253R45K879
2197A336L073k012m739j372K907J897J644J062n064o372L597R885J237q847n237
2212g005M532N101j978j720L252j316o246K042Q112r26p245J407L974l520k232
2227c768O744L098p684m748O456M326n622k163O998J089j0315k271J2213N009
$$ plain form
2241 9362 -131 -6346 -2653 -166 614 4190 3983 -3097 -6195 -600 4323 1746 -784 483 -478 -4882
2257 -4882 -2415 6581 6946 -3921 -8261 -580 4240 886 -1072 368 569 -2209 -4358 -829 4460
2272 4460 3941 -2614 -5963 -2410 1636 3543 3615 -556 -5894 -4310 1717 4452 1682 -1304 -1541 -2136
2288 -2136 -3091 1138 7571 4171 -6758 -7895 2986 7157 1317 -1643 1018 -842 -3427 361 4592
2303 4592 2745 -999 -1683 -1136 -1799 1380 6597 3302 -6777 -6450 3927 6614 -1350 -2742 3149
2318 3149 682 -6162 -2687 7059 6124 -3350 -7471 -1560 4579 3387 -136 -2085 -2864 -1943 1581 2927
2334 2927 -193 -762 718 -1780 -3729 447 5479 2120 -4954 -5586 1888 6464 1588 -3111 -843
2349 -843 2038 -1481 -2710 2896 5784 -437 -4789 -2440 2904 4059 1752 -1216 -3109 -2294 1431
$$ packed form
2241I362r493o215L693K487P80L576k07p080l098N595M923k577k530J267r61m404
2257d882K467Q996L65j0867m340P681M820l354j958J440K01k778k149L529N289
2272D460n19o555l349L553M046J907P2m171n338J584O027K735k770k986k37n95
2288b136r55M229O433l400j0929j137J0881M171n840k960K661j860k585L788M231
2303D592j847l744o84N47o63L179N217l295j0079L27J0377K687p964j392N891
2318C149k467o844L475R746r35r474m121N911O139j192l523j949p79R21L524J346
2334B927l120n69J480k498j949M176N032l359p074o32P474M576m876m699K268
2349h43K881l519j229N606K888o221m352K349N344J155k307k968j893Q15L725
$$ plain form
2364 1431 4495 2159 -2678 -2475 1056 -598 -1724 2684 4291 -2664 -6851 -1166 5437 3177 -2707
2379 -2707 -3927 -1572 -34 231 1612 2132 -1107 -3419 -2124 123 1527 3454 1464 -4826 -5599 1998
2395 1998 5794 1772 -3478 -3426 -531 417 321 1410 2951 110 -4474 -3619 3250 5815 1508 -3510
2411 -3510 -4145 -182 3357 2526 467 -245 -1562 -2872 -431 3293 3365 671 -2410 -4280 -1473 4259
2427 4259 4612 -650 -4531 -1958 327 1511 1222 850 145 -3525 -4203 265 4729 1746 -2445 -2931
2443 -2931 -2021 -206 2939 2826 -1804 -4163 -1520 838 1570 1794 833 -1059 -2864 -2068 1677 4147
2459 4147 1679 -2266 -3426 -766 2345 3782 832 -2880 -2574 360 781 960 2671 1074 -2804 -3278
2475 -3278 -163 3089 2927 -213 -3475 -2832 1257 3279 1603 -1075 -1850 -893 -614 -300 1912 3380
$$ packed form
2364A431L064k336m837K03L531j654j126M408J607o955m187N685O603k260n884
2379b707j220K355J538K65J381N20l239k312J295K247J404J927j990o290p73P597
2395A998L796m022n250N2K895R48r6J089J541k841m584Q55O869K565m307n018
2411c510o35L963L539q31k059p12j317j310K441L724P2k694l081j870K807N732
2427D259L53n262l881K573K285J184k89l72p05l670o78M468M464k983m191m86
2443b931R10J815L145j13m630k359K643K358P32K24r61j892j805P96L745K470
2459D147k468l945j160K660L111J437k950l712L06K934M21J79J711j597l878m74
2475c278L115L252j62l140l262O43M089K022j676k678p75R57K79L14K212J468
$$ plain form
2491 3380 -1044 -5477 -2782 3187 2910 -381 -2226 -2625 -1830 866 2303 934 -1365 -2292 -1245 -520
2507 -520 809 2769 1546 -3056 -5006 6 4729 2116 -1967 -1570 -665 -686 1197 2677 1270 -964
2523 -964 -1826 -1944 200 2624 3767 95 -3698 -3637 1906 5110 1145 -2665 -1905 43 -471 479 3098
2540 3098 2535 -1709 -4211 -1988 2602 4227 1015 -3788 -3486 184 2635 2263 -640 -1988 -1174 -700
2556 -700 -1773 156 3694 2056 -4205 -5378 478 5211 2592 -2751 -3118 46 685 -781 1357 3261
2572 3261 -227 -4320 -2160 2357 3532 2677 -675 -3795 -2149 2496 4810 917 -3248 -1831 2113
2587 2113 1063 -1231 1597 3561 -1448 -5770 -887 5135 2840 -2077 -2489 -286 117 304 1312 1303
2603 1303 -827 -2244 -694 691 181 1207 1970 -2193 -5807 -513 6929 3300 -4361 -4155 1541 1835
$$ packed form
2491C380m424m433K695N969k77l291j845l99P95K696J437j369k299r27J047P25
2507e20J329J960j223m602j950N012M723k613m083L97R05k1J883J480j407k234
2523i64q62j18K144K424J143l672l793O1N543L204l965l810P60J948n14R50K619
2540C098n63m244k502K223M590J625l212m803L02L670K451l72k903j348Q14M74
2556g00j073J929L538j638o261j173N856M733k619n343l67L164O39j466K138J904
2572C261l488m093K160M517J175q55l352l120J646M645K314l893m165J417L944
2587B113j050k294K828J964n009m322M883O022k295m917m12K203M03J87J008r
2603A303k130j417J550J385n10J026P63m163l614N294P442l629p661K06N696K94
$$ plain form
2619 1835 -490 -165 2111 -514 -4589 -1950 4170 4190 -1428 -3694 -714 329 1335 3082 895 -2863
2635 -2863 -1776 1981 1952 -798 -172 3083 589 -4425 -2562 5775 5646 -2712 -5383 451 2462 -305
2651 -305 164 2300 -107 -4481 -2388 3127 3874 -302 -2942 -2424 -950 447 3782 2863 -3490 -5628
2667 -5628 860 4121 1 -2399 553 824 -2521 -2506 2484 4166 -664 -4133 -1552 1828 605 -2
2683 -2 2327 394 -3951 -2236 2931 3034 321 -595 -431 -2456 -1492 3634 5595 -665 -6329 -2857 4444
2700 4444 4131 -1466 -1279 938 -1162 -2298 2182 4159 -228 -3596 -1741 1249 1128 255 668 505
2716 505 -2590 -2523 1735 2342 -1067 -1293 1058 -740 -3849 -49 4840 2135 -4350 -4528 1527 4050
2732 4050 1260 -1100 -831 -1291 -2175 997 4499 612 -4050 -2183 1982 1682 110 921 553 -2439
$$ packed form
2619A835k325L25K276k625m075K639O120K0n618k266K980J043J006J747k187l758
2635b863J087L757k9k750O26L255k494n014J863Q337j29q358k671N834K011k767
2651c05M69K136k407m374K093N515P47m176k640N18J474J397L335r19o353k138
2667e628O488L261m120k400K952K71l345J5M990J682m830l469K581L380j223o07
2683bK329j933m345J715N167J03k713r16J64k025R64N126J961o260n664L472P301
2700D444l13n597J87K217k100j136M480J977m387l368J855K990j21q73M13j63
2716E05l095O7M258O07l409k26K351j798l109L800M889k705o485j78O055K523
2732D050k790k360K69m60q84L172L502l887m662J867M165l00j572Q11l68k992
$$ plain form
2748 -2439 -2311 1883 4361 105 -3826 -533 3261 -78 -2565 1652 3413 -1585 -3665 402 2767
2763 2767 1070 -37 186 -1663 -2776 884 4479 1391 -4571 -2675 2228 1265 -1078 1236 2279
2778 2279 -3477 -5483 1696 6276 752 -5380 -2775 1993 1575 -613 -242 544 -1228 -1983 748 1902
2794 1902 60 -247 1030 -1085 -2972 990 4061 1420 -2835 -1943 1088 1636 -467 868 2631 -297
2810 -297 -4870 -1561 5242 4688 -2792 -4484 -691 1688 1919 1513 133 -2360 -2696 817 3135 281
2826 281 -1992 -75 945 -2353 -1913 3929 3456 -3521 -4549 1774 2869 -1650 -1474 2402 1492 -3661
2842 -3661 -3427 2381 3837 -561 -2847 -1232 -671 301 3760 2599 -3413 -4524 2442 4242 -634 -1513
2858 -1513 1841 834 -3262 -1502 4516 3908 -2762 -4414 1509 4068 -84 -1394 775 566 -1364
$$ packed form
2748b439J28M194K478m256l931L293L794l339k487M217J761m998k080M067K365
2763B767j697j107K23j849j113L660L595l088n962J896M903r63k343K314J043
2778B279n756k006P179M580n524o132K605M768m18k188L71P86j772p55K731J154
2794A902j842l07J277k115j887L962L071k641m255Q92L031N48k103J335J763k928
2810b97m573L309O803n54p480j692L793K379K31m06j380k493l36L513K318k854
2826B81k273J917J020l298M40N842m73o977j028O323J095m519J76L876r10n153
2842c661K34N808J456m398k286J615N61R72L459j161o012j111O966J800m876q79
2858a513L354j007m096J760O018o08o670j652N923K559m152j310K169k09j930
$$ plain form
2873 -1364 -615 1121 858 684 550 -1429 -2073 -379 2680 2299 -2141 -3668 -261 3057 950 -1422
2889 -1422 -176 561 -1804 -2108 1865 3441 -563 -3937 -1930 2304 2735 -644 -1811 12 -908 -570
2905 -570 1922 1334 -1351 -1308 1011 209 -1664 997 3307 9 -3874 -1229 3476 2592 -1589 -1343 1572
2922 1572 -185 -2297 1037 4151 316 -2933 -826 1079 1151 1506 1095 -1801 -2897 -51 3398 1717
2938 1717 -2083 -1531 1041 175 -1314 638 3004 -451 -3452 -1557 1876 1417 -530 -1153 -1042 -434
2954 -434 -345 808 1145 554 -1404 -1906 -480 818 1382 961 -722 -2225 -1382 1841 2696 658 -1842
2971 -1842 -1261 353 985 476 853 1284 -1467 -2185 869 2916 821 -1193 -480 -472 -476 747 1876 257
2989 257 -1652 -1398 771 1114 -461 386 1321 -989 -3178 -351 3158 1109 -2214 -1923 4 180 385
$$ packed form
2873a364P49J736k63j74j34j979o44J694L059l81m440j527L407L318k107k372
2889a422J246P37k365l04L973J576m004l374K007M234M31l379j167J823r20L38
2905e70K492n88k685M3K319q02j873K661K310l298l883K645M705q84m181K46K915
2922A572j757k112L334L114l835l249K107J905P2L55m11k896j096K846L449j681
2938A717l800N52K572q66j489J952K366l455l001J895L433m59j947o23J11O08
2954d34Q9J153L37n91j958n02J426J298N64m21j683j503Q43L223Q55k038k500
2971a842N81J614O32n09L77M31k751p18L054K047k095k014P13QmJ223J129j619
2989B57j909K54K169L43j575Q47R35k310k189K827L509k049l323K91J927J76K05
$$ plain form
3006 385 366 -10 -1170 -1538 -352 957 805 -29 -636 -1102 -777 719 2138 495 -2125 -1336 1155 1725
3024 1725 302 -391 136 638 -613 -939 1182 2311 -358 -2366 -328 1399 965 598 -115 -1080 -561
3041 -561 250 1578 594 -506 -758 -75 -263 -585 1292 2353 -1324 -3663 284 3181 842 -1528 -769
3058 -769 -42 -534 -685 710 1325 -51 -1712 -1469 55 1105 1153 131 -1785 -2654 1325 2523 -313
3075 -313 -1444 -201 775 -915 -758 1296 2315 59 -2949 -1460 2324 2877 -34 -1537 -699 452
3091 452 433 618 712 520 -55 -1597 -832 1161 1806 400 -1077 -2231 -525 2340 1881 -1314 -1791 562
3109 562 81 -937 -485 1474 713 -1812 -2332 402 2245 850 -1718 -1122 -645 137 550 809 -602
3126 -602 -1253 -122 -520 -893 915 2414 -20 -2740 -1002 1763 2114 -740 -1697 340 1043 15 -136
$$ packed form
3006C85j9l76j160l68J186J309j52q34o07m66L25J496J419j643k620P89K491N70
3024A725j423o93N27N02j251l26K121J129k669k008K038J727m34l67p13r65N19
3041e61Q11J328r84j100k52O83j88l22J877J061l677k339L947K897k339k370P59
3058g69P27m92j51J395O15j376j661K43J524J050M8j022j916q69L979J198k836
3075c13j131J243R76j690J57K054J019k256l008J489L784N53k911j503Q38J151
3091D52j9J85R4j92n75j542P65J993O45j406j477j154J706K865m59l195m77K353
3109E62m81j018M52J959p61k525n20K734J843j395k568N96M77P82M13K59j411
3126f02o51J131l98l73J808J499k434k720J738K765L51k854r57K037P03j028j51
$$ plain form
3143 -136 880 623 -664 -934 206 531 1804 778 -1369 -1779 911 2266 84 -973 -749 525
3159 525 216 -811 97 1085 263 -1399 -1386 982 1638 448 -1243 -1631 12 1012 333 -560 -144 164
3177 164 -800 -897 769 762 211 -1170 -1473 -271 1548 1144 -647 -1454 -286 511 819 -101 -62 51 -309
3196 -309 -1033 151 2022 783 -841 -1003 77 551 1300 812 -262 -807 -272 741 575 442 715 313
3214 313 -1110 -1045 674 2393 562 -1918 -938 409 469 521 554 -728 -1070 -395 496 709 299 -72 -1023
3233 -1023 -1084 -84 886 1120 -199 -1686 -1143 777 798 -103 -67 -100 -275 -672 1 1109 1129 58 -1540
3252 -1540 -201 851 786 507 56 -858 -896 443 1485 396 -596 -227 -287 -285 101 1264 1182 -866 -1862
3271 -1862 509 1916 595 -1099 -132 553 10 -144 569 229 -584 -634 -340 25 -4 314 494 -448 -1562
$$ packed form
3143a36J016k57j287k70J140L25J273j026k147m10K690J355k182j057K24J274
3159E25l09j027R08R88q22j662J3K368O56j190j691l88J643J000o79q93M16L08
3177A64r64r7J666pn51j381l03J202J819m04j791q07J168P97L08r20L9J13l60
3196c09p24J184J871j239j624j62J080M74P49m88j074n45N35J013j66j33K73m02
3214C13j423O5J719J719j831k480R80J347O0N2L3j282l42O75Q91K13m10l71r51
3233a023o1J000R70K34j319j487N43J920K1r01L6l3j75l97O73J108K0j071j598
3252a540J339J052o5k79m51r14l8J339J042j089r92L69o0KL86J163q2k048r96
3271a862K371J407j321j694R67O85n43j54P13l40q13n0K94L65k9L18J80r42j114
$$ plain form
3290 -1562 -87 1786 263 -1905 -522 1185 29 -1293 688 1280 -394 -1972 -808 1409 1620
3305 1620 -441 -1271 -244 87 204 884 150 -1048 -540 908 312 -329 101 1114 -426 -1754 12
3322 12 2215 1215 -1426 -1352 1268 1375 -1469 -632 1634 696 -1900 -863 908 1147 13 -445 -643
3339 -643 -1001 67 1520 845 -1712 -1590 745 1497 -820 -831 1077 467 -2256 -1005 2297 1617 -1442
3356 -1442 -1864 701 1346 -16 -617 467 672 -661 -657 921 673 -24 750 564 -1615 -852 1719 2059
3374 2059 -1279 -2013 811 1562 -488 -1024 1017 1187 -1567 -2014 1434 2401 -512 -2258 -330 1270
3390 1270 588 324 409 -528 -964 530 945 -136 -1143 53 940 -679 -1920 663 2138 -715 -2219
3407 -2219 -30 1595 82 -1337 238 1513 -773 -1715 294 1377 687 -1549 -615 424 163 476
$$ packed form
3290a562J475J873j523k168J383J707j156j322J981N92j674j578J164K217K11
3305A620k061q30J027L31J17O80p34j198N08J448n96o41M30J013j540j328J766
3322A2K203j000k641P4K620J07k844Q37K266r38k596J037J771K39j134m58j98
3339f43l58J068J453o75k557J22K335P52k317j1J908o10k723J251L302o80l059
3356a442m22K565O45j362o01J084K05j333MJ578k48o97P74j86k179P63K571L40
3374B059l338p34K824P51k050n36K041J70k754m47L448R67k913j746J928J600
3390A270o82k64Q5r37m36J494M15j081j007J196Q87j619j241K583J475k853j504
3407b219K189J625j513j419J575J275k286r42K009J083o90k236R34J039k61L13
$$ plain form
3423 476 970 -367 -1451 184 1707 408 -1019 -449 1004 141 -797 228 1588 553 -1922 -706
3439 -706 1706 1049 -1072 -662 764 85 -857 -14 675 -61 -469 -107 -31 -359 180 1260 265 -1884 -1534
3458 -1534 1142 1546 -760 -1388 218 147 -636 264 1457 304 -1735 -863 678 1611 -117 -596 -9
3475 -9 66 -413 592 1006 -485 -705 569 514 -567 -265 774 1087 -442 -1232 396 1231 169 -575 -374
3494 -374 491 -368 -121 902 591 -486 -1013 385 796 347 -359 56 -171 -496 371 1546 177 -1516
3512 -1516 -691 1538 365 -1414 -504 1043 316 -1161 -356 651 270 -708 -402 527 -3 -548 296 862
3530 862 -800 -949 806 848 -938 -293 1245 -114 -1474 -5 2099 1013 -1374 -1184 1071 1643 -195
3547 -195 -738 104 414 -81 294 994 -249 -624 -188 346 -247 111 700 -14 -595 -377 724 570 -469
$$ packed form
3423D76M94j337j084J635J523j299j427N70J453q63r38J025J360j035k475J216
3439g06K412o57k121M10J426o79r42Q43O89p36m08L62P6l28N39J080r95k149L50
3458a534K676M04k306o28J606p1p83R00J193j153k039Q72J541R33j728m79N87
3475iP5m79J005M14j491k20J274n5j081L02J039L13j529p90J628Q35j062p44K01
3494c74Q65q59K47J023l11j077n27J398M11m49p06M15k27l25Q67J175j369j693
3512a516Q25K229j173j779R10J547p27j477Q05J007l81r78L06R29n30n45Q44N66
3530H62j662j49J755M2j786O45J538j359j360J469K104j086k387J90K255N72j838
3547a95n43Q42L10m95L75P00j243l75M36N34n93L58N89p14n81K18J101j54j039
$$ plain form
3566 -469 -925 382 839 -1102 -1467 706 1342 -645 -1662 -232 1193 635 -276 -196 -483 -319 294 875
3584 875 -63 -533 -535 421 131 -303 927 1105 -675 -1443 576 1962 117 -1594 -101 1480 142 -1471
3602 -1471 -40 1588 44 -1164 -187 775 602 20 457 -231 -704 398 812 152 -917 -107 629 -157
3620 -157 -825 384 1509 -652 -1642 39 1674 299 -1419 -1018 284 8 -351 -394 489 52 -461 -83
3638 -83 22 -204 271 526 35 -1067 285 1186 196 -964 125 1122 40 -816 -129 1154 505 -850
3656 -850 -570 996 1165 -604 -834 148 165 151 45 112 -18 -88 146 14 -188 -66 465 -177 -842 -469 795
3677 795 622 -997 -887 489 869 -558 -833 521 449 -467 -767 104 551 -99 -530 -209 -103 33 303
3696 303 167 -478 -610 352 590 -9 -341 480 227 -334 -249 500 766 -2 -621 -195 627 466 -346 -236
$$ packed form
3566d69m56J307M57j941l65K173O36j987j017J430J425n58r11Q0k87J64O13N81
3584H75r38m70kR56k90m34J230J78j780p68K019J386j845j711J493J581j338j613
3602a471J431J628j544j208R77R62j73n82M37o88m73J102M14o60j069Q10P36p86
3620a57o68J209J125k161r90J681J635j375j718M01J302k76l59m3Q83m37n13L78
3638h3J05k26M75K55m91j102J352R01r90j160J089R97j082q56O87J283o49j355
3656h50K80J566J69j769k30R82J7j4j06O7j30p0K34j32k02J22N31o42o65L73J264
3677G95j73j619J10J376L80j427k75J354p2r16l00Q71M47o50m31L21J06J36K70
3696C03j36o45j32R62K38n99l32Q21k53n61Q5P49K66p68o19M26Q22j61q12J10
$$ plain form
3716 -236 55 -237 -225 246 323 147 -191 106 -428 332 838 -60 -76 -538 -240 739 606 -565 -388 44 -8
3737 -8 -821 -4 536 377 -675 -644 61 575 223 -413 -199 -86 -218 27 235 -261 -723 113 264 -526 39
3758 39 507 85 -513 -470 188 777 481 -335 -234 204 193 -235 77 212 150 -178 245 187 464 254 -188 -227
3780 -227 -441 111 458 89 -371 -333 182 -93 -407 -149 624 -247 -852 -365 364 81 -242 -910 105 161
3800 161 -375 -188 -21 -324 4 241 256 -166 -81 479 49 -544 76 1074 128 -732 -488 572 634 -156 -219
3821 -219 562 676 -355 -117 458 332 -140 -102 -196 -55 452 641 -437 -577 -266 332 321 -366 -205 110
3841 110 377 -867 -504 792 560 -503 -1009 -43 598 318 -481 -161 -219 409 -412 -229 219 -89 -60 -442
3861 -442 -515 118 695 -123 -998 -592 855 690 -299 -814 363 236 -106 -355 398 1041 60 -1079 -36
$$ packed form
3716b36K91k92J2M71P7j76l38K97n34P60N06q98j6m62K98R79j33j171J77M32n2
3737hq13Q17N40j59j052L1P05N14l52o36K14J13j32K45K08m96m62Q36J51p90N65
3758C9M68m22n98M3O58N89k96q16J01M38j1m28L12J35o2l28M23n8K77k10m42l9
3780b27k14N52L47l69m60L8N15k75l14K58P73q71o05M87P29k83l23o68J015N6
3800A61n36J87J67l03L28K37J5m22Q5N60m30n93O20R98r46q60K44J060O2p90o3
3821b19P81J14j031K38N75j26m72L8r4J41N07J89j078j40L11N98j1o87J61L15
3841A10K67j244L63J296k32j063n06R66O41k80p99L20n8O28q21J83M48l08K9l82
3861d42p3O33N77q18q75M06J447j65r89n15J177j27l42k49P53O43r81j139J043
$$ plain form
3880 -36 706 412 132 -294 -193 -72 662 289 -128 -268 908 162 -381 1 767 417 -722 -951 -20 891
3900 891 -52 -449 -374 158 -357 -445 -107 296 225 -402 -245 -97 56 610 -9 -815 -423 416 609 -50 -901
3921 -901 188 546 -422 -406 431 480 -186 -752 77 639 447 -33 -534 124 306 -191 -68 24 -75 -77 220 188
3943 188 -213 490 686 -241 -552 -73 1043 615 -575 -144 103 154 -530 -47 318 -277 -831 -142 366 159
3963 159 -306 -481 -131 31 109 241 34 -530 -216 308 212 -169 -94 439 48 -786 -9 346 324 -404 -457 353
3985 353 235 257 320 130 90 -589 -468 736 499 161 -166 177 -298 -187 722 385 -418 -630 -40 577 100
4006 100 -289 -120 355 -43 -353 189 577 -352 -724 -33 -57 -409 166 319 -292 -601 -140 396 365 -552 -74
4027 -74 525 -200 -855 -92 1015 -358 -1081 -572 855 368 21 -204 42 335 -202 147 582 -44 -359
$$ packed form
3880c6P42k94k80m26J01J21P34l73m17j40J176p46n43L82P66l50j139k29R31R11
3900H91r43l97P5N32n15q8L38M03p1o27J57J48J53N54o19q06L92Q39J93o59q51
3921i01J089L58r68J6Q37M9o66n66Q29N62j92m80n01O58J82m97J23R2r9kK97l2
3943A88m01P03J96r27l11M79J116m28j190M31K47N1o84M83L65n95n54O89N08k07
3963A59m65j75L50J62P8J32k07n64L14N24r6l81P5N33l91q34P77L55k2p28n3Q10
3985C53j18K2O3j90m0o79J21J204k37l38l27L43m75J11R09l37q03k12N90O17m77
4006A00l89J69M75l98l10N42L88r29l72O91k4l52N75J53o11l09M61N36l1r17M78
4027g4N99p25o55P63J107j373p23N09J427m87l47k25K46K93n37L49M35o26l15
$$ plain form
4046 -359 217 191 344 175 242 245 -526 -115 967 489 -372 -346 685 178 -698 -344 653 599 -296 -542 430
4067 430 780 -119 -80 37 -170 -816 337 568 -191 -943 17 417 -274 -162 439 142 -960 -1196 464
4086 464 1076 -624 -962 294 755 -30 -431 325 452 -229 -500 186 620 -27 -276 83 -217 -435 333
4105 333 954 -52 -598 81 698 -154 -306 643 729 -393 -1113 210 1379 303 -1289 -498 620 157
4123 157 -459 91 81 -384 -492 581 126 -99 60 128 8 -725 310 917 55 -1291 -393 729 -107
4142 -107 -750 -71 901 -250 -1083 -308 994 532 -750 -710 -71 -114 129 426 7 -254 -380 335 612 -283
4162 -283 135 402 -225 -1021 53 927 123 -1069 -294 835 430 -775 -769 579 45 -664 -338 436 426
4181 426 -288 -279 -136 -434 117 396 -167 -721 -263 278 490 107 -169 193 45 -488 -385 818 375 -840
$$ packed form
4046c59N76k6J53j69O7Lp71M11J082m78q61K6J031n07q76L54R97n4q95k46R72
4067D30L50q99L9J17k07o46J153K31p59p52R60M00o91J12O01k97j102k36J660
4086D64O12j700l38J256M61p85m01P56J27o81k71O86M34o47k49L59l00k18P68
4105C33O21j006n46O79O17q52j52R49Q6j122p20J323J169j076j592P91J118m63
4123A57o16N50j0m65j08J073m55k25J59O8j20p33J035O07q62j346Q98J122q36
4142a07o43O79R72j151q33P75J302m62j282M0O39m3K43K97m19k61j26P15K77q95
4162b83M18K67o27p96J074Q74q04j192P75J129m05j205OJ348n34p09L26P74j0
4181D26p14RJ43k98N51K79n63n54M58N41K12l83k76L62j48n33J03J203m43j215
$$ plain form
4201 -840 -700 197 560 -31 -162 98 -57 -108 91 487 217 40 -277 3 1 -95 350 409 -182 -248 210 344
4223 344 -10 -143 23 100 -165 -78 417 453 -169 -732 -13 725 289 0 -49 -483 -593 100 437 73 -223
4244 -223 -158 -77 112 -47 158 144 -273 -467 -179 393 453 -174 -327 -299 -4 71 301 237 114 -149 -214 236 111
4267 111 46 240 136 -479 -62 605 295 -459 -416 23 515 157 -17 418 47 -134 -241 421 389 78 -166
4288 -166 5 -129 -120 67 84 -137 -501 228 521 -132 -154 2 -164 -362 -587 -241 890 -313 -575 -221 480
4309 480 225 -441 86 47 -347 -324 309 188 -23 -34 -176 -109 -251 410 398 -387 -562 215 844 298 -599 -10
4331 -10 515 32 -129 270 236 255 -491 -327 401 308 267 -56 -74 -409 -90 496 382 -236 206 88 -104 -115
4353 -115 197 851 -70 -821 -413 654 642 -505 -396 60 -153 -407 -147 389 156 -324 -486 -201 106 -26
$$ packed form
4201h40J40Q97L63n91j31K60j55n1J99L96k70j77l17K80kr6M45N9n91o6M58J34
4223C44l54j33J66P7k65Q7M95L6o22n63P19P38m36k89m9m34j10O93L37l64k96
4244b23O5Q1J89j59K05j4m17j94K88N72O0o27j53K8K95P5K30o4j23k63o5M50j25
4267A11o5J94j04o15M17O67l10p54M3M39M92l58j74M35l71j81j07O62l2l11k44
4288a66J71j34RJ87J7k21l64P29K93o53k2J56j66j98k25L46J131j203k62L54P01
4309D80k55o66N27l9l94K3O33j21k11j1j42O7j42O61j2p85j75P77O29n46q97N89
4331a0N25m83j61L99l4J9p46J64P28r3m1l23j8l35L19N86j14o18M42j18j92j1
4353a15L12O54r21p51M08J067j2j147J09M56k13k54K60N36k33m80j62K85L07j32
$$ plain form
4373 -26 139 49 -39 -108 353 586 -378 -458 219 55 -423 -155 748 221 -803 -399 201 807 345 -199 -48
4394 -48 465 -73 -9 391 317 -418 8 239 91 500 524 -37 -400 -214 18 551 -466 -445 -132 298 -67
4415 -67 -286 619 593 -242 -842 -93 590 192 -422 -343 -77 68 294 34 -265 -171 -293 -199 -123 65 365 191
4437 191 -405 -453 347 187 130 -209 33 617 40 -248 312 459 202 -609 -49 613 165 161 -239 -471 -17
4458 -17 350 503 190 -106 -369 -166 163 -106 211 -104 -465 -657 -321 465 381 -165 -991 -21 -192 -49 35
4479 35 175 -34 38 -218 320 578 -50 -362 -156 -270 72 455 141 -116 -147 -26 346 -245 143 -90 198
4500 198 -272 -298 427 428 -43 -245 -120 135 60 133 -86 124 -44 1 207 264 -32 -218 84 -414 20 300
4522 300 278 -29 -451 -658 458 289 131 102 -244 -133 -107 165 -113 241 -347 -298 -113 31 174 100 188 -441
$$ packed form
4373b6J65r0q8o9M61K33r64q0O77j64m78K68R03n27j024M04O00O06m62n44J51
4394d8N13n38O4M00p4p35M26K31j48M09K4n61l63J86K32N33j017K1L13M30l65
4415f7k19R05k6q35o00P49O83l98o14P9K66J45K26k60k99R4j22R4P6J88L00j74
4437A91n96m8Q00j60n7l39K42N84n77k88N60J47k57q11N60O62m48mm00k32M54
4458a7L67J53l13k96k63K03L29k69L17l15l61j92L36P86q4n46q26R70j71J43Q4
4479C5J40k09P2k56N38K58o28l12K06j14L42L83l14k57l1J21L72n91L88k33K88
4500A98m70k6P25Jm71k02J25K55p5P3k19K10j68M5K06N7k96j86L02m98M34K80
4522C00k2l07m22k07J116j69j58k9l46J11K6K72k78L54n88M9J85J44J43p4Q8o29
$$ plain form
4544 -441 -94 262 310 -227 -447 386 83 -331 289 264 80 -70 -339 326 428 547 -242 -151 169 92 488
4565 488 137 169 -87 9 48 -22 354 348 -147 -452 -351 242 780 -203 -247 -208 184 -215 -70 -9 192 -370 -111
4588 -111 -280 87 306 -104 -353 -449 -222 414 555 209 -587 -57 46 -89 54 200 491 -171 -414 224
4608 224 752 211 -280 -529 -274 84 347 196 346 -101 -187 323 204 -46 446 156 -602 -294 794 324
4628 324 33 -231 -297 90 -129 -346 156 462 24 -665 50 333 -86 -109 -279 -76 -44 -2 67 49 -132 -7
4650 -7 125 -42 -180 299 -20 -246 -382 413 408 -343 -461 -124 249 385 -40 120 465 -159 -213 75 335 229
$$ packed form
4544d41L47L56M8n37k20Q33l03m14O20k5j84j50k69O65J02J19p89R1L20p7L96
4565D88l51L2k56R6L9p0L76om95l05J01N93N38r83m4L9L92l99J45O1K01n62K59
4588a11j69L67K19m10k49r6K27O36J41l46p96N30J03j35J43J46K91o62k43O38
4608B24N28n41m91k49K55L58K63j51J50m47q6N10j19k50M92k90p58L08J088m70
4628C24k91k64o6L87k19k17N02L06m38o89P15K83m19k3j70K03L2M2O9j8j81J25
4650gJ32j67j38M79l19k26j36P95np51j18L37L73J36m25J60L45o24n4K88K60j06
$$ [...]
8191A61
##END NTUPLES=NMR FID
##END=
