##TITLE=1H_Ser 3511-NEA
 CDCl3
 8 sc, 
 6.2.2024
##JCAMPDX= 6.0         $$ Bruker NMR JCAMP-DX V2.0
##DATA TYPE= NMR FID
##DATA CLASS= NTUPLES
##ORIGIN= UXNMR, Bruker Analytische Messtechnik GmbH
##OWNER= root
$$ XWIN-NMR		Version 3.5
$$ Tue Feb  6 14:23:52 2024 Russian Standard Time (UT+4h)  she@DPX200
##.OBSERVE FREQUENCY= 200.1313
##.OBSERVE NUCLEUS= ^1H
##.DELAY= (6, 6)
##.ACQUISITION MODE= SIMULTANEOUS
##.ACQUISITION SCHEME= undefined
##.AVERAGES= 8
##.DIGITISER RES= 18
##SPECTROMETER/DATA SYSTEM= spect
##.PULSE SEQUENCE= zg30
##.SOLVENT NAME= CDCl3
##.SHIFT REFERENCE= (INTERNAL, CDCl3, 0, 15.7039)
##AUDIT TRAIL= $$ (NUMBER, WHEN, WHO, WHERE, WHAT)
$$ ##TITLE= Audit trail, XWIN-NMR		Version 3.5
$$ ##JCAMPDX= 5.01
$$ ##ORIGIN= Bruker BioSpin GmbH
$$ ##OWNER= she
$$ F:/spectra/data/she/nmr/H-F/1/audita.txt
$$ ##AUDIT TRAIL=  $$ (NUMBER, WHEN, WHO, WHERE, WHAT)
(   1,<2024-02-06 14:22:39.07 +0400>,<she>,<DPX200>,
      <created by zg, POWCHK disabled, PULCHK disabled
       configuration hash MD5:
       00 E9 B6 7A A2 85 ED C7 34 08 36 98 17 FE 4E 26
       data hash MD5: 16K
       D0 34 B0 57 02 84 D2 31 56 36 CE F9 2E 84 98 2A>)
$$ ##END=
$$ 
$$ hash MD5
$$ E8 3E FB 25 71 26 FF 7F 16 7D 5F 48 1A 4A E0 73
##$RELAX= 
##$RELAX= 
##$RELAX= 
##$RELAX= 
##$RELAX= 
##$RELAX= 
$$ Bruker specific parameters
$$ --------------------------
##$DU= <F:/spectra>
##$EXPNO= 1
##$NAME= <H-F>
##$PROCNO= 1
##$TYPE= <nmr>
##$USER= <she>
##$AMP= (0..31)
100 100 100 100 100 100 100 100 100 100 100 100 100 100 100 100 100 100 
100 100 100 100 100 100 100 100 100 100 100 100 100 100 
##$AQSEQ= 0
##$AQ_mod= 1
##$AUNM= <au_zg>
##$AUTOPOS= <>
##$BF1= 200.13
##$BF2= 200.13
##$BF3= 200.13
##$BF4= 200.13
##$BF5= 200.13
##$BF6= 200.13
##$BF7= 200.13
##$BF8= 200.13
##$BYTORDA= 1
##$CFDGTYP= 0
##$CFRGTYP= 5
##$CHEMSTR= <none>
##$CNST= (0..31)
1 1 145 1 1 1 1 1 1 1 1 1 1 1 1 1 1 1 1 1 1 1 1 1 1 1 1 1 1 1 1 1 
##$CPDPRG= <>
##$CPDPRG1= <>
##$CPDPRG2= <>
##$CPDPRG3= <>
##$CPDPRG4= <mlev>
##$CPDPRG5= <mlev>
##$CPDPRG6= <mlev>
##$CPDPRG7= <mlev>
##$CPDPRG8= <mlev>
##$CPDPRGB= <>
##$CPDPRGT= <>
##$D= (0..31)
0 1.2 0 0 0 0 0 0 0 0.06 0 0.03 0 0 0 0 0.0002 0 0 0 0 0 0 0 0 0 0 0 0 
0 0 0 
##$DATE= 1707214958
##$DBL= (0..7)
120 120 120 120 120 120 120 120 
##$DBP= (0..7)
150 150 150 150 150 150 150 150 
##$DBP07= 0
##$DBPNAM0= <>
##$DBPNAM1= <>
##$DBPNAM2= <>
##$DBPNAM3= <>
##$DBPNAM4= <>
##$DBPNAM5= <>
##$DBPNAM6= <>
##$DBPNAM7= <>
##$DBPOAL= (0..7)
0.5 0.5 0.5 0.5 0.5 0.5 0.5 0.5 
##$DBPOFFS= (0..7)
0 0 0 0 0 0 0 0 
##$DE= 6
##$DECBNUC= <off>
##$DECIM= 32
##$DECNUC= <off>
##$DECSTAT= 4
##$DIGMOD= 1
##$DIGTYP= 9
##$DL= (0..7)
0 120 120 120 120 120 120 120 
##$DP= (0..7)
150 150 150 150 150 150 150 150 
##$DP07= 0
##$DPNAME0= <>
##$DPNAME1= <>
##$DPNAME2= <>
##$DPNAME3= <>
##$DPNAME4= <>
##$DPNAME5= <>
##$DPNAME6= <>
##$DPNAME7= <>
##$DPOAL= (0..7)
0.5 0.5 0.5 0.5 0.5 0.5 0.5 0.5 
##$DPOFFS= (0..7)
0 0 0 0 0 0 0 0 
##$DQDMODE= 0
##$DR= 18
##$DS= 0
##$DSLIST= <SSSSSSSSSSSSSSS>
$$ [...]
##$SUBNAM2= <"">
##$SUBNAM3= <"">
##$SUBNAM4= <"">
##$SUBNAM5= <"">
##$SUBNAM6= <"">
##$SUBNAM7= <"">
##$SUBNAM8= <"">
##$SUBNAM9= <"">
##$SW= 18.0517328524113
##$SWIBOX= (0..15)
0 0 2 0 0 0 0 0 0 0 0 0 0 0 0 0 
##$SW_h= 3612.71676300578
##$TD= 16384
##$TD0= 1
##$TE= 0
##$TE2= 300
##$TE3= 300
##$TEG= 300
##$TL= (0..7)
0 120 120 120 120 120 120 120 
##$TP= (0..7)
150 150 150 150 150 150 150 150 
##$TP07= 0
##$TPNAME0= <>
##$TPNAME1= <>
##$TPNAME2= <>
##$TPNAME3= <>
##$TPNAME4= <>
##$TPNAME5= <>
##$TPNAME6= <>
##$TPNAME7= <>
##$TPOAL= (0..7)
0.5 0.5 0.5 0.5 0.5 0.5 0.5 0.5 
##$TPOFFS= (0..7)
0 0 0 0 0 0 0 0 
##$TUNHIN= 0
##$TUNHOUT= 0
##$TUNXOUT= 0
##$USERA1= <user>
##$USERA2= <user>
##$USERA3= <user>
##$USERA4= <user>
##$USERA5= <user>
##$V9= 5
##$VALIST= <valist>
##$VCLIST= <CCCCCCCCCCCCCCC>
##$VD= 0
##$VDLIST= <DDDDDDDDDDDDDDD>
##$VPLIST= <PPPPPPPPPPPPPPP>
##$VTLIST= <TTTTTTTTTTTTTTT>
##$WBST= 1024
##$WBSW= 4
##$XGAIN= (0..3)
0 0 0 0 
##$XL= 0
##$YL= 0
##$YMAX_a= 36639
##$YMIN_a= -52127
##$ZGOPTNS= <>
##$ZL1= 120
##$ZL2= 120
##$ZL3= 120
##$ZL4= 120
##$ABSF1= 10
##$ABSF2= 0
##$ABSG= 5
##$ABSL= 3
##$ALPHA= 0
##$AQORDER= 0
##$ASSFAC= 0
##$ASSFACI= 0
##$ASSFACX= 0
##$ASSWID= 0
##$AUNMP= <proc_1d>
##$AZFE= 0.1
##$AZFW= 0.1
##$BCFW= 1
##$BC_mod= 2
##$BYTORDP= 1
##$COROFFS= 0
##$CY= 11.3945322036743
##$DATMOD= 1
##$DC= 2
##$DFILT= <>
##$DTYPP= 0
##$F1P= 15.7292609196834
##$F2P= 12.9074282941183
##$FCOR= 0.5
##$FTSIZE= 0
##$FT_mod= 4
##$GAMMA= 1
##$GB= 0.15
##$INTBC= 1
##$INTSCL= 1
##$ISEN= 128
##$LB= 0.24
##$LEV0= 0
##$LPBIN= 0
##$MAXI= 10000
##$MC2= 0
##$MEAN= 0
##$ME_mod= 0
##$MI= 1.114404
##$NCOEF= 0
##$NC_proc= 0
##$NLEV= 6
##$NOISF1= 3.799351
##$NOISF2= 2.8
##$NSP= 1
##$NTH_PI= 0
##$NZP= 0
##$OFFSET= 15.70392
##$PC= 1
##$PHC0= -24596.52
##$PHC1= 14.45268
##$PH_mod= 1
##$PKNL= yes
##$PPARMOD= 0
##$PSCAL= 0
##$PSIGN= 0
##$REVERSE= no
##$SF= 200.130013532006
##$SI= 16384
##$SIGF1= 3
##$SIGF2= 2
##$SINO= 400
##$SIOLD= 16384
##$SREGLST= <1H.CDCl3>
##$SSB= 0
##$STSI= 0
##$STSR= 0
##$SW_p= 3612.71676300578
##$SYMM= 0
##$S_DEV= 0
##$TDeff= 0
##$TDoff= 0
##$TI= <>
##$TILT= no
##$TM1= 0
##$TM2= 0
##$TOPLEV= 0
##$USERP1= <user>
##$USERP2= <user>
##$USERP3= <user>
##$USERP4= <user>
##$USERP5= <user>
##$WDW= 1
##$XDIM= 8192
##$YMAX_p= 0
##$YMIN_p= 0
$$ End of Bruker specific parameters
$$ ---------------------------------
##NTUPLES= NMR FID
##VAR_NAME=  TIME,          FID/REAL,        FID/IMAG
##SYMBOL=    X,             R,               I
##VAR_TYPE=  INDEPENDENT,   DEPENDENT,       DEPENDENT
##VAR_FORM=  AFFN,          ASDF,            ASDF
##VAR_DIM=   8192,          8192,            8192
##UNITS=     SECONDS,       ARBITRARY UNITS, ARBITRARY UNITS
##FACTOR=    0.0002768,     1,               1
##FIRST=     0,             0,               0
##LAST=      2.2672688,     0,               0
##MIN=       0,             -52127,          0
##MAX=       2.2672688,     36639,           0
$$ Real data points
##PAGE= N=1
##DATA TABLE= (X++(R..R)), XYDATA
$$ plain form
0 0 0 0 0 0 0 0 0 0 0 0 0 0 0 0 0 0 0 0 0 0 0 0 3 -8 8 -8 8 -8 8 -9 14 -16 16 -17 21 -24 25 -29 32 -37 41 -45 49 -56
44 -56 61 -68 75 -82 91 -101 110 -120 134 -147 162 -181 202 -225 252 -285 324 -375 437 -521 639
65 639 -816 1110 -1694 3257 -16450 -42754 2446 27126 21670 14939 24528 35792 17304 -7170
79 -7170 7132 11453 -12710 -27750 -25914 -9983 -2364 -15305 -4922 11870 -3043 -14177 -4446
92 -4446 8200 16042 5001 3108 17725 9168 -3931 3274 3747 -3340 -11302 -9724 13081 18560
106 18560 278 -3513 -5797 -16595 -21786 -20433 -3663 6520 -7571 -2574 19010 18624 9870 6456
120 6456 9905 13364 -1097 -3856 16301 12773 -11091 -24037 -25321 -17127 -15608 -15445 7766 19475
134 19475 3926 1119 11815 17807 10040 -8603 -5424 8252 -498 -4892 5153 5910 -2512 -14475
$$ packed form
0@%%%%%%%%%%%%%%%%%%%%%%Lj1J6j6J6j6J6j7K3l0L2l3L8m5M9n4O1o9P8q6R4j05
44e6J17j29J43j57J73j92K11k30K54k81L09l43L83m27M77n37O09o99Q12r58J160
65F39j455J926k804M951j9707k6304M5200K4680n456o731R589J1264j8488k4474
79g170J4302M321k4163j5040J836J5931P619j2941J0383J6792j4913j1134R731
92d446J2646P842j1041j893J4617q557j3099P205M73p087p962J578K2805N479
106A8560j8282l791k284j0798n191J353J6770J0183j4091M997K1584l86q754l414
120F456L449L459j4461k759K0157l528k3864j2946j284Q194J519J63K3211J1709
134A9475j5549k807J0696N992p767j8643L179J3676q750m394J0045P57q422j1963
$$ plain form
148 -14475 -11671 7560 5672 -4975 2661 5948 -1216 -8530 -10987 -161 147 -12972 -4443 11666
162 11666 13233 11703 8982 10298 7687 -7117 -6260 5914 -2132 -13638 -13956 -9324 -2065 -4675 -5410
177 -5410 7335 5378 -3659 3578 12445 14285 6691 -3618 1843 1313 -12858 -9709 1583 1342 -3470
192 -3470 -7150 2870 13306 1305 -4709 3627 -115 -7684 -8845 -1490 9643 1292 -9390 1478
206 1478 8046 1303 -1740 969 9571 7486 -5014 700 7125 -4315 -12755 -10379 -3325 1529 -4326
221 -4326 -787 11183 5266 -3065 -25 3292 4361 -2215 -6393 3782 3827 -4012 597 3605 34
236 34 -4701 -6529 3206 8305 -1555 -773 4074 -1755 -6215 -6718 -1255 4101 -3336 -3555 7542 5819
252 5819 -648 -136 2472 4796 -2500 -8240 2982 6148 -3513 -3596 854 3100 -935 -8060 -327 6826
$$ packed form
148a4475K804J9231j888j0647P636L287p164p314k457J0826L08j3119Q529J6109
162A1666J567j530k721J316k611j4804Q57J2174q046j1506l18M632P259k610p35
177e410J2745j957r037P237Q867J840p594j0309N461n30j4171L149J1292k41m812
192c470l680J0020J0436j2001o014Q336l742p569j161P355J1133q351j0682J0868
206A478O568o743l043K709Q602k085j2500N714O425j1440q440K376P054M854n855
221d326L539J1970n917q331L040L317J069o576m178J0175M5p839M609L008l571
236C4m735j828R735N099r860P82M847n829m460n03N463N356p437k19J1097j723
252E819o467N12K608K324p296n740J1222L166r661q3M450K246m035p125P733P153
$$ plain form
268 6826 -2729 -5318 1619 4110 1003 -6753 -3907 7244 2226 -3646 3854 7226 3853 -2111 -3344
283 -3344 4886 1722 -9190 -4747 1122 -2217 -4028 -3257 3383 5429 -4071 -2698 5400 2353 -174
298 -174 553 2425 4350 -3175 -5242 3788 2214 -3046 -181 2210 3243 -1376 -5531 1662 1743 -7073
314 -7073 -4676 -277 -388 -1557 -2800 4151 8607 226 -555 6328 4625 656 -2143 -28 4155 -4478
330 -4478 -10131 -1743 335 -4532 -4910 -847 5707 2194 -5141 2746 8242 1017 -2115 165 3933
345 3933 2783 -4988 -1672 6824 1326 -4161 -1493 1268 1562 -4667 -5620 3000 332 -6933 -3371 728
361 728 1783 212 -1202 5909 7038 -632 1409 5563 2627 169 -2926 -604 990 -6603 -6526 591
377 591 -1369 -3860 -2593 350 3633 -685 -2497 6214 5738 -853 371 3202 4412 604 -3897 2237
$$ packed form
268F826r555k589O937K491l107p756K846J1151n018n872P500L372l373n964j233
283c344Q230l164j0912M443N869l339j811P71O640K046r500J373Q098l047k527
298a74P27J872J925p525k067R030j574n260K865K391J033m619m155P193Q1q816
314g073K397M399j11j169j243O951M456q381p81O883j703l969k799K115M183q633
330d478n653Q388K078m867l78M063O554l513p335P887N496p225l132K280L768
345C933j150p771L316Q496n498n487K668K761K94o229r53Q620k668p265L562M099
361G28J055j571j414P111J129p670K041M154k936k458l095K322J594p593P7P117
377E91j960k491J267K943L283m318j812Q711m76o591J224K831J210l808m501O134
$$ plain form
393 2237 4708 -4393 -5480 -773 466 -2077 -6513 -2041 4592 -2058 -5516 1876 4958 3073 -648
408 -648 566 7496 2916 -4462 988 4372 483 -3015 -3968 1271 1197 -6692 -3670 2478 -663 -3546
424 -3546 -3103 989 3703 -1733 -1355 6145 3483 -116 1668 3393 4932 700 -3079 1727 -214 -6983
440 -6983 -4874 -1942 -1538 -2826 -4704 963 4202 -1537 540 6218 4894 2136 -244 1824 4363
455 4363 -2531 -5250 1524 778 -3614 -3906 -911 3709 -36 -4524 2104 4037 -2450 -3924 -1299 2404
471 2404 1318 -4604 310 6407 773 -1294 2711 5352 4291 -2667 -3332 2282 -1888 -7075 -3654
486 -3654 -771 -624 -3674 -4332 3549 5219 380 3287 6001 4119 904 -2635 211 1453 -5531 -5057
502 -5057 6 -961 -1652 -780 1431 3923 -572 -2127 3676 2254 -1574 -776 -372 825 -2114 -4896
$$ packed form
393B237K471r101j087M707J239k543m436M472O633o650l458P392L082j885l721
408f48J214O930m580p378N450L384l889l498r53N239p4p889L022O148l141k883
424c546M43M092K714n436L78P500k662l599J784J725J539m232l779M806j941o769
440f983K109K932M04j288j878N667L239n739K077N678j324k758k380K068K539
455D363o894k719O774p46m392k92K995M620l745m488O628J933o487j474K625L703
471B404j086n922M914O097n634k067M005K641j061o958o65N614m170n187L421
486c654K883J47l050o58P881J670m839K907K714j882l215l539K846J242o984M74
502e057N063r67o91Q72K211K492m495j555N803j422l828P98M04J197k939k782
$$ plain form
518 -4896 1057 2880 -1928 446 4717 5116 2060 -3425 -1089 1366 -5041 -5433 521 1536 -447 -3212
534 -3212 -1048 5434 1834 -2087 3027 4088 631 -1673 -1788 3085 388 -7472 -4562 350 -786
549 -786 -343 1398 4748 4890 -1952 -1702 3490 975 -2465 -2255 -1235 1237 -2270 -3398 2574 1683 -2540
566 -2540 -443 1841 3201 1802 -1354 1936 1949 -3540 -2160 1122 -287 -1604 -3285 477 4602 91
582 91 -691 2430 -366 -2995 -2689 -186 3727 -708 -3710 1636 2995 -155 256 1026 2665 -447 -4744
599 -4744 908 5276 87 -2301 -1926 -1775 -1949 -4786 -861 5488 1428 -2415 641 2816 3073 -950
615 -950 -2797 2106 1129 -2661 1566 4101 2058 -2090 -5492 -1360 701 -3558 -1739 2373 852 -283
631 -283 -753 1171 3450 -1484 -2796 2169 2675 1866 2572 1353 767 -3998 -6495 -495 1420 -1349 -398
$$ packed form
518d896N953J823m808K374M271L99l056n485K336K455o407l92N954J015j983k765
534c212K164O482l600l921N114J061l457k304j15M873k697p860K910M912j136
549g86M43J741L350J42o842K50N192k515l440K10J020K472l507j128N972q91m223
566b540K097K284J360j399l156L290J3n489J380L282j409j317j681L762M125m511
582I1p82L121k796k629L06K503L913m435l002N346J359l150M11P70J639l112m297
599d744N652M368n189k388L75J51j74k837L925O349m060l843L056K175K57m023
615i50j847M903r77l790M227K535k043m148l402M132K061m259J819M112j521j135
631b83m70J924K279m934j312M965N06q09P06j219n86m765k497O000J915k769R51
$$ plain form
648 -398 249 496 371 -1515 1872 2366 -3769 -3218 1434 3276 3329 539 856 2540 -2527 -4155 1608
665 1608 2682 486 -2287 -2366 1335 -652 -4890 -1105 596 -2366 -1872 919 6430 6545 -328 -489
681 -489 2324 -388 -1858 -1473 -20 856 -3413 -3171 2794 1038 -3296 -2794 -1665 1004 780 437 4675
698 4675 3665 -2345 -2255 -715 -93 707 -953 1389 3098 -727 47 3168 306 -3058 -5172 -3797
714 -3797 773 -278 -484 3103 1238 -2225 -1596 670 3752 2223 -791 2873 3951 -544 -1303 -955
730 -955 -1097 -2561 -5741 -1774 3786 1028 -501 976 592 -434 -2937 -1072 3855 1013 -2468 1197
746 1197 3132 2429 76 -2703 306 428 -3000 517 3396 944 -1870 -3957 -1814 554 -2557 -1904
762 -1904 2541 1289 371 834 1904 3587 109 -2919 128 -436 -1398 772 1469 1456 -624 -3787 -284
$$ packed form
648c98O47K47j25j886L387M94o135N51M652J842N3k790L17J684n067j628N763
665A608J074k196k773p9L701j987m238L785J701k962M94K791N511J15o873j61
681d89K813k712j470L85J453Q76m269K42N965j756m334N02J129K669k24l43M238
698D675j010o010R0J540O22Q00j660K342J709l825P74L121k862l364k114J375
714c797M570j051k06L587j865l463O29K266L082j529l014L664J078m495p59L48
730i55j42j464l180L967N560k758j529J477l84j026k503J865M927k842l481L665
746A197J935p03k353k779L009J22l428L517K879k452k814k087K143K368l111O53
762a904M445j252r18M63J070J683l478l028L047n64r62K170O97j3k080l163L503
$$ plain form
779 -284 1157 -1843 -755 675 170 423 -885 683 2380 -2072 -2063 1767 1816 1189 606 1048 3002 -681
797 -681 -3795 -352 -93 -2373 -2796 -1562 2061 1888 -1790 978 2748 -1067 -1818 -309 2533 3003 -1598
814 -1598 -1602 2092 45 -1951 -488 232 1335 -663 -1518 2727 2192 -1764 -1516 -1315 -1108 -1642 -2887 1256
832 1256 3469 64 638 2200 949 857 -357 201 1576 -1438 -1940 958 -500 -2012 -2115 -1660 907
849 907 -403 -1430 2548 2679 -85 343 344 511 -774 -3364 -48 2558 -633 -74 1672 1594 872 -2208
867 -2208 -937 2297 -470 -2528 -68 85 -833 -2089 -2151 1903 847 -2226 1118 3270 2649 1433
883 1433 -213 1424 1306 -3257 -2457 335 -808 -1127 -1060 23 1550 -1549 -2370 1526 1058 -477 309
900 309 386 1791 364 -1871 1038 1169 -1161 64 932 1078 1028 -1092 426 1233 -2623 -2521 -621 -702
$$ packed form
779b84J441l000J088J430n05K53j308J568J697m452RL830M9o27n83M42J954l683
797f81l114L443K59k280m23J234L623j73l678K768J770l815p51J509K842M70m601
814a598mL694k047j996J463P20J103j998q55M245n35l956K48K01K07n34j245M143
832A256K213l405N74J562j251r2j214N58J375l014n02K898j458j512j03M55K567
849I07j310j027L978J31k764M28JJ67j285k590L316K606l191N59J746p8p22l080
867b208J271L234k767k058K460J53r18j256o2M054j056l073L344K152o21j216
883A433j646J637j18m563Q00K792j143l19O7J083J527l099q21L896m68j535P86
900C09P7J405j427k235K909J31k330J225Q68J46n0k120J518Q07l856J02J900q1
$$ plain form
918 -702 -327 -1025 -26 2169 -221 -1435 2161 1742 395 404 727 2692 802 -2696 161 917 -1970 -2224
936 -2224 -1420 66 452 -2466 -567 2557 -26 -1264 45 1168 2240 -183 -503 3252 1667 -1421
952 -1421 -515 239 535 -672 -2611 281 669 -2594 -1423 421 316 37 -1376 228 2262 -284 -234
969 -234 2215 1143 530 -141 -49 1845 -85 -1445 1170 81 -1722 -1292 -1326 -462 -821 -2531 367 1337
987 1337 -1050 345 1558 2107 1895 -3 1275 2936 -476 -1396 357 113 -646 -2623 -2303 858 -995
1004 -995 -2847 655 1517 517 -180 -613 1847 1770 -1502 189 1998 501 -384 -768 894 2285 -1131
1021 -1131 -1464 1294 -356 -1709 -1430 -1119 526 -1104 -2586 522 752 -421 995 1495 2533 1943
1037 1943 -70 1317 2068 -919 -698 -151 -992 -949 -2170 -1489 581 -1334 -1395 1281 377 233 -83 190
$$ packed form
918g02L75o98R99K195k390j214L596m19j347RL23J965j890l498K857P56k887k54
936b224Q04J486L86k918J899L124k583j238J309J123J072k423l20L755j585l088
952a421R06P54K96j207j939K892L88l263J171J844j05k79j413J604K034k546N0
969b34K449j072o13o71R2J894j930j360K615j089j803M30l4Q64l59j710K898R70
987A337k387J395J213N49k12j898J278J661l412r20J753k44p59j977L20L161j853
1004i95j852L502Q62j000o97m33K460p7l272J691J809j497q85l84J662J391l416
1021a131l33K758j650j353K79L11J645j630j482L108K30j173J416N00J038n90
1037A943k013J387P51k987K21N47q41M3j221O81K070j915o1K676r04j44l16K73
$$ plain form
1055 190 2032 482 -1206 1265 1070 -761 -161 -43 1389 912 -2008 -30 1128 -1573 -1687 -814 -65
1072 -65 170 -2438 -1563 1875 436 -679 1118 1725 1759 141 -749 2078 1384 -1690 -397 47 -427 -989
1090 -989 -2335 -91 1011 -1700 -1000 922 393 335 -589 -9 1944 21 -676 1456 698 211 484 -14
1108 -14 1090 -141 -2061 219 139 -1352 -544 -407 -233 -312 -1732 201 1711 -372 281 1564 783 430
1126 430 -355 -65 2141 -528 -1713 544 251 -70 -561 -743 1186 -212 -2873 -717 890 -450 -457
1143 -457 -661 941 1428 -1149 62 2476 761 152 127 748 1520 -956 -2207 97 -604 -2041 -926
1160 -926 -581 507 151 -1293 1122 1657 -236 179 386 -9 454 -515 467 1822 -595 -769 374 -177
1178 -177 147 -126 -328 798 -1250 -2020 179 -106 -904 -854 -828 689 840 -169 2313 2505 66 327
$$ packed form
1055A90J842j550j688K471j95j831O00J18J432m77k920J978J158k701j14Q73P49
1072f5K35k608Q75L438j439j115J797O07L4j618q90K827o94l074J293M44m74n62
1090i89j346K244J102k711P00J922n29n8r24N80J953j923o97K132p58m87K73m98
1108a4J104j231j920K280q0j491Q08J37J74p9j420J933J510k083O53J283p81l53
1126D30p85K90K206k669j185K257k93l21m91j82J929j398k661K156J607j340p
1143d57k04J602M87k577J211K414j715o09k5O21P72k476j251K304p01j437J115
1160i26L45J088l56j444K415N35j893M15K07l95M63r69R82J355k417j74J143n51
1178a77L24k73k02J126k048p70K199k85p98N0K6J517J51j009K482J92k439K61
$$ plain form
1196 327 374 723 608 -1705 -956 587 -1612 -1942 -574 -385 -26 -1231 -886 2031 1389 -307 1162 904
1214 904 598 -68 -1155 1214 1162 -1335 -395 1023 428 300 -997 -832 415 -1910 -1459 823 413 -37
1232 -37 -557 -1012 849 355 -231 2140 1692 427 831 371 651 520 -1774 -1062 -928 -2321 -739 194
1250 194 68 326 -952 -550 1277 -128 83 1858 1001 703 473 234 1668 -75 -2225 -150 58
1267 58 -459 -115 -565 688 -88 -2468 -728 819 -582 -636 -281 634 1830 65 389 2158 465 -774
1285 -774 -275 479 1617 482 -1224 223 -479 -2103 -909 -589 -559 -405 -1328 567 1993 313 536
1302 536 965 127 458 -22 572 2123 277 -516 -2 -1152 -1544 -1150 -1283 -10 -362 -1086 1145 1076 -289
1321 -289 168 -505 224 762 -477 1293 2078 -516 -368 349 279 243 -1075 -829 999 -386 -1113 552
$$ packed form
1196C27M7L49j15k313P49J543k199l30J368J89L59j205L45K917o42j696J469k58
1214I04l06o66j087K369n2k497R40J418n95j28j297J65J247k325M51K282m10m50
1232c7n20m55J861m94n86K371m48j265M04m60K80j31k294P12J34j393J582R33
1250A94j26K58j278M02J827j405K11J775q57k98k30k39J434j743k150K075K08
1267E8n17L44m50J253p76k380J740J547j401n4L55R15J196j765L24J769j693j239
1285g74M99P54J138j135j706J447p02j624J194L20L0J54r23J895J426j680K23
1302E36M29q38L31m80N94J551j846p93N14j150l92L94j33J273l52p24K231o9j365
1321b89M57o73P29N38j239J770P85k594J48P17p0l6j318K46J828j385p27J665
$$ plain form
1339 552 -53 -640 -1542 -1911 603 857 -173 1595 2111 951 290 -241 994 1236 -1398 -1072 223 -487
1357 -487 -611 -1041 -1197 -124 -1372 -1623 903 1012 829 970 378 1313 337 -1063 42 419 -198 8
1375 8 408 554 825 -800 -573 -120 -1476 -1021 89 -144 42 -641 -530 915 -157 -453 840 609 605
1394 605 1123 895 1740 535 -1518 -683 -359 -1445 -929 -650 284 413 -1215 -650 1323 -218 -345 309
1412 309 648 1184 81 -21 1708 570 -1235 -303 -225 251 192 -934 660 613 -1146 -733 -430 -600 -410
1431 -410 -843 -50 1645 91 -79 1128 360 563 157 -245 965 349 -545 735 -300 -792 -640 -1046
1449 -1046 -526 -253 -1388 236 996 -352 308 309 153 528 -300 361 1291 106 3 739 135 -99 -882
1468 -882 -1107 326 -496 -1465 -30 323 240 -171 -684 435 483 -957 279 1360 535 575 70 268 787
$$ packed form
1339E52o05n87r02l69K514K54j030J768N16j160o61n31J235K42k634L26J295p10
1357d87j24m30j56J073j248k51K526J09j83J41n92R35r76j400J105L77o17K06
1375HM00J46K71j625K27M53j356M55J110k33J86o83J11J445j072k96J293k31m
1394F05N18k28Q45j205k053Q35L24j086N16K79R34J29j628N65J973j541j27O54
1412C09L39N36j103j02J729j138j805R32P8M76n9j126J594m7j759M13L03j70J90
1431d10m33P93J695j554j70J207p68K03m06m02J210o16q94J280j035m92J52m06
1449a046N20K73j135J624P60j348O60Jj56L75q28O61R30j185j03P36o04k34p83
1468h82k25J433q22r69J435L53q3m11n13J119M8j440J236J081q25M0n05J98N19
$$ plain form
1487 787 -769 -853 669 110 -335 -294 -389 267 -293 -1400 154 -30 -633 188 134 724 1146 -27 607 1251
1507 1251 -10 375 447 47 544 -385 -604 41 -1247 -1333 -237 -575 -248 362 28 1104 475 -490 909
1526 909 776 -26 250 184 486 547 -644 361 604 -924 -801 -548 -156 608 -698 -712 649 -492 -892
1545 -892 88 284 760 413 -229 1403 1177 -302 391 339 106 -237 -1415 -258 407 -1223 -829 -11 -409
1564 -409 64 -396 -108 1187 564 70 1175 696 120 505 -210 269 286 -707 330 163 -672 -273 -710
1583 -710 -420 141 -916 -89 514 -506 -54 648 299 533 41 134 1120 40 -273 948 182 -380 -475
1602 -475 -995 125 -3 -1270 -428 167 -498 -34 -269 359 986 -427 333 1053 624 242 330 201 821
1621 821 -166 -1080 318 -218 -806 -381 -658 -90 -173 -1027 46 580 -404 297 441 365 843 -91 161 922
$$ packed form
1487G87j556q4J522n59m45M1r5O56n60j107J554j84o03Q21n4N90M22j173O34O44
1507A251j261L85P2m00M97r29k19O45j288q6J096l38L27O10l34J076o29r65J399
1526I09j33q02K76o6L02O1j191J005K43j528J23K53L92P64j306j4J361j141m00
1545h92R80J96M76l47o42J632k26j479O93n2k33l43j178J157O65j630L94Q18l98
1564d09M73m60K88J295o23m94J105m79n76L85p15M79J7r93J037j67q35L99m37
1583g10K90N61j057Q27O03j020M52P02l49K34m92R3R86j080l13J221p66n62r5
1602d75n20J120j28j267Q42N95o65M64k35O28O27j413P60P20m29l82Q8j29O20
1621H21r87r14J398n36n88M25k77N68q3q54J073N34r84P01J44p6M78r34K52P61
$$ plain form
1641 922 -176 29 448 -390 31 -210 -587 274 -347 -1019 21 -477 -362 5 -203 413 324 -505 617
1660 617 917 214 750 504 359 507 -630 -515 402 -710 -675 -269 -559 -178 -733 -755 769 378 -369 542
1680 542 571 563 399 -474 777 694 -466 -32 301 -90 92 -523 -316 518 -761 -845 197 -379 -187 -128 -415
1701 -415 604 355 -326 799 658 210 824 61 276 485 -534 -142 54 -654 -361 -479 -745 -103 -419
1720 -419 -366 673 -338 -318 754 317 565 393 29 803 138 -301 576 225 -372 -156 -315 -51 147 -1131
1740 -1131 -449 420 -303 -211 -91 82 661 -219 -365 1213 522 201 452 62 646 74 -652 323 181 -889
1760 -889 -408 -379 -353 71 -792 -161 494 -364 -56 343 90 776 143 -72 917 91 -361 590 -291 13 32
1781 32 -680 85 -51 -727 148 -129 -565 227 -199 101 619 -300 497 966 5 269 595 -22 300 -385
$$ packed form
1641I22j098K05M19q38M21k41l77Q61o21o72J040m98J15L67k08O16q9q29J122
1660F17L00p03N36k46j45J48j137J15R17j112L5M06k90L81n55k2J524l91p47R11
1680E42K9qj64q73J251q3j160M34L33l91J82o15K07Q34j279q4J042n76J92N9k87
1701d15J019k49o81J125j41m48O14p63K15K09j019L92J96p08K93j18k66O42l16
1720d19N3J039j011K0J072m37K48j72l64P74o65m39Q77l51n97K16j59K64J98j278
1740a131O82Q69p23R2J20J73N79q80j46J578o91l21K51l90N84n72p26R75j42j070
1760h89M81K9K6M24q63O31O55q58L08L99k53O86o33k15R89q26m52R51q81L04J9
1781C2p12P65j36o76Q75k77m36P92m26L00N18r19P97M69r61K64L26o17L22o85
$$ plain form
1801 -385 -307 605 -461 -882 -238 -543 -301 -230 -758 211 29 -531 184 817 287 360 -168 326 783 -184 228
1822 228 734 -73 -223 -422 -610 181 -622 -1221 7 -197 -146 207 -299 405 465 -337 444 697 179 601
1842 601 293 -1 336 -498 -490 166 -575 -276 -135 -511 -37 -44 -573 215 -306 -468 551 354 194 598 306
1863 306 672 686 -320 409 268 -525 -222 -315 -188 233 -763 -815 50 -766 -466 275 145 771 129 -325 949
1884 949 278 -123 236 -105 374 160 -484 161 329 -787 -509 -440 -489 117 -166 -251 487 -255 -342 270 -98
1905 -98 253 246 -41 824 488 56 562 -160 -427 -134 -703 -463 126 -526 -351 -36 -621 79 19 -127 457
1926 457 60 175 1036 388 261 612 -29 -141 -126 -438 530 -229 -701 106 -463 -498 -253 -764 -168 105 -500
1947 -500 143 749 356 358 33 131 607 -373 -183 584 27 -24 0 -691 -158 -372 -878 -122 -84 -194 460 -4
$$ packed form
1801c85P8R12j066m21O44l05K42P1n28R69j82n60P15O33n30P3n28M94M57r67M12
1822B28N06q07j50j99j88P91q03n99J228k04N1L53n06P04O0q02P81K53n18M22
1842F01l08k94L37q34QO56p41K99J41l76M74pn29P88n21j62J019j97j60M04k92
1863C06L66J4j006P29j41p93L03r3J27M21r96n2Q65q16L00P41j30O26o42m54J274
1884I49o71m01L59l41M79k14o44O45J68j116K78O9m9O06k83q5P38p42q7O12l68
1905i8L51pk87Q65l36m32N06p22k67K93n69K40N89o52J75L15n85P00o0j46N84
1926D57l97J15Q61o48j27L51o41j12J5l12R68p59m72Q07n69l5K45n11N96K73o05
1947e00O43O06l93Kl25R8M76r80J90P67n57n1K4o91N33k14n06P56L8j10O54m64
$$ plain form
1969 -4 129 535 -282 149 627 85 622 236 120 611 121 -624 -9 -865 -736 -77 -643 -315 286 -349 78
1990 78 18 -475 411 310 233 599 445 410 570 -483 -130 71 -614 -197 110 -204 159 -274 -430 242 -402
2011 -402 -604 -53 -102 282 503 34 811 439 -176 240 142 155 452 -334 -206 318 -747 -482 -306 -669 -255
2032 -255 -436 -541 358 119 -10 607 183 203 294 -276 446 598 -119 416 197 -317 17 -447 -728 -84 -685
2053 -685 -84 283 -430 35 373 -378 75 379 -79 634 235 -100 650 195 187 128 -647 75 -11 -683 107
2074 107 189 -552 -241 -617 -164 162 -255 2 682 -9 368 449 123 555 -34 -392 281 -32 -89 -42 -441
2095 -441 -87 -124 -662 -335 14 -283 188 123 230 691 303 71 468 -188 83 482 119 529 282 -510 38
2116 38 -471 -397 106 -426 -464 -4 -314 19 247 -44 350 347 -324 500 544 121 553 -49 -56 275 -380 -300 -27
$$ packed form
1969dJ33M06q17M31M78n42N37l86j16M91m90p45O15q56J29O59n66L28O01o35M27
1990G8o0m93Q86j01p7L66j54l5J60j053L53K01o85M17L07l14L63m33j56O72o44
2011d02k02N51m9L84K21m69P77l72o15M16r8J3K97p86J28N24j065K65J76l63M14
2032b55j81j05Q99k39j29O17m24K0R1n70P22J52p17N35k19n14L34m64k81O44o01
2053f85O01L67p13M65L38p51M53L04m58P13l99l35P50m55qn9p75P22q6o72P90
2074A07Q2p41L11l76M53L26m17K57O80o91L77Q1l26M32n89l58O73l13n7M7l99
2095d41L54l7n38L27L49k97M71o5J07M61l88k32L97o56K71L99l63M10k47p92N48
2116C8n09P4N03n32l8M60l10L33K28k91L94lo71Q24M4m23M32o02pL31o55Q0K73
$$ plain form
2139 -27 -427 -154 -314 -372 429 -105 -654 111 -68 256 448 1 544 575 155 277 223 -246 83 -201 -331
2160 -331 319 -251 -453 -26 -544 -227 -243 -557 299 258 -173 519 316 276 520 34 217 772 -104 243 214
2181 214 -290 99 -66 -606 -449 -447 -515 72 -339 -254 354 -155 195 157 143 688 377 -62 677 142 -198 375
2203 375 -428 -193 -22 -680 -243 253 -616 -112 -139 -182 305 -136 -323 543 60 106 458 87 399 87 -319
2224 -319 139 20 -281 124 -337 -253 31 -502 -537 197 -467 120 135 -177 576 279 81 564 323 140 556
2245 556 -20 86 194 -577 -222 -163 -484 -255 -177 -473 199 -89 -6 217 5 74 254 -165 377 289 108 328
2267 328 113 55 471 -379 -298 101 -486 -62 -101 -558 -10 13 -317 198 -87 -8 514 -54 91 718 47 111
2289 111 624 95 254 72 -439 154 -167 -510 -15 -193 -291 28 -423 71 424 0 203 493 -33 545
$$ packed form
2139b7m00K73j60n8Q01n34n49P65j79L24J92m47N43L1m20J22n4m69L29k84j30
2160c31O50n70k02M27n18L17j6l14Q56m1m31O92k03m0K44m86J83N55q76L47k9
2181B14n04L89j65n40J57Ko8N87m11Q5O08n09L50l8j4N45l11m39P39n35l40N73
2203C75q03K35J71o58M37M96q69N04k7m3M87m41j87Q66m83M6L52l71L12l12m06
2224c19M58j19l01M05m61Q4K84n33l5P34o64N87J5l12P53k97j98M83k41j83M16
2245E56n76J06J08p71L55N9l21K29P8k96O72k88Q3K23k12O9J80m19N42q8j81K20
2267C28k15n8M16q50Q1L99n87M24l9m57N48K3l30N15k85P9N22n68J45O27o71O4
2289A11N13n29J59j82n11N93l21l43M95j78r8L19m51M94L53m24K03K90n26N78
$$ plain form
2309 545 -8 30 525 -46 8 275 -278 -164 -37 -544 -80 -128 -373 104 -333 -236 450 -116 -76 332 232 480
2331 480 480 22 491 349 -256 311 -146 -255 83 -317 -105 183 -455 -256 -287 -279 171 -26 59 576 263 47
2353 47 442 329 299 407 -358 246 230 -407 60 -204 -363 28 -276 -406 174 -261 8 294 -287 262 306
2374 306 -1 480 360 97 309 160 -150 151 -340 -184 53 -393 -224 -72 -443 -280 -170 -298 135 -5
2394 -5 15 267 -33 260 614 102 223 267 -202 135 119 -475 54 -236 -433 -167 -506 -267 109 -275 295 442
2416 442 -139 301 185 38 562 -22 -186 217 -28 -16 65 -241 16 -38 -448 -3 12 -266 9 -451 -82
2437 -82 309 -123 65 394 49 591 441 17 652 242 -133 100 -55 -72 130 -547 -234 -93 -278 -139 51
2458 51 -547 119 -22 -166 544 422 245 306 -49 139 303 -98 -129 -57 -234 -83 -198 -510 -42 -351 -237
$$ packed form
2309E45n53L8M95n71N4K67n53J14J27n07M64m8k45M77m37R7O86n66M0M08j00K48
2331D80%m58M69j42o05N67m57j09L38m00K12K88o38J99l1QM50j97Q5N17l13k16
2353D7L95j13l0J08p65O04j6o37M67k64j59L91l04j30N80m35K69K86n81N49M4
2374C06l07M81j20k63K12j49l10L01m91J56K37m46J69J52l71J63J10j28M33j40
2394eK0K52l00K93L54n12J21M4m69L37j6n94N29k90j97K66l39K39L76l84N70J47
2416D42n81M40j16j47N24n84j64M03k45J2Q1l06K57n4m10M45J5k78K75m60L69
2437h2L91m32J88L29l45N42j50m24O35m10l75K33j55j7K02o77L13J41j85J39J90
2458E1n98O66j41j44P10j22j77O1l55J88J64m01l1P2j77J51j15l12M68l09J14
$$ plain form
2479 -237 237 -98 43 -8 -307 304 338 7 260 97 108 452 26 53 262 -255 -86 -99 -441 94 -354 -333
2501 -333 -13 -270 -223 258 -110 50 184 39 428 459 -63 357 137 -171 125 -26 -436 128 -424 -325 15
2522 15 -432 85 85 -302 12 280 -62 328 -15 167 334 44 134 352 -130 132 172 -501 166 -170 -614 -141
2544 -141 -298 -255 79 -281 -190 407 -159 145 292 42 410 112 121 333 268 97 55 -376 -213 -169 -584 -205
2566 -205 -13 -479 193 79 -278 327 -24 -137 437 -41 260 227 -80 189 285 -53 47 9 -350 58 -303
2587 -303 -291 260 -187 -92 30 -297 126 235 -93 389 115 178 399 242 255 306 -202 -103 118 -324 -5 -173
2609 -173 -399 -206 -227 -418 3 -112 -120 274 44 386 247 26 170 153 -80 91 -1 50 191 -117 -203 48
2631 48 -327 -196 -69 -453 63 198 -34 298 85 -283 298 14 12 533 109 399 191 -136 41 -62 -326
$$ packed form
2479b37M74l35J41n1k99O11L4l31K53j63J1L44m26K7K09n17J69j3l42N35m48K1
2501c33L20k57M7M81l68J60J34j45L89L1n22M20k20l08K96j51m10N64n52R9L40
2522A5m47N17%l87L14K68l42L90l43J82J67k90R0K18m82K62M0o73O67l36m44M73
2544a41j57M3L34l60R1N97n66L04J47k50L68k98RK12o5j71m2m31J63M4m15L79
2566b05J92m66O72j14l57O05l51j13N74m78L01l3l07K69R6l38J00l8l59M08l61
2587c03J2N51m47R5J22l27M23J09l28M82k74O3K21j57J3N1n08R9K21m42L19j68
2609a73k26J93k1j91M21j15qL94k30L42j39k21J44j7k33J71r2N1J41l08q6K51
2631D8l75J31J27l84N16J35k32L32k13l68N81k84kN21m24K90k08l27J77j03k64
$$ plain form
2652 -326 83 -352 -414 -65 -237 -54 74 -156 -163 157 -141 305 126 112 395 111 23 241 -113 -287 74 -243
2674 -243 -67 -2 -302 27 -42 -442 -2 -19 -60 279 80 243 256 -62 444 358 -6 244 180 -74 349 -61
2696 -61 -202 115 -399 -383 -115 -249 113 -14 -195 227 170 -118 287 62 -77 299 -15 342 297 -10 -99 139
2718 139 -237 -264 -362 -295 124 -166 -164 84 -59 -46 46 -127 350 352 86 388 237 -66 350 -179 -208 152 -142
2741 -142 -111 -80 -205 -30 -44 -301 82 -30 -354 52 -163 178 356 42 296 339 32 99 92 -7 284 -41 -347
2764 -347 -36 -405 -374 38 -466 -104 -8 -263 120 299 104 483 132 159 238 -14 -15 200 -66 75 207 -273
2786 -273 -10 -108 -211 -74 -219 -236 46 -75 -128 102 -69 79 338 -5 454 128 -84 284 56 -145 216
2807 216 -127 20 -94 -378 -84 -5 -325 -54 13 -251 74 157 46 449 274 123 299 183 228 146 -145 -25
$$ packed form
2652c26M09m35o2L49j72J83J28k30pL20k98M46j79j4K83k84q8K18l54j74L61l17
2674b43J76O5l00L29o9m00M40j7m1L39j99J63J3l18N06q6l64K50o4k54M23m10
2696f1j41L17n14J6K68j34L62j27j81M22n7k88M05k25j39L76l14L57m5l07q9K38
2718A39l76k7r8O7M19k90KK48j43J3R2j73M77Kk66L02j51l03M16n29k9L60k94
2741a42L1L1j25J75j4k57L83j12l24M06k15L41J78l14K54M3l07O7pr9K91l25l06
2764c47L11l69L1M12n04L62R6k55L83J79j95L79l51K7P9k52jK15k66J41J32m80
2786b73K63r8j03J37j45j7K82j21n3K30j71J48K59l43M59l26k12L68k28k01L61
2807B16l43J47j14k84K94P9l20K71O7k64L25Q3j11M03j75j51J76j16M5q2k91J20
$$ plain form
2829 -25 -197 -338 182 -108 -197 -219 -322 -204 77 -26 220 160 -128 285 222 239 305 20 47 231 -217 -122 13
2852 13 -323 -156 -53 -275 126 -28 -437 -86 -52 -134 129 -150 361 355 45 272 355 158 372 160 -401 -3
2874 -3 -272 -319 -53 -157 -218 28 -302 -9 89 -369 244 98 104 306 229 35 157 -11 81 307 -227 -62 48
2897 48 -234 76 -155 -252 145 -144 -281 133 -83 -67 151 -101 246 199 -55 456 408 109 408 -8 -23 -24 -162
2920 -162 -267 -117 -386 -13 -157 -151 94 -73 -285 197 -63 87 386 22 301 375 15 200 176 -434 151
2941 151 -30 -91 131 -370 -485 30 -335 52 99 -171 240 38 83 263 164 290 387 148 -52 393 -109 -46
2963 -46 4 -279 -132 -206 -435 -227 -142 -48 95 -78 114 283 47 201 245 -129 386 195 -129 287 -9 -159
2985 -159 89 -133 -174 137 -428 -59 -95 -405 -97 84 -184 27 153 80 543 42 50 187 -16 -46 193 -268
$$ packed form
2829b5j72j41N20k90q9k2j03J18K81j03K46o0k88M13o3J7O6k85K7J84m48R5J35
2852A3l36J67J03k22M01j54m09L51L4q2K63k79N11ol10K27Q3j97K14k12n61L98
2874ck69m7K66j04o1K46l30K93R8m58O13j46OK02p7j94J22j68R2K26n34J65J10
2897D8k82L10k31r7L97k89j37M14k16J6K18k52L47m7k54N11m8k99K99m16j5jj38
2920a62j05J50k69L73j44OK45j67k12M82k60J50K99l64K79P4l60J85k4o10N85
2941A51j81o1K22n01j15N15l65L87M7k70M11k02M5J80r9J26R7k39k00M45n02O3
2963d6N0k83J47p4k29K08Q5R4J43j73J92J69k36J54M4l74N15j91l24M16k96j50
2985a59K48k22m1L11n65L69l6l10L08J81k68K11J26p3M63n01QJ37k03l0K39m61
$$ plain form
3007 -268 203 57 -122 57 -82 -146 -48 -284 -94 32 23 122 235 -112 286 142 -51 393 210 32 272 -194
3029 -194 14 52 -313 -153 -208 -453 -19 -234 -334 192 41 -27 246 146 114 397 -197 260 245 37 132 -33
3051 -33 -76 152 -146 -272 199 -129 -329 11 -94 56 -120 -126 109 104 -70 275 155 211 233 -148 198 292 39
3074 39 129 -37 -171 -114 -253 -362 116 -290 -209 79 -120 52 300 102 173 288 -75 277 138 -79 187 -103
3096 -103 -136 172 -227 -141 31 -407 -364 45 -80 100 37 -63 431 -32 -41 190 9 231 216 -170 174 9
3118 9 -148 57 -62 -251 7 -240 -321 106 -262 -183 -56 -124 284 1 137 276 16 131 423 174 -59 78
3140 78 -3 43 132 -379 -57 -97 -450 158 -25 -112 18 -27 123 244 92 137 438 -2 278 308 89 57 139 -323
3164 -323 108 -143 -209 21 -82 -105 43 -270 -46 -44 33 201 94 224 523 170 258 205 24 55 -33 -40 279 -298
$$ packed form
3007b68M71j46j79J79j39o4R8k36J90J26rR9J13l47L98j44j93M44j83j78K40m66
3029a94K08L8l65J60n5k45M34k15j00N26j51o8K73j00l2K83n94M57j5k08R5j65
3051c3m3K28k98j26M71l28k00L40j05J50j76oK35nj74L45j20N6K2l81L46R4k53
3074C9R0j66j34N7j39j09M78m06Q1K88j99J72K48j98P1J15l63L52j39k17K66k90
3096a03l3L08l99Q6J72m38M3M09j25J80o3j00M94m63rK31j81K22j5l86L44j65
3118Ij57K05j19j89K58k47q1M27l68P9J27o8M08k83J36J39k60J15K92k49k33J37
3140G8q1M6Q9n11L22m0l53O08j83q7J30m5J50J21j52M5L01m40K80L0k19l2Q2m62
3164c23M31k51o6K30j03k3J48l13K24KP7J68j07J30K99l53Q8n3j81L1q8pL19n77
$$ plain form
3188 -298 -358 -90 -226 -154 -110 0 -27 144 -258 181 147 78 262 252 24 234 -1 -8 90 -150 3 25 -66 -112
3212 -112 -110 -377 38 -253 -115 141 -23 52 -16 71 48 250 -66 182 -8 -181 136 61 68 20 -251 -167 5 -301
3236 -301 -175 -74 -239 -5 -164 -73 264 177 -64 330 163 216 299 -36 -28 72 -97 -23 -84 -353 -87 -81 12 252
3260 252 -184 -162 154 -242 -93 28 206 168 151 -157 215 195 41 -35 -107 47 103 -346 -121 132 -283 -160
3282 -160 -119 -302 151 -47 62 371 -65 194 297 -185 133 399 -59 -7 135 -142 147 46 -201 -69 -84
3303 -84 92 -144 47 24 103 -41 153 51 -66 160 62 37 372 -51 -7 251 -136 -25 -93 -369 71 -61
3325 -61 -385 11 -269 -141 263 -135 65 157 83 128 423 -18 289 15 -70 56 -81 -291 171 -18 106 138
3347 138 -241 -193 -30 -207 67 38 -119 295 141 164 450 32 138 177 -142 55 115 -49 123 -74 -179 -136
$$ packed form
3188b98o0K68j36P2M4J10k7J71m02M39l4o9J84j0k28K10k35pR8k40J53K2r1m6
3212a12Kk67M15k91J38K56j64P5o8Q7k3K02l16K48j90j73L17p5Pm8k71Q4J72l06
3236c01J26J01j65K34j59R1L37q7k41L94j67N3Q3l35QJ00j69P4o1k69K66OR3K40
3260B52m36K2L16l96J49J21J78l8j7l08L72k0j54p6p2J54N6m49K25K53m15J23
3282a60M1j83M53j98J09L09m36K59J03m82L18K66m58N2J42k77K89j01k47J32j5
3303h4J76k36J91k3P9j44J94j02j17K26r8k5L35m23M4K58l87J11o8k76M40j32
3325f1l24L96k80J28M04l98K00R2p4M5K95m41L07k74q5J26j37k10M62j89J24L2
3347A38l79M8J63j77K74k9j57M14j54K3K86m18J06L9l19J97O0j64J72j97j05M3
$$ plain form
3369 -136 -198 -40 24 105 -117 205 87 193 39 -57 182 175 -29 153 -29 178 266 -217 -12 -86 -108 -173 -182 -225
3393 -225 -60 -101 -334 -117 -239 39 60 38 223 204 -153 156 235 -9 74 -25 -128 -54 -358 -159 132 -287 -209
3416 -209 -29 -5 76 170 -63 219 -8 -22 199 98 121 188 59 146 109 -101 200 32 -374 -4 -75 -195 81
3439 81 -254 -65 142 85 171 169 109 111 119 141 321 16 -61 91 62 -125 80 -304 -138 26 -299 106 35 -123 37
3464 37 -101 141 436 109 -136 259 299 291 153 -139 283 246 -192 31 -6 -209 -47 -118 36 51 -298 -14 13
3487 13 -74 204 248 107 246 131 111 236 -81 -52 145 -185 -42 -76 -177 -19 -222 -388 32 41 -9 19 150
3510 150 -10 347 -107 124 429 -43 151 118 30 179 -121 -10 78 -144 -311 -87 -179 -162 73 -124 159 68
3532 68 -59 363 133 30 184 -44 -47 186 62 117 211 -332 150 -31 -97 -24 -242 -135 -132 -286 -53 -144 -91 109
$$ packed form
3369a36o2J58O4Q1k22L22j18J06j54r6K39pk04J82j82K07Q8m83K05p4k2o5rm3
3393b25J65m1k33K17j22K78K1k2J85j9l57L09P9k44Q3r9j03P4l04J99K91m19P8
3416b09J80K4Q1R4k33K82k27j4K21j01K3O7j29Q7l7k10L01j68m06L70p1j20K76
3439H1l35J89K07n7Q6ko0KQK2J80l05p7J52k9j87K05l84J66J64l25M05p1j58J60
3464C7j38K42K95l27k45L95M0qj38k92M22l7m38K23l7k03J62p1J54J5l49K84K7
3487A3q7K78M4j41J39j15k0J25l17K9J97l30J43l4j01J58k03j66M20Rn0K8J31
3510A50j60L57m54K31L05m72J94l3q8J49l00J11Q8k22j67K24r2J7K35j97K83r1
3532F8j27M22k30j03J54k28lK33j24N5R4n43M82j81o6P3k18J07Lj54K33r1N3K00
$$ plain form
3556 109 194 -26 270 148 26 118 49 159 69 -353 39 16 -233 11 61 16 66 -265 -121 247 141 62 331
3579 331 29 185 16 -34 294 128 -198 137 -20 -206 -40 -52 53 -154 -278 -231 149 -179 -131 47 -112
3600 -112 322 115 -77 223 225 137 254 89 128 83 -236 -158 49 -327 -185 -112 -152 -78 -300 19 81 -188 122
3623 122 88 9 315 -60 41 366 -72 -22 45 -37 -27 31 -272 -82 -127 -259 32 156 -224 -55 -117 47 370
3646 370 -131 5 58 -208 73 85 58 -15 -187 -203 181 20 -139 95 -153 2 -129 -232 64 -9 -130 77
3668 77 -40 20 247 41 218 241 -42 -59 -99 -14 71 29 -284 -3 -97 -363 -38 -15 -10 -150 14 4 122 -53
3692 -53 188 47 -143 157 11 28 190 24 73 -86 -138 -48 -69 -281 0 -111 -313 176 32 -111 129 31
3714 31 -2 256 96 198 172 -145 71 99 -161 12 -227 13 -5 -185 -251 213 35 216 -85 -71 -30 -97 36
$$ packed form
3556A09Q5k20K96j22j22R2o9J10r0m22L92k3k49K44N0m5N0l31J44L68j06p9K69
3579C31l02J56j69n0L28j66l26L35j57j86J66j2J05k07j24M7L80l28M8J78j59
3600a12M34k07j92L00Kq8J17j65L9m5l19P8K07l76J42P3m0P4k22L19O2k69L10
3623A22l4p9L06l75J01L25m38N0O7q2J0N8l03J90m5j32K91J24l80J69o2J64L23
3646C70n01J36N3k66K81J2k7p3j72j6L84j61j59K34k48J55j31j03K96p3j21K07
3668G7j17O0K27k06J77K3k83j7m0Q5Q5m2l13K81r4k66L25K3Nj40J64j0J18j75
3692e3K41j41j90L00j46J7J62j66M9j59n2R0k1k12K81j11k02M89j44j43K40r8
3714C1l3K58j60J02k6l17K16K8k60J73k39K40j8j80o6M64j78J81l01J4M1o7J33
$$ plain form
3737 36 49 148 -30 235 33 -61 147 63 -152 -15 -81 112 -84 -283 -219 -19 -280 254 -164 -1 206 45
3759 45 190 186 20 221 -130 -193 132 22 -162 9 -190 -217 -57 -245 -32 -3 -320 -11 -5 105 113 141 275 148
3783 148 45 -8 185 38 241 171 -307 123 111 -296 -75 24 -17 230 -238 74 299 -210 -104 87 -74 87
3805 87 -2 66 326 -52 74 108 122 59 47 -228 -153 -141 -108 -87 -134 -10 95 -4 14 98 -100 187 275 159 -29
3830 -29 120 28 -116 158 -26 29 -269 -213 -38 -21 -174 -5 77 114 158 -114 32 226 96 311 -39 18 192
3853 192 -19 -7 41 -155 -18 55 -127 -51 -202 -156 164 -7 -114 161 -85 137 205 105 280 261 -83 200
3875 200 176 -31 138 5 -45 129 -177 -151 -15 -79 156 -15 -130 129 -5 -166 195 191 120 250 13 -3 148
3898 148 -119 60 -69 -238 -35 4 -98 41 -102 -44 346 -231 102 83 12 -31 68 93 169 132 -47 222 -129
$$ packed form
3737C6J3R9j78K65k02r4K08q4k15J37o6J93j96j99O4K00k61N34m18J63K07j61
3759D5J45mj66K01l51o3L25j10j84J71j99k7J60j88K13K9l17L09OJ10QK8J34j27
3783A48j03n3J93j47K03p0m78M30j2m07K21R9m1K47m68L12K25n09J06J91j61J61
3805H7q9O8K60l78J26L4J4o3j2k75P5J2L3K1m7J24J05r9J8Q4j98K87Q8j16j88
3830b9J49r2j44K74j84N5k98N6J75J7j53J69Q2L7M4k72J46J94j30K15l50N7J74
3853A92k11J2M8j96J37P3j82P6j51M6L20j71j07K75k46K22O8j00J75j9l44K83
3875B00k4k07J69j33n0J74l06K6J36o4K35j71j15K59j34j61L61mp1J30k37j6J51
3898A48k67J79j29j69K03L9j02J39j43N8L90n77L33j9p1m3R9K5P6l7j79K69l51
$$ plain form
3921 -129 -225 32 15 -15 -134 -331 -26 -14 99 29 -69 -96 -62 10 126 146 -119 77 193 135 143 -48 -94 101 15
3946 15 -10 -133 43 -44 -275 -148 -150 44 -266 119 168 -49 46 204 125 254 135 -43 245 -88 275 151 -200
3969 -200 39 -134 -191 -45 -41 -221 117 -46 46 169 -3 238 252 33 99 61 49 89 40 -42 -25 -177 -136 -162 -90
3994 -90 3 -202 -205 108 -20 -55 87 -102 79 135 -231 -35 -106 -40 36 57 156 -54 -23 -9 119 24 100 -14 -44
4019 -44 -30 -23 -193 -13 -59 -142 235 135 44 183 232 29 254 2 86 123 -388 -30 12 12 -90 -27 -12 41 47 -144
4045 -144 -125 -114 188 -19 -101 262 36 -71 -26 -3 63 -56 37 -14 119 -197 -6 118 -197 36 75 -77 -181
4068 -181 51 135 18 218 -43 203 89 91 130 -160 -4 60 -59 225 -35 -200 -48 -127 128 -92 -76 48
4090 48 60 40 246 -9 89 213 50 -130 175 168 115 -112 -22 162 -175 -181 157 -25 -192 -82 -80 -34 102 38 192
$$ packed form
3921a29r6K57j7l0j19j97L05J2J13p0r8k7L4P2J16K0k65J96J16n8Qj91m6J95q6
3946A5k5j23J76q7k31J27kJ94l10L85M9k17R5J58p9J29j19j78K88l33L63j24l51
3969b00K39j73n7J46Mj80L38j63R2J23j72K41J4k19O6l8j2M0m9q2J7j52M1k6P2
3994i0R3k05lL13j28l5J42j89J81N6l66J96p1O6P6K1R9k10L1J4J28r5P6j14l0
4019d4J4Pj70J80m6q3L77j00r1J39M9k03K25k52Q4L7n11L58M2%j02O3J5N3Oj91
4045a44J9J1L02k07q2L63k26j07M5K3O6j19R3n1J33l16J91J24l15K33L9j52j04
4068a81K32Q4j17K00k61K46j14KL9k90J56O4j19K84k60j65J52p9K55k20J6J24
4090D8J2k0K06k55R8J24j63j80L05pn3k27R0J84l37oL38j82j67J10KM6J36o4J54
$$ plain form
4115 192 223 9 -148 -30 93 86 139 -40 346 -254 -280 139 65 -117 18 -192 -178 61 -343 95 294 16
4137 16 175 3 26 320 4 128 89 -98 -51 95 -89 96 -200 -109 -132 -195 -12 19 -141 -65 79 59 26 164
4161 164 43 -134 74 -141 -23 49 -7 -14 -140 -50 -128 -139 -28 -169 -38 -46 81 2 -48 117 128 235 78 55
4185 55 280 -139 117 174 -135 -53 -72 -101 -118 -159 -2 103 -118 -30 61 -94 140 343 97 303 46 -113 140
4208 140 -7 109 341 6 14 61 -35 115 -113 52 -43 -236 53 53 91 -102 -22 -13 86 -59 41 96 301 -2
4232 -2 255 -18 81 115 -196 -123 -66 8 -204 -88 111 132 35 9 42 4 -29 203 76 21 82 74 -6 -6 -150 122 -86
4259 -86 -174 -111 -36 -144 122 -130 -155 52 45 -26 70 68 -15 158 171 122 -33 24 218 -49 -51 -19 -272 -188 70 0 -144
4286 -144 -78 -95 49 96 20 113 34 -44 -5 -135 -2 117 -139 -114 -55 -101 -103 -8 -167 28 -261 43 201 -165 59
$$ packed form
4115A92L1k14j57J18J23pN3j79L86o00k6M19p4j82J35k10J4K39m04M38J99k78
4137A6J59j72K3K94l16J24l9j87M7J46j84J85k96R1k3o3J83L1j60P6J44k0l3J38
4161A64j21j77K08k15J18P2n6pj26R0p8j1J11j41J31qJ27p9n0J65J1J07j57k3
4185E5K25m19K56N7l09Q2j9k9j7m1J57J05k21Q8R1j55K34K03k46K06k57j59K53
4208A40j47J16K32l35QM7r6J50k28J65r5j93K89%L8j93Q0RR9j45J00N5K05l03
4232bK57k73R9L4l11P3N7P4k12J16J99K1r7k6L3l8l3K32j27n5O1qq0%j44K72k08
4259h6q8O3P5j08K66k52k5K07pp1R6kq3J73J3m9j55N7J94k67kL2k53Q4K58p0j44
4286a44O6j7J44M7p6R3p9p8L9j30J33J19k56K5N9m6kR5j59J95k89L04J58l66K24
$$ plain form
4311 59 -181 18 117 231 -201 91 -73 -128 226 152 -34 -8 -132 -98 67 -20 -78 49 -294 -11 -153 -135 217
4334 217 12 55 1 -27 172 177 83 23 74 -138 200 174 -319 130 -99 -42 13 -332 -196 -28 -78 194 84 116
4358 116 -2 164 125 157 -32 204 178 -32 24 134 -168 18 -150 -85 53 -235 25 74 15 58 154 -197 18
4381 18 -288 62 109 -4 237 123 -1 56 -79 96 -59 55 -85 -190 114 -172 -53 -50 -25 17 8 36 86 -64
4405 -64 82 235 -168 98 -14 28 5 26 -79 10 28 -110 64 -116 -55 187 -332 85 160 -18 -72 93 -72
4428 -72 254 -75 15 213 7 203 74 -90 -17 44 -326 83 -89 -74 61 -67 -54 -51 -137 121 173 -103 113
4451 113 -41 24 203 23 -77 15 125 56 -17 -111 41 -135 -144 -143 -129 -47 150 74 -43 234 121 146 230 1 38
4476 38 -26 -28 -105 73 -164 110 -72 -119 12 -248 -21 230 -189 -163 -123 -72 172 186 -24 141 87 26 261 198
$$ packed form
4311E9k40J99R9J14m32K92j64n5L54p4j86K6j24L4J65q7n8J27l43K83j42J8L52
4334B17k05M3n4k8J99Nr4o0N1k12L38k6m93M49k29N7N5l45J36J68n0K72j10L2
4358A16j18J66l9L2j89K36k6k10N6J10l02J86j68O5J38k88K60M9n9M3R6l51K15
4381A8l06L50M7j13K41j14j24N7j35J75j55J14j40j05L04k86J19LK5M2rK8N0j50
4405f4J46J53m03K66j12M2k3K1j05Q9J8j38J74j80O1K42n19M17P5j78n4J65j65
4428g2L26l29R0J98k06J96j29j64P3O1l70M09j72J5J35j28J3Lq6K58N2k76K16
4451A13j54O5J79j80j00R2J10o9p3r4J52j76rJJ4Q2J97p6j17K77j13K5Q4k29L7
4476C8o4kp7J78k37K74j82m7J31k60K27K51m19K6M0N1K44J4k10J65n4o1K35o3
$$ plain form
4500 198 -118 -37 -13 -39 -133 -83 25 -134 -166 -55 -154 -245 51 75 19 11 109 -110 259 -123 96 235 -94 96
4524 96 -39 181 13 -1 -26 60 -74 9 -20 -90 26 15 140 23 -71 -9 62 -33 -31 98 65 118 94 -120 -134 4
4550 4 -184 99 -166 -68 20 -125 -85 -19 141 57 60 16 205 135 17 47 47 -67 42 -128 -148 45 -128 180 -95
4575 -95 0 1 28 94 147 33 -16 244 93 -155 -28 132 101 -39 -99 -6 112 -98 126 -166 -53 -94 -143 51
4599 51 -45 -65 32 10 -121 113 -76 55 -17 -25 41 102 124 -7 14 -141 134 -21 -308 -70 -51 31 -116 60 48
4624 48 91 -45 11 23 -81 -14 136 112 4 240 -242 29 -85 -188 -171 -5 29 13 -67 -24 32 -83 94 10
4648 10 -81 167 21 84 173 -19 55 93 -265 37 136 59 -105 -298 -146 -35 -116 -179 32 -130 116 -6 -10 68
4672 68 126 -30 15 79 -48 253 20 60 14 -96 -35 -31 -8 209 -115 22 116 -53 67 123 -109 102 332 -104
$$ packed form
4500A98l16Q1K4k6r4N0J08j59l2J11r9r1K96K4n6qR8k19L69l82K19J39l29J90
4524I6j35K20j68j4k5Q6j34Q3k9p0J16j1J25j17r4O2P1r5KJ29l3N3k4k14j4J38
4550Dj88K83k65R8Q8j45M0O6J60q4Lm4J89p0j18L0%j14J09j70k0J93j73L08k75
4575i5R5JK7O6N3j14m9K60j51k48J27J60l1j40o0R3J18k10K24k92J13m1m9J94
4599E1r6k0R7k2j31K34j89J31p2qO6O1K2j31K1j55K75j55k87K38J9Q2j47J76j2
4624D8M3j36N6J2j04O7J50k4j08K36m82K71j14j03J7J66L4j6q0M3N6j15J77q4
4648A0r1K48j46O3Q9j92P4L8l58L02R9p7j64j93J52J11q1o3K11j62K46j22mP8
4672F8N8j56M5O4j27L01k33M0m6j10O1MK3K17l24J37R4j69J20N6k32K11K30m36
$$ plain form
4696 -104 159 70 -3 62 74 156 149 51 44 129 -120 -63 -24 -55 -111 9 40 -169 -203 11 86 88 -90 72 108 13 225
4723 225 -89 -135 -150 -168 77 -104 -27 145 -196 45 171 -68 41 40 -135 -88 -113 139 48 -25 -21 39 234 -106
4747 -106 185 -45 -95 207 -207 -128 -39 -149 -23 -42 52 10 92 243 64 -171 20 58 27 58 149 -19 -90 -140
4771 -140 -75 -25 -181 -118 69 -123 112 268 -89 66 131 26 211 85 164 -53 12 109 213 -34 -43 21 -240
4794 -240 32 15 -260 101 21 -304 37 -49 -4 -28 37 -80 56 -66 -38 14 10 -35 12 -53 163 -151 -202 155 -34
4819 -34 13 -25 -73 170 31 -155 165 68 73 143 53 129 -30 -133 54 85 -224 -24 106 -96 114 148 -101 71
4843 71 -143 -114 118 -26 -45 30 -23 147 134 -16 111 -7 -95 57 -47 22 -97 -122 -108 -2 -53 -12 -48 -155
4867 -155 171 -171 -130 232 42 88 324 -28 255 163 -34 55 59 -143 -4 13 -54 -15 -200 -67 -40 -7 28 229
$$ packed form
4696a04K63q9p3O5J2Q2pr8pQ5k49N7L9l1n6J20L1k09l4K14P5Kj78J62L6r5K12
4723B25l14m6j5j8K45j81P7J72l41K41J26k39J09jj75M7k5K52r1p3MO0J95l40
4747a06K91k30n0L02m14P9Q9j10J26j9R4m2Q2J51j79k35J91L8l1L1R1j68p1n0
4771a40O5N0j56O3J87j92K35J56l57J55O5j05J85j26P9k17O5R7J04k47rO4k61
4794b40K72j7k75L61q0l25L41q6M5k4O5j17J36j22K8N2mm5M7o5K16l14n1L57j89
4819c4M7l8m8K43j39j86L20r7NP0r0P6j59j03J87L1l09K00J30k02K10L4k49J72
4843G1k14K9K32j44j9P5n3J70j3j50J27j18q8J52j04O9j19k5J4J06n1M1l6j07
4867a55L26l42M1L62j90M6K36l52K83r2j97Q9Mk02J39J7o7L9j85J33K7L3L5K01
$$ plain form
4891 229 -20 -15 -61 82 5 -81 -117 130 4 -37 -20 16 -6 76 85 45 -67 244 78 -117 -60 -7 -8 -145 -9 -27
4917 -27 35 3 58 90 186 0 -33 -123 -214 -55 -81 -33 115 6 -101 -75 -326 -192 148 100 -74 35 51 135 -29
4942 -29 40 206 119 35 43 37 217 -208 28 -25 -97 -5 27 -156 -138 -98 21 105 48 -29 46 94 229 192 72 -85 -29
4969 -29 -19 -113 -30 -51 -107 -271 -143 -35 -4 75 -40 -90 -117 -117 -224 -79 4 -54 68 154 -5 4 32 56 -55 -126 -127
4996 -127 -58 -38 -124 -61 -164 156 125 -110 -58 189 -172 -111 -23 -90 -156 -114 -49 227 7 -209 4 -111 143 -104
5020 -104 -155 28 -104 0 -108 -41 40 -33 63 20 32 37 -20 -23 95 -49 77 -24 -189 9 -157 64 -156 -150 -2
5045 -2 -26 -86 -52 -119 -34 -47 -31 38 -54 -67 112 142 -46 -31 -90 -62 -95 -196 -81 -211 -131 47 26 -202 28 -23 46
5072 46 118 30 -1 66 63 81 -46 230 20 -82 -196 -68 -82 -172 -57 -116 7 -15 -96 240 8 -9 171 -26 172
$$ packed form
4891B29k49Nm6J43p7q6l6K47j26m1J7L6k2Q2Rm0j12L11j66j95N7N3jj37J36j8
4917b7O2l2N5L2R6j86l3r0r1J59k6M8J48j09j07K6k51J34L40m8j74J09J6Q4j64
4942b9O9J66q7q4QoJ80m25K36n3p2R2L2j83J8M0J19Q4n7p7P5M8J35l7j20j57N6
4969b9J0r4Q3k1n6j64J28J08L1P9j15n0k7%j07J45Q3n8J22Q6j59RK8K4j11p1j
4996a27O9K0q6O3j03L20l1k35N2K47l61O1Q8o7o6M2O5K76k20k16K13j15K54k47
5020a04n1J83j32J04j08O7Q1p3R6m3J2Nn7lJ18j44J26j01j65J98j66K21k20OJ48
5045bk4o0L4o7Q5j3J6O9r2j3J79L0j88J5n9K8l3j01J15j30Q0J78k1k28K30n1O9
5072D6P2q8l1O7lJ8j27K76k10j02j14J28j4r0J15n9J23k2q1L36k32j7J80j97J98
$$ plain form
5097 172 -64 55 47 1 4 -44 -11 61 -33 -135 14 -60 -70 131 -161 -130 9 125 -79 67 100 -6 -1 -159 77
5122 77 29 87 57 -58 -86 80 -76 -47 128 -320 -69 43 -165 -78 26 -32 -133 -35 -76 200 -93 74 152 -1
5146 -1 -73 -123 -120 -35 -25 -115 37 -72 -171 -46 91 -108 22 97 -22 163 -6 125 26 126 29 -207 -26 170
5170 170 26 115 83 5 -62 62 144 -131 38 -23 114 -124 -67 116 -21 62 -136 142 64 70 -29 -12 -84 -306 -79
5195 -79 192 74 -129 -258 -55 -225 -16 -144 -93 -16 136 151 -19 106 -100 71 -50 -77 168 -85 0 45
5217 45 114 -183 -25 73 125 24 4 -11 37 -164 85 49 105 74 51 127 230 9 -130 155 -125 39 -80 79
5241 79 -16 -60 -125 -28 73 51 41 98 55 115 -75 218 123 -95 13 126 74 174 38 -88 -16 -28 -117 66 47
5266 47 -118 -81 -15 108 -91 -62 -35 -9 -99 24 136 -117 73 -48 109 27 -79 -165 60 61 90 -62 -169 -3
$$ packed form
5097A72k36J19qm6Lm8L3P2r4j02J49p4j0K01k92L1J39J16k04J46L3j06Nj58K36
5122G7m8N8l0j15k8J66j56K9J75m48K51J12k08Q7J04n8j01R8m1K76k93J67P8j53
5146ap2n0LQ5J0r0J52j09r9J25J37j99J30P5j19J85j69J31r9J00r7k36J81J96
5170A70j44Q9l2p8o7J24Q2k75J69o1J37k38N7J83j37Q3j98K78p8Or9J7p2k22K27
5195g9K71j18k03j29K03j70K09j28N1P7J52J5j70J25k06J71j21k7K45k53Q5M5
5217D5O9k97J58R8N2j01k0j5M8k01K49l6N6l1k3P6J03k21j39K85k80J64j19J59
5241G9r5m4o5R7J01k2j0N7m3O0j90K93r5k18J08J13n2J00j36j26P2j2q9J83j9
5266D7j65L7O6J23j99K9K7K6r0J23J12k53J90j21J57q2j06q6K25JK9j52j07J66
$$ plain form
5290 -3 60 -97 -45 47 -85 -6 -34 36 120 160 -100 0 129 98 -4 24 229 -162 15 -147 -118 -93 38 1 69
5315 69 61 77 145 39 -63 35 188 114 38 167 34 16 23 -30 11 -62 -30 -182 -178 73 146 -29 48 205 37 -25 102
5342 102 221 268 6 -102 -18 8 -65 1 -10 -39 -116 -87 95 -3 -22 47 53 -15 -62 -40 -104 -12 -170 187 -87 4 31
5369 31 -166 93 159 31 -26 74 -133 115 -101 -16 -142 -211 15 1 103 25 112 183 13 -34 -3 179 75 50
5393 50 -13 -248 -64 -103 -76 83 66 -58 42 -240 34 -36 -95 -87 144 -69 13 87 -38 -31 46 -314 7 18 -50
5418 -50 -79 -49 -53 -30 50 170 -10 -22 -53 68 -70 281 128 46 -61 -12 -68 76 178 72 108 -43 -72 -202 -163
5443 -163 73 43 -115 94 -113 32 0 128 -34 -120 -71 130 156 -48 171 161 -56 13 70 -44 -55 77 155
5466 155 119 -226 61 -88 -85 101 82 136 12 59 -125 130 -21 -38 -44 -126 5 -77 -87 184 93 -11 210 29
$$ packed form
5290cO3j57N2R2j32P9k8P0Q4M0k60J00J29l1j02K8K05l91J77j62K9K5J31l7O8
5315F9qJ6O8j06j02R8J53p4p6J29j33j8Pn3M1p3L2j52MK51P3j75P7J57j68o2J27
5342A02J19M7k62j08Q4K6p3O6j1k9p7K9J82r8j9O9Oo8m7K2o4R2j58L57k74R1K7
5369C1j97K59O6j28n7J00k07K48k16Q5j26o9K26j4J02p8Q7P1j70m7L1J82j04k5
5393E0o3k35J84l9K7J59j7j24J00k82K74p0n9QK31k13Q2P4j25PP7l60L21J1o8
5418e0k9L0mK3Q0J20j80j2l1J21j38L51j53q2j07M9n6J44J02j06L6j51k9j30L9
5443a63K36l0j58K09k07J45l2J28j62q6M9K01K6k04K19j0k17O9N7j14j1J32P8
5466A55l6l45K87j49LJ86j9N4j24M7j84K55j51j7oq2J31q2j0K71r1j04K21j81
$$ plain form
5490 29 80 -131 20 -96 -13 -10 -318 39 8 248 200 -74 128 48 44 207 35 -58 36 -207 -66 -204 53 94
5514 94 -115 54 62 97 -10 116 99 89 135 162 78 -127 -85 -31 72 -103 79 50 -18 37 -22 -174 -6 -181 -171
5539 -171 -78 -259 -121 -79 112 294 22 38 177 -204 106 52 43 -192 -31 -45 71 93 -34 92 -134 -96 -7
5562 -7 30 132 -101 -36 94 106 109 50 -76 -186 10 -23 1 255 -28 -169 45 -184 -96 35 68 23 122 69 25
5587 25 19 37 -89 77 -6 -65 61 176 155 -137 -78 -140 -141 -46 34 -66 -73 -200 199 104 -11 94 85 -30 126 -127
5613 -127 44 -57 -3 58 -116 -67 -21 -23 80 -203 9 -125 105 33 -3 -55 -137 22 0 -42 141 -28 93 126
5637 126 95 -109 -145 -43 -217 -49 -83 -136 90 21 -92 81 -165 144 58 -109 76 -39 166 63 95 -16
5659 -16 -28 63 -28 -62 -41 -87 46 -113 -128 53 111 -125 49 -106 -31 -109 46 22 -91 65 -153 -130 121 86 -186
$$ packed form
5490B9N1k11J51j16Q3Ll08L57l1K40m8k74K02q0mJ63j72r3R4k43J41j38K57M1
5514I4k09J69QL5j07J26j7j0M6K7q4k05M2N4J03j75J82k9o8N5n9j52J68j75J0
5539a71R3j81J38M2J91J82k72J6J39l81L10n4rk35J61j4J16K2j27J26k26L8Q9
5562gL7J02k33O5J30J2Ln9j26j10J96l3K4K54k83j41K14k29Q8J31L3m5R9n3m4
5587B5oJ8j26J66q3n9J26J15k1k92N9o2jR5Q0j00pj27L99r5j15J05rj15J56k53
5613a27J71j01N4O1j74M9M6kJ03k83K12j34K30p2l6n2q2J59k2m2J83j69J21L3
5637A26l1k04l6J02j74J68l4n3K26o9j13J73k46L09q6j67J85j15K05j03L2j11
5659a6j2R1r1l4K1m6J33j59j5J81N8k36J74j55P5p8J55k4j13J56k18K3K51l5k72
$$ plain form
5684 -186 72 61 8 -56 21 -173 -87 -43 -42 -52 94 209 -155 -70 52 -88 -124 31 129 12 178 74 -209 -46
5708 -46 -134 -134 43 -72 217 -46 -53 93 -71 -155 9 134 41 22 52 42 80 -51 112 -12 -55 218 -299 -9
5732 -9 87 -120 -65 -64 -154 -39 -213 -23 -41 80 -69 113 18 -103 40 -80 71 128 -2 41 29 -162 -77 52
5756 52 25 40 31 129 -3 122 -35 36 49 -25 -240 -165 118 -125 1 -46 -35 -29 -76 -68 -19 -23 123 -96 -67 81 -119
5783 -119 -99 -31 235 63 186 -106 -6 11 163 48 -163 7 -68 66 190 33 -63 -93 -8 -53 248 -125 -173
5806 -173 123 191 92 -117 102 -52 141 35 11 -32 -117 -112 113 66 5 -78 -16 36 -5 51 72 186 26 -20 152
5831 152 48 116 1 -46 -14 -127 195 57 -54 -37 -25 -78 282 13 -10 103 -43 134 -128 4 43 -81 22
5854 22 -112 108 -225 27 93 -94 -77 -86 -66 -88 7 -92 12 98 72 52 -123 -112 -121 20 -36 -68 -106 -4 90 117 94
$$ packed form
5684a86K58j1n3o4P7j94Q6M4Jj0J46J15l64Q5J22j40l6J55R8j17J66j04k83J63
5708d6q8%J77j15K89k63pJ46j64q4J64J25r3j9L0j0L8j31J63j24m3K73n17K90
5732iR6k07N5Jr0J15j74J90j8J21j49J82r5j21J43j20J51N7j30M3j2j91Q5J29
5756E2k7J5rR8j32J25j57P1J3p4k15P5K83k43J26m7J1Om7QM9mJ46k19K9J48k00
5783a19K0O8K66j72J23k92J00J7J52j15k11J70p5J34J24j57r6l0Q5m5L01l73m8
5806a73K96O8r9k09K19j54J93j06k4m3q5NK25m7o1q3O2N2m1N6K1J14j60m6J72
5831A52j04O8j15m7L2j13L22j38j11J7J2n3L60k69k3J13j46J77k62J32L9j24J03
5854B2j34K20l33K52O6j87J7rK0k2R5r9J04Q6k6k0j75J1rJ41n6l2l8J02R4K7k3
$$ plain form
5881 94 66 195 90 -37 -45 14 -8 25 -21 -98 -76 -21 122 -7 -2 -53 -29 61 3 57 298 225 48 -75 67 -52
5907 -52 -16 177 -182 153 -79 -191 90 -13 58 37 -2 -52 123 82 24 24 -6 57 16 27 189 -49 0 -11 -86 95
5933 95 -164 -55 -101 -131 132 87 -216 -120 64 -110 56 -68 -130 32 90 -49 12 -21 -260 63 38 -55 36 -66
5957 -66 -24 35 -20 -271 -25 56 -137 -22 -194 -49 -79 155 201 -57 37 -74 -15 26 -143 144 -111 48 -114
5980 -114 -87 -294 -173 -42 4 84 5 -163 79 131 53 83 -61 92 -20 17 10 -184 -190 -2 11 46 43 273 39
6005 39 -94 -70 -74 50 115 129 371 220 94 -61 105 48 140 -138 -97 -175 -40 -41 -109 -82 114 103 149 -27 -80 -39
6031 -39 40 101 -84 -145 161 132 49 -93 -39 8 -26 -142 31 -14 77 -78 165 119 -97 34 -24 60 -50 47 8
6056 8 71 0 -118 -147 80 -98 73 104 -77 -49 60 -91 -276 -51 17 131 98 24 -77 -50 -2 -26 201 94
$$ packed form
5881I4k8J29j05j27qN9k2L3m6p7K2N5J43j29Nn1K4R0n8N4K41p3j77j23J42j19
5907e2L6J93l59L35k32j12K81j03P1k1l9n0J75m1n8%l0O3m1J1J62k38M9j1p5J81
5933I5k59J09m6l0K63m5l03R6J84j74J66j24o2J62N8j39O1l3k39L23k5r3R1j02
5957f6M2N9n5k51K46Q1j93J15j72J45l0K34M6k58R4j11N9M1j69K87k55J59j62
5980a14K7k07J21J31M6Q0p9j68K42N2p8L0j44J53j12L7pj94oJ88J3L5lK30k34
6005C9j33K4mJ24O5J4K42j51j26j55J66n7R2k78M1p8J35jo8K7J96j1M6j76n3M1
6031c9P9O1j85o1L06k9q3j42N4M7l4j16J73m5R1j55K43m6k16J31n8Q4j10R7l9
6056HO3p1j18k9K27j78J71L1j81K8J09j51j85K25O8J14l3p4j01K7M8k4K27j07
$$ plain form
6080 94 -113 74 88 -44 -263 -114 35 45 -197 -188 13 -38 -142 -72 102 -49 21 -147 19 -123 74 70 -40
6103 -40 4 53 -91 -24 102 -120 47 -23 -37 59 88 -88 108 66 6 -4 6 -172 59 56 -73 166 92 268 114
6128 114 -41 -8 -169 127 -27 -74 44 -12 -207 13 -93 -147 87 121 -10 50 -221 -136 -240 -41 0 204 -100
6151 -100 -11 -88 85 337 -176 215 -166 -20 6 -66 -2 8 -162 -57 55 -205 -107 -22 -82 48 188 -41 136
6174 136 125 -103 2 149 12 62 -116 -88 -69 121 -113 -28 1 -40 -89 80 -61 98 -117 106 66 -14 192
6197 192 7 48 56 -18 6 7 -152 -143 -231 134 -7 -46 28 55 -54 157 -86 -8 -82 200 -135 -27 46 -143 51
6222 51 -312 -75 -144 -59 -58 -163 -25 -25 -55 -95 -22 63 45 43 -56 -28 97 133 97 108 -52 -47 65 11 -113 -70 -159 -5
6250 -5 10 -53 -31 82 193 72 169 77 27 75 -53 149 56 19 32 -56 77 -116 48 224 128 -38 1 -69 -9 -106
$$ packed form
6080I4k07J87J4j32k19J49J49J0k42RK01n1j04P0J74j51P0j68J66j42J97mj10
6103d0M4M9j44O7J26k22J67p0j4R6K9j76J96m2o0j0J0j78K31lj29K39p4J76j54
6128A14j55L3j61K96j54m7J18n6j95K20j06n4K34L4j31O0k71Q5j04J99M1K04l04
6151a00Q9p7J73K52n13L91l81J46K6p2O4J0j70J05J12k60R8Q5o0J30J40k29J77
6174A36j1k28J05J47j37N0j78K8J9J90k34Q5K9m1m9J69j41J59k15K23m0q0K06
6197A92j85M1Qp4K4Jj59Rq8L65j41l9P4K7j09K11k43P8p4K82l35J08P3j89J94
6222E1l63K37o9Q5Jj05J38%l0m0P3Q5j8kr9K8J25L6l6J1j60NJ12n4j24M3q9J54
6250eJ5o3K2J13J11j21R7r2n0M8j28K02r3l7J3q8J33j93J64J76r6j66L9p0O0r7
$$ plain form
6276 -106 -88 140 -80 54 -130 49 1 27 -71 63 -81 -86 143 93 20 30 67 88 -54 -71 -96 -47 -37 -127 -106 43
6302 43 114 110 -209 94 15 -16 148 13 -42 -149 33 67 -27 -73 -103 -170 50 -87 -69 91 31 69 -132 -103 -17 9
6328 9 -108 10 -2 -82 -70 59 147 34 -154 216 -108 -27 26 8 -28 120 64 -13 241 112 26 213 39 -124
6352 -124 88 162 -78 54 -3 12 -52 -103 20 -44 -102 0 175 26 99 -34 -19 110 44 -37 102 -36 33 149
6376 149 67 -18 -55 -23 115 30 74 24 -25 136 3 37 175 132 65 35 -75 -90 -172 16 53 294 2 150 -279
6401 -279 -19 -56 -36 -111 42 -8 -158 -3 -46 110 10 -15 55 24 -108 -11 -40 -77 -64 -115 -97 -108 22 54 65 8
6427 8 21 -21 -151 -133 186 44 54 242 -90 81 142 54 73 -17 135 96 47 22 -117 -64 12 162 -56 70 76 -34
6453 -34 19 -103 -5 -37 -44 -6 31 -13 71 167 52 2 -74 32 148 78 -124 -148 -166 83 64 -21 175 -96 48 138
$$ packed form
6276a06J8K28k20J34j84J79m8K6r8J34j44nK29n0p3J0L7K1j42j7k5M9J0r0K1J49
6302D3P1ml19L03p9l1J64j35n5j07J82L4r4m6l0o7K20j37J8J60o0L8k01K9Q6K6
6328Ij17J18j2q0J2J29Q8j13j88L70l24Q1N3j8l6J48n6p7K54j29q6J87j74j63
6352a24K12P4k40J32n7J5o4n1J23o4n8J02J75j49P3j33J5J29o6q1J39j38O9J16
6376A49q2q5l7L2J38q5M4n0m9J61j33L4J38m3o7l0j10j5q2J88L7K41k92J48m29
6401b79K60l7K0p5J53n0j50J55m3J56j00k5P0l1j32R7k9l7J3n1J8j1J30L2J1n7
6427HJ3m2j30J8L19j42J0J88l32J71O1q8J9r0J52l9m9k5j39N3P6J50k18J26Oj10
6453c4N3j22R8l2pL8L7m4Q4R6j15n0p6J06J16p0k02k4j8K49j9q5J96k71J44R0
$$ plain form
6479 138 39 44 246 -50 105 17 83 -88 -81 -218 71 -154 -157 -108 4 97 160 -2 -89 -61 40 51 -32 58 105 -218
6505 -218 73 -42 92 136 218 -121 46 8 -18 7 97 17 -16 6 -127 -19 -29 75 -111 156 -115 -9 -65 36
6529 36 -129 3 45 49 -99 -150 -118 -63 -63 -59 -33 64 -31 -30 271 -44 -148 -9 162 -18 -13 -34 114 -132 -38 -149 -7
6556 -7 22 -59 -7 -103 31 -160 -38 -141 -208 -58 41 -39 63 55 76 210 56 62 -130 -247 60 -32 -63 -266 -115
6581 -115 -46 214 32 -25 34 -34 -80 -111 64 -11 28 -67 37 -104 -71 -38 -146 -64 -47 -23 -132 -5 14 -62 -58 -62 -6
6608 -6 52 7 159 13 -5 -15 -15 11 -39 42 66 75 -258 -69 -34 51 25 -67 -44 43 -122 -66 -3 -117 1 -23 57 62 24
6637 24 -3 -30 125 113 -152 -2 69 -3 -172 -141 155 107 171 -1 65 93 -113 67 93 -131 -80 29 79 77 52 56
6663 56 3 84 -1 203 -28 15 26 -63 -106 -104 -94 111 8 56 142 89 74 -13 -32 3 -34 -151 -214 -25 168 124 23
$$ packed form
6479A38r9NK02k96J55q8O6j71Pj37K89k25lM9J12R3O3j62q7K8J01J1q3R0M7l23
6505b18K91j15J34M4Q2l39J67l8k6K5R0q0l3K2j33J08j0J04j86K67k71J06n6J01
6529C6j65J32M2Mj48n1L2N5%MK6R7r5JL01l15j04J39J71j80Nk1J48k46R4j11J42
6556gK9q1N2r6J34j91J22j03o7J50R9q0J02qK1J34j54Oj92j17L07r2l1k03J51
6581a15O9K60j82n7N9o8m6l1J75p5L9r5J04j41L3L3j08Q2J7K4j09J27J9p6MmN6
6608fN8m5J52j46j8j0%K6n0Q1K4Rl33J89L5Q5k6r2K3Q7j65N6O3j14J18k4Q0Nl8
6637B4k7k7J55j2k65J50P1p2j69L1K96m8O4j72O6K8k06J80K6k24N1J09N0kk5M
6663E6n3Q1q5K04k31M3J1q9m3KJ0K05j03M8Q6n3j5q7j9L5l7j17o3J89J93m4j01
$$ plain form
6690 23 -114 57 -23 -20 -90 29 -37 -26 -86 1 119 91 148 -41 52 196 -222 -48 -84 -75 -83 -122 -63 4 -12 -55 -124 16
6718 16 24 35 -159 -74 -9 84 -3 150 35 54 -15 -115 167 -75 77 109 -78 77 28 -84 44 -163 115 139
6742 139 30 -174 7 39 -77 40 73 40 5 -213 -52 15 -110 -129 90 -177 44 -12 -129 -77 -48 -40 -101 -100 -54
6767 -54 -32 156 -16 105 129 22 101 69 4 148 70 -212 -2 -93 32 -31 -138 -85 -128 -84 -102 177 39 -156
6791 -156 -215 213 58 -49 128 -154 69 -154 24 56 54 132 -61 54 22 57 85 21 10 -78 -118 73 118 83 -298
6816 -298 -200 65 5 -29 -110 -205 4 -39 -110 15 -198 -71 101 -95 123 142 -152 153 -84 92 -68 -135 29
6839 29 114 64 -172 132 17 -17 65 10 31 -26 -123 -86 -72 50 -29 -10 38 -47 51 -21 136 -66 49 -84 -7 68
6865 68 -103 162 94 -74 -2 140 -54 -77 71 -212 15 -104 -31 7 83 -41 39 0 -4 36 -98 -37 21 -33 -66
$$ packed form
6690B3j37J71q0Lp0J19o6J1o0Q7J18k8N7j89R3J44m18J74l6Rql9N9O7j6m3o9J40
6718A6QJ1j94Q5O5R3q7J53j15J9o9j00K82k42J52L2j87J55m9j12J28k07K78K4
6742A39j09k04J81L2j16J17L3l3l5k18J61O7j25j9K19k67K21n6j17N2K9Qo1JM6
6767e4K2J88j72J21K4j07P9l2o5J44p8k82K10r1J25o3j07N3m3M4j8K79j38j95
6791a56n9M28j55j07J77k82K23k23J78L2kP8j93J15l2L5K8o4j1q8m0J91M5l5l81
6816b98R8K65o0l4q1r5K09m3p1J25k13J27J72j96K18J9k94L05k37J76j60o7J64
6839B9Q5n0k36L04j15l4Q2n5K1n7r7L7J4J22p9J9M8q5R8p2J57k02J15j33P7P5
6865F8j71K65o8j68P2J42j94k3J48k83K27j19P3L8P6j24Q0l9mM0j34O1N8n4l3
$$ plain form
6890 -66 84 -157 240 -122 98 -7 -115 -34 137 -76 41 -70 -30 -17 3 59 44 98 -88 140 -128 -224 -18
6913 -18 -64 -34 105 44 -108 -35 26 -83 -161 46 36 -265 -49 30 25 -80 -63 -29 -104 -55 49 29 92 -37 33 102
6939 102 106 51 -82 -3 -5 32 -11 58 -157 84 80 114 -103 -80 -52 76 -73 -5 60 -35 6 -100 121 -188 45 0
6965 0 9 43 21 37 -21 25 133 -310 -41 -28 -87 62 -142 -71 33 -97 69 200 -37 -75 -4 -78 122 -92 -71
6990 -71 9 -16 101 37 -88 -8 38 -70 44 -78 -205 -55 -148 141 -13 -214 21 38 24 55 -13 -8 175 65
7014 65 64 68 101 36 -36 -120 115 46 -109 16 170 -132 -195 -97 -22 121 38 -54 91 97 -24 -88 -59 43 117 -52 56
7041 56 -69 -7 -58 -51 -217 99 -163 48 -112 -89 -82 -53 6 -14 -10 9 -117 -124 -74 113 20 64 136 -11 -67 180 65
7068 65 -25 -110 -63 -201 -72 91 -103 -109 -89 -43 26 -44 13 16 224 50 8 220 -33 -50 -72 77 -288 58 -94
$$ packed form
6890f6J50k41L97l62K20j05j08Q1J71k13J17j11M0J3K0N6j5N4j86K28k68r6K06
6913a8m6L0J39o1j52P3O1j09p8K07j0l01K16P9nj05J7L4p5M9J04k0O3j29P0O9
6939A02Mn5j33P9kL7m3O9k15K41mL4k17K3K8J28j49O8O5r5M1j06K21l09K33m5
6965@RL4k2J6n8M6J08m43K69J3n9J49k04P1J04j30J66J31k37l8P1p4K00k14K1
6990g1Q0k5J17o4j25Q0M6j08J14j22j27J50r3K89j54k01K35J7j4L1o8NJ83j10
7014F5jML3o5p2q4K35o9j55J25J54l02o3R8P5J43q3r2J45Oj21o4K9J02P4j69J08
7041E6j25O2n1Pj66L16k62K11j60K3PK9N9k0MJ9j26pN0J87r3M4P2j47n6K47j15
7068F5r0q5M7j38J29J63j94oK0M6O9p0N7LK08j74m2K12k53j7k2J49l65L46j52
$$ plain form
7093 -94 73 137 -119 56 -156 90 -18 110 -20 55 222 87 25 48 18 80 12 1 18 3 101 -4 6 91 169
7118 169 -182 -274 -17 14 182 -38 -140 -50 4 234 205 69 183 -34 -13 -1 -7 -9 52 8 5 -123 -64 17 118 -37
7144 -37 50 -76 -46 -38 12 15 16 -43 -103 -66 -60 -17 -135 -25 8 78 -93 -37 -190 -224 75 203 -46 49 -6 -81 14 53
7172 53 149 146 53 59 -20 103 -16 -133 -104 -43 -41 67 82 156 80 5 21 16 -41 84 142 337 34 -48 47 -87 -2 -84
7200 -84 -35 282 63 -120 -156 22 81 -159 37 -181 -66 -24 -41 -80 -147 -18 -12 89 -186 -92 -35 -53 55 -50
7224 -50 67 -15 -199 15 105 -88 -7 91 -149 105 148 192 190 46 7 209 58 70 -56 106 59 31 76 7 -69
7249 -69 -151 25 -45 -52 57 -3 114 33 52 23 -32 96 100 18 -36 25 -39 -157 -21 58 53 66 61 128 205 -125 25 -103
7277 -103 -86 -43 -113 -110 35 90 -51 25 57 -214 64 85 105 -58 -3 158 -8 64 -93 -38 -146 97 -5 116
$$ packed form
7093i4J67O4k56J75k12K46j08J28j30P5J67j35o2K3l0O2o8j1J7j5R8j05J0Q5P8
7118A69l51r2K57L1J68k20j02R0N4K30k9j36J14k17K1J2okO1m4lj28N9Q1J01j55
7144c7Q7j26L0QN0LJn9o0L7OM3j18J10L3P0j71N6j53l4K99J28k49R5n5p5R5L9
7172E3R6lr3Op9J23j19j17K9O1KJ08J5P4p6p5J6nn7J25N8J95l03q2R5j34Q5q2
7200h4M9L17k19j83l6J78N9k40J96k18J15M2j7l9o7J29OJ01k75R4N7j8J08j05
7224e0J17q2j84K14R0j93Q1R8k40K54M3M4kj44l9K02j51J2j26J62m7k8M5o9p6
7249f9q2J76p0pJ09o0J17q1J9k9n5J28Mq2n4O1o4j18J36P9nJ3nO7P7l30J50j28
7277a03J7M3p0LJ45N5j41P6L2k71K78K1K0j63N5J61j66P2j57N5j08K43j02J21
$$ plain form
7301 116 26 -127 -24 -36 -46 -107 51 -63 120 42 -23 203 -49 -28 62 -55 67 -52 14 50 30 34 -11 -45 96
7326 96 77 -69 46 70 -138 23 -38 -4 137 -37 224 -267 37 -91 -93 -21 -247 -5 88 -36 -33 -41 -31 -160 -122
7351 -122 18 62 -39 108 -36 38 68 -137 204 -78 -86 140 -96 87 -61 -47 -88 -108 -118 106 -27 5 66 165
7375 165 -19 171 -74 -110 210 80 -9 -82 149 -182 -15 4 115 -31 65 14 -108 -16 -96 130 -108 45 3
7398 3 -18 -46 63 82 122 -68 86 35 -123 56 -21 -107 46 -58 -53 13 158 -67 36 144 29 -191 -143 18
7422 18 -9 119 -86 4 -85 -98 -70 54 -164 47 -2 50 5 152 24 35 26 -76 4 -150 47 128 3 -32 54
7447 54 30 8 85 -17 -59 -112 -105 -100 5 -157 67 114 15 -40 -28 -150 64 -116 187 -37 40 -90 -93 17 95 130
7473 130 120 16 -50 66 34 121 5 -141 -26 172 34 -13 131 -73 69 158 -42 73 -93 -4 68 -19 -117
$$ packed form
7301A16r0j53J03j2j0o1J58j14J83p8o5K26k52K1R0j17J22j19O6L6k0Mm5l4J41
7326I6j9j46J15K4k08J61o1L4J41j74K61m91L04j28kP2k26K42R3j24LqJ0j29L8
7351a22J40M4j01J47j44P4L0k05L41k82qK26k36J83j48J4m1k0j0K24j33L2O1R9
7375A65j84J90k45l6L20j30q9p3K31l31J67J9J11j46R6n1j22R2q0K26k38J53m2
7398Ck1k8J09J9M0j90J54n1j58J79p7q6J53j04NO6J45k25J03J08j15k20M8J61
7422A8k7J28k05R0q9j3K8J24k18K11m9N2m5J47j28J1rj02Q0j54J97Q1j25l5Q6
7447E4k4k2P7j02m2n3PNJ05j62K24M7r9n5J2j22K14j80L03k24P7j30lJ10P8L5
7473A30j0j04o6J16l2Q7j16j46J15J98j38m7J44k04J42Q9k00J15j66Q9P2q7r8
$$ plain form
7496 -117 -76 140 -149 -52 35 -85 28 -163 79 81 -4 72 -109 129 13 71 20 1 -25 1 19 0 85 55 -60
7521 -60 50 -156 132 -8 -116 191 -17 -27 -151 104 66 17 7 121 -18 -38 136 -33 -10 5 36 81 -78
7544 -78 120 41 177 -12 93 -15 7 -111 129 14 -24 154 112 51 47 -129 232 -236 -175 166 -96 -126 -255
7567 -255 27 177 -11 172 72 -244 13 12 140 -5 -68 108 -19 198 33 106 192 70 -292 72 -51 -107
7589 -107 -104 24 -63 -133 -5 37 121 -65 100 -15 -64 185 -106 -39 -99 -40 55 82 -81 -6 -62 -220 -119 -150 -46
7614 -46 -40 -173 -127 -105 125 -94 86 -206 92 -108 20 -5 -29 -21 156 -88 -45 78 63 -189 -14 143 -63 -40
7638 -40 25 109 42 70 -71 124 -193 -12 -124 -125 41 -75 87 -73 -188 240 -8 10 127 12 -10 -33 -40 22
7662 22 14 11 -19 107 -46 236 1 127 73 -61 28 -70 -27 -34 -67 5 51 -123 15 -102 120 182 -160 97 -24
$$ packed form
7496a17M1K16k89R7Q7j20J13j91K42Kq5P6j81K38j16N8n1j9k6K6J8j9Q5l0j15
7521f0J10k06K88j40j08L07k08j0j24K55l8m9j0J14j39k0J74j69K3J5L1M5j59
7544g8J98p9J36j89J05j08K2j18K40j15l8J78m2o1mj76L61m68O1L41k62l0j29
7567b55K82J50j88J83j00l16K57jJ28j45o3J76j27K17j65P3Q6j22l62L64j23n6
7589a07LJ28q7p0J28M2Q4j86J65j15m9K49k91O7o0N9R5K7j63P5n6j58J01l1J04
7614d6Oj33M6K2K30k19J80k92K98k00J28k5k4QJ77k44M3J23j5k52J75J57k06K3
7638d0O5Q4o7K8j41J95l17J81j12jJ66j16J62j60j15M28k48J8J17j15k2k3pO2
7662B2qll0J26j53K82k35J26n4j34Q9r8M3pl3P2M6j74J38j17K22O2l42K57j21
$$ plain form
7687 -24 -70 -264 147 -45 33 -30 -184 152 125 -28 16 18 -59 -160 150 116 49 -10 -13 116 121 -81 -20 -37 32 103 -3
7714 -3 -8 -38 -132 -35 -57 106 90 33 -65 3 55 -28 -47 -81 44 88 -84 87 -17 97 86 -55 113 70 15 68 11
7741 11 -9 -150 6 -39 -80 166 194 16 103 109 220 -68 -31 -105 -86 73 63 -50 -43 65 70 191 -125 -157 -90 -207
7767 -207 8 -107 8 -110 -259 -78 166 189 54 67 47 20 75 9 2 -80 77 105 -26 63 103 -122 17 38
7791 38 -109 -148 172 -59 58 -12 -264 -82 -32 47 9 -212 145 54 -81 -4 -55 91 66 153 -186 15 -169 -99
7815 -99 -79 -110 79 -28 3 93 178 -36 84 40 -13 45 -98 -75 195 32 80 -43 -74 -107 -147 108 -25 173 73
7840 73 109 -121 100 122 -94 -3 164 -119 -3 17 4 113 -45 144 -149 -15 64 26 83 42 97 -19 111 56
7864 56 -5 188 26 -118 -75 -113 63 -204 -85 -59 -32 -11 -40 -160 -140 108 48 -22 162 217 -9 147 -210 22
$$ packed form
7687b4m6j94M11j92P8o3j54L36k7j53M4Kp7j01L10l4o7n9lJ29Nk02O1j7O9P1j06
7714cnl0r4R7k2J63j6n7r8O8N2q3j9l4J25M4j72J71j04J14j1j41J68m3n5N3n7
7741A1k0j41J56m5m1K46K8j78Q7OJ11k88L7p4J9J59j0j13PJ08NJ21l16l2O7j17
7767b07K15j15J15j18j49J81K44K3j35J3k0k7N5o6pq2J57K8j31Q9M0k25J39K1
7791C8j47l9L20k31J17p0k52J82N0P9l8k21L57r1j35P7n1J46k5Q7l39K01j84P0
7815i9K0l1J89j07L1R0Q5k14J20m4n3N8j43K3K70j63M8j23l1l3m0K55j33J98j00
7840G3L6k30K21K2k16R1J67k83J16K0j3J09j58J89k93J34P9l8N7m1N5j16J30n5
7864E6o1J93j62j44M3l8J76k67J19K6K7K1k9j20K0K48o0p0J84N5k26J56l57K32
$$ plain form
7888 22 -207 152 7 -196 105 4 -110 -1 -170 -2 -93 1 -67 -75 -108 -199 46 -15 -189 -48 -108 113 142 175
7912 175 90 85 -3 -136 -35 109 -67 141 38 -14 30 49 -16 -158 -137 -60 30 61 27 118 128 -95 -6 43 -2 -48
7938 -48 185 -161 -79 96 10 -79 80 -8 -113 3 160 22 75 31 137 -116 -69 12 40 -120 173 -9 -65 71
7962 71 -270 43 61 -140 -49 14 120 26 -130 73 -32 -173 150 163 52 -12 -15 197 -61 -226 56 132 -64
7985 -64 -161 127 -176 -4 41 46 95 -68 -91 -3 148 62 114 -185 53 75 -134 17 -172 -103 -29 111 -70 17 205
8010 205 -91 110 17 -63 -13 110 102 99 -2 -22 75 -94 26 12 -33 130 -26 -103 66 -76 -121 49 -6 116 -60
8035 -60 105 -49 73 -112 -91 55 -14 -24 -3 -69 157 121 -8 175 -113 26 -131 -40 -76 -154 -117 56 49 68 67
8060 67 44 2 119 24 -18 -97 -136 120 -35 -55 -14 15 25 25 -47 3 -112 44 -109 11 92 -1 -123 -107 49 34
$$ packed form
7888B2k29L59j45k03L01j01j14J09j69J68r1R4o8ql3r1K45o1j74J41o0K21K9L3
7912A75q5nq8j33J01J44j76K08j03n2M4J9o5j42K1P7R0L1l4R1J0k23Q9M9m5m6
7938d8K33l46Q2J75q6q9J59q8j05J16J57j38N3m4J06k53M7Q1K8j60K93j82n6J36
7962G1l41L13J8k01R1O3J06r4j56K03j05j41L23J3j11o4lK12k58j65K82P6j96
7985f4r7K88l03J72M5NM9j63k3Q8J51q6N2k99K38K2k09J51j89O9P4J40j81Q7J88
8010B05k96K01r3q0N0J23qlj01k0R7j69J20j4m5J63j56p7J69j42m5J70n5J22j76
8035f0J65j54J22j85K1J46o9j0K1o6K26l6j29J83k88J39j57R1l6p8L7J73pJ9j
8060F7k3m2J17r5m2p9l9K56j55k0M1K9J0%p2N0j15J56j53J20Q1r3j22J6J56j5
$$ plain form
8086 34 59 -66 -140 179 -5 113 -197 -55 32 -41 7 -43 -55 61 -4 8 47 16 34 -25 152 14 95 -91 -136
8111 -136 -56 -73 -25 -114 23 -37 -82 -113 22 159 -92 170 -112 1 7 113 -38 -70 -30 -11 29 -45 172 41 -70
8136 -70 -8 60 -122 64 107 -61 -150 -62 -131 -40 -85 -226 53 -20 122 -78 25 -3 -82 -7 -55 -153 -68 -36 52 114
8162 114 -74 -18 -90 152 71 -14 -54 -48 35 54 9 -83 -9 -150 -25 -111 5 -98 106 164 -90 106 52 79 -54
8187 -54 -119 -228 29 -85
$$ packed form
8086C4K5j25p4L19j84J18l10J42Q7p3M8n0j2J16o5J2L9l1J8n9J77j38Q1j86m5
8111a36Q0j7M8q9J37o0m5l1J35J37k51K62k82J13OJ06j51l2M0J9M0p4K17j31j11
8136g0O2O8j82J86M3j68q9Q8o9R1m5j41K79p3J42k00J03k8p9P5m8r8Q5L2Q8O2
8162A14j88N6p2K42q1q5m0OQ3J9m5r2P4j41J25q6J16j03K04N8k54J96n4K7j33
8187e4o5j09K57j14
8191h5
$$ Imaginary data points
##PAGE= N=2
##DATA TABLE= (X++(I..I)), XYDATA
$$ plain form
0 0 0 0 0 0 0 0 0 0 0 0 0 0 0 0 0 0 8 -8 8 -8 8 -8 16 -16 16 -24 24 -32 32 -40 47 -49 56 -64 72 -85 95 -104
38 -104 119 -133 146 -164 181 -199 221 -245 269 -299 328 -363 396 -437 483 -532 589 -652 724
57 724 -806 902 -1015 1150 -1316 1525 -1797 2171 -2711 3583 -5197 9265 -45964 -52127 6463
72 6463 -5760 912 7358 20516 7278 -2886 17803 36639 10048 -3319 3142 15945 15085
85 15085 -6556 -17629 -8884 -24168 -28738 -3354 17730 19665 4358 -9798 -829 -5501 -17775
98 -17775 -6319 2702 -2580 -1396 5962 24391 27720 3755 -2696 5018 642 -491 969 2302
112 2302 -1979 -25023 -30575 -7945 -4422 -12141 -5795 4806 14092 10314 9375 28448 26360 -638
126 -638 -9316 -3628 1480 -1222 -11575 -3955 1870 -15892 -17509 1342 8052 1147 -11485 -6532
$$ packed form
0@%%%%%%%%%%%%%%%%Qj6J6j6J6j6K4l2L2m0M8n6O4p2Q7r6J05j20J36j57J80j99
38a04K23k52K79l10L45l80M20m66N14n68O27o91P59q33R20j015J121j241J376
57G24j530J708j917K165k466K841l322L968m882O294q780J4462n5229o163N8590
72F463j2223O672O446J3158j3238j0164K0689J8836k6591j3367O461J2803q60
85A5085k1641j1073Q745j5284m570K5384K1084J935j5307j4156Q969m672j2274
98a7775J1456R021n282J184P358J8429L329k3965o451P714m376j133J460J333
112B302m281k3044n552K2630L523p719O346J0601R286l778r39J9073k088k6998
126f38q678N688N108k702j0353P620N825j7762j617J8851O710o905j2632M953
$$ plain form
140 -6532 12075 7278 -905 9978 10056 -1419 -9287 -5761 10390 9138 -5419 1923 9847 1390
154 1390 -4931 -7213 -2988 -4006 -17596 -11750 7455 6681 635 23 1022 2454 -3785 -594 16031
169 16031 12280 -451 2012 5259 4499 -3553 -12367 -6319 -5598 -14488 -4963 7812 6380 -225 -7099
184 -7099 -859 6252 -2485 702 14393 10662 505 -4318 -427 5847 -5426 -13448 -919 1664
198 1664 -4657 -1674 4548 9751 974 -11995 -1856 7202 -1849 -5347 -821 4488 3378 -6737
212 -6737 -1883 9651 1112 -5569 1881 7609 7764 -865 -4176 3941 -1870 -12499 -6476 -333 -581
227 -581 -3487 -5557 4881 9158 266 3143 7921 1359 -3407 -4084 1714 5964 -4277 -6146 1968
242 1968 -1857 -5535 -1428 3023 6686 338 -3275 6490 4508 -5727 -4852 -1632 -1024 -4655 -8116
$$ packed form
140f532J8607m797q183J0883P8j1475p868L526J6151j252j4557P342P924q457
154A390o321k282M225j018j3590N846J9205p74o046o12R99J432o239L191J6625
169A6031l751j2731K463L247p60q052q814O048P21q890R525J2775j432o605o874
184g099O240P111q737L187J3691l731j0157m823L891O274j1273q022J2529K583
198A664o321K983O222N203q777j2969J0139R058r051l498M526N309j110j0115
212f737M854J1534q539o681P450N728J55q629l311Q117n811j0629O023O143k48
227e81k906k070J0438M277q892K877M778o562m766o77N798M250j0241j869Q114
242A968l825l678M107M451L663o348l613R765j982j0235Q75L220O08l631l461
$$ plain form
257 -8116 3436 10156 -88 -678 5967 5630 1235 -4820 -122 7097 -2727 -8125 142 1139 -3861
272 -3861 -8086 -4976 6194 4129 -4011 3647 7965 1654 -2803 -2875 3950 3457 -6999 -2564 6102
287 6102 1404 -1968 -549 2810 3436 -5497 -6287 3410 863 -4450 -1859 48 1117 -3054 -4940 5096
303 5096 6134 -1092 1958 5238 3491 118 -3591 1600 3446 -6004 -4895 1639 -407 -2836 -3528
318 -3528 257 4226 -3547 -5831 3321 3174 -1344 -722 2568 6528 1509 -4206 4289 7295 -1007 -2663
334 -2663 -257 1781 -2246 -10060 -3951 3453 -3813 -6582 -527 3529 3851 -1028 1157 10126 4567
349 4567 -3210 451 3241 1317 -3193 -5023 2721 1867 -6508 -2794 2728 1053 -1268 -3026 973
364 973 2533 -5334 -4228 2808 840 -1045 41 2854 6617 1934 651 7436 5051 -2227 -2477 -2104
$$ packed form
257h116J1552O720j0244n90O645l37m395o055M698P219r824n398Q267R97n000
272c861m225L110J1170k065q140P658M318o311m457p2O825m93j0456M435Q666
287F102m698l372J419L359O26q933p90R697k547n313K591J907J069m171j886J0036
303E096J038p226L050L280j747l373l709N191J846r450J109O534k046k429o92
318c528L785L969p773k284R152j47m518O22L290L960n019n715Q495L006q302j656
334b663K406K038m027p814O109P404p266k769O055M056L22m879K185Q969n559
349D567p777L661K790j924m510j830P744q54q375L714N522j675k321j758L999
364I73J560p867J106P036j968j885J086K813L763m683j283O785k385p278k50L73
$$ plain form
380 -2104 -2010 -6266 -9668 -1914 111 -6396 -2975 3448 5170 4231 1504 6431 9536 -215 -3231 2136
396 2136 1279 -3134 -6346 -3779 2836 -2453 -7117 1480 4940 495 -2354 -1397 3864 1088 -6560 -1271
412 -1271 4681 -43 -2467 -223 4817 6587 -266 672 7449 2015 -4057 -3697 -2604 -1667 -6696 -7965
428 -7965 -190 -503 -4471 131 4793 6122 4743 1923 6227 6113 -1926 -1401 1453 -1447 -4029 -5844
444 -5844 -2754 979 -4258 -3604 3724 2277 -907 -680 1561 4935 -24 -3647 3023 3079 -2852 -1977
460 -1977 1457 4183 1941 -3228 2066 4669 -3204 -5133 -1368 583 -792 -5728 -2615 4038 -1015
475 -1015 -4196 1900 5021 4054 90 -65 6762 3622 -3417 -624 1533 -1626 -4499 -5475 414 2544
491 2544 -3820 -2290 2372 240 -1310 -741 2353 5502 53 -1603 3838 1775 -2068 -1037 -319 1071
$$ packed form
380b104R4m256l402P754K025o507L421O423J722r39k727M927L105r751l016N367
396B136q57m413l212K567O615n289m664Q597L460m445k849R57N261k776p648N289
412a271N952m724k424K244N040J770o853R38O777n434o072L60J093R37n029j269
428g965P775l13l968M602M662J329j379k820M304j14q039N25K854k900k582j815
444e844L090L733n237O54P328j447l184K27K241L374m959l623O670N6n931Q75
460a977L434K726k242n169N294K603p873j929L765J951j375m936L113O653n053
475a015l181O096L121r67l964j55O827l140p039K793K157l159k873r76N889K130
491B544o364J530M662k132j550N69L094L149n449j656N441k063l843J031P18J390
$$ plain form
507 1071 -1975 -4141 1748 1920 -3171 -1446 720 898 -48 -2725 1901 4215 -2404 -1874 3086 1925
523 1925 -805 -3332 -455 3794 -1028 -2534 3471 3319 -879 -3042 -1306 3141 234 -5348 -942
538 -942 2376 -1575 -1691 569 4552 3530 -4033 -2053 4130 1189 -939 203 1054 619 -4897 -4913 2262
555 2262 717 -2764 175 2508 4171 2315 -716 2847 1715 -4899 -3360 -82 -87 -645 -2641 312
571 312 2513 -2296 -1216 3674 2225 440 463 2278 4382 -895 -4583 -1188 -2569 -4599 -1310 1756
587 1756 4549 1289 -3056 1438 3523 -1492 -1430 199 648 -705 -3700 708 5462 -222 -3232 -55
603 -55 1489 1874 11 1414 5200 -480 -6584 -3114 -197 -911 -2716 -3346 1950 3291 -589 2878
619 2878 5885 2382 -1055 -2511 705 3086 -2435 -3161 928 -1113 -3110 -2004 -360 1523 -1469
$$ packed form
507A071l046k166N889J72n091J725K166J78r46k677M626K314o619N30M960j161
523A925k730k527K877M249m822j506O005j52m198k163J736M447k907n582M406
538i42L318l951j16K260L983j022p563J980O183k941k128J142Q51m35n516j6P175
555B262j545l481K939K333J663j856l031L563j132o614J539L278nn58j996K953
571C12K201m809J080M890j449j785K3J815K104n277l688L395j381k030L289L066
587A756K793l260m345M494K085n015O2J629M49j353k995M408M754n684l010L177
603e5J544L85j863J403L786n680o104L470K917p14j805o30N296J341l880L467
619B878L007l503l437j456L216K381n521p26M089k041j997J106J644J883k992
$$ plain form
634 -1469 -3131 2508 3552 965 1610 904 -625 -2354 -3587 2092 4573 -93 -3 1612 955 371 -1770
651 -1770 -1102 -87 -5422 -4913 1630 3069 1438 -601 -953 1542 -940 -2199 4353 6140 1706 -206
667 -206 -586 1352 -203 -5362 -2848 368 -2546 -2064 1631 4005 3169 -3878 -4187 1214 89 -1106
683 -1106 1574 2875 3059 67 -1284 3545 1843 -4054 -2536 324 1301 900 -1448 269 -411 -6074
699 -6074 -4628 432 1582 2413 1345 2060 3773 420 -372 2817 210 -2886 -2951 -1000 2692 1401
715 1401 -1646 540 -816 -4505 -2193 737 2347 1207 -2315 684 2899 -1514 -1734 807 952 202
731 202 -1032 1634 6198 1845 -2418 -607 -1229 -2734 -3547 -2431 2063 -3 -3586 437 3487 1538
747 1538 -516 -1518 1184 3034 -440 1193 4137 415 -2957 -3496 -1488 1235 -1551 -2196 2399 1214
$$ packed form
634a469j662N639J044k587O45p06j529j729j233N679K481m666R0J615o57n84k141
651a770O68J015n335N09O543J439j631k039l52K495k482j259O552J787m434j912
667b06l80J938j555n159K514L216k914M82L695K374q36p047l09N401j125j195
683a106K680J301J84k992j351M829j702n897J518K860R77m01k348J717o80n663
699f074J446N060J150Q31j068P15J713l353p92L189k607l096o5J951L692j291
715A401l047K186j356l689K312K930J610j140l522K999K215m413k20K541J45p50
731B02j234K666M564m353m263J811o22j505q13J116M494k066l583M023L050j949
747A538k054j002K702J850l474J633K944l722l372n39K008K723k786o45M595j185
$$ plain form
763 1214 -1250 108 581 1179 -1424 -4208 -103 1724 -42 2090 2978 1251 -357 -2177 453 2991
779 2991 -439 -1047 1136 -70 -939 -2057 -1672 289 -2830 -3114 2133 2704 866 945 1205 2424 -13
796 -13 -3250 722 2285 -1112 -1390 109 1956 1485 -2880 -1614 1585 -1844 -2653 509 2428 2047 -1810
813 -1810 -2728 2000 982 -1903 269 1436 1706 511 -922 2608 2416 -2551 -2056 -266 -791 -761 -1433
830 -1433 815 2752 -1388 -2164 639 -331 -783 -375 158 2159 241 -987 2336 1390 -1130 -639 -106
847 -106 1015 295 -1813 720 1413 -2302 -1747 -421 -557 -729 -1869 698 4043 645 -578 1679 992
864 992 -285 -1827 -980 2749 910 -2053 753 1232 -430 -1334 -1350 1111 900 -3168 -742 2085 -66
881 -66 -1222 -1490 92 1634 -1376 -617 3796 2508 736 785 649 960 -1656 -3466 280 408 -2313
$$ packed form
763A214k464J358M73N98k603k784M105J827j766K132Q88j727j608j820K630K538
779B991l430o08K183j206q69j118L85J961l119k84N247N71j838P9K60J219k437
796a3l237L972J563l397k78J499J847m71m365J266L199l429q09L162J919l81l857
813a810r18M728j018k885K172J167K70j195j433L530j92m967M95J790n25L0o72
830a433K248J937m140p76K803r70m52M08N33K001j918j228L323r46k520M91N33
847a06J121p20k108K533O93l715N55J326j36j72j140K567L345l398j223K257o87
864I92j277j542Q47L729j839k963K806M79j662r04j6K461k11m068K426K827k151
881f6j156k68J582J542l010P59M413j288j772M9j36L11k616j810L746J28k721
$$ plain form
898 -2313 -1274 -601 421 154 -1686 1030 2252 -641 183 1823 945 738 -1082 -343 1458 -1403 -1856
915 -1856 1280 1042 27 -24 -597 903 -958 -3489 68 538 -1721 -891 -74 1572 1256 -1296 1464
932 1464 3868 524 12 1262 987 771 -2558 -2100 937 -1884 -4030 -1225 297 1008 -194 -739 2806
949 2806 2198 -1366 64 1692 1176 408 -1360 665 1862 -1661 -1077 1414 58 -481 -1571 -1093 959
966 959 -1416 -2123 549 -425 -1218 -635 -69 2030 1642 35 2753 2674 -409 187 456 176 -386 -2466
984 -2466 -987 411 -2737 -2098 219 53 260 -421 113 2757 536 -902 2086 1696 331 -283 -469
1001 -469 1922 681 -2128 381 1482 -1062 -1746 -1784 -243 372 -2657 -1311 1694 -295 -789 325
1017 325 1389 2983 584 -440 2598 1474 -1041 -139 -28 121 -929 -3009 -376 313 -2051 -989
$$ packed form
898b313J039O73J022k67j840K716J222k893Q24J640q78k07j820P39J801k861m53
915a856L136k38j015n1n73J500j861k531L557M70k259Q30Q17J646l16k552K760
932A464K404l344n12J250k75k16l329M58L037k821k146K805J522P11j202n45L545
949B806o08l564J430J628n16p68j768K025J197l523N84K491j356n39j090M78K052
966I59k375p07K672r74p93N83N66K099l88j607K718p9l083N96K69k80n62k080
984b466J479J398l148O39K317j66K07o81N34K644k221j438K988l90j365o14j86
1001d69K391j241k809K509J101k544o84l8J541O15l029J346L005j989m94J114
1017C25J064J594k399j024L038j124k515R02J11J49j050k080K633O89k364J062
$$ plain form
1033 -989 339 193 610 -994 173 2307 -44 -263 1720 798 571 129 -37 1793 -83 -1623 612
1050 612 -242 -2103 -1329 -1199 41 -401 -2116 537 1428 -637 291 1459 1853 1797 -687 434 2188
1067 2188 -455 -1307 349 12 -333 -1831 -1693 1407 13 -2205 -81 617 -91 -597 -1213 1592 1918
1084 1918 -1205 -7 1647 768 334 -308 792 2035 -944 -1545 654 -607 -1558 -1361 -1240 569 -377
1101 -377 -1518 925 1114 -160 840 746 1271 1078 -824 565 1620 -811 -219 365 -382 -499 -1489 -540
1119 -540 1392 -810 -1406 574 -318 -797 -557 -149 1837 232 -1493 1231 1660 453 388 135 1178
1136 1178 702 -2363 -509 1342 -966 -1087 -1142 -310 374 -1717 -1219 1835 512 -521 515 970 1762
1153 1762 172 -1207 1313 1120 -877 244 554 547 203 -1643 -284 882 -1770 -1862 -313 -726 -32
$$ packed form
1033i89J328j46M17j604J167K134k351k19J983r22k27m42j66J830j876j540K235
1050F12q54j861P74J30J240m42j715K653Q91k065R28J168L94n6k484J121J754
1067B188k643q52J656l37l45j498J38L100j394k218K124O98p08n06o16K805L26
1084A918l123J198J654q79m34o42J100J243k979o01K199j261r51J97J21J809r46
1101c77j141K443J89j274J000r4N25j93j902J389J055k431N92N84p47j17r90R49
1119e40J932k202n96J980q92m79K40M08J986j605j725K724M29j207o5k53J043
1136A178m76l065J854J851k308j21n5Q32O84k091M98L054j323j033J036M55P92
1153A762j590j379K520j93j997J121L10pl44j846J359J166k652r2J549m13O94
$$ plain form
1170 -32 -111 286 1831 -140 -967 1317 776 662 1040 147 882 -225 -1650 309 313 -1568 -1055 -828 53
1189 53 445 -1033 369 1170 -1257 -859 511 826 1317 145 391 2269 331 -1121 861 572 -262
1206 -262 -1022 -1621 806 179 -2661 -1019 -49 -630 -525 -408 1293 2190 -297 77 2184 878 152 -352
1224 -352 -514 586 -831 -1218 1400 706 -1251 -1121 -1456 -177 -93 -1191 524 815 -950 -6 714 758
1242 758 1224 -361 165 1475 161 593 1464 156 -638 -1687 -2089 -469 -1218 -1637 510 165 -430 262
1260 262 119 1493 771 -1146 1078 2070 402 598 511 197 -157 -1891 -1052 1108 -448 -1011 -299 -3
1278 -3 647 -877 -1471 492 -379 -1836 397 1550 2176 1363 -420 916 1107 -844 -110 653 -248 -389
1296 -389 -1609 -1004 403 -1397 -1742 -448 -746 30 735 1086 2217 1169 -606 668 197 -486 362
$$ packed form
1170c2p9L97J545j971q27K284n41j14L78q93P35j107j425J959Mj881N13K27Q81
1189E3L92j478J402Q01k427L98J370L15M91j172K46J878j938j452J982k89q34
1206b62p60n99K427o27k840J642R70n81J05J17J701Q97k487L74K107j306p26n04
1224c52j62J100j417l87K618o94j957J30l35J279Q4j098J715K91j765R44P20M4
1242G58M66j585N26J310j314M32Q71j308p94j049m02J620p49m19K147l45n95O92
1260B62j43J374p22j917K224R92j668J96q7l14l54j734Q39K160j556n63P12K96
1278cO50j524n94J963q71j457K233J153O26q13j783J336J91j951P34P63r01j41
1296c89j220O05J407j800l45J294k98P76P05L51J131j048j775J274m71o83Q48
$$ plain form
1313 362 133 502 388 -1040 506 658 -1499 -1140 -688 -675 358 -449 -44 1378 -624 -965 887 715
1331 715 677 382 354 2076 1111 -755 323 129 -1308 -1893 -2015 70 844 -1293 -329 794 -584 -373
1349 -373 -333 938 1907 -16 -216 1789 1221 41 -101 -778 19 -764 -1358 954 975 -563 -363 -904 -558
1368 -558 -215 -1549 -123 1184 37 610 1157 737 765 -77 -370 1069 -156 -441 1155 75 -620 -1065
1386 -1065 -1321 -256 -839 -1568 130 553 -120 596 720 1000 449 -1122 114 1465 128 185 908 563
1404 563 425 -1271 -1270 569 -536 -1415 -258 74 183 -171 -824 953 639 -1168 91 945 1007 1036 -139
1423 -139 717 1232 -851 -837 156 -485 -238 -532 -430 827 -421 -1338 66 -99 -414 -30 -91 1049 1041 -28
1443 -28 851 1039 -298 307 30 166 174 -674 -266 559 -1016 -1163 -229 -982 -243 -451 -49 1515 173 -196
$$ packed form
1313C62k29L69j14j428J546J52k157L59M52J3J033q07M05J422k002l41J852j72
1331G15l8k95k8J722r65j866J078j94j437n85j22K085P74k137R64J123j378K11
1349c73M0J271R69j923k00K005n68j180j42o77P97p83n94K312K1j538K00n41L46
1368e58L43j334J426J307j147N73N47m20K8q42k93J439j225k85J596j080o95m45
1386a065k56J065n83p29J698M23o73P16J24K80n51j571J236J351j337N7P23l45
1404E63j38j696JJ839j105q79J157L32J09l54o53J777l14j807J259Q54O2K9j175
1423a39Q56N15k083J4R93o41K47k94J02J257j248r17J404j65l15L84o1J140qj069
1443b8Q79J88j337O05k77J36Qq48M08Q25j575j47R34p53P39k08M02J564j342l69
$$ plain form
1463 -196 982 403 2 -44 -234 983 769 -1018 346 775 -498 -421 -936 -418 122 -1229 -377 1072
1481 1072 -2 -325 -113 -16 865 0 -529 1606 1299 175 456 142 278 -167 -1453 -94 42 -1030
1499 -1030 -469 120 -39 46 -873 -399 948 -48 172 892 559 833 453 -92 700 -95 -676 736 175
1518 175 -468 -137 -516 -450 -294 -1587 -186 217 -946 -6 268 533 896 -23 447 1425 28 -427 784
1537 784 355 486 -458 -1186 55 -681 -1715 -386 28 -106 -64 -576 598 978 -496 61 691 517 488
1556 488 -190 385 1322 89 -598 428 -318 -524 -376 -992 -26 -188 -1224 145 192 -502 187 32 564
1575 564 1031 123 690 1112 -191 346 335 -267 57 -483 -657 316 -725 -798 189 -412 -206 -222 -402 759
1595 759 231 -485 892 625 -69 284 96 978 822 -662 -325 585 -784 -749 -529 -376 84 -872 -988
$$ packed form
1463a96J178n79m01m6j90J217k14j787J364M29j273P7n15N18N40j351Q52J449
1481A072j074l23K12R7Q81q65n29K135l07j124K81l14J36m45j286J359J36j072
1499a030N61N89j59Q5r19M74J347r96K20P20l33K74l80n45P92p95n81J412n61
1518A75o43L31l79O6J56j293J401M03j163R40K74K65L63r19M70R78j397m55J211
1537G84m29J31r44p28J241p36j034J329M14j34M2n12J174L80j474N57O30j74k9
1556D88o78N75R37j233o87J026p46k06J48o16R66j62j036J369M7o94O89j55N32
1575E64M67r08N67M22j303N37j1o02L24n40j74R73j041p3R87o01K06j6j80J161
1595G59n28p16J377k67o94L53j88Q82j56j484L37R10j369L5K20J53M60r56j16
$$ plain form
1614 -988 735 68 -346 358 268 824 455 -398 886 791 -307 252 -6 -55 153 -838 -310 159 -573 -563
1634 -563 -159 -528 -247 -505 -376 781 17 -443 859 401 294 804 -2 678 379 -621 -43 -18 -756
1653 -756 -258 -472 -521 -78 -828 -343 654 -198 -3 667 372 454 166 73 973 221 -638 438 -136 -72 -117
1674 -117 -615 194 125 -1144 -342 25 -320 -303 -537 167 746 -438 -368 855 341 387 294 250 1027 120 -677
1695 -677 401 64 -526 -552 -790 -244 -33 -807 29 536 -226 331 248 256 790 159 223 828 -74 -123 193 -513
1717 -513 -105 -83 -355 384 -377 -718 210 -123 -258 -68 -279 280 214 -554 588 775 21 349 631 451
1737 451 741 -365 -305 569 -363 -571 -274 -609 254 -621 -783 428 -39 -624 127 99 745 609 -235 467
1757 467 842 -399 -55 274 -55 298 -562 -586 158 -776 -787 198 -229 -62 -108 -255 446 424 -176 611 484
$$ packed form
1614i88J723o67m14P04r0N56l69q53J284r5j098N59k58m9K08r91N28M69p32J0
1634e63M04l69K81k58J29J157p64m60J302m58j07N10q06O80k99j000N78K5p38
1653g56M98k14m9M43p50M85R97q52J95O70k95Q2k88r3R00p52q59J076n74O4m5
1674a17m98Q09o9j269Q02L67l45J7k34P04N79j184P0J223n14M6r3m4P77r07p97
1695f77J078l37n90k6k38N46K11p74Q36N07p62N57q3QN34o31O4O05r02m9L16p06
1717e13M08K2k72P39p61l41R28l33j35J90k11N59o6p68J142J87p54L28K82j80
1737D51K90j106O0Q74r32k08K97l35Q63q75j62J211m67n85P51k8O46j36q44P02
1757D67L75j241L44L29l29L53q60k4P44r34j1R85m27J67m6j47P01k2o00P87j27
$$ plain form
1778 484 41 601 -65 478 627 -360 -70 252 -829 -146 -109 -554 -147 -384 -416 297 -457 -337 347 107
1798 107 472 388 245 1089 513 -498 346 192 -106 27 -751 -195 81 -1027 -456 232 -354 -208 -153 -108
1818 -108 1015 -38 -180 836 171 -173 149 101 548 528 -591 220 78 -542 47 -409 -216 46 -913
1837 -913 -509 199 -198 141 200 -354 514 269 116 804 42 136 762 146 -91 -33 -801 -261 -383 -692 127
1858 127 -31 -525 -66 -164 -57 339 -201 419 763 67 355 625 202 324 -482 -697 306 -287 -637 144
1878 144 -264 26 -468 -968 13 214 -549 251 314 160 561 118 297 844 -221 -149 494 117 183 3 -552
1899 -552 158 -561 -1048 -264 -393 -346 232 -205 351 763 -231 498 486 66 424 395 144 616 -259 -265 235 -524
1921 -524 -466 -126 -664 -227 -431 -301 605 38 -362 269 -169 -175 494 252 869 869 -198 177 347 -332 -88
$$ packed form
1778D84m43N60o66N43J49r87K90L22j081O83L7m45M07k37l2P13p54J20O84k40
1798A07L65q4j43Q44n76j011Q44j54k98J33p78N56K76j108N71O88n86J46N5M5
1818a08J123j053j42J016o65l44L22m8M47k0j119Q11j42o20N89m56J93K62r59
1837i13M04P08l97L39N9n54Q68k45j53O88p62R4O26o16k37N8p68N40j22l09Q19
1858A27j58m94M59r8J07L96n40O20L44o96K88K70m23J22q06k15J003n93l50P81
1878A44m08K90m94n00R81K01p63Q00O3j54M01m43J79N47j065P2O43l77O6j80n55
1899e52P10p19m87P84j29M7N78m37N56M12r94P29j2m20L58k9k51M72q75oN00p59
1921e24N8L40n38M37k04J30R06n67m00O31m38oO69k42O17%j067L75J70o79K44
$$ plain form
1942 -88 -460 -252 221 -828 -370 394 -299 -217 -134 -435 327 130 -95 898 683 261 349 -73 132 177 -574
1963 -574 -138 192 -282 -165 -365 -561 -209 -578 -323 572 48 83 629 113 447 431 -390 419 150 -129 472
1984 472 209 -19 227 -395 -520 -378 -945 -150 90 -395 182 137 -180 304 -273 4 540 35 350 826
2004 826 281 412 77 -422 131 -196 -922 -225 -260 -151 7 -539 -70 188 -648 59 499 213 767 379
2024 379 251 610 87 -250 390 -194 -52 -118 -323 343 -22 -561 -1 -121 -459 57 -255 296 619 -61
2044 -61 233 480 -102 435 328 -67 508 327 -43 330 -534 -636 -161 -711 -470 -84 -546 95 -5 -172
2064 -172 626 189 -53 294 70 65 709 -41 330 597 -602 -249 -343 -595 23 -478 -600 306 -326 -323 254
2085 254 -278 99 142 -417 605 664 -25 341 76 40 179 -421 -298 277 -324 -127 -188 -587 -195 -302 -643
$$ packed form
1942h8l72K08M73j049M58P64o93Q2Q3l01P62j97k25R93k15m22Q8m22K05M5p51
1963e74M36L30m74J17k00j96L52l69K55Q95n24L5N46n16L34j6q21Q09k69k79O01
1984D72k63k28K46o22j25J42n67P95K40m85N77m5l17M84n77K77N36n05L15M76
2004H26n45J31l35m99N53l27p26O97l5J09J58n46M69K58q36P07M40k86N54l88
2024C79j28L59n23l37O40n84J42o6k05O66l65n39N60j20l38N16l12N51L23o80
2044f1K94K47n82N37j07l95N75j81l70L73q64j02M75n50K41L86m62O41j00j67
2064a72P98m37k42L47k24nO44p50L71K67j199L53r4k52O18n01j22R06o32LN77
2085B54n32L77M3n59J022N9o89L66k65l6J39o00J23N75o01J97o1l99L92j07l41
$$ plain form
2106 -643 78 -128 -158 687 191 477 684 16 -11 445 -49 440 38 -447 170 -225 -477 -83 -756 -529 -51
2127 -51 -692 -25 551 39 344 42 -186 623 207 51 441 243 150 90 -509 151 -114 -884 -305 -240 -564
2148 -564 178 -248 -99 88 -486 -216 524 176 492 181 13 810 254 -32 368 197 -433 -127 -564 -49
2168 -49 13 -480 -211 -82 -428 -50 -46 -170 432 96 121 466 207 428 330 -311 93 138 -380 -30 -240 -310 71
2191 71 -439 -391 278 -387 -201 88 -410 250 336 -120 482 65 -46 551 31 304 614 -93 -105 118 -310
2212 -310 -175 -150 -656 -56 -220 -393 185 106 36 318 -128 375 656 62 366 164 -85 319 -182 -397 58
2233 58 -235 -553 -28 -563 -69 178 -464 146 38 -351 252 179 84 337 28 287 448 -112 82 283 -432
2254 -432 83 -184 -637 -50 -484 -366 126 -555 -276 205 -146 294 281 -91 723 370 -6 525 116 -41
$$ packed form
2106f43P21k06l0Q45m96K86K07o68k7M56m94M89m02m85O17l95k52L94o73K27M78
2127e1o41O67N76n12L05l02k28Q09m16j56L90j98r3o0n99O60k65p70N79O5l24
2148e64P42m26J49J87n74K70P40l48L16l11j68P97n56k86M00j71o30L06m37N15
2168d9O2m93K69J29l46L78Mj24O02l36K5L45k59K21r8o41M04M5n18L50k10p0L81
2191G1n10M8O69o65J86K89m98O60Q6m56O02m17j11N97n20K73L10p07j2K23m28
2212c10J35K5n06O00j64j73N78p9p0K82m46N03K81n94L04k02k49M04n01k15M55
2233E8k93l18N25n35M94K47o42O10j08l89O03p3r5K53l09K59J61n60J94K01p15
2254d32N15k67m53N87m34J18M92o81K79M81l51M40j3l72Q14l53l76N31m09j57
$$ plain form
2274 -41 194 -92 -71 50 -746 -330 89 -556 -164 -161 -296 322 -62 -257 464 196 54 345 184 403 384 -242
2296 -242 387 217 -420 147 -505 -320 219 -534 -350 -82 -394 204 147 -346 488 282 2 564 296 236 374
2317 374 -92 132 231 -356 30 -144 -653 -23 -338 -598 28 -246 -169 198 -8 107 565 -219 244 277 21
2338 21 469 172 -197 277 -200 -317 219 -418 -178 -64 -641 127 52 -471 17 86 -105 344 48 10 438
2359 438 -88 82 449 105 148 1 -393 233 -312 -456 -85 -466 -479 -139 -359 106 144 -70 317 337 -66
2380 -66 391 300 38 533 41 12 102 -408 -288 92 -524 -130 -20 -425 -7 -111 -235 276 58 90 303 78
2402 78 103 305 -62 483 327 -212 319 -131 -344 38 -230 -301 -159 -553 -364 -100 -531 97 -11 -295 353
2423 353 298 248 548 326 108 304 -194 120 196 -407 -95 -224 -515 31 -383 -503 93 -135 -36 414 -102
$$ packed form
2274d1K35k86K1J21p96M16M19o45L92Lj35O18l84j95P21k68j42K91j61K19j9o26
2296b42O29j70o37N67o52J85N39p53J84K68l12N98n7m93Q34k06k80N62k68o0J38
2317C74m66K24R9n87L86j74n09O30l15k60O26k74P7L67k06J15M58p84M63L3k56
2338B1M48k97l69M74m77j17N36o37K40J14n77P68p5n23M88O9j91M49k96l8M28
2359D38n26J70L67l44M3j47l94O26n45j44L71l81j3L40k20M65L8k14L87K0m03
2380f6M57r1k62M95m92k9R0n10J20L80o16L94J10m05M18j04j24N11k18L2K13k25
2402G8K5K02l67N45j56n39N31m50k13L82k68p1J42l94J89K64m31O28j08k84O48
2423C53n5n0L00k22k18J96m98L14P6o03L12j29k91N46m14j20N96k28R9M50n16
$$ plain form
2444 -102 -113 469 -27 346 260 117 542 -87 -195 267 -193 -130 134 -537 38 -141 -564 -1 -129 -345 176
2465 176 -193 -146 272 97 292 710 30 235 253 -167 192 55 -373 275 -299 -299 16 -396 -136 103 -293
2486 -293 126 256 89 276 224 -45 264 92 -28 389 22 94 211 -268 199 -84 -492 9 -252 -243 92
2507 92 -300 -41 277 -233 16 -21 32 276 277 -1 446 124 -12 220 -114 -212 154 -297 -296 196 -357 -57 -162
2530 -162 -482 41 42 -134 571 276 236 694 67 293 391 -378 65 86 -400 -30 -334 -311 11 -325 -226 -81
2552 -81 -211 253 262 -286 313 238 -55 391 210 -34 328 -78 72 249 -285 -135 -165 -393 25 -132 -552 -120
2574 -120 -158 -71 96 144 138 497 -47 230 333 82 351 274 -33 252 -287 -526 -134 -335 -101 -240 -381 -37
2596 -37 231 -243 275 31 -125 324 -71 77 426 42 210 127 -69 -46 277 -377 -150 24 -415 34 -183
$$ packed form
2444a02j1N82m96L73q6j43M25o29j08M62m60O3K64o71N75j79m23N63j28k16N21
2465A76l69M7M18j75J95M18o80K05J8m20L59j37m28O48n74%L15m12K60K39l96
2486b93M19J30j67J87n2k69L09j72j20M17l67P2J17m79M67k83m08N01k61RL35
2507I2l92K59L18n10K49l7N3K44Jk78M47l22j36K32l34r8L66m51JM92n53L00j05
2530a62l20N23Jj76P05k95m0M58o27K26R8p69M43K1m86L70l04K3L22l36R9J45
2552h1j30M64Rn48N99p5k93M46j81k44L62m06J50J77n34J50l0k28M18j57m20M32
2574a20l8Q7J67M8oL59n44K77J03k51K69p7l07K85n39k39L92k01K34j39j41L44
2596c7K68m74N18k44j56M49l95J48L49l84J68q3j96K3L23o54K27J74m39M49k17
$$ plain form
2617 -183 -255 -4 -210 -98 89 -269 69 200 -65 487 201 100 289 -16 51 323 -370 136 -83 -583 -165
2638 -165 -227 -397 -150 -91 -127 360 299 -117 392 145 16 451 -83 206 211 -120 52 47 -186 16 -266 -265 -41
2661 -41 -374 -189 129 -96 124 154 -210 170 375 -6 444 205 260 303 16 -48 226 -268 -90 -169 -445 33
2683 33 -68 -110 -6 -225 -242 -16 -219 141 306 39 410 399 30 315 -54 -65 206 -292 -33 -104 -151 -224 -59
2706 -59 -345 3 -77 -73 61 129 -44 424 -23 -108 296 196 85 243 -51 265 113 -342 -57 -238 -427 -14
2728 -14 -293 -198 58 -86 -38 237 -294 271 168 118 396 149 -49 388 11 112 104 -393 -250 -23 -436 -80
2750 -80 -22 -313 180 -297 -87 301 -262 117 299 -17 372 235 17 263 57 -103 349 -177 -282 54 -52
2771 -52 -74 -95 -291 -41 -229 -340 344 83 -138 365 96 97 450 43 57 476 -130 195 -44 -266 94 -338
$$ packed form
2617a83p2K51k06J12J87l58L38J31k65N52k86j01J89l05O7K72o93N06k19n00M18
2638a65o2j70K47N9l6M87o1m16N09k47j29M35n34K89Nl31J72nk33K02k82JK24
2661d1l33J85L18k25K20L0l64L80K05l81M50k39N5M3k87o4K74m94J78p9k76M78
2683C3j01m2J04k19j7K26k03L60J65k67L71j1l69K85l69j1K71m98K59p1m7p3J65
2706e9k86L48q0MJ34O8j73M68m47q5M04j00j11J58k94L16j52m55K85j81j89M13
2728a4k79R5K56j44M8K75n31N65j03n0K78k47j98M37l77J01qm97J43K27m13L56
2750h0N8k91M93m77K10L88n63L79J82l16L89j37k18K46k06j60M52n26j05L36j06
2771e2k2k1j96K50j88j11O84k61k21N03k69JL53m07J4M19o06L25k39k22L60m32
$$ plain form
2793 -338 -495 -128 -208 -317 246 -233 50 247 -57 189 343 -29 264 108 -2 262 61 80 45 -175 -25
2814 -25 34 -175 -39 130 -443 -15 -10 -205 324 -98 -80 311 42 79 418 34 41 36 -119 -10 134 -199 -120 -190
2838 -190 -112 75 -301 -168 48 -130 -40 -43 -16 440 110 -93 492 175 50 178 -164 66 99 -269 -133 57
2860 57 -251 -6 -86 -257 22 -111 94 114 -7 241 221 -63 344 136 -137 68 357 -217 124 -136 6
2881 6 99 -424 -26 -64 -160 18 -11 -176 -15 -239 -39 168 -8 41 296 109 245 190 -136 188 -108 -242 -23
2904 -23 -26 -267 -8 -272 -164 -103 -241 -13 226 -30 281 112 16 234 52 -85 342 -193 -158 -8 -256 -2
2926 -2 -247 -371 87 -154 -244 -51 -138 -319 343 -38 100 367 50 162 131 -87 281 178 41 283 -26 -96
2948 -96 54 -285 -132 -178 -422 -93 137 -258 219 -23 -170 329 192 236 328 33 145 -10 -357 -161 -55
$$ packed form
2793c38j57L67q0j09N63m79K83J97l04K46J54l72K93j56j10K64k01J9l5k20J50
2814b5N9k09J36J69n73M28Nj95N29m22J8L91k69L7L39l84Pnj55J09J44l33P9p0
2838a90P8J87l76J33K16j78R0lK7M56l30k03N85l17j25J28l42K30L3l68J36J90
2860E7l08K45q0j71K79j33K05K0j21K48k0k84M07k08k73K05K89n74L41k60J42
2881FR3n23L98l8r6J78k9j65J61k24K00K07j76M9K55j87J36n5l26L24k96j34K19
2904b3lk41K59k64J08O1j38K28K39k56L11j69r6K18j82j37M27n35L5J50k48K54
2926bk45j24M58k41r0J93q7j81O62l81J38K67l17J12l1k18L68j03j37K42l09p0
2948i6J50l39J53m6k44L29K30l95M77k42j47M99j37M4R2k95J12j55l47J96J06
$$ plain form
2969 -55 -62 101 -114 -240 -35 -198 -188 214 -80 98 212 -121 191 156 60 406 151 -88 269 148 0 8 -164
2992 -164 -109 -48 -262 -139 -117 -246 16 -235 -253 82 33 31 223 174 80 349 -8 249 231 -72 -157 -77 -359 80
3016 80 -116 -285 -163 -355 20 24 -241 116 258 62 327 192 -108 253 13 -79 160 22 -95 -136 -305 120
3038 120 -40 -285 129 -105 -222 156 -247 34 271 -120 86 204 163 317 230 61 491 57 -305 155 -189
3059 -189 -251 3 -308 -118 -117 -300 -17 48 -125 214 -7 206 320 150 69 238 234 56 50 -98 145 -23 -218
3082 -218 -60 -188 -267 7 -259 -26 -66 -77 69 240 -159 293 142 50 327 27 146 278 -49 46 245 -159
3104 -159 2 -162 -283 -137 127 -121 186 -49 -131 355 59 71 317 44 219 408 -94 240 -3 -59 11
3125 11 -174 -263 123 -239 -99 -80 -294 -156 -8 -355 155 161 -58 175 -13 261 75 -64 165 189 -328 64
$$ packed form
2969e5pJ63k15j26K05j63J0M02k94J78J14l33L12l5r6L46k55k39L57j21j48Qj72
2992a64N5O1k14J23K2j29K62k51j8L35m9kJ92m9r4K69l57K57j8l03q5Q0k82M39
3016H0j96j69J22j92L75Mk65L57J42j96K65j35l00L61k40r2K39j38j17m1j69M25
3038A20j60k45M14k34j17L78m03K81K37l91K06J18m1J54q7j69M30m34l62M60l44
3059a89o2K54l11J90Jj83K83O5j73L39k21K13J14j70q1J69mj78oj48K43j68j95
3082b18J58j28p9K74k66K33m0j1J46J71l99M52j51r2K77l00J19J32l27R5J99m04
3104a59J61j64j21J46K64k48L07k35q2M86k96J2K46k73J75J89n02L34k43n6P0
3125A1j85q9L86l62J40J9k14J38J48l47N10Ok19K33j88K74j86j39K29K4n17L92
$$ plain form
3147 64 46 -226 30 -11 -357 163 -140 -219 156 19 128 97 -52 287 228 -27 365 175 -140 373 68 94
3169 94 12 -361 -100 -127 -343 -246 -83 -377 -33 -32 5 239 -142 3 42 -115 154 -30 -87 264 48 -263 259
3192 259 -64 72 89 -132 -56 39 -211 -58 2 -334 164 115 -121 168 138 -14 374 4 20 -4 -225 186 73
3215 73 -427 -19 -15 -480 -158 -207 -157 49 -77 31 196 79 192 346 4 63 -14 -12 210 87 -127 201 -186
3238 -186 -203 112 -282 104 204 -571 45 185 -125 247 -54 -43 397 111 -32 203 183 35 44 -25 -2 -73 -265
3261 -265 -5 -340 -217 142 -321 -12 284 -305 92 190 -117 286 441 132 383 -49 -13 82 -99 108 -15
3282 -15 -40 -25 -49 -46 86 -12 -460 44 -140 -99 147 -85 197 72 33 119 37 -91 197 8 20 -24 -207 -88
3306 -88 197 -202 -210 102 -266 -82 82 -179 42 203 -57 259 115 -8 238 92 356 277 -11 160 -34
$$ packed form
3147F4j8k72K56m1l46N20l03p9L75j37J09l1j49L39n9k55L92j90l15N13l05K6
3169I4q2l73K61k7k16R7J63k94L44JL7K34l81J45L9j57K69j84n7L51k16l11N22
3192B59l23J36J7k21P6R5k50J53O0l36M98m9k36K89l0j52L88l70J6k4k21M11j13
3215G3n00M08Mm65L22m9N0K06j26J08J65j17J13J54l42N9p7KK22j23k14L28l87
3238a86j7L15l94L86J00p75O16J40l10L72l01J1M40k86j43K35k0j48Ro9K3p1j92
3261b65K60l35J23L59m63L09K96n89L97R8l07M03J55l09K51m32L6R5j81K07j23
3282a5k5J5k4LJ32r8m48N04j84M1K46k32K82j25l9Q6q2j28K88j89J2m4j83J19
3306h8K85l99qL12l68J84J64k61K21J61k60L16j44j23K46j46K64p9k88J71j94
$$ plain form
3327 -34 -196 -168 -166 -33 157 -247 -356 -6 -45 213 3 35 200 31 -211 217 9 -51 -8 -105 -189 129 -340
3350 -340 22 -74 -150 -13 71 -119 -33 -245 -264 213 -147 68 214 119 116 265 -144 151 77 -136 284 -174 -201
3373 -201 -84 -309 -306 -48 -271 -68 68 -219 187 129 -210 206 283 24 174 -67 133 36 62 48 3 -243 209
3396 209 71 -409 159 -117 -138 162 -104 -25 188 4 155 137 58 255 51 53 120 -107 -421 -4 2 -136 28
3419 28 -360 -73 -66 -388 7 -156 -59 224 9 -39 255 139 117 215 -73 -17 61 -54 173 -90 -90 205 -148 -191
3443 -191 124 -198 -202 33 -208 249 132 -207 327 371 146 77 -137 23 192 -3 -96 117 -350 -124 -59 -88
3465 -88 40 -6 -240 137 197 -145 245 -154 23 306 58 248 193 11 125 70 96 -57 -243 -196 -38 -120 -155
3488 -155 -89 -88 77 -31 -45 186 -45 59 270 11 179 298 248 20 181 -253 -233 -224 -272 27 -209 -105 9
$$ packed form
3327c4j62K8KJ33J90m04j09L50l9K58k10L2J65j69k42M28k08o0M3r7q4L18m69
3350c40L62r6p6J37Q4j90Q6k12j9M77l60K15J46r5lJ49m09K95p4k13M20m58k7
3373b01J17k25LK58k23K03J36k87M06n8l39M16P7k59J50k41K00r7K6j4m5k46M52
3396B09j38m80N68k76k1L00k66P9K13j84J51j8p9J97k04KO7k27l14M17Oj38J64
3419B8l88K87Pl22L95j63R7K83k15m8K94j16k2R8k88N6P8j15K27k63%K95l53m3
3443a91L15l22mK35k41M57j17l39N34M4k25o9k14J60J69j95r3K13m67K26O5k9
3465h8J28m6k34L77O0l42L90l99J77K83k48J90n5j82J14n5K6j53j86M7J58q2l5
3488a55O6JJ65j08j4K31k31J04K11k59J68J19n0k28J61m34K0Rm8K99k36J04J14
$$ plain form
3511 9 -294 -7 152 -278 48 64 -138 232 58 -37 321 127 -99 225 -219 101 82 -163 -156 147 -341 -107
3533 -107 149 -201 22 -109 59 333 22 115 43 -36 71 244 -106 -17 -134 -119 75 9 -252 -14 -80 -109 10
3556 10 -186 212 125 -96 39 62 -182 232 40 -31 263 191 51 194 104 -80 -2 -382 -199 -190 -476 -83 -210
3579 -210 -96 -35 -138 -117 224 -29 188 162 -129 232 84 -217 17 -106 76 109 -192 -166 -49 -213 188 28
3601 28 -175 260 47 -168 125 -37 50 151 180 142 191 18 185 -33 -103 -110 -80 -199 3 -185 -163 199 -34
3624 -34 180 72 22 3 103 -94 330 116 201 210 -29 120 88 14 210 25 -388 -150 -135 -139 -74 -111 -65 304 155
3649 155 51 266 54 25 161 35 293 163 -187 67 40 -233 -64 -50 -115 168 -188 -72 109 -128 139
3670 139 -40 -108 222 -168 -229 227 83 -141 360 51 186 134 -100 196 15 -94 -68 -32 14 66 -222 -43
$$ packed form
3511Il03K87J59m30L26J6k02L70j74r5L58j94k26L24m44L20j9k45PL03m88K34
3533a07K56l50K23j31J68K74l11R3p2p9J07J73l50Q9j17J5J94o6k61K38o6k9J19
3556A0j96L98q7k21J35K3k44M14j92p1K94p2j40J43r0j84P8l80J83Rk86L93j27
3579b10J14O1j03K1L41k53K17k6k91L61j48l01K34j23J82L3l01K6J17j64M01j60
3601B8k03M35k13k15K93j62Q7J01K9l8M9j73J67k18p0pL0j19K02j88K2L62k33
3624c4K14j08n0j9J00j97M24k14Q5Rk39J49l2p4J96j85m13K38J5mO5l7M6L69j49
3649A55j04K15k12k9J36j26K58j30l50K54k7k73J69J4o5K83l56J16J81k37K67
3670A39j79o8L30l90o1M56j44k24N01l09J35n2k34K96j81j09K6L6M6N2k88J79
$$ plain form
3692 -43 -16 -136 146 296 92 128 96 72 191 50 120 238 -11 -100 -224 -341 12 -27 -169 -7 -88 87 -215
$$ packed form
3692d3K7j20K82J50k04L6l2k4J19j41P0J18k49q9j24j17L53l9j42J62q1J75l02
$$ [...]
8191d6
##END NTUPLES=NMR FID
##END=
