##TITLE=1H_Ser 3511-NEA-H
 CDCl3
 8 sc, 
 7.3.2024
##JCAMPDX= 6.0         $$ Bruker NMR JCAMP-DX V2.0
##DATA TYPE= NMR FID
##DATA CLASS= NTUPLES
##ORIGIN= UXNMR, Bruker Analytische Messtechnik GmbH
##OWNER= root
$$ XWIN-NMR		Version 3.5
$$ Thu Mar  7 15:33:30 2024 Russian Standard Time (UT+4h)  she@DPX200
##.OBSERVE FREQUENCY= 200.1313
##.OBSERVE NUCLEUS= ^1H
##.DELAY= (6, 6)
##.ACQUISITION MODE= SIMULTANEOUS
##.ACQUISITION SCHEME= undefined
##.AVERAGES= 8
##.DIGITISER RES= 18
##SPECTROMETER/DATA SYSTEM= spect
##.PULSE SEQUENCE= zg30
##.SOLVENT NAME= CDCl3
##.SHIFT REFERENCE= (INTERNAL, CDCl3, 0, 15.7039)
##AUDIT TRAIL= $$ (NUMBER, WHEN, WHO, WHERE, WHAT)
$$ ##TITLE= Audit trail, XWIN-NMR		Version 3.5
$$ ##JCAMPDX= 5.01
$$ ##ORIGIN= Bruker BioSpin GmbH
$$ ##OWNER= she
$$ F:/spectra/data/she/nmr/H-F/1/audita.txt
$$ ##AUDIT TRAIL=  $$ (NUMBER, WHEN, WHO, WHERE, WHAT)
(   1,<2024-03-07 15:32:00.75 +0400>,<she>,<DPX200>,
      <created by zg, POWCHK disabled, PULCHK disabled
       configuration hash MD5:
       00 E9 B6 7A A2 85 ED C7 34 08 36 98 17 FE 4E 26
       data hash MD5: 16K
       13 10 49 84 E3 79 4D 7D B0 B7 05 03 C0 7C 8F A2>)
$$ ##END=
$$ 
$$ hash MD5
$$ F1 D4 34 C3 B7 51 23 84 94 95 74 2E BE 30 32 D0
##$RELAX= 
##$RELAX= 
##$RELAX= 
##$RELAX= 
##$RELAX= 
##$RELAX= 
$$ Bruker specific parameters
$$ --------------------------
##$DU= <F:/spectra>
##$EXPNO= 1
##$NAME= <H-F>
##$PROCNO= 1
##$TYPE= <nmr>
##$USER= <she>
##$AMP= (0..31)
100 100 100 100 100 100 100 100 100 100 100 100 100 100 100 100 100 100 
100 100 100 100 100 100 100 100 100 100 100 100 100 100 
##$AQSEQ= 0
##$AQ_mod= 1
##$AUNM= <au_zg>
##$AUTOPOS= <>
##$BF1= 200.13
##$BF2= 200.13
##$BF3= 200.13
##$BF4= 200.13
##$BF5= 200.13
##$BF6= 200.13
##$BF7= 200.13
##$BF8= 200.13
##$BYTORDA= 1
##$CFDGTYP= 0
##$CFRGTYP= 5
##$CHEMSTR= <none>
##$CNST= (0..31)
1 1 145 1 1 1 1 1 1 1 1 1 1 1 1 1 1 1 1 1 1 1 1 1 1 1 1 1 1 1 1 1 
##$CPDPRG= <>
##$CPDPRG1= <>
##$CPDPRG2= <>
##$CPDPRG3= <>
##$CPDPRG4= <mlev>
##$CPDPRG5= <mlev>
##$CPDPRG6= <mlev>
##$CPDPRG7= <mlev>
##$CPDPRG8= <mlev>
##$CPDPRGB= <>
##$CPDPRGT= <>
##$D= (0..31)
0 1.2 0 0 0 0 0 0 0 0.06 0 0.03 0 0 0 0 0.0002 0 0 0 0 0 0 0 0 0 0 0 0 
0 0 0 
##$DATE= 1709811120
##$DBL= (0..7)
120 120 120 120 120 120 120 120 
##$DBP= (0..7)
150 150 150 150 150 150 150 150 
##$DBP07= 0
##$DBPNAM0= <>
##$DBPNAM1= <>
##$DBPNAM2= <>
##$DBPNAM3= <>
##$DBPNAM4= <>
##$DBPNAM5= <>
##$DBPNAM6= <>
##$DBPNAM7= <>
##$DBPOAL= (0..7)
0.5 0.5 0.5 0.5 0.5 0.5 0.5 0.5 
##$DBPOFFS= (0..7)
0 0 0 0 0 0 0 0 
##$DE= 6
##$DECBNUC= <off>
##$DECIM= 32
##$DECNUC= <off>
##$DECSTAT= 4
##$DIGMOD= 1
##$DIGTYP= 9
##$DL= (0..7)
0 120 120 120 120 120 120 120 
##$DP= (0..7)
150 150 150 150 150 150 150 150 
##$DP07= 0
##$DPNAME0= <>
##$DPNAME1= <>
##$DPNAME2= <>
##$DPNAME3= <>
##$DPNAME4= <>
##$DPNAME5= <>
##$DPNAME6= <>
##$DPNAME7= <>
##$DPOAL= (0..7)
0.5 0.5 0.5 0.5 0.5 0.5 0.5 0.5 
##$DPOFFS= (0..7)
0 0 0 0 0 0 0 0 
##$DQDMODE= 0
##$DR= 18
##$DS= 0
##$DSLIST= <SSSSSSSSSSSSSSS>
$$ [...]
##$SUBNAM2= <"">
##$SUBNAM3= <"">
##$SUBNAM4= <"">
##$SUBNAM5= <"">
##$SUBNAM6= <"">
##$SUBNAM7= <"">
##$SUBNAM8= <"">
##$SUBNAM9= <"">
##$SW= 18.0517328524113
##$SWIBOX= (0..15)
0 0 2 0 0 0 0 0 0 0 0 0 0 0 0 0 
##$SW_h= 3612.71676300578
##$TD= 16384
##$TD0= 1
##$TE= 0
##$TE2= 300
##$TE3= 300
##$TEG= 300
##$TL= (0..7)
0 120 120 120 120 120 120 120 
##$TP= (0..7)
150 150 150 150 150 150 150 150 
##$TP07= 0
##$TPNAME0= <>
##$TPNAME1= <>
##$TPNAME2= <>
##$TPNAME3= <>
##$TPNAME4= <>
##$TPNAME5= <>
##$TPNAME6= <>
##$TPNAME7= <>
##$TPOAL= (0..7)
0.5 0.5 0.5 0.5 0.5 0.5 0.5 0.5 
##$TPOFFS= (0..7)
0 0 0 0 0 0 0 0 
##$TUNHIN= 0
##$TUNHOUT= 0
##$TUNXOUT= 0
##$USERA1= <user>
##$USERA2= <user>
##$USERA3= <user>
##$USERA4= <user>
##$USERA5= <user>
##$V9= 5
##$VALIST= <valist>
##$VCLIST= <CCCCCCCCCCCCCCC>
##$VD= 0
##$VDLIST= <DDDDDDDDDDDDDDD>
##$VPLIST= <PPPPPPPPPPPPPPP>
##$VTLIST= <TTTTTTTTTTTTTTT>
##$WBST= 1024
##$WBSW= 4
##$XGAIN= (0..3)
0 0 0 0 
##$XL= 0
##$YL= 0
##$YMAX_a= 46143
##$YMIN_a= -64952
##$ZGOPTNS= <>
##$ZL1= 120
##$ZL2= 120
##$ZL3= 120
##$ZL4= 120
##$ABSF1= 10
##$ABSF2= 0
##$ABSG= 5
##$ABSL= 3
##$ALPHA= 0
##$AQORDER= 0
##$ASSFAC= 0
##$ASSFACI= 0
##$ASSFACX= 0
##$ASSWID= 0
##$AUNMP= <proc_1d>
##$AZFE= 0.1
##$AZFW= 0.1
##$BCFW= 1
##$BC_mod= 2
##$BYTORDP= 1
##$COROFFS= 0
##$CY= 11.3945322036743
##$DATMOD= 1
##$DC= 2
##$DFILT= <>
##$DTYPP= 0
##$F1P= 15.7292609196834
##$F2P= 12.9074282941183
##$FCOR= 0.5
##$FTSIZE= 0
##$FT_mod= 4
##$GAMMA= 1
##$GB= 0.15
##$INTBC= 1
##$INTSCL= 1
##$ISEN= 128
##$LB= 0.24
##$LEV0= 0
##$LPBIN= 0
##$MAXI= 10000
##$MC2= 0
##$MEAN= 0
##$ME_mod= 0
##$MI= 1.114404
##$NCOEF= 0
##$NC_proc= 0
##$NLEV= 6
##$NOISF1= 3.799351
##$NOISF2= 2.8
##$NSP= 1
##$NTH_PI= 0
##$NZP= 0
##$OFFSET= 15.70392
##$PC= 1
##$PHC0= -24943.62
##$PHC1= 10.98731
##$PH_mod= 1
##$PKNL= yes
##$PPARMOD= 0
##$PSCAL= 0
##$PSIGN= 0
##$REVERSE= no
##$SF= 200.130013532006
##$SI= 16384
##$SIGF1= 3
##$SIGF2= 2
##$SINO= 400
##$SIOLD= 16384
##$SREGLST= <1H.CDCl3>
##$SSB= 0
##$STSI= 0
##$STSR= 0
##$SW_p= 3612.71676300578
##$SYMM= 0
##$S_DEV= 0
##$TDeff= 0
##$TDoff= 0
##$TI= <>
##$TILT= no
##$TM1= 0
##$TM2= 0
##$TOPLEV= 0
##$USERP1= <user>
##$USERP2= <user>
##$USERP3= <user>
##$USERP4= <user>
##$USERP5= <user>
##$WDW= 1
##$XDIM= 8192
##$YMAX_p= 0
##$YMIN_p= 0
$$ End of Bruker specific parameters
$$ ---------------------------------
##NTUPLES= NMR FID
##VAR_NAME=  TIME,          FID/REAL,        FID/IMAG
##SYMBOL=    X,             R,               I
##VAR_TYPE=  INDEPENDENT,   DEPENDENT,       DEPENDENT
##VAR_FORM=  AFFN,          ASDF,            ASDF
##VAR_DIM=   8192,          8192,            8192
##UNITS=     SECONDS,       ARBITRARY UNITS, ARBITRARY UNITS
##FACTOR=    0.0002768,     1,               1
##FIRST=     0,             0,               0
##LAST=      2.2672688,     0,               0
##MIN=       0,             -64952,          0
##MAX=       2.2672688,     46143,           0
$$ Real data points
##PAGE= N=1
##DATA TABLE= (X++(R..R)), XYDATA
0 0 0 0 0 0 0 0 0 0 0 0 0 0 0 0 0 0 0 0 0 0 0 0 0 0 1 -3 4 -5 7 -8 8 -8 8 -9 11 -12 13 -15 17 -20 21 -22 26 -28 32 -35
46 -35 37 -42 46 -48 55 -60 67 -74 82 -92 103 -114 129 -149 171 -199 240 -292 372 -499 721 -1194
68 -1194 2574 -13156 -59290 1446 46143 28591 29063 36314 16933 4825 15847 9713 -25871
81 -25871 -28859 -7355 -19099 -20398 2871 -10213 -20932 9015 19735 -2072 -8452 9674 17994
94 17994 1558 844 14232 54 -6523 11643 3613 -12684 -5363 186 -460 1778 1546 -2753 -9674
109 -9674 -4198 -552 -16207 -10758 12320 4848 -2750 12402 13893 5291 4138 7466 5941 -4306
123 -4306 -5266 2279 -4110 -8258 -6087 -13080 -8601 1661 -5166 -4565 6805 9703 7449 4132 7275
138 7275 9606 -3393 -6778 2452 -1718 -5011 448 -461 -136 -2132 -4991 1434 1261 -2322 2093 1338
154 1338 1215 2035 -6641 -4424 4079 427 -2582 609 3491 6392 1548 430 5758 -533 -3743 2501
170 2501 -808 -5813 -6680 -5871 2097 3292 -2300 387 612 550 4631 402 -660 4802 1193 -1173
186 -1173 473 -2478 -3436 -3634 463 6228 -1046 -3681 5987 4168 -1191 325 -1734 -2288 -1303 -3152
202 -3152 -1648 -2775 -3280 1535 346 1108 4531 -974 -391 7705 3291 -1302 1149 2002 1310 -4240
218 -4240 -5629 492 -2261 -4197 1183 -527 -1270 2193 -728 371 2712 -1141 -240 1645 2387 3607
234 3607 -1649 -504 4966 -1035 -3300 2373 -156 -1285 -888 -2770 -485 -1269 -3473 -848 -1425 -916
250 -916 1923 -958 1910 5439 338 1464 4266 240 -10 263 -287 1238 -2622 -3679 -490 -3218
266 -3218 -2693 -1091 -3727 84 1861 -1390 2303 2783 -204 2523 2804 2469 2281 -1460 652 3166
282 3166 -2021 -1745 -1045 -3073 162 -1927 -4180 1 -196 -1373 1272 406 1069 970 -751 4073 3356
299 3356 -2342 781 2108 196 1559 -1363 -1813 1604 -794 -2000 -1343 -2539 89 -1179 -2627 1884
315 1884 -444 -3406 2231 2618 643 1636 593 2932 3619 -463 184 585 -1664 476 -1571 -3304
331 -3304 -263 -2374 -2802 1226 -850 -1695 -397 200 3209 1001 -1914 2847 2810 -192 1211 -160
347 -160 312 1748 -934 100 845 -2109 -985 -217 -1297 -520 -2968 -3230 1842 -394 -2484 561 1550
364 1550 3213 1977 -356 3709 3166 -609 1714 1069 -1234 -786 -2685 -1926 -406 -3924 -3230 -140
380 -140 -639 324 -964 -604 4598 2383 -936 2399 2528 1094 1018 -239 1639 407 -3053 543 882
397 882 -2439 -1298 -1834 -1534 832 -2869 -2830 1353 853 89 3 822 3683 1321 318 4716 2217 -866
415 -866 1222 350 -1041 -1639 -4075 -1401 -745 -3610 -2379 -1659 -274 2052 -451 754 4979 1540
431 1540 44 3259 2060 684 -112 -208 1522 -1881 -4245 -498 -333 -923 -560 -2688 56 1542 -2603
448 -2603 -1348 1972 1125 255 -132 1305 2621 -1374 -277 4401 1467 -838 401 -631 588 -831
464 -831 -4048 -1377 -57 -1721 -1878 -2264 613 2010 -1588 1643 4985 589 435 2710 1408 505
480 505 -1458 -956 1832 -868 -2803 -1287 -1597 216 -62 -2558 1106 2060 -1969 -520 850 -46 -91
497 -91 -711 2126 2395 -2490 -332 2940 907 833 481 -338 1147 -1208 -3427 -955 -1073 -1200 -1114 -1759
515 -1759 848 171 -2557 1679 4161 1162 1551 1784 1847 1065 -2670 -1236 1985 -543 -1502 -658 -1078
532 -1078 -452 -1799 -1686 2306 890 -874 310 -570 208 537 -1970 1541 3413 -733 -1123 1582 1479
549 1479 647 -963 1085 2381 -2635 -2639 -313 -2607 -2095 -534 -1107 988 1202 -897 527 1446 2484
566 2484 2023 -45 2785 2686 -3641 -1420 1906 -1387 -2129 -44 84 -1050 -2467 -407 1262 -1618
582 -1618 760 2051 -1463 317 1043 -2042 803 3369 172 -1101 1087 2780 -210 -3386 1429
597 1429 2230 -3506 -894 1541 -3073 -2971 -681 -354 441 727 930 105 166 3112 1280 -1702 3577
614 3577 3805 -2891 -940 1624 -1543 -2954 -672 1546 -741 -3223 339 189 -2664 973 1333 -1104
630 -1104 1760 2395 -1856 -342 2222 1272 -573 348 3314 -180 -3724 1264 1170 -3323 -355 1150
646 1150 -1617 -1855 -873 -738 -155 340 1879 224 -479 2621 1111 -1472 2568 2266 -1679 525 1518
663 1518 -867 -2755 -2313 752 -482 -2785 504 149 -1685 846 750 -569 2103 934 194 822 939
680 939 1145 -782 -417 2540 93 -3190 104 295 -1633 -759 -741 -374 -359 -1723 -123 936 -507 854
698 854 672 590 2928 742 -425 1587 591 -380 202 -483 526 -730 -2971 -425 -50 -2025 -1035 -616
716 -616 -66 378 -810 884 2206 326 1528 1641 -162 1110 473 -886 1004 -120 -1376 -851 -639
733 -639 173 -1062 -2470 436 438 -1880 481 1308 -371 530 339 1204 1571 -442 925 1136 -450 716
751 716 -29 -1242 984 -346 -3055 -851 129 -860 -957 -679 1054 -19 -1591 1752 1713 -874 975
768 975 1494 179 1761 367 -577 580 -264 -916 -1605 -1272 656 -806 -2452 958 742 -1312 94
785 94 776 640 479 52 1799 1780 -126 899 401 -655 897 -637 -1035 1235 -181 -1425 -510 -353
803 -353 -424 -1274 -1780 973 -211 -1228 1641 1236 -10 961 257 700 1478 -171 323 1106 -136 -234 -1300
822 -1300 -1313 280 -1807 -2307 373 -465 -501 208 26 1243 563 -670 1692 1892 46 514 438 577 734
841 734 -1519 -882 498 -1655 -1108 -392 -602 -15 -746 -1132 1280 257 -1051 716 904 1729 890 -505
859 -505 1761 1875 -733 78 361 -525 -739 -1249 -684 37 -2053 -1600 177 -559 124 71 -119 2362 1270
878 1270 -227 1772 1448 574 418 -414 548 -174 -2210 -281 435 -1806 -957 -773 -740 349 -1536 -544
896 -544 1684 111 -47 534 344 1790 515 -281 1965 1068 -567 289 323 139 -766 -2332 -502 162
914 162 -2197 -1314 355 121 305 -202 555 2155 383 -140 1635 659 521 192 -865 642 -36 -2428
932 -2428 -562 -156 -852 -927 -1032 471 659 -1494 -137 1219 -168 280 465 225 1549 132 -455 920
950 920 192 -28 -73 -786 303 -507 -2184 300 396 -1400 -514 -88 47 111 -685 775 1852 -237 456
969 456 1387 -56 585 -82 -463 1201 164 -1483 -457 -60 -143 -908 -1186 934 528 -1315 411 1015
987 1015 -252 208 540 1101 1409 -738 -104 1189 277 376 -167 -580 855 -727 -2322 -106 240 -826
1005 -826 -382 -361 309 60 -1246 996 1515 165 689 807 487 855 -589 -153 1235 113 -539 -645
1023 -645 -1017 -344 -1015 -1600 616 260 -1042 381 171 -149 517 -3 1591 1839 -225 471 667 -446
1041 -446 200 -489 -607 590 -1136 -1375 -293 -844 -565 -351 -478 910 -10 -1230 1018 1180 11 795
1059 795 722 1114 685 -1013 -205 534 -895 -366 -282 -890 155 -1037 -1566 393 235 -286 476 323 1095
1078 1095 141 -501 1411 1409 -345 825 453 -666 -108 -987 -455 447 -657 -605 -505 -764 -304 -807 -986
1097 -986 1494 642 -698 803 541 27 430 500 1226 731 -580 282 -268 -713 138 -918 -636 787
1115 787 -842 -1454 -101 -203 -189 203 654 1328 -175 -347 1677 176 -370 1188 65 256 281 -1089
1133 -1089 -748 -113 -279 -249 -978 -425 288 -1551 -487 1692 -305 -447 1290 885 473 -278 382 1226
1151 1226 277 180 391 -1120 -228 72 -1682 -644 801 -765 -1006 226 78 -350 -1022 710 1511 -437
1169 -437 321 1591 25 224 798 -284 125 851 -821 -658 -877 -411 -167 -1366 81 406 -1729 -535
1187 -535 1239 -443 -328 1021 700 751 243 432 485 -416 216 370 -1025 80 343 -1789 -267 363
1205 363 -1062 -833 -83 333 -87 -786 787 1605 -173 840 1429 32 946 730 -398 518 -117 -721
1223 -721 -691 -1069 -526 -562 -1301 440 148 -1263 273 909 289 335 242 877 1250 -122 219 1073 -262 23
1243 23 -83 -809 405 -612 -1379 -12 -208 -580 -465 -554 455 130 -1045 638 1117 148 491 636 401
1262 401 801 -546 -380 524 -574 -502 -552 -862 -433 -333 -905 250 29 -387 192 640 1044 557 -618
1281 -618 930 1371 -373 153 650 -22 -85 -507 -518 102 -804 -759 2 -708 -432 -329 -711 911 295 -608
1301 -608 408 1043 380 62 83 828 1026 -803 141 647 -945 -426 -237 -654 -33 -636 -711 11 -347 4
1321 4 -182 -160 1031 721 -354 875 1478 -198 -125 493 9 -170 -839 134 344 -879 -301 -70 -812 72
1341 72 -132 -689 864 375 -576 400 544 820 419 -151 1084 417 -663 410 506 -833 -535 -502 -375
1360 -375 56 -933 -538 246 -247 172 -237 -147 1047 259 -662 1098 1004 118 284 186 143 -384 -1027 64
1380 64 371 -1006 -493 -162 -177 110 -714 -499 471 -7 -256 485 383 941 181 -380 931 589 -698 221
1400 221 -53 -187 -501 -1080 -128 127 -1164 -704 122 -51 289 -196 85 999 257 178 925 215 393 204
1420 204 -2 676 -44 -1221 169 -216 -778 -686 -786 28 200 -692 -10 599 -22 134 259 271 988 -194
1440 -194 66 987 164 -557 53 -121 -42 -452 -1134 -177 -213 -920 -264 -154 -299 231 -322 199 1371 -112
1460 -112 84 608 374 466 -194 68 667 -463 -734 -20 -602 -357 -281 -620 -114 117 -801 16 411 310
1480 310 520 -145 565 1306 -545 -193 702 97 -225 34 -102 88 -831 -752 117 -533 -430 30 -530 7
1500 7 523 -604 47 1025 362 343 331 410 322 -631 250 926 -580 -524 -14 -676 -522 -538 -827 133 9 -330
1522 -330 251 -231 390 352 -240 931 1252 -461 20 625 -38 -354 -442 312 261 -597 -713 61 -785 -347
1542 -347 274 -530 423 471 -542 300 702 419 144 198 942 459 -1132 -49 571 -417 -463 -139 -254 -282
1562 -282 -686 -633 -200 -51 165 286 -116 402 296 -572 432 867 239 331 4 422 -67 -761 9 338
1582 338 -815 -238 -81 -711 -298 -307 -161 667 237 211 241 -215 537 189 6 1133 796 -784 22 302
1602 302 -485 -626 -216 34 14 -1000 -488 -37 -443 149 176 -118 874 465 -232 440 795 143 195 -33 691
1623 691 -47 -1186 80 80 -974 -289 -162 -294 -150 -484 -396 505 204 389 270 63 687 207 -590 580
1643 580 1071 -455 -187 2 -246 -529 -640 -17 117 -830 -125 -110 -509 104 246 -22 802 444 -261 445
1663 445 296 219 192 -136 814 70 -767 34 -121 -741 -293 35 80 -3 -630 -214 232 -54 539 358 230
1684 230 839 116 -437 641 76 -480 -148 -2 -72 -544 -848 -69 -119 -593 -150 6 -273 356 -339 86
1704 86 1059 368 192 347 384 143 -311 77 854 -181 -794 138 -307 -614 -312 -410 -260 -9 -511 86 78
1725 78 281 495 -215 338 1043 -180 -56 668 159 -83 -128 -26 -34 -647 -804 0 -493 -418 -211 -410 199
1746 199 476 -431 44 796 162 159 545 433 409 -423 35 300 -682 -446 -57 -546 -198 -782 -690 196 -71
1767 -71 -344 257 313 406 -13 -186 693 598 -412 409 978 22 -31 -88 -203 237 -398 -474 -85 -528 -410 -374
1789 -374 -473 368 280 -459 548 491 83 168 686 766 869 -674 105 421 -328 -244 -229 -84 -244 -514 -504 182
1811 182 -96 -345 -19 42 316 179 -258 795 650 -156 443 276 214 52 -641 90 279 -799 -519 26
1831 26 83 -336 -447 -40 620 96 -391 479 465 227 252 150 386 338 -358 31 36 -107 -342 -825 -317 -21
1853 -21 -826 -679 537 -477 -336 237 193 351 95 27 620 346 55 43 127 293 76 -613 -35 357 -504
1874 -504 -328 -413 -148 -207 -461 152 708 -327 110 830 249 432 240 -124 408 111 -358 9 150 460
1894 460 -297 -929 -23 28 -1099 -278 315 -374 -164 27 52 537 178 134 341 93 182 194 -346 296 -170
1915 -170 -391 -200 172 -390 -291 -468 -160 172 -835 129 338 26 348 478 171 615 206 -96 622 61
1935 61 -215 -97 -383 101 -315 -779 -56 92 -406 -85 -20 -180 -167 1 353 471 -36 261 298 -40 317
1956 317 231 20 335 -10 -429 -103 -156 -286 -441 -493 381 25 -609 172 226 -282 376 396 252 531 -56 -6
1978 -6 604 -91 177 -58 -81 373 -325 -975 77 -185 -482 -115 -65 243 -128 -395 647 620 43 630 311
1999 311 -18 230 31 -174 435 -52 -410 0 -353 13 -710 -590 477 43 -502 539 99 -111 600
2018 600 190 602 623 11 -50 68 -175 302 -229 -347 143 -430 -908 -189 16 -267 102 -198 523 19 -355
2039 -355 514 273 -131 577 115 17 355 146 -95 125 -15 -151 -166 -303 8 -856 -400 517 -67 -475 360
2060 360 117 -180 29 54 381 354 277 73 -178 90 0 -591 -189 283 -340 -501 -312 -12 -191 -467 43
2081 43 592 -81 -5 518 40 164 528 52 373 405 -218 -66 -84 216 -112 -532 4 258 -474 -453 56 -148
2103 -148 -315 185 371 300 -113 23 488 217 241 546 -165 330 138 -773 -126 364 -175 -245 -188 -179 86 -517
2125 -517 -365 349 38 140 626 144 291 255 45 373 462 131 152 -580 -40 19 -604 -179 178 -676 -369
2146 -369 68 -79 -249 -264 474 649 -188 -92 479 -24 4 49 -82 9 351 -538 98 -250 -173 -170 -522 -3 -43
2169 -43 -717 -25 273 -245 299 381 385 448 -204 80 669 -309 -80 210 -236 -160 -61 -811 -163 59 -254 -256 -81
2192 -81 108 177 -364 452 672 41 187 703 103 171 -35 4 404 -168 -260 -15 -203 -320 -246 -201 187 102 -166
2215 -166 -96 183 -218 96 236 483 448 -72 58 397 -37 -91 -179 -136 -103 -338 -620 275 -260 -309 -332 -210 106
2238 106 -169 -515 318 569 -282 293 304 15 231 -53 -90 453 -213 -295 -184 -69 -85 -339 -429 351 159 -196
2260 -196 226 157 9 284 120 532 321 -88 312 478 -90 199 -584 -162 159 -370 -522 -173 -301 -266 -41
2281 -41 -123 238 -64 -333 377 189 95 338 218 210 457 -358 29 312 -122 -41 -201 -481 -67 -428 -191 163
2303 163 -175 -139 217 200 65 154 162 396 464 -67 190 396 -20 163 -404 -151 121 -303 -212 -157 -147 -371 -336
2326 -336 -185 274 103 -109 184 -48 279 226 -94 253 53 -376 -115 161 -165 -100 -340 -43 251 -325 -7
2347 -7 50 27 78 -36 1 423 57 -35 399 515 -43 0 81 -29 253 -216 241 -183 -263 -159 -132 -155 -192 -193 -260
2372 -260 379 -95 -132 516 293 570 -90 -145 736 385 -222 148 31 -33 -167 -290 -181 115 -769 -189 -54
2393 -54 -107 157 -42 243 540 99 187 460 260 42 -214 53 75 -139 -257 -31 -203 -161 -170 -132 -120 -81 -330
2416 -330 -38 262 -273 167 345 -44 330 -10 94 558 32 -333 229 -339 -1 -79 -271 -61 -142 -324 -102
2437 -102 -112 43 192 -283 253 701 -82 74 259 -14 76 -110 37 368 -359 -193 -5 -221 -172 -252 -517
2458 -517 250 48 -284 85 477 188 244 -135 346 545 -296 20 478 -74 -39 299 -234 106 -66 -335 -9
2479 -9 35 146 -255 -282 250 156 -92 200 496 -120 193 380 224 96 -179 107 138 -155 -171 -215 -277 -91 -78
2502 -78 -249 28 17 -212 -77 144 454 -37 16 491 490 -94 9 291 -49 39 -166 -204 -59 -33 -398 -258 185
2525 185 -99 36 -65 354 143 -359 204 145 182 81 5 339 73 -321 179 347 -410 108 -80 -113 -146 -326
2547 -326 -83 63 319 -52 -7 -9 229 330 -56 245 452 -234 223 296 -283 -120 -370 211 105 -506 -94
2568 -94 52 -323 -153 -82 26 319 253 -339 220 -115 291 -70 198 400 -28 -439 45 28 -301 -272 -51 -19
2590 -19 -51 -327 -279 -48 -347 -62 14 61 290 -80 -322 485 74 126 -47 102 -136 -184 -291 109 -23 -398
2612 -398 24 -24 -145 -222 -295 -122 283 298 21 304 85 310 -102 2 469 -17 -181 37 -44 -396 -230 -306
2634 -306 15 41 -268 -194 -301 -237 124 33 185 740 117 78 254 -166 126 121 0 204 -118 -335 320 -453
2656 -453 -401 -34 201 -275 45 -23 72 330 60 146 195 195 205 56 155 608 -181 -450 -175 17 -66 -173 -446
2679 -446 288 -221 -56 -56 -201 -149 296 -213 97 388 14 169 267 109 66 -56 -125 246 -237 -429 219 -194
2701 -194 -306 -42 -222 153 -58 41 368 335 37 202 13 253 291 -18 -183 194 -60 -80 120 -339 257
2722 257 -120 -231 62 10 -344 -52 -55 -15 11 -63 -159 146 138 124 269 76 336 -46 101 319 -317 -347 186 43
2746 43 -155 -326 -318 137 -201 61 97 -202 70 -14 -121 303 323 -145 300 389 -129 -32 -175 -167 254 -523 -232
2769 -232 -7 -3 -145 -5 -59 -27 327 -156 241 313 111 -168 112 266 277 -136 -17 35 -357 -85 -224 -340
2791 -340 -140 -258 -202 307 -139 -90 -38 155 238 62 33 124 198 -134 62 196 -6 -237 -297 60 -98 -41 -305
2814 -305 264 -431 -10 -81 -262 140 61 -120 338 53 -30 283 87 176 -65 -172 280 -20 -153 30 -190
2835 -190 -111 314 -243 -324 227 -133 49 155 79 282 -32 -144 366 110 -10 -27 28 196 -12 -275 -136 -267
2857 -267 -292 -139 -49 -35 -65 -478 -28 52 -133 -109 306 129 -17 88 -18 520 38 -253 425 -34 -242 197
2879 197 -328 -51 111 -192 -119 63 -100 -172 76 143 407 179 218 353 -56 121 -49 -49 21 119 -234 55 -161
2902 -161 -298 140 -61 -27 -110 -281 259 266 -19 186 164 69 182 -77 -172 326 118 -1 -14 -111 -103 -117 -371 91
2926 91 -11 -378 -189 148 -53 158 -234 96 405 157 179 22 58 223 -31 -95 222 -65 -180 -2 -99 39
2948 39 -21 -385 -165 -58 -20 51 338 -117 345 -14 72 201 -84 13 281 314 48 147 25 183 -73 -264 1
2971 1 -193 -209 -16 154 -126 191 108 253 266 -138 297 -5 -14 340 -11 -106 272 -98 -407 -113 -44 -172 -88
2994 -88 -88 245 -151 -251 -44 -35 7 6 -42 184 288 -212 -10 -66 -49 -6 -212 -134 45 -197 -367 262 -203 -49
3018 -49 143 -23 -85 135 -146 234 57 196 343 -260 74 128 -380 -217 243 -230 -218 -117 -44 -88 -316 -115
3040 -115 117 4 -107 99 -107 63 214 -74 177 215 195 140 31 76 113 -109 278 266 -302 21 -101 -249
3062 -249 -194 -106 -81 19 -132 23 269 -186 -16 84 -52 22 149 -224 -107 -89 -52 -170 -194 -62 78 -495
3084 -495 -105 99 -380 -178 109 110 291 131 -37 343 124 208 153 -3 -130 238 22 -126 200 -404 132
3105 132 -100 -32 -28 -241 -43 201 -90 179 79 56 12 376 -23 47 127 -97 126 -257 -133 -142 -130 16 18 -177
3129 -177 -25 132 -105 171 167 168 260 37 183 370 -332 254 257 86 299 -11 -162 100 -31 -240 -137 -284
3151 -284 34 81 -431 24 -124 -110 -63 -160 178 270 62 121 189 171 -104 -188 -441 11 -26 -278 65 120 -388 52
3175 52 26 -127 187 -204 77 308 41 -161 255 100 -82 74 78 95 143 114 -194 -199 -163 -214 -358 26 78 -435
3199 -435 59 77 28 55 190 266 182 -47 -42 106 -37 78 53 195 261 -274 -152 266 -179 -349 -19 -138 -61
3222 -61 4 119 52 -4 -64 432 93 101 120 -16 18 -45 -29 -275 -14 -151 191 -177 -88 -25 82 -477 136 -43
3246 -43 52 149 75 247 252 222 53 208 -142 86 -41 -216 -78 -50 -368 221 -50 -76 -117 -157 138 108 -12 30
3270 30 32 30 24 10 104 40 -267 71 130 -147 65 -99 -331 -89 -94 -241 55 -108 -275 13 -63 219 -11 -185 52
3295 52 -19 168 198 -61 -2 39 -210 -152 66 -291 -316 -73 -368 35 -238 -85 129 -349 -230 200 95 44 133
3318 133 234 58 46 -28 203 120 -77 -27 26 -91 -131 -388 -45 55 -240 -78 -7 -298 281 129 19 358
3340 358 32 -6 154 -197 -117 75 -130 24 -82 -6 -194 -132 -213 139 -96 -186 28 -149 64 151 -94 -80 173
3363 173 -74 325 166 -254 172 186 -270 136 -77 68 53 -22 -47 -121 -283 -76 -65 -87 266 3 410 72
3385 72 247 -97 -60 -126 -54 60 -120 267 255 -185 -195 -181 -149 179 -92 -142 39 170 -191 9 -144 78 -99
3408 -99 7 153 57 37 334 132 -73 29 -151 32 19 -403 133 9 -55 52 -58 -259 23 87 96 90 22 60
3432 60 53 65 100 -99 -99 -21 -170 -262 -97 -179 -121 187 -276 62 181 -18 81 136 -14 488 66 -4 330 62 20
3457 20 -65 -180 24 -167 -100 -28 -368 -77 -189 32 -202 -67 -149 122 465 -60 222 186 -158 188 -127 152
3479 152 125 100 -175 -29 -5 -126 -28 -174 45 -12 -19 -58 161 30 -155 54 130 316 -84 245 -78 -263 127
3502 127 -80 -115 -92 -139 -117 -213 -84 91 18 179 404 234 -135 163 304 32 252 180 153 115 33 88 273 -126
3526 -126 -74 -107 -145 -35 -300 -157 52 -186 -204 -114 -14 -40 -159 61 -24 97 -161 87 59 -142 -38 -14 -181
3549 -181 -6 55 -127 -171 -39 -12 -234 -102 188 54 -82 -78 7 -126 460 312 227 -206 -455 224 122 3
3571 3 -36 14 -164 112 -321 -99 -35 -105 -96 14 324 153 -30 112 330 131 -240 87 8 -136 22 -390 -60
3594 -60 -109 -279 -73 -91 -86 -97 -109 112 393 -30 -56 79 237 164 16 50 308 105 -38 45 25 -119 -229 -118
3618 -118 -24 4 -45 -1 -68 -105 247 -135 87 195 121 -75 120 100 -31 514 -12 65 -56 -86 -94 -187 -17 142
3642 142 -97 -81 15 -238 137 262 -98 -148 -55 32 137 16 136 162 92 -68 101 -147 -146 -173 -144 1 -79 -417
3666 -417 24 -103 -125 123 -404 -10 21 -70 -102 157 -78 -163 185 -67 -85 48 58 -69 -329 -176 -1 46 142
3689 142 255 16 196 63 -321 58 -145 -160 338 98 -175 157 -52 203 328 -74 -72 -68 -234 -96 53 44
3711 44 142 -154 -231 220 -235 108 214 -190 40 471 201 217 -134 250 114 -220 85 51 -13 -76 -130 -177 190
3734 190 -179 -123 21 78 37 168 56 11 134 -19 65 108 -265 3 -9 -35 -6 215 -226 15 -243 -193 131
3757 131 -216 122 89 -147 75 196 153 -45 -241 355 233 -59 222 -22 -70 -238 104 -330 -210 -216 -282 85
3779 85 -151 -97 196 189 76 235 -118 320 136 -143 185 133 117 75 -225 -176 212 -203 36 -144 -50 21 166
3802 166 -10 88 -123 -85 273 173 -154 46 43 -82 -30 -53 48 157 7 53 -245 -110 11 13 -46 121 39 -28
3826 -28 311 67 265 68 -86 246 -125 -106 9 -153 211 -40 -227 48 -158 -166 51 -208 88 30 205 -136
3848 -136 250 -204 66 182 97 216 57 -97 195 -10 -150 41 -213 88 -80 -17 -64 -97 -58 -121 -93 -209
3870 -209 -38 2 -56 315 -11 78 135 76 -201 -52 -135 -25 -174 105 66 -169 95 -189 -36 -170 5 4 140
3893 140 -5 -197 156 196 76 77 56 4 355 -155 76 1 52 106 -163 -180 26 28 -126 136 169 -74 111 -29
3917 -29 -158 236 2 77 39 32 371 65 186 2 -197 -151 120 -35 -185 -202 -231 207 -281 -211 -91 57 -41
3940 -41 96 71 134 111 1 -22 -99 26 -53 -75 122 -14 -146 -138 123 145 -197 122 38 68 143 74 255 55 -4
3965 -4 24 -16 -46 38 -208 -168 -29 -258 -83 -3 -81 29 -2 23 159 -42 159 -20 -33 -8 142 63 -43 120 -245
3990 -245 31 188 4 -20 78 -52 -112 -310 -68 -22 -210 -104 -154 103 -8 -41 -32 -8 -14 2 189 -25 10 144
4014 144 -216 -137 236 -86 113 -33 -186 -114 127 -255 -99 -194 195 300 -8 90 -52 69 158 201 245 44
4036 44 -304 -1 41 -32 58 90 -172 -199 -33 112 -51 183 -152 95 -59 -6 213 -104 375 15 -151 80
4058 80 42 -72 22 222 -299 -77 -9 -71 44 -116 -70 49 -64 -3 7 21 5 88 -64 -3 222 220 271 220 345
4083 345 91 -349 265 -198 -281 -251 23 -35 73 -70 50 102 22 -1 -248 131 -140 172 -6 62 -104 100
4105 100 -120 -25 -224 -136 -161 -2 -54 -274 175 89 33 143 -2 121 139 151 -103 423 171 71 50 -106 55
4128 55 -169 -224 -162 -70 -56 -129 180 -86 -266 25 169 -179 -106 -94 203 46 -122 77 -160 -46 -206 -218 -60
4151 -60 -223 -173 32 -271 -43 -335 -273 146 33 -172 90 91 94 51 -58 24 179 -544 -210 -122 42 -65 -165
4174 -165 169 59 -73 209 -207 -273 -24 -81 104 110 -403 -130 241 46 -51 41 -11 -163 278 -147 -140 37 -255
4197 -255 61 11 -406 97 -82 -148 -109 -138 -207 219 -89 279 44 -67 177 58 -146 -8 -166 106 266 -18
4219 -18 -138 156 -131 32 -197 -269 218 -216 -31 -140 271 -165 -27 97 189 70 -77 75 206 -176 147
4240 147 -57 -35 2 -178 117 117 43 -170 46 181 -8 47 16 294 201 32 -62 -190 -90 202 -2 70 164 -146
4264 -146 39 -27 -233 97 -220 -153 92 -44 -258 109 -99 444 -21 -28 162 131 -144 47 -110 60 78 -50
4286 -50 55 -60 -242 28 -73 -242 -143 102 -50 163 -298 98 128 -145 124 42 -80 214 22 71 255 100
4308 100 -56 -53 -122 -203 146 -46 131 -78 -141 -111 -35 -241 416 277 327 -3 60 132 66 -33 -10 189 -9 11 -34
4333 -34 -114 -26 7 226 -3 -258 35 130 -175 -130 -47 -51 24 380 94 120 -88 -141 -126 -267 34 -1 -39 -157 113
4358 113 -382 17 14 33 129 -21 50 190 -7 117 304 -28 15 223 85 60 -102 -302 -14 -143 -192 51 -105
4381 -105 11 -99 -127 108 43 57 55 280 153 -101 -121 16 -25 -23 -76 -99 -49 -125 -117 -174 152 -18 -189 100 84 140
4407 140 -148 9 153 136 128 -13 -101 170 22 -59 -177 -74 -45 42 145 -180 -169 -124 -267 180 -149 -99 54
4430 54 -154 26 -5 -41 -105 83 136 59 51 22 -65 -9 65 -202 174 -65 -133 -224 -128 -182 138 116 199 -38 289 212
4456 212 -21 381 221 -14 155 -33 105 -52 -82 18 -129 21 81 -152 -166 -2 -299 -147 224 -14 -76
4477 -76 92 -51 -102 73 -81 83 130 113 132 -45 -132 -282 143 36 11 -60 -153 -156 -141 -2 -63 -63 220 93 -171
4502 -171 159 149 0 21 24 -38 15 -104 -143 152 -18 -258 -232 -55 325 -3 -199 -77 -3 150 37 -44 72
4525 72 -36 12 60 -10 -93 -80 7 -199 -20 -276 64 7 -47 -163 -77 227 36 -227 6 88 7 226 115 -68
4549 -68 147 87 -172 -65 -111 17 -43 -237 -60 23 14 -322 -18 131 10 -20 -141 321 60 201 375 -158 -63
4572 -63 153 136 -209 29 -21 60 159 -203 -186 -88 6 102 -79 -269 86 14 -63 5 7 266 13 129 179 231 14
4597 14 70 -14 2 115 29 225 -15 3 -353 -114 -74 -50 84 -163 161 64 -62 -9 80 -33 -82 -91 61 51 14
4622 14 -5 -366 -148 168 24 18 -67 -88 99 174 -42 98 -110 -40 72 30 216 41 151 86 167 -70 -85 -37
4646 -37 40 60 128 -4 111 -18 -104 6 -270 210 117 108 161 42 63 147 -375 -106 -138 191 59 -59 -132 -188 -50
4671 -50 62 -12 -74 -3 66 -143 7 154 -197 197 70 -34 285 78 -140 133 125 -104 -241 -6 8 144 47
4694 47 -62 -33 -114 -264 -190 -36 -41 -73 78 -43 5 -15 246 -209 267 137 118 -169 -183 -239 147 -32 -273 143
4718 143 79 -167 2 -35 303 -39 -114 19 -45 -31 247 153 -2 213 -28 -53 -44 39 -187 46 68 -104 -324 -87
4742 -87 -339 -58 -32 184 -37 74 76 104 133 165 -32 357 -10 25 -47 31 -75 -129 84 -9 22 -60 -67 111 -72
4767 -72 144 45 -108 96 -141 -36 79 -89 39 207 8 10 202 11 -2 112 -230 -193 2 -83 -9 127 -237
4790 -237 55 -80 46 -18 198 127 -79 73 41 130 -151 30 -66 69 246 121 -7 -16 -173 -21 -189 44
4812 44 -111 -224 48 -8 -69 168 -5 -47 133 -103 87 -60 -48 -138 5 -94 160 -52 106 -9 128 -114
4834 -114 -3 -7 108 -39 54 196 140 99 -196 161 -71 -90 -113 -102 35 -48 -174 110 28 -62 30 73 89 144 16
4859 16 68 -40 4 -48 -44 141 -40 -4 -102 78 -185 -127 -95 -77 -156 73 -60 140 249 161 44 -15 98 151 74
4884 74 122 -83 171 39 -56 55 226 8 75 56 -64 -214 229 0 42 225 296 40 -27 -34 167 12 171
4907 171 86 -109 -93 149 -203 -230 47 258 -8 -48 -41 78 -229 -9 35 -64 -2 -376 100 -68 183 -32 18
4930 18 99 13 9 -124 -128 56 -83 -56 -45 81 36 153 114 -83 238 -49 -166 47 -3 32 99 84 131 133 -25 -34 121
4957 121 165 -122 -112 -14 -25 122 -202 -6 -79 38 -55 68 68 295 262 46 68 151 59 -157 -83 -115 -120 -7 63 -177
4983 -177 199 8 116 127 -211 -215 -339 -47 207 0 -130 -2 -5 -19 234 -214 99 1 -79 -55 118 -76 -458
5006 -458 -21 98 160 47 44 -58 -159 143 -156 25 56 -92 216 311 115 160 -211 -103 129 82 25 -99 20
5029 20 65 -95 -73 -191 -48 -28 69 22 146 283 71 -176 178 225 -81 336 -111 18 24 -200 61 -225 -105
5052 -105 -36 85 135 -213 12 -114 297 138 -2 13 252 -33 253 169 -33 -60 -31 13 7 103 30 -163 -194 -233
5076 -233 -62 100 -141 54 293 73 44 -117 18 -156 134 -110 -111 -11 106 -78 -11 -34 50 109 -68 28 108
5099 108 -197 -90 -126 -23 244 -29 186 -58 45 -89 -52 -5 83 -209 -239 136 70 -159 -219 -133 -295 -19 50
5122 50 -213 -58 199 81 -112 184 35 34 -153 243 194 221 42 -209 63 -216 -199 -121 2 130 -4 -195
5144 -195 205 257 10 -61 135 -44 253 74 -137 99 -76 16 -36 -95 67 39 -264 -28 104 210 -59 -50 43
5167 43 176 -91 110 228 -73 88 189 -117 195 184 163 297 -42 -22 -160 -179 -190 26 -64 -140 353 -55 -43
5190 -43 28 50 -23 159 126 57 38 205 218 20 325 -4 -305 188 58 37 -103 -154 -32 111 -373 111 171 -247
5214 -247 -98 -294 170 124 -6 -23 68 8 15 34 -115 118 -46 -286 -4 104 63 99 -273 -178 80 -27 89
5237 89 206 -66 104 15 66 173 -131 59 76 -72 -241 9 -63 33 -54 -141 33 -24 10 157 215 -26 224 -152
5261 -152 -150 -1 44 89 243 77 13 -160 -137 31 271 -149 -56 -1 -355 -15 50 -252 -178 -110 79 117 -250 -3
5285 -3 187 -129 52 -115 104 117 76 279 -176 219 -136 36 -54 -15 18 12 -20 110 -130 205 117 -197 -59 47
5309 47 -81 -86 -86 -265 -179 12 -256 -355 29 -163 -208 -127 -177 -16 182 5 -69 185 167 -200 -89 -155 -117 -49 -143
5334 -143 106 -267 -25 -246 126 -106 -19 -178 -165 -106 -152 36 -68 142 -111 163 -96 -12 133 -252 -33 -140
5356 -140 124 156 -50 -46 206 77 -52 200 -64 -73 -177 212 -125 -65 -222 63 85 9 -49 5 60 256 -291 69
5380 69 122 -240 37 -25 -47 -19 1 -35 -39 -73 -94 74 182 -109 97 -33 -62 297 1 -157 111 -108 -32 -79 -125
5405 -125 102 -78 -82 -126 -141 183 205 74 112 161 45 138 -325 53 80 -215 -45 17 96 -44 -68 83 21 11 101
5430 101 -102 -301 -77 42 -37 -6 81 172 -157 41 -6 190 -46 65 -97 54 104 9 83 -44 -229 -50 -12
5453 -12 130 -67 -156 -48 -92 256 9 118 95 -140 -29 -30 110 178 320 92 44 -174 -67 144 -7 -67 -107
5476 -107 -56 -172 -12 85 9 89 -121 135 30 3 140 -6 3 -54 -102 260 -189 -162 -130 110 -58 -20 115 115 142
5501 142 0 -77 63 -1 178 181 4 -39 113 63 -26 -172 -106 -56 22 57 41 -56 -194 -38 112 -142 -110 -32 68
5526 68 -100 76 -111 -75 85 35 -163 -2 -94 -25 26 -36 -27 118 -200 100 -102 -5 159 212 123 251 94 -89
5550 -89 86 -57 75 -63 -1 111 129 -25 211 -87 63 -136 72 4 -2 -83 -170 -41 -29 -218 95 63 124 61
5574 61 -170 -17 -155 141 186 -90 -128 -145 51 -238 114 -32 -119 -6 -29 29 16 -20 -54 -67 101 84 -24 289
5598 289 -27 281 153 314 -101 135 116 180 -100 -81 -258 -146 103 -4 -111 -278 191 -111 -17 115 274
5619 274 177 -144 185 17 60 -203 17 22 -134 -12 3 0 104 -75 -22 32 -38 -39 -163 126 72 -219 96 -55
5643 -55 -150 15 43 352 1 57 -238 -52 -37 -30 -223 -93 -268 -230 105 -163 -15 72 -43 88 124 -217 212
5666 212 -47 346 -237 -77 -47 -158 49 -160 -106 -21 183 124 -155 214 101 -16 -11 -79 7 320 260 -110 93
5689 93 51 315 -175 51 -40 182 74 -260 -11 137 73 1 -12 112 39 9 181 87 187 20 -35 -53 -28 95
5713 95 109 75 68 8 -153 162 -5 18 126 51 16 -22 15 263 12 -7 -93 -37 45 133 -165 100 7 -24 -92 -77 -133
5740 -133 101 -38 20 12 -373 100 59 24 70 14 69 89 259 -95 3 68 -115 181 -43 -352 72 -79 -59 -83
5764 -83 -38 124 -216 -227 -242 -97 -135 97 -40 2 23 5 296 109 -70 -102 33 -41 -104 136 68 113 -197 -164 113
5789 113 -156 77 -22 105 37 -12 110 -50 172 35 96 159 87 -31 117 -190 -10 -182 85 104 -301 135
5811 135 3 -61 35 -342 -255 174 -27 -85 -41 125 61 114 95 207 208 76 203 170 150 154 88 6 -193 75 280
5836 280 -19 -62 149 -193 129 177 21 116 -113 -181 -42 170 3 -142 129 12 -49 29 38 -136 -12 -240 139
5859 139 -94 96 118 -140 243 33 -131 332 9 45 31 123 19 -164 14 35 -219 76 -20 3 -33 -183 -176
5882 -176 -145 77 84 -20 -72 111 259 186 -106 182 107 -40 24 36 -173 -228 -16 26 -148 -192 -92 61 -25 -146
5906 -146 78 65 -89 -205 167 -74 74 102 189 23 72 191 207 79 -206 187 -35 -284 -251 265 -25 -229
5928 -229 301 -77 14 140 -40 -17 61 129 140 -113 103 -152 40 -165 70 220 -164 -71 -21 35 62 -50 -139
5951 -139 -30 -160 -151 49 5 -166 -43 -114 132 -188 -72 -55 -24 -155 175 4 -403 -190 11 -147 -211 124
5973 124 86 -41 154 -65 126 158 4 52 70 -221 217 -136 51 -67 -144 -233 -49 -64 -137 184 61 -18 -267
5996 -267 -47 -112 296 -214 77 -34 43 -4 -170 -137 144 160 -167 170 -194 -91 -153 -46 63 69 42 -34 30 62
6020 62 142 7 -210 -3 116 189 -55 105 21 -30 -131 9 145 -90 -406 -182 -66 27 52 140 -59 -263 -156
6043 -156 -108 174 219 278 220 -46 63 -72 119 -127 11 -6 -36 50 -257 -245 183 54 4 60 -36 -76 555 -18
6067 -18 130 78 250 22 47 76 145 -227 -251 -47 -420 -99 80 99 104 -20 7 281 86 104 281 -32 -9 79
6091 79 -146 -193 119 236 139 -152 177 92 73 -63 259 28 -248 53 -115 -63 95 14 115 -64 73 195
6113 195 -61 -44 83 -182 -126 43 -86 -48 -164 -59 7 34 62 58 -60 17 139 153 44 0 0 73 24 -33 136
6138 136 1 -20 -74 -166 -180 3 -114 -257 132 -240 -202 -146 -71 -13 -164 -78 4 -88 126 192 -96 126 156 -11
6162 -11 -174 -105 50 29 -166 101 -24 -279 -2 -109 -143 88 -164 175 368 -14 7 -78 104 -162 -14 -28
6184 -28 -93 165 -57 46 173 -43 -37 14 198 -27 32 61 -260 246 46 58 37 -248 -17 -142 24 181 131
6207 131 154 -37 -65 -158 -165 -88 47 7 -23 2 6 190 -91 237 -47 3 -26 -26 132 40 -35 -334 -57 433 -26 -56
6233 -56 -229 -6 -88 -328 -299 103 -248 -133 -31 87 354 47 -9 90 119 -115 132 -140 96 -294 -97 20
6255 20 -35 101 199 -31 -58 125 -116 -9 -98 17 -237 216 44 -178 123 -5 -144 153 46 -182 108 -178
6277 -178 -313 67 115 -27 -181 189 -56 -105 -8 -47 92 151 72 117 42 -45 -162 -8 -41 -5 -179 -129 -91 -147 135
6302 135 103 49 -12 177 185 -27 184 -94 -132 -44 242 119 173 40 37 24 -54 41 14 -232 105 -8 -197 -42 -95
6327 -95 108 127 -23 61 -124 69 17 -197 25 104 103 105 161 24 -63 113 -83 186 -33 -104 -60 10 88 45 120 108
6353 108 -24 -286 -142 -21 124 273 -3 66 -237 96 -33 186 102 68 -142 229 -73 -149 -2 -153 217
6374 217 -200 179 -180 17 49 21 58 62 125 167 96 -190 -84 -32 -104 -139 -57 179 -272 49 7 -21 -111 48 66
6399 66 103 276 51 -136 259 58 83 73 -11 73 107 -96 -35 -104 -71 79 -205 -13 37 3 43 -41 195 154 47
6424 47 133 59 199 291 -88 144 148 74 -158 40 -104 -171 297 -249 -22 125 36 -145 -124 249 -5 -4 -372 186
6448 186 146 73 280 103 -252 -50 112 -221 101 -83 11 -203 -115 -50 140 -22 -87 -57 24 140 -80 -13 145
6471 145 -172 103 -61 46 259 6 106 -119 -128 44 92 4 105 -77 -107 62 46 73 -5 55 82 263 49
6494 49 -63 55 -125 -91 139 -202 -67 -407 7 -77 157 106 -116 -111 -182 -116 -75 -56 94 -99 -34 159 110 2
6518 2 -235 -9 81 -27 -42 -35 -148 52 -180 -321 74 -28 -172 -42 -1 27 104 110 -7 255 -122 -66 80 12
6542 12 160 254 -70 -111 -160 -63 -205 68 25 82 -140 49 180 27 120 44 -64 96 -1 41 -267 -47 -203 90
6566 90 2 -275 -20 -34 -52 259 -65 -98 143 -321 125 -190 164 -110 154 176 -166 -117 -255 -104 46 170
6588 170 -85 -126 160 102 -56 32 -236 -69 41 57 23 71 -14 70 109 148 179 13 -91 -195 210 67 -17 -11 30
6613 30 -40 -189 51 -148 -88 8 -143 -96 60 103 -53 -17 34 197 11 -198 37 202 -208 -176 42 -345 188
6636 188 -85 -105 176 -33 63 -18 33 -96 66 -21 64 29 68 225 -177 173 55 -23 -185 -137 -92 22 -138 214
6660 214 -75 200 -70 -98 63 104 56 124 128 110 176 40 11 -75 63 102 -14 42 -105 -44 216 74 -202 -55
6684 -55 69 14 230 14 306 115 81 -94 -58 -28 84 185 22 -80 -257 132 -320 195 -303 -10 -199 -66
6706 -66 17 11 32 70 186 -37 157 147 -64 256 101 -201 5 -126 15 142 96 -11 110 172 -51 10 -100
6729 -100 -92 125 22 7 333 67 -47 97 47 212 176 -118 40 -27 -208 147 -169 -77 5 -163 -99 -240 -78
6752 -78 221 -269 -226 230 160 14 -38 -63 -131 -22 108 136 -244 -23 -27 -151 67 192 -222 -65 -261 102 1
6775 1 119 -156 157 203 1 151 39 156 130 -165 150 -88 -312 -158 38 -97 166 21 130 -5 -204
6796 -204 -133 116 228 -237 214 128 -73 349 60 25 53 8 229 90 11 219 -271 210 -237 -40 246 -145
6818 -145 -166 -22 -192 -78 -96 136 234 1 -9 -166 87 -97 -53 153 -78 107 46 -230 -31 -174 42 -119
6840 -119 -149 4 49 -46 128 161 -277 323 279 68 240 6 198 27 166 -23 -7 104 -34 -60 -314 188
6862 188 -81 96 153 98 45 133 -26 -90 -122 -252 1 4 113 258 19 -100 -111 116 -66 133 -352 -129 -94
6885 -94 25 161 -133 89 -130 88 2 72 93 10 224 139 107 84 -98 31 113 -2 -244 -115 325 -156 307
6908 307 -36 -134 106 -45 86 -165 -84 -81 166 76 -141 -69 49 -141 125 47 -178 -21 -91 71 -109 -14 -245
6931 -245 155 76 -43 5 -74 205 379 -50 99 35 85 46 146 -168 125 32 310 40 -73 98 -61 -161
6953 -161 63 45 -116 48 84 70 130 200 74 -33 -33 286 153 -141 148 49 -94 164 -138 22 -319 -37 -18
6976 -18 -139 -90 113 -65 120 154 81 -155 32 7 -5 114 -267 -40 88 166 31 66 -140 -82 8 -199 158
6999 158 59 -165 6 -73 48 87 -4 104 165 -221 152 152 -20 150 -137 11 59 -197 -166 91 -40 137 96
7022 96 -34 -90 -167 -6 55 23 -75 -48 -240 19 109 -140 311 82 13 -94 -163 -51 -51 -296 -52 -5 -264 -220 24
7047 24 -37 -102 -41 -4 -46 292 -2 250 -4 -31 -133 -121 -128 -101 -111 35 8 -56 -54 -214 125 34 -86 288 26 -104
7073 -104 -24 169 158 3 128 -9 122 -98 -69 -8 -65 20 -133 -97 -101 57 -269 -79 4 -84 16 279 -170 168
7097 168 -66 106 216 75 223 -145 34 20 36 32 -17 111 12 -38 -165 -94 12 13 -6 65 -51 -60 43 111 21
7122 21 -246 108 140 -109 -137 119 -281 14 -52 -139 48 19 -146 -23 154 124 233 113 -3 9 32 210 -89
7145 -89 -189 109 170 -35 207 -102 -8 -145 -79 -120 139 137 -22 -89 -256 -109 103 63 221 7 -105 235 107
7168 107 157 74 -7 -35 25 -157 59 -212 -75 304 -67 -191 70 206 34 -163 -58 177 -16 113 149 -83
7190 -83 -104 181 -99 -234 -212 31 -297 -35 -271 -72 170 -1 -76 85 -62 -17 -260 -102 -23 -62 -171 140
7212 140 -43 4 -51 -352 -62 -31 51 -32 86 -79 -78 -40 60 24 -50 -4 253 209 -29 199 -171 99 137 -80
7236 -80 -22 -184 -226 -136 46 121 200 -78 2 110 -109 61 -179 -107 24 -62 -242 89 43 60 153 -129 64 19
7260 19 128 179 128 -146 -38 -78 -304 -122 -235 100 -11 -29 -22 -229 28 347 214 78 124 185 305 113 160
7283 160 -118 -37 -59 -74 23 59 -33 -43 237 8 80 -21 42 6 388 89 161 195 -183 5 228 10 -58 -25 15
7308 15 -28 30 -27 -185 -115 -197 15 36 141 -125 106 -62 -236 29 34 207 29 -72 -244 -90 -232 -42 100
7331 100 150 -127 259 -34 -86 -188 169 -64 80 -159 3 31 -71 -54 46 -6 36 -225 23 -10 -75 113 7
7354 7 -189 -77 229 -37 56 38 -13 -100 248 109 178 -67 142 -90 30 -52 74 -231 -168 -214 -120 -188 -11 -72
7378 -72 -32 297 -59 103 -131 -168 168 28 80 24 142 -76 -16 -111 32 61 -149 153 -51 66 -151 -85 -18
7401 -18 -115 -163 11 -38 -46 -49 39 77 -112 -239 -70 120 -13 44 44 163 -56 81 -35 5 -136 60 -101 15 21
7426 21 -6 -23 16 79 237 -69 -239 64 206 -164 11 -59 -104 -170 -136 76 52 -12 109 -57 84 12 172 -34
7450 -34 -67 34 149 169 -82 210 -39 -67 -70 95 -24 -256 -37 261 -102 34 190 51 317 171 106 -72
7472 -72 -125 -24 -66 171 249 12 196 206 28 -9 2 -25 40 224 -67 -3 158 -32 -55 15 16 -24 271 -33 -19
7497 -19 -17 158 -10 -106 -131 -79 54 187 27 79 34 -151 -13 53 -68 -21 -80 -177 235 121 212 166 368 124 173
7522 173 32 128 -257 202 -195 20 -238 17 73 -24 -96 -128 -153 -111 174 -155 22 -125 -125 -13 -170 239 157
7545 157 -65 -34 112 66 185 4 -126 13 -288 -9 -147 -73 21 86 -264 -11 97 -19 -268 -133 39 -41
7567 -41 131 -77 -251 98 -20 -224 -266 12 -12 -210 186 176 -26 93 -80 12 201 257 71 354 17 19 -29
7590 -29 86 117 -18 57 -112 -210 274 -152 -35 -1 -41 -179 -339 31 -110 132 126 121 225 -7 -38 43 -171 294
7614 294 -158 -238 268 -132 5 30 -128 -145 60 -94 5 18 45 117 104 -155 60 35 143 69 144 -4 159 30
7638 30 -97 274 110 159 -254 -136 -2 -68 199 301 44 106 -181 115 -119 -58 74 65 -20 -123 92 -192 -43
7661 -43 151 -82 -176 52 131 8 85 0 147 -219 -77 112 31 93 167 117 -192 219 57 27 -106 -98 247 -188
7685 -188 -126 107 15 -70 64 75 -212 198 12 -68 -220 138 -35 -53 -92 -8 301 17 100 -16 29 40 -239 -23
7709 -23 71 119 148 8 40 65 53 48 11 -14 -86 -29 -35 48 -7 34 -51 -26 62 55 -3 13 -222 38 -79 -76 -105 61 28 118
7739 118 27 24 -71 337 -158 103 86 56 146 81 -23 33 -203 201 -114 119 -32 -59 -25 -137 5 351 -43 -77
7763 -77 252 -92 196 215 -139 -117 367 -30 72 2 -179 70 -59 -134 -229 76 202 -81 -271 28 -254 113
7785 113 -158 158 -28 132 -160 -60 -133 173 86 290 -147 -175 -89 240 56 166 148 -302 61 -53 128 -51
7807 -51 69 8 47 -149 162 183 -168 11 48 111 -151 115 -14 174 -53 -164 -16 81 12 141 70 -116 -102
7830 -102 -177 173 14 76 128 -117 92 -151 -13 -19 103 49 171 126 -143 87 -38 56 262 44 176 67 -32
7853 -32 232 202 -233 -1 74 -49 -18 -17 40 101 -212 -49 337 -12 127 -194 -183 60 24 -91 242 -13 -115
7876 -115 -56 -101 93 11 -93 64 100 -358 -64 -113 -239 -31 -204 49 -75 -90 126 268 36 337 -22 45
7898 45 10 -82 -107 123 300 -134 279 -42 -126 -111 -136 -59 73 -235 62 44 -9 158 1 230 19 73 -52 -36
7922 -36 -167 50 65 94 -56 -74 23 67 86 -166 63 25 96 148 -25 -156 106 -178 185 -122 -83 -38 53 -131
7946 -131 19 -147 50 -84 -171 59 -7 -227 113 -13 120 -168 30 -198 272 112 1 -194 -232 -19 112
7967 112 175 170 277 37 -42 -240 30 135 71 -291 -111 29 -3 65 -163 -181 231 -45 193 -47 -61 98 -76
7990 -76 -25 160 -118 21 -108 -116 -54 18 -95 -85 -40 -210 149 -152 -196 108 229 1 -198 -227 136 55 101 11
8014 11 -75 -74 56 -150 -72 38 -11 -30 285 115 88 61 132 -174 128 -13 181 -102 153 149 -161 55 -146 169
8038 169 -179 -26 26 82 -18 29 124 -144 -241 -135 -94 20 -1 88 -84 110 87 -169 344 253 106 99 25 125
8062 125 -62 198 -21 72 97 25 -187 -119 -87 20 -43 -188 160 22 185 59 112 203 96 81 122 -24 -194
8085 -194 0 -50 -96 -10 -80 -150 28 0 -47 -147 -146 59 29 71 340 -128 87 161 -81 -127 -66 -122 -1 -23 -47 -97
8111 -97 -8 362 -196 -102 19 -168 70 -187 92 36 -188 219 83 333 142 -37 -7 171 40 -71 3 -39
8133 -39 88 12 46 -30 -33 9 72 81 48 70 -126 -117 52 -57 -97 86 -67 4 -159 -42 52 160 -42 30 -6 -37 -296
8160 -296 -94 -43 46 52 103 3 -56 -56 44 244 176 62 -34 196 -91 -153 201 -10 227 174 4 -108 19 -175
8184 -175 119 116 15 -41 -90 104 170
8191A70
$$ Imaginary data points
##PAGE= N=2
##DATA TABLE= (X++(I..I)), XYDATA
0 0 0 0 0 0 0 0 0 0 0 0 0 0 0 0 3 -8 8 -8 8 -8 16 -16 16 -24 24 -32 38 -40 48 -56 64 -72 82 -94 104 -120
36 -120 134 -150 167 -187 207 -231 257 -284 314 -346 385 -423 466 -513 566 -622 688 -757 837
55 837 -927 1029 -1146 1282 -1444 1636 -1873 2171 -2561 3094 -3867 5106 -7412 13185 -63970
70 -63970 -64952 27784 -7001 -5910 7928 9764 2069 25884 27987 8270 4652 31733 16435 -4137
84 -4137 4209 -7603 -31282 -7609 3035 -19287 -24000 1130 12189 -839 -4908 11703 4060
97 4060 -7076 9159 7498 -11194 -1233 10305 7621 6715 6082 1467 -3435 -1580 2827 -9876 -12248
112 -12248 6667 -1636 -18518 -5032 906 -7814 -3665 6198 9651 5998 6716 16037 11418 800
126 800 2322 -3338 -6930 -57 -8476 -13693 -2871 -605 -4586 -4087 237 5714 -435 -3222 9378
141 9378 7916 467 4254 3048 -1304 -2645 -5441 -890 1780 -2616 1279 3410 246 1380 -3906
156 -3906 -4725 4075 -635 -6583 -2640 183 1541 -639 -2450 4762 2933 -1360 5436 4859 -1878 -810
172 -810 462 3864 2939 -6093 -6128 -2682 -3714 785 49 -1641 5046 3664 -974 1655 -186 -2043
188 -2043 -657 776 4013 -1879 -6705 3127 4092 -3438 149 2188 1071 3307 1441 668 -99 -2835
204 -2835 -658 -1532 -4767 -1227 -3974 -4816 4237 2709 -2832 1986 4973 3766 657 -1407 4449 2744
220 2744 -2964 1168 68 -4059 -1151 -2504 -3071 152 -1880 -1839 1406 1360 1731 -1321 -1757 4737 689
237 689 -3281 3404 2784 -426 1534 481 920 1466 -1777 -398 -494 -2719 -758 -2848 -3284 1240 -2362
254 -2362 -3287 2406 -58 54 3246 2847 4184 2257 -79 3302 1212 -1824 -140 -2836 -2111 37
270 37 -4159 -2975 -46 -3277 -1064 1497 327 1137 -27 1351 5336 1088 -229 2438 335 1199
286 1199 832 -2870 46 789 -2795 -775 -1231 -2284 -1365 -2219 380 1913 -3360 -537 3356 856
302 856 1235 1010 -22 3447 2029 -708 853 -37 144 151 -2657 5 -582 -4816 -269 1254 -2686
319 -2686 -1455 -928 379 2238 -798 256 2783 1280 2450 2224 -745 2056 1226 -1825 1105 -600
335 -600 -3364 -1665 -1371 -240 -917 -4030 -3 2653 -1538 220 1208 342 2403 432 29 2357 -58
352 -58 -176 2196 358 662 -723 -2401 1555 -110 -4257 -1687 -495 -1039 -1326 -3425 76 2242 -1054
369 -1054 1285 3824 1208 2491 2391 1683 3096 -542 -2121 557 -1102 -2243 -2894 -3703 196 -366
385 -366 -4354 -39 1950 -201 1181 1464 2381 2423 -708 1878 3371 -748 -289 736 -215 1526 -1183
402 -1183 -2913 838 105 -2802 -2211 -2330 69 -891 -3035 1907 2071 -1365 2252 3605 2291 2603 1119
419 1119 1887 2769 -1661 -2447 -1285 -2141 -1297 -3581 -4041 455 -924 -3051 1883 2023 901 1816 1647
436 1647 3168 1479 -2056 1502 2362 -737 -225 -1651 -654 1608 -2444 -2616 1616 -22 -1697 -1280
452 -1280 -839 705 -1898 -2175 3347 1553 -1430 1582 2008 2407 2344 -458 996 2854 -928 -2280 -2203
469 -2203 -1433 -149 -3676 -2518 1975 -1540 -2351 2311 1752 1065 1128 1261 3461 1114 -1784 290 416
486 416 136 565 -2302 -201 1596 -2606 -1674 1021 -396 -959 -860 190 1136 -2704 -2063 2839 1257
503 1257 -55 1289 1082 2256 1256 -1160 1431 2009 -481 -526 -1590 -1132 -917 -4446 -1442 2092 -1031
520 -1031 -1619 1127 796 1027 -550 674 4442 1608 -827 982 168 -524 -670 -1200 1652 868 -2472
537 -2472 -1065 -508 -751 109 -1494 -51 2496 -1902 -2751 1284 1241 773 449 1647 3225 -170 -1487
554 -1487 2022 346 -1049 750 -950 -729 -846 -3480 -2531 -516 -441 457 -539 1047 2773 -1835 -390
571 -390 4948 1171 -1042 1449 1189 -624 -1912 -510 1210 -1480 -1344 902 -2086 -1746 952 -1630
587 -1630 -659 3015 -467 -2507 600 2132 200 -1879 1926 4729 -1254 -566 3231 -1070 -2463 751
603 751 12 -755 -760 -2030 -2174 -1878 364 323 -2592 2089 4212 -1901 -610 4394 1074 -1074 1705 2344
621 2344 132 -3226 -650 759 -2587 -909 1509 -2114 -265 1172 -2276 -1710 1990 1011 -842 240
637 240 2640 536 -2987 1605 3943 -1386 47 3108 -397 -1665 -453 -737 -476 -797 -785 -1294 -2923
654 -2923 208 465 -2100 1815 3116 -753 677 3183 736 -482 378 2239 1198 -2311 -397 207
670 207 -2821 -849 -120 -1817 253 233 -1635 -78 643 245 -1 -246 2532 1180 -1904 1172 2767
687 2767 -422 407 845 -302 4 -1553 -1115 -298 -1583 -1538 -492 -1323 513 -130 -1534 1085 1398 399
705 399 1694 1284 1289 860 -974 695 1660 -1236 -691 -309 -963 -814 -1852 -1312 625 -1132 -703 869
723 869 -700 163 1283 191 1807 1811 -207 819 1318 515 -160 -1612 93 977 -2411 -1107 431
740 431 -1874 -1482 -273 -215 553 -626 209 1723 33 488 1531 -272 1396 1327 -1804 168 1617
757 1617 -326 -890 -626 -150 -598 -2530 -399 697 -2150 -953 1193 -177 933 935 -39 1589 1536 454
775 454 511 159 1705 455 -1987 24 501 -2533 -1561 245 -931 -509 -645 317 1184 -858 -168 867
793 867 3 1112 834 -338 1912 1274 -1172 332 739 -53 -524 -995 205 104 -2060 -352 343 -1620
811 -1620 -505 -431 -231 1131 -13 450 2330 1454 566 716 225 1305 101 -1771 731 91 -1725
828 -1725 -860 -792 -788 -541 -2043 107 1466 -675 102 1225 1145 1445 -360 174 2099 156 -498 927
846 927 82 -90 -751 -1428 40 -359 -2566 -745 38 -574 -382 -1067 574 1902 -509 391 2166 783
864 783 1040 1052 363 1159 -674 -1496 603 -899 -1463 -1138 -1612 128 51 -1844 42 1407 -3 546
882 546 611 1266 1452 -237 815 2187 -474 -609 293 -230 -229 -1092 -1408 684 -422 -1772 -284 -702 110
901 110 -63 -945 1407 1496 -371 688 1605 1010 716 -407 649 1280 -1441 -1500 620 -544 -1229 -1531
919 -1531 -1256 518 -609 -1562 744 988 414 719 344 1479 1665 -813 554 1497 -378 -340 -657 282
937 282 654 -2085 -1144 1026 -643 -1209 230 -472 568 124 -516 1009 1114 41 732 409 939 991
955 991 -1069 581 1591 -1275 -1276 -7 -573 -694 -1399 -395 931 -1324 -1010 1020 -38 210 760 60
973 60 1825 1427 -690 295 1176 181 -332 -905 407 585 -2370 -827 855 -1234 -485 61 -227 386
991 386 -1059 -746 1217 694 264 604 449 1221 573 -981 1179 1562 -568 -471 -352 -720 -761 -2012 -433
1010 -433 875 -1223 -791 451 172 443 183 188 1834 1218 -51 486 79 402 89 -814 502 528 -1775
1029 -1775 -634 -283 -1054 -540 -765 152 871 -1043 -376 1154 189 718 1017 373 1588 503 -827 911
1047 911 264 -380 -94 -575 -246 -542 -2223 -209 454 -1086 -313 363 510 816 -387 296 2123 255
1065 255 637 1302 -113 242 -330 -1349 372 357 -988 -594 -654 -585 -849 -1459 811 1280 -611 535 925
1084 925 -10 640 427 364 1639 268 -449 -8 -581 -13 -674 -1337 356 -193 -2005 -416 -43 -877 44
1103 44 505 770 749 -638 648 1139 -157 766 629 -251 1285 -126 -1525 -5 -168 -528 -539 -404 159
1122 159 -1084 -1442 964 508 -691 1115 1092 -49 1083 14 149 1261 511 135 -117 -494 -36 -948
1140 -948 -1080 1115 -442 -1761 194 235 -851 -371 -85 919 542 -119 788 54 293 1412 -220 -232
1158 -232 1435 -454 -1165 144 -416 -1361 -1443 -124 636 -1231 -1325 1006 10 -669 1252 137 181 1596
1176 1596 28 160 633 650 338 -556 -67 669 -1673 -1090 662 -655 -1199 358 65 -270 -49 -301
1194 -301 732 284 307 1144 34 412 1198 -512 -56 1024 -785 -1039 138 -393 -877 -1466 -618 417
1212 417 -1169 -774 968 -259 149 840 187 1145 967 -14 551 305 317 150 -788 225 492 -1688 -1022
1231 -1022 439 -794 -811 -119 -232 656 -412 -93 1038 613 339 456 96 992 786 -620 363 576
1249 576 -748 -674 -632 -616 -6 -1373 -524 555 -866 -581 366 131 831 36 270 1458 802 -80 767
1268 767 374 215 96 -857 -76 123 -1211 -537 -147 -444 -207 -896 -288 1138 -419 -237 1291 308 446
1287 446 261 196 947 -17 -218 588 -213 -463 -162 -733 -226 260 -1290 -415 539 -466 -632 -275 468 981
1307 981 -366 162 1581 107 -128 1069 82 300 -212 -703 117 -385 -1148 -539 -643 163 193 -1327 48
1326 48 890 -191 -312 827 710 635 -26 468 896 -430 -91 484 -392 -72 -105 -898 24 -137 -1250 -489
1346 -489 152 -265 -308 -388 580 718 -199 595 1356 40 120 436 211 341 -550 -495 158 -215 -731 -734 -1056 115
1368 115 -42 -1076 435 968 -521 134 487 666 407 -245 665 1102 -523 -145 488 -90 191 -818
1386 -818 -994 218 -299 -1044 -277 -39 -59 -89 -361 619 622 -388 642 738 194 341 -64 138 659 -988
1406 -988 -677 373 -318 -549 -657 -904 51 -206 -873 489 36 -170 387 496 761 711 -205 816 658
1425 658 -254 -40 -142 -49 321 -813 -864 221 -678 -651 -198 -167 218 -343 -375 924 388 -413 395 752 519
1446 519 443 -249 606 549 -709 -621 -143 -594 -314 -755 -570 489 -837 -592 171 54 -74 110 410 1267
1466 1267 287 -505 664 423 -218 -18 -78 -351 5 -981 -477 13 -520 -381 -409 -52 716 -392 -516 1092
1486 1092 470 -32 628 452 407 -15 -335 556 458 -500 -29 -276 -532 -122 -968 -488 390 -234 -541 -76
1506 -76 115 327 -143 362 1447 -188 -391 712 494 -81 94 -173 122 -25 -713 -615 -500 -446 201 -647
1526 -647 86 804 -789 -400 964 574 146 439 654 715 -188 -630 542 -173 -271 143 -424 -269 22 -1179
1546 -1179 -642 233 11 -107 104 392 564 -641 308 1360 283 -6 596 169 -21 -8 -368 92 -341
1565 -341 -548 -201 -849 -522 43 -882 174 859 92 49 413 475 508 23 584 1048 -515 -135 330 -566
1585 -566 -468 -5 -420 -39 -296 -729 -564 -533 -152 82 -98 472 899 -336 176 818 398 46 137 424 229
1606 229 -377 -491 -42 -628 -274 -241 -752 -125 -236 -607 -217 623 -32 56 448 575 404 -559 363 1266 6
1627 6 -358 317 106 -481 -423 -801 168 -211 -497 -194 -93 -75 28 -287 713 1029 -174 352 599 358 57
1648 57 76 389 505 -768 -133 166 -622 -242 -17 -424 334 -77 -788 -56 -147 122 54 28 650 483 -481
1669 -481 719 816 -306 138 143 74 82 -650 -676 70 -372 -475 -383 -299 21 159 -668 718 704 -170 339 584
1691 584 449 -72 -285 488 263 -679 -169 88 -559 -248 -609 -532 31 -279 -809 -77 166 376 -40 -241
1711 -241 978 385 -163 751 465 33 58 68 -61 177 -454 -644 -146 -396 -178 -512 -465 681 -10 -382
1731 -382 741 396 -253 280 508 454 138 -387 499 178 -433 -32 -440 -405 -16 -751 -504 516 -266 -273 -32
1752 -32 271 277 -19 402 834 -108 -312 588 178 -202 223 -296 -82 -115 -373 -351 -11 -50 -28 -197 -14 627
1774 627 -471 -144 724 251 140 238 178 691 259 -193 260 23 -432 -192 -393 33 26 -803 -271 390 -310
1795 -310 -168 143 251 479 -444 247 915 100 79 540 170 -63 -194 -547 332 24 -566 -249 35 -97
1815 -97 -267 -641 128 448 -424 71 688 492 433 -120 -40 556 107 -373 392 -233 -249 -253 -547 90 -423 -854
1837 -854 -263 -75 -349 -49 -165 322 545 -71 -3 617 275 48 -2 -44 566 -563 -348 372 -162 -867 -439
1858 -439 -223 -17 13 -527 26 108 -142 318 151 300 667 -94 244 722 -10 -123 23 188 -128 -533 -261
1879 -261 277 -487 -427 2 -407 30 355 -268 174 500 58 336 476 302 255 -147 300 466 -695 -352
1899 -352 257 -450 -305 -147 -160 18 -220 -217 240 57 236 200 -82 648 359 -445 318 659 -60 -12 209 57
1921 57 198 -458 -324 230 -803 -522 -124 -351 -102 169 -118 407 364 136 308 386 531 371 -392 422 635
1942 635 -568 -183 11 -388 -576 -335 -349 8 -349 -56 40 31 37 463 201 445 514 -186 333 382 219 173 -133
1965 -133 142 4 -505 -12 151 -403 -349 -51 -242 138 -169 43 695 266 116 343 242 142 203 -382 563
1986 563 403 -266 -183 -318 106 -565 -626 -238 72 -238 -254 43 81 299 165 99 522 426 -236 207 196 169 18
2009 18 -254 133 -52 -1002 -199 -145 -339 -402 -42 -9 157 -53 -40 -33 119 469 155 82 872 255 -468 410 184
2032 184 -417 -43 -259 53 -115 -709 86 129 -456 213 178 -324 427 56 16 380 310 255 397 -154 330 -445
2054 -445 -636 520 -42 -607 -24 -261 -536 -280 -118 36 457 -255 195 134 -294 571 222 34 867 207
2074 207 -238 29 162 -189 -374 -210 294 -433 -776 -6 -165 -598 114 177 282 257 -82 19 358 167 415
2095 415 36 304 569 -366 -694 258 -5 -594 -58 52 -91 -365 -375 97 98 -170 644 41 258 718 -115
2116 -115 -117 525 197 -321 -125 87 -32 -496 -374 685 -349 -482 304 -88 -479 188 -251 378 543 14
2136 14 193 174 270 407 94 112 682 -424 -504 240 20 -241 -295 -78 365 -390 -256 324 23 -42 588 -26
2158 -26 359 629 -56 257 466 -41 -71 -252 101 297 -577 -504 -152 -426 -486 49 -112 -154 -228 -68 490 247
2180 247 42 639 270 5 385 -20 116 191 -372 -415 -28 -56 8 -353 -6 204 -29 -195 404 -246 -14
2201 -14 325 14 481 192 -22 405 54 81 237 -383 346 122 -764 -393 15 -307 -234 -363 229 355 -119
2222 -119 -132 383 -86 104 370 -38 330 233 -367 46 159 -268 -38 -136 -78 65 -853 -376 330 -317 -119
2243 -119 239 188 320 29 120 646 304 -112 289 -19 293 -23 -460 122 157 -586 -114 27 -433 -241 -371
2264 -371 -134 75 -298 -171 723 -138 315 294 119 424 164 -341 340 26 -578 -73 -232 -178 -243 -447 87
2285 87 200 -58 99 324 67 247 24 19 784 119 -155 254 -117 27 -135 -432 312 -369 -475 147 -82
2306 -82 -463 1 -446 144 134 -45 246 167 354 571 47 -47 597 -96 -233 224 159 -292 125 -99 160 -244
2328 -244 -605 160 -55 -283 118 -51 -1 494 -215 261 524 42 -14 114 199 285 -359 -466 255 -57 -389
2349 -389 -38 -99 -196 -34 -293 60 9 -231 411 146 126 323 13 217 633 -172 -115 92 -17 -86 -335 -299
2371 -299 182 -373 -279 -39 -112 -200 116 45 619 477 -118 348 262 88 327 -42 137 95 -489 -167 194 -507
2393 -507 -271 -282 -366 -157 -191 -294 269 80 -291 180 159 327 401 -82 182 378 -164 67 278 -166 112 -127
2415 -127 -255 81 -313 -627 -128 64 -104 -21 -106 586 76 141 464 172 32 355 60 305 162 -239 -71
2436 -71 -150 -137 -333 -413 -256 260 -370 -266 283 195 184 109 36 -8 247 -103 547 229 -120 283 -322 -214 235
2459 235 -385 -549 236 -149 -337 -258 -73 238 -171 -13 433 450 52 406 37 153 158 62 26 31 -13 -301 -202
2482 -202 -173 -143 -275 -278 268 -296 -294 383 82 167 -80 324 419 60 90 495 -122 22 313 -300 -17 127 -411
2505 -411 -380 125 -342 -184 -187 -71 304 -580 99 163 279 -49 21 85 220 -163 -125 37 -45 -269 -32 -210 -302
2528 -302 -223 -519 -201 199 -289 -309 214 202 325 -261 263 513 -72 354 357 -54 108 -244 -274 -34 32 -722
2550 -722 -439 -326 -28 -96 -298 179 332 -184 -117 325 -42 85 87 313 441 224 -298 27 -267 -112 -193 -172
2572 -172 124 -22 -644 -402 -111 -358 -21 -26 428 110 -408 242 670 78 75 66 178 52 -182 -115 10 -332
2594 -332 0 -30 -404 219 -416 -406 -92 295 -150 274 341 155 120 -57 267 339 -304 54 265 -178 -96 -223
2616 -223 -252 107 -9 -387 11 159 -9 -71 -105 383 216 -137 398 293 -297 167 103 57 39 -222 -243 47
2638 47 -391 -105 -323 -216 106 -12 -471 9 50 -8 103 276 292 93 -225 217 69 -66 37 169 -153
2659 -153 -51 -18 -437 141 -172 -202 -136 57 63 -141 -97 158 132 178 324 345 25 40 -104 145 82 -93 130 -34
2683 -34 -140 -115 -91 -351 98 -40 -41 254 249 7 484 107 355 -26 -131 638 231 -266 3 17 -82 97 -311
2706 -311 -355 -63 -472 -425 134 -250 25 -2 -94 205 239 -140 75 212 137 124 -317 225 17 -61 147 -162 -174
2729 -174 -155 -263 -211 77 -256 15 -77 -91 -37 171 221 392 214 -48 92 174 -55 60 -53 248 -85 -210
2751 -210 -80 -148 -192 24 -380 -158 375 -135 -2 412 231 192 -87 -6 416 -82 -284 265 -1 -257 -108
2772 -108 -92 -136 -85 -604 -123 196 -219 -55 157 113 194 194 152 633 176 100 205 181 41 88 -69 477 -4 -107
2796 -107 -206 -492 -70 206 -314 185 247 -264 143 39 -61 321 -98 282 433 -30 -155 314 -236 -359 -45
2817 -45 -302 179 -270 -462 11 -89 -180 -290 184 133 313 -249 256 298 -123 147 -111 16 156 -70 -319
2838 -319 376 -162 -284 -196 -217 -73 -148 -24 260 139 -244 260 275 81 336 15 348 406 108 72 132 -237
2860 -237 167 60 -239 35 -222 -235 -46 -147 -81 -79 191 64 167 -120 291 -37 168 299 131 90 131 -188
2882 -188 44 169 -59 -97 -183 -141 -70 6 -334 379 85 -109 243 -76 100 548 170 283 217 213 38 16 -11
2905 -11 153 -416 -354 288 -376 -185 77 9 71 136 62 228 -58 46 388 129 15 -115 -53 235 154 -158 -93
2928 -93 -133 -262 -327 -193 -4 -25 -173 47 144 -105 -230 64 10 516 59 204 312 30 -72 -3 -17 -96 -188
2951 -188 -370 10 139 -26 -95 -40 -53 409 -151 -136 427 335 140 236 166 456 78 -129 434 105 -199 -295 -217
2974 -217 -29 -5 -331 -122 -41 -218 150 65 21 -2 -65 -68 319 55 73 111 99 120 165 -159 162 -210 -281 -165 -150
2999 -150 -420 93 -166 -165 202 57 -15 262 112 317 54 108 193 -225 -272 176 192 -265 53 -281 -76 39
3021 39 -363 142 -154 -322 -56 16 -88 233 -4 -201 472 32 10 -97 208 -31 39 -321 -7 -61 -207 19
3043 19 -125 -5 -184 -57 0 172 58 288 298 351 324 199 5 272 -23 -86 291 -151 -232 -158 38 -57 -363
3066 -363 -314 -203 -244 -113 -23 94 136 221 -19 6 314 125 380 15 -25 216 40 204 345 -57 -275 260
3088 260 138 -142 -57 -339 328 159 71 149 -66 -177 96 -271 -98 450 -138 83 59 -75 -145 41 -119 280
3110 280 -340 92 -11 -211 -308 10 33 -57 109 -126 23 230 163 158 -158 90 209 -363 -105 238 -88 -291
3132 -291 -88 92 -75 -93 -323 -63 -95 120 212 -27 50 45 -212 69 324 120 7 50 -362 -31 -392 -71
3154 -71 386 -515 -123 -20 -106 -44 -4 -58 139 18 153 170 83 171 -2 27 162 126 -141 150 -78 -224 22
3177 22 -146 -54 293 -162 -176 118 -96 128 313 -94 161 143 122 120 -52 102 155 -163 42 -98 -262 -18 108
3200 108 -286 -109 -35 -43 21 85 132 34 98 47 115 6 342 71 94 -88 376 -356 159 -5 -20 -39 -252 65
3224 65 -42 -341 -100 -93 -281 188 -186 -117 26 312 85 -32 127 124 -238 -184 107 -46 -337 -256 218 -219 -201
3247 -201 -168 -99 430 -190 -69 168 134 237 296 214 338 125 -498 -133 -23 -174 249 -200 102 -302 -232 -6
3269 -6 52 -173 231 65 -135 61 131 142 428 169 80 335 117 385 -83 6 74 21 -346 210 -27 -113 47
3292 47 -330 135 57 -11 75 112 -68 428 139 108 208 265 -110 281 3 -388 81 -208 -70 -148 -590 172 29
3315 29 12 -187 299 60 518 -16 -18 227 264 34 -154 72 233 -248 126 302 14 -209 -84 -111 -11 -303
3337 -303 -126 65 1 -133 202 196 6 -71 -28 371 240 104 12 135 -219 46 138 41 138 59 -178 -307 -40
3360 -40 2 -24 -170 178 105 -19 344 245 107 195 -129 -135 98 -218 -143 -103 -218 -211 -157 13 312 -129 -243 75
3384 75 -32 -76 31 226 154 14 109 121 302 -93 180 -47 -28 62 -89 -173 239 -167 -212 -243 -156 59 -270 -222
3408 -222 216 -16 -244 308 195 127 92 -72 169 47 -95 34 -64 -205 -45 32 -169 -67 -227 -125 57
3429 57 -53 -79 63 -40 348 34 102 269 42 -53 178 -5 40 33 -231 -329 123 -236 -207 -150 -98 13 -161 -155
3453 -155 273 88 -70 123 264 181 -194 -82 221 -19 -247 64 -142 -248 62 -189 24 26 -150 -106 -92 67
3475 67 -46 -131 15 253 -54 101 245 -2 -25 86 -237 207 -193 -450 -136 4 54 -80 -120 -69 325 21
3497 21 161 156 78 24 228 203 121 -182 -197 212 -9 -168 -156 -290 -135 -161 -402 -70 164 -163 58 69 -90 -63
3521 -63 209 197 269 12 -105 95 -154 234 91 -41 -98 260 -117 -174 -63 -278 115 238 43 258 -151 238
3543 238 264 -109 156 -12 -22 240 36 114 264 -57 47 -237 -141 100 -18 -455 325 -2 -4 3 295 280 86
3566 86 -101 108 471 -131 16 53 -172 211 75 -146 -219 -160 67 -8 -190 122 82 -259 263 31 -37 315
3588 315 133 -210 120 40 -206 61 249 -1 221 -50 66 -150 22 162 -218 -320 -82 21 -231 -103
3608 -103 14 124 -68 -559 199 41 91 300 84 35 69 -44 -33 -284 -265 -38 -148 74 250 -219 -202 -66
3630 -66 21 126 90 172 91 263 144 135 269 -37 138 -164 -223 211 44 -113 128 0 -228 16 -72 -2 -169
3653 -169 -79 162 -57 -137 311 529 61 233 -177 -135 15 6 130 -6 -52 -17 -127 -152 152 -271 -351 -34 -8
3676 -8 56 244 122 330 -35 140 228 12 -231 160 -173 -118 95 -449 26 -28 -48 -124 -113 -95 25 -220 -48
3699 -48 318 78 -34 42 -5 81 -54 -134 126 187 92 -214 -8 -309 81 -126 -312 123 -327 -57 68 145 93
3722 93 155 -40 174 -94 49 164 182 -1 23 -195 -82 -48 -355 -6 -320 -128 -114 -55 -14 107 -183 50 151
3745 151 72 167 118 33 237 139 54 39 385 -157 -142 -88 -68 -198 -322 0 -219 -55 -267 12 120 356 161
3768 161 37 209 169 -155 54 17 235 -59 -46 142 -225 -267 -102 -308 -172 -12 -192 -3 64 -67 65 207
3790 207 159 102 -6 164 152 -121 -170 46 -38 115 -181 -86 144 -98 -196 41 -16 75 -87 -16 96 -46 -33 -174
3814 -174 88 -127 47 237 -161 113 -266 31 196 50 -397 -298 -269 -197 -319 -6 1 -280 104 20 14 36 85
3837 85 -31 262 93 -172 176 22 -362 117 -64 -283 52 -67 -210 123 -34 70 -166 53 156 247 160
3858 160 147 -125 152 34 64 160 39 13 63 75 -219 -136 -40 -157 163 -75 -80 247 13 -188 -108 68 216 139
3882 139 -147 264 173 83 153 -14 -148 81 -77 67 -160 -268 -148 -99 -203 -81 24 -156 196 139 87 220
3904 220 171 49 84 -31 24 40 39 -138 -307 71 -134 -500 -208 16 -12 -309 -28 271 -12 -9 -101 149 159 -20
3928 -20 138 90 283 -75 86 10 -153 -25 37 69 -80 -62 -155 -86 -39 38 131 -121 99 20 -38 102 186 -70 -67
3953 -67 183 -19 -144 -57 -81 7 138 -189 -63 -119 -271 329 161 -134 65 -103 1 236 -123 -184 175 -160
3975 -160 -44 -212 11 328 -108 -247 -200 -224 26 31 -260 95 24 17 -121 286 -36 31 83 181 27 -154 72
3998 72 109 -99 201 21 -23 -140 127 -110 55 -210 18 -220 -124 57 291 119 31 306 209 -78 -77 -225 149
4021 149 -114 -104 92 -258 86 5 187 -401 -3 57 -102 4 -51 93 82 -21 34 -24 368 33 35 -31 -54 2
4045 2 -209 187 -60 76 -218 -472 -101 -101 -281 85 -166 76 191 195 25 324 -70 38 189 -62 -123 31
4067 31 -133 45 -233 -137 33 8 -89 -190 -88 11 150 41 165 -105 91 -51 -117 192 72 -117 -183 270
4089 270 4 71 156 -147 170 -69 -117 -107 -108 -85 3 -239 6 156 -172 101 318 38 217 -254 85 30 -74
4112 -74 -107 128 -160 -11 168 70 -55 -139 15 -124 84 80 27 -27 171 -30 50 297 132 -62 -23 201 6
4135 6 -123 -78 -95 -32 -75 -203 1 -46 -56 99 -52 -156 75 -154 113 61 41 112 105 -126 34 -145 186 -87
4159 -87 -175 -131 -59 102 -145 -69 -8 107 -115 -217 0 114 49 81 94 166 59 -25 -10 -21 -66 74 -136 15 222
4184 222 -152 67 13 -251 -61 100 -118 -48 48 99 -91 -104 265 107 110 24 27 -235 -47 70 -81 -151 -26 -96
4208 -96 138 279 209 174 180 -190 103 -142 145 -40 -33 346 -217 115 -43 102 -117 -94 -247 15 -123 -115 -33 170
4232 170 89 234 125 -35 267 -31 -98 -68 375 63 -15 -19 112 -42 -75 135 -43 11 70 -210 -7 -150 -222
4255 -222 -89 27 -32 -111 -106 69 151 202 230 182 7 17 11 5 -117 -165 -216 -40 58 -167 114 93 65 -128 -17 132
4281 132 -148 65 16 43 99 148 -68 62 259 320 -323 -51 271 1 -60 77 39 239 -123 52 74 -186 -174
4304 -174 -133 17 167 -268 178 276 -49 -30 29 139 59 -79 -166 165 -123 -150 -55 -200 92 -57 -114 153 3
4327 3 30 60 95 174 155 5 80 -141 30 95 11 87 146 39 -30 104 44 7 73 64 211 144 -173 86 74 -94 -58
4354 -58 168 46 -167 -74 154 44 -50 41 127 316 112 -4 13 292 52 5 -144 281 -107 73 -226 16
4376 16 -6 24 103 -213 151 -2 -11 -114 58 -195 150 -132 -108 122 -185 171 237 133 53 -76 33 -89 -3
4399 -3 7 -147 -58 -189 120 -408 -174 -26 -329 16 -107 34 -118 -127 -97 76 205 -255 122 -186 -1 68 67
4422 67 -29 68 -118 -172 -248 106 236 258 -227 293 -134 -110 -176 120 -1 169 272 110 4 -10 117 261 -169
4445 -169 75 -115 -142 -105 -47 6 -4 -161 7 21 -75 -90 165 -328 11 16 -66 181 168 161 107 -112 -61 116 -237
4470 -237 -121 214 -228 81 -33 -86 -66 -84 44 142 -168 -125 155 -210 297 68 -68 46 88 35 215 29
4492 29 -15 30 -258 35 -418 69 -26 -142 -332 -26 25 -178 37 -60 235 164 84 -44 -23 -19 -30 111 58 75 71
4517 71 -76 -54 -364 -46 110 109 -57 68 93 96 -35 -206 160 56 42 42 -4 14 217 -78 -5 -128 93 123 -45
4542 -45 -149 84 190 -87 -22 43 -180 175 10 -26 -64 -245 118 123 -193 -32 88 85 89 -88 213 73 186 -199
4566 -199 7 -30 32 96 34 339 39 -159 81 334 174 97 -34 -94 285 -29 103 -170 -76 21 63 -159 240
4589 240 -217 -128 208 -43 -109 -39 65 265 165 94 121 -134 -22 0 52 -170 69 -155 -33 -40 74 -5 4 -355
4613 -355 240 137 -180 63 -29 46 -5 106 210 -30 94 14 132 -99 -78 -195 -90 -142 58 -250 143 93
4635 93 -289 80 -156 180 55 -135 61 71 33 238 -102 3 -27 -82 78 29 -78 64 47 35 273 -43 68
4658 68 201 -103 -119 55 147 254 165 13 -3 167 25 92 -164 146 41 -181 40 10 113 -13 -130 42
4680 42 -4 -66 -29 -146 -106 -13 196 -224 17 166 15 -64 30 -276 80 -196 -96 -8 -68 5 3 -37 -126 230 1
4705 1 309 57 73 55 -38 172 130 308 -77 52 -4 -389 -10 -17 -4 47 40 118 145 242 -62 -198 252 27 24 50
4731 50 -88 92 375 101 -5 -28 6 -2 8 247 193 -294 67 -66 164 161 -11 -6 -56 95 52 13 -29 -175 -49
4756 -49 141 -86 9 28 182 72 -140 -1 228 37 -175 -176 -198 -241 146 -60 26 325 49 -9 65 -92 230
4779 230 -11 83 -42 -27 -87 -116 -311 -1 79 -25 -68 -177 -237 46 -182 -15 -40 89 167 75 38 136 174 -92
4803 -92 -43 -169 200 171 7 -216 -57 -6 100 -24 77 -132 -76 -170 -93 -28 228 96 -236 168 110 -46 -132
4826 -132 40 -229 -69 -42 97 83 105 125 -74 -57 -97 107 -221 -26 -83 19 113 211 23 102 -70 83 189
4849 189 -99 -151 316 11 -149 23 0 143 49 -68 -63 -27 13 12 -67 18 160 -247 -116 43 -102 218 -41 -155
4873 -155 -254 -160 -35 45 2 -356 -67 1 -225 -8 44 52 -28 -58 417 3 221 48 -97 115 256 92 61 305
4897 305 51 56 -207 -209 -137 -45 -39 136 166 -207 135 46 276 -55 51 -84 -24 178 -187 -68 -3 -57 -101 -21 -5
4922 -5 -104 -120 175 -286 102 17 -86 149 -97 -144 210 247 -65 -62 42 125 -42 -106 -20 25 -167 -16 -190 -211 -106
4947 -106 -13 133 -177 149 -65 221 10 68 168 116 63 222 -23 91 -134 27 -295 -77 56 -161 -160 -70
4969 -70 -53 -129 57 -137 69 318 -158 91 42 298 -27 -37 -16 -165 176 -108 306 7 125 -157 -93 43
4991 43 -75 -253 196 -51 -7 156 -192 -70 94 -265 162 234 -25 324 191 -116 4 -9 38 -236 28 56
5013 56 -111 -59 19 132 23 -71 231 25 -93 -4 96 -37 -126 -62 169 -200 114 -127 -52 -187 259 -145 -113
5036 -113 -24 -108 95 -16 -220 104 -192 126 128 173 165 36 162 111 -57 -130 110 -154 -72 -174 -170 -90 -34 -102 -168
5061 -168 158 -206 -132 138 -139 186 16 225 -52 -98 279 87 -56 -111 32 -1 -147 -169 -32 58 -69 -49
5083 -49 135 79 342 49 -162 171 -100 308 120 76 -188 87 -162 -27 -109 17 -146 -14 -311 -128 6
5104 6 79 242 -231 31 -83 53 164 -33 -123 358 -85 -33 -21 69 47 -125 53 -18 -109 -178 78 159 -148 -69
5128 -69 202 -58 38 -95 -115 141 -151 166 -223 80 157 145 -353 21 -121 -116 -61 14 -93 108 -91 33 41 237
5152 237 247 -63 -129 66 -40 -90 145 -22 118 55 -68 27 6 -101 43 26 106 -20 -120 -33 131 141 -72
5175 -72 -93 -194 20 276 -39 90 67 150 88 -42 -169 0 -47 -127 -108 -125 -206 -239 -256 -69 -124 102 143 -40 -10
5200 -10 162 20 -72 102 68 72 -14 -248 202 160 -102 102 -6 68 -99 -116 95 -96 123 -136 95 217 34
5223 34 126 -133 151 191 13 -57 -151 -73 119 18 -69 -269 -85 108 -168 -15 -59 126 184 163 -55 -63 137 -84
5247 -84 -341 4 103 277 121 -278 -150 99 -218 104 -99 -67 184 -123 -86 -16 -223 -83 287 23 14 29 -131
5270 -131 359 -76 114 263 -155 -234 99 -96 132 108 17 -20 -27 -80 -201 -27 -136 18 114 -123 83 123 94
5293 94 83 42 -302 -210 -37 34 -237 -160 -115 -59 -211 -116 -266 210 -39 -351 106 -116 -150 119 -55 -124 45 -97
5317 -97 159 -104 -61 6 -156 -51 34 9 -290 -17 -177 44 29 -176 2 -22 72 259 221 -22 85 173 123 127
5341 127 -1 165 47 162 71 31 4 -138 -5 -29 241 174 -116 20 64 211 49 -60 -71 121 -138 -176 -27
5364 -27 -52 -16 -93 -47 -50 117 -13 44 -262 57 201 -80 -14 -168 151 201 -138 265 239 -18 126 -99 -18 -54
5388 -54 -4 -273 137 -74 -44 -47 29 71 -102 -38 59 132 -119 70 -93 -43 90 9 172 -41 -192 4 -260 45
5412 45 -315 97 -166 -117 -302 -120 95 53 287 134 -94 -482 -124 -168 289 -21 146 85 96 118 -86 174
5434 174 -323 64 21 82 119 -134 154 316 53 16 -228 -94 155 75 52 91 -201 21 -219 79 -143 -83 -289
5457 -289 66 93 -56 140 64 -361 -25 183 119 102 -22 30 -98 82 20 -246 -13 142 -93 -91 -77 -234 -115
5480 -115 -105 61 -39 127 -188 99 56 48 -24 115 27 228 23 -43 195 -315 -158 26 18 35 125 -44 43 97
5504 97 111 -230 189 141 62 136 92 -23 -48 102 22 150 147 -10 4 98 150 101 67 30 -204 12 1 28 -74 -151
5530 -151 -72 31 29 99 8 -103 32 -141 -102 187 97 73 -11 -179 116 223 -60 111 -90 -72 -141 -86 -57 9 -141
5555 -141 261 -18 68 221 -36 304 119 141 50 50 -95 231 -302 -119 -21 -123 -145 245 62 -82 178 43
5577 43 92 148 -39 -207 106 122 25 -3 300 102 -45 56 -108 -101 -136 -87 20 103 -73 -67 -84 -158 -68 119 2
5602 2 -68 388 -159 270 -119 24 -43 8 -196 80 213 30 82 -49 160 -5 -180 -57 29 92 15 10 -78 251
5626 251 76 315 56 -117 -99 -149 -252 -140 125 -52 -41 130 132 -109 -53 73 52 -258 145 151 -59 57 -111
5649 -111 -166 73 121 16 16 -242 10 67 -102 -23 55 -147 -255 -226 -140 19 197 55 24 24 174 51 131 238
5673 238 -49 -135 209 -28 -100 -59 9 318 -210 134 -8 -207 48 64 128 -112 -80 -29 180 200 -137 11 3 -102
5697 -102 139 318 -12 -25 -98 -295 108 -33 -110 140 115 83 143 -40 95 49 79 126 -302 163 -4 145 -189
5720 -189 69 123 118 -45 -90 -3 -183 -71 59 -91 -218 123 -25 -69 -39 -15 119 88 -101 68 146 -142 78
5743 78 11 54 51 253 -119 -98 83 42 137 40 -74 -14 40 126 360 62 49 142 14 -120 85 173 56 -52 110
5768 110 -105 -187 -329 70 -172 27 -36 5 28 -135 28 -49 133 116 -107 109 32 69 275 -88 -84 -62 98 -231
5792 -231 -26 -61 189 -82 -108 -42 54 74 -181 -14 -173 -20 -34 33 174 -138 -72 -28 -114 227 -10 -90 108 51
5816 51 -139 53 -74 -42 244 65 9 226 101 291 -243 26 235 -66 164 29 23 -80 91 15 37 3 -191
5839 -191 -62 128 -402 69 107 291 199 97 -60 313 167 -94 375 14 19 -40 -87 -9 -35 -99 -160 -116 -342 -25
5863 -25 -42 -29 -60 142 -140 132 41 -101 138 127 169 95 -498 225 -108 -320 -151 -34 -179 148 -37 -8 -134
5886 -134 249 -43 63 72 177 205 -64 39 77 8 137 19 -245 305 -9 -269 41 -242 27 186 -98 -11
5908 -11 -24 -318 -264 -70 -19 31 -10 59 66 54 145 0 -125 -55 76 -272 131 -242 -70 -178 -76 -181 -42 -103
5932 -103 -93 18 -52 24 23 -168 -61 66 100 -90 -251 15 -32 24 99 169 -134 7 -23 -178 -27 -321 108 -110
5956 -110 92 286 105 253 228 -25 -42 155 -62 53 59 -96 23 92 -67 -2 30 136 -24 164 -264 1
5978 1 -119 345 170 344 17 162 36 -252 124 120 136 133 -61 44 -9 -94 79 -200 -168 -189 -83 73 -33 -82
6002 -82 112 268 52 35 280 217 -61 94 38 -160 213 -168 257 -156 -109 -10 -112 -93 -181 -230 -22 -74 92
6025 92 87 17 216 -47 213 -95 102 -41 245 142 -12 376 -85 27 -79 -79 73 -217 -123 97 252 -35
6047 -35 -171 -78 395 215 -275 167 125 -150 4 147 36 22 -160 -136 119 -56 306 223 100 28 -96 -94 120
6070 120 -78 163 62 165 -12 147 118 -109 46 21 -49 -153 -113 -33 234 -109 -199 -111 52 46 268 -111 264
6093 264 111 100 116 19 87 137 347 47 45 79 115 -169 4 -53 -174 67 111 -104 -22 -7 -208 84 -126 99
6117 99 76 22 16 157 78 -266 -10 -334 150 166 -147 -141 -76 -211 41 96 109 36 36 -7 -56 -186 35 90 81 26 -117
6144 -117 -34 47 -96 38 -183 -117 13 191 -99 -75 -393 88 9 63 116 234 212 -124 123 42 196 -36 -48
6167 -48 102 -222 -32 162 -168 43 -217 106 -57 250 -53 11 -206 -98 137 305 191 120 100 50 145 43
6189 43 14 295 -220 58 94 67 78 -250 25 77 4 -27 48 -111 -92 111 -45 -35 274 173 -84 35 -10 117
6213 117 30 -282 292 -49 -109 -79 -303 -75 -229 -62 -23 -77 157 -192 -242 25 387 -43 194 218 -161 -176 -141
6236 -141 108 -9 144 -45 -45 -16 -76 12 -252 -18 21 -92 159 44 76 -153 161 148 36 -130 -140 -29 79
6259 79 25 -57 -10 -88 177 106 103 -36 -32 -119 180 99 158 138 72 67 98 76 136 35 -1 42 0 176 -83 -37 53 -63
6287 -63 -118 51 31 178 130 -283 190 -3 -143 -57 102 76 106 -9 149 -65 -7 -122 -121 144 -50 -131 19 -54
6311 -54 -149 127 157 -267 -25 -188 258 223 99 107 296 -167 125 -128 -95 249 95 -62 -198 -107 -181 -62 15
6334 15 175 -108 -143 100 246 -151 158 -53 71 43 242 -18 -79 144 14 -112 -159 -71 -211 -328 -218 -37
6356 -37 -41 -37 68 -24 240 177 201 5 -4 195 -6 261 -108 51 52 -87 -117 -36 -72 50 1 -126 27 36 -137 -74
6382 -74 -20 130 131 166 -88 -140 23 -27 -127 -184 183 -177 55 -26 -213 -93 -112 -241 177 -27 -263 -16 -114 97
6406 97 160 60 -189 34 -26 -93 264 -97 -19 -40 12 -269 -38 -152 -131 100 9 23 144 -137 -237 141 -40
6429 -40 144 -62 -88 -118 48 -238 163 -134 -244 -15 182 7 -38 71 -34 24 -72 -48 38 -111 147 -34 -61
6452 -61 254 -96 190 172 368 47 106 -266 113 -11 244 33 54 110 -99 64 -123 106 93 128 154 109 -151
6475 -151 161 36 -46 190 -148 348 -206 -165 91 141 -198 34 -38 -119 -199 32 -58 -20 198 39 -172 -274 289
6498 289 121 43 -164 123 -91 -134 -237 123 81 -46 -26 214 -113 60 -117 55 185 50 -13 29 22 157 -39
6521 -39 -261 -226 91 -197 38 -152 -114 159 48 -13 -18 -102 -253 63 -220 8 197 -97 26 -153 165 267
6543 267 -411 40 227 37 -55 13 164 -36 282 -102 46 -149 17 -54 183 -2 -65 75 63 4 19 280
6565 280 -145 -63 -84 132 125 79 -52 -66 92 87 301 9 -152 66 -117 55 12 -46 52 301 -156 99 16 -134
6589 -134 32 -98 217 200 -62 51 -215 29 -210 191 -159 218 153 -138 202 103 109 -35 -63 150 277 49
6611 49 -169 -31 74 274 -23 -168 -17 -52 107 41 -5 194 32 -133 -39 52 -110 69 157 -76 9 -24 -20 -46
6635 -46 -175 -222 200 -15 -9 218 -72 -270 -265 -161 163 26 -301 7 233 28 147 270 -61 142 -65 137
6657 137 0 -125 -7 74 -140 174 -136 7 -67 -157 26 -98 -115 -17 -27 24 101 183 39 39 54 105 101 -78 139
6682 139 2 -2 188 102 -164 169 122 290 124 -210 193 -78 302 62 5 -46 85 293 125 272 -49 -40 138
6705 138 67 54 -7 -44 57 38 15 -151 324 -194 48 140 -80 223 140 -108 132 147 164 -23 170 279 101
6728 101 -121 -33 180 68 -179 61 -58 395 -114 49 118 -69 -158 188 -94 -99 -125 285 100 -183 20 -42
6750 -42 -6 103 90 -182 -86 278 276 60 -67 -286 66 -84 -32 -63 36 19 -23 -19 158 -40 185 63 -70 62
6774 62 49 -102 -98 66 171 -6 -232 25 -71 -71 -74 249 -76 148 -109 -146 -16 -303 121 -54 -98 -46 166 -483
6798 -483 -121 -154 -109 -235 5 -45 68 41 251 -64 51 110 136 -5 -152 93 59 187 208 3 -242 264 130
6821 130 165 -2 120 114 -18 24 17 5 159 148 242 259 23 390 133 7 44 40 -105 -155 -213 -121 -98 -180 64 36
6847 36 -129 -63 116 118 13 204 -121 6 265 33 49 236 34 121 -71 3 158 -49 42 18 -141 50 41 -17
6871 -17 -82 210 89 197 -111 -15 172 143 211 -85 -59 195 101 -240 170 52 105 169 -35 -259 -108 -146 -319
6894 -319 -100 92 111 -9 -393 -28 -68 329 -13 -85 -133 32 -38 -229 -416 80 -126 -64 -59 -288 227 -179 133
6917 133 97 -223 -107 7 28 41 -222 4 234 187 180 14 -115 -154 -156 -90 -96 11 114 -30 -24 4 168 -50 225
6942 225 25 58 223 73 -28 230 189 -124 0 99 10 341 -26 -29 -99 -5 4 21 -215 284 -103 -33 126 -225
6966 -225 116 364 -44 129 13 219 123 -30 132 151 -92 137 -57 23 210 -124 -16 -188 292 107 -123
6987 -123 -78 -96 -118 124 -159 -4 -181 255 -49 32 34 -72 160 -71 41 -73 -83 98 -68 -90 44 -31 -28 -59
7011 -59 161 108 -42 130 113 137 148 68 -163 -30 180 45 -153 -381 51 -431 228 -100 126 160 66 34 -166
7034 -166 56 -144 159 -167 156 26 226 119 201 -22 -54 -76 -381 114 196 -130 -2 273 18 57 180 6
7056 6 -18 276 -8 154 108 -16 -15 -127 -115 -9 -158 -8 -483 -234 228 -70 -253 -14 90 -111 1 98 95
7079 95 245 -24 -23 -88 107 124 -83 -218 -124 -45 -96 9 -161 -323 -160 17 135 197 -82 62 99 45 -35 -122
7103 -122 -52 163 -8 -227 -73 266 -6 -1 47 95 -163 144 263 -164 147 32 -257 7 36 -132 -84 -145 92
7126 92 -58 -71 -41 -36 -80 -229 52 -49 176 133 -106 55 -43 66 40 -96 32 -11 88 54 -165 -82 190 18
7150 18 -170 230 193 -159 208 -300 -44 -8 -353 81 10 -80 -230 -1 47 -156 214 -40 -48 -103 256 -80 37
7173 37 158 140 -214 201 -210 -130 -134 -140 -6 123 374 -257 -217 211 51 70 4 68 -53 -45 132 -104 6 197
7197 197 208 -131 -76 -150 36 57 -305 -233 234 -49 -138 -4 -197 -73 24 276 149 30 189 -92 -82 1 -14
7220 -14 -231 73 128 10 77 -215 49 11 -148 44 48 -42 33 -76 0 -225 18 59 -53 156 -104 -155 -54 -199
7244 -199 -84 -105 -211 -144 150 -49 91 6 279 116 154 16 -105 50 130 140 66 -191 -25 -20 -154 79 -60
7267 -60 -186 133 67 -187 -213 148 -133 -19 -125 -2 -1 -147 113 145 -21 90 258 -72 353 144 -55 113
7289 113 -24 10 20 -154 16 -114 -50 -166 -134 -177 14 292 -67 107 133 -141 151 1 -133 258 -24 14
7311 14 203 -75 -50 1 2 -19 -29 -196 286 -43 215 87 13 -12 -59 99 18 -129 -73 -23 -425 -94 -73 -261 15
7336 15 12 -459 -99 -175 -30 -232 126 -50 -70 -24 -127 148 -19 -68 -98 -110 -89 106 -40 48 192 -211 68 -37
7360 -37 136 -34 -12 -118 136 -167 134 -92 -162 34 -50 8 61 34 39 -121 11 -96 11 233 22 55 295
7383 295 -20 -28 -86 181 -133 27 370 -37 119 115 -259 35 191 -15 -16 -204 14 2 83 -183 -277 -115 43
7406 43 12 -32 81 48 -76 -12 -63 198 3 -6 140 58 -84 24 25 -91 -8 -3 -83 -47 -111 183 -23 -42 27 2 132
7433 132 14 158 74 230 37 -58 204 -169 70 131 67 -115 -35 110 55 -58 99 -159 -198 178 92 -217 -332
7456 -332 202 163 -194 23 68 93 -55 41 118 133 39 80 52 -70 112 23 -9 105 -86 191 41 -137 178 55
7480 55 -186 -183 -94 78 -123 -10 4 -87 -265 138 103 182 -84 3 137 118 -116 -204 198 44 -5 315 -50 -9
7504 -9 37 -131 137 -53 -273 -100 41 2 -138 -42 167 151 -186 129 -148 203 -143 106 91 183 -225 243 -303
7527 -303 -12 -146 11 32 -112 5 -111 -192 106 79 -37 -317 -90 95 -86 -250 -218 -85 -133 218 -295 159
7549 159 69 -155 121 61 4 54 13 169 73 -48 -112 -6 -164 -48 124 -45 -184 27 21 -71 174 -40 143
7572 143 -9 112 -85 -217 91 103 57 101 -103 103 -17 -77 -169 -148 -211 105 184 23 45 103 87 39 50 54 68
7597 68 59 147 -222 -187 43 -197 -74 -283 55 15 162 78 -53 108 -29 167 90 -14 104 53 56 -252 -339 -126
7621 -126 197 -173 83 85 -116 -102 -50 2 91 30 -219 -77 -126 -102 39 -118 43 68 17 63 -265 178 14 152
7645 152 -248 -119 -166 -381 -116 -126 90 -150 -114 -95 54 121 -48 70 -95 107 223 10 -77 146 -167 -80
7667 -80 -73 -8 0 -62 116 22 -165 78 -133 50 323 -22 -231 20 -96 254 -92 -70 -16 -183 -3 40 46 31 -205
7692 -205 32 35 -165 -79 -199 107 -137 -92 185 17 96 72 -104 98 -60 -147 -23 -182 -171 -152 -50 292 -154
7715 -154 -261 -139 -94 -40 188 -19 -92 14 21 -33 24 83 71 -242 -92 276 -320 -4 -245 -127 63 143 161 86
7739 86 179 -161 139 -228 45 183 -43 -44 -54 -32 -16 47 -268 43 -72 -30 -71 121 -189 -100 -78 104 257 -69
7763 -69 172 18 -153 76 -52 198 13 13 -100 219 41 146 117 154 30 93 -129 77 -133 -78 61 -76
7785 -76 -49 -79 72 21 244 -104 -44 -155 -73 154 297 -46 -9 134 -46 -153 44 21 -140 -352 -134 -23 -253
7808 -253 -71 123 29 94 -49 -68 12 -110 215 120 -202 19 -282 -150 -113 -118 20 -139 -75 24 -52 -129 12 30
7832 30 -278 -100 -25 -111 166 60 -11 -29 358 24 -183 -49 167 49 -71 59 -67 -234 -110 17 61 267
7854 267 -250 -55 -46 223 157 34 -8 62 315 -24 101 114 -34 77 106 146 -238 -85 -73 -102 -221 -248 81 -227
7878 -227 -13 104 55 98 -44 12 -31 106 -30 -51 -297 -86 294 -143 10 -17 -128 -202 35 48 338 0 -282
7901 -282 -98 -60 -44 230 -134 199 -184 153 -67 -10 -71 -42 -96 201 -36 173 -27 -12 4 191 -54 -175 152
7924 152 -168 -28 6 -145 176 1 61 149 39 -106 29 -42 60 -24 -168 -207 -150 -102 -232 86 43 -57 154
7947 154 65 -31 117 -88 56 -72 29 -26 19 133 261 135 -104 55 79 -120 38 -125 -137 -94 -201 -154 -4
7970 -4 74 -61 -92 -53 -121 163 -29 -169 -56 154 100 -234 -199 -28 32 -133 55 116 160 -208 -4 153 122 178
7994 178 228 145 36 66 0 212 58 -167 -136 -145 -150 105 72 -14 -175 -54 -47 -32 -227 6 -162 -4 -9 -70 37 -30
8020 -30 15 -156 -118 -6 4 -82 -168 276 67 -175 200 -41 107 33 32 116 49 90 -86 44 225 198 211 117 -84
8045 -84 85 73 -135 -10 74 -92 -161 -9 33 188 -3 15 68 -31 -13 -162 -108 88 210 185 303 270 -33 -128
8069 -128 -43 84 175 -186 -217 39 87 -12 244 33 -239 -5 249 115 -115 183 141 85 -152 93 -56 21 40
8092 40 -35 164 -134 -141 22 74 -131 -85 -144 205 -110 96 -143 -217 -148 -31 -55 163 299 194 -24 213 -4
8115 -4 -3 -80 -103 161 106 -42 -173 70 -3 -6 214 -29 0 215 -177 -12 -24 -278 77 121 96 -120 -49 -141 92
8140 92 -98 238 22 255 -10 -242 -116 394 142 -206 -109 13 7 -33 74 53 -139 152 13 -151 -33 269
8162 269 -37 -71 3 12 276 56 -77 -26 -63 9 168 101 -284 17 94 5 -283 11 49 -71 -176 162 47 20
8186 20 -54 -105 31 63 -192
8191a92
##END NTUPLES=NMR FID
##END=
