##TITLE=1H_Ser 3511-Leu
 CDCl3, 8 sc, 
 25.6.2019
##JCAMPDX= 6.0         $$ Bruker NMR JCAMP-DX V2.0
##DATA TYPE= NMR FID
##DATA CLASS= NTUPLES
##ORIGIN= UXNMR, Bruker Analytische Messtechnik GmbH
##OWNER= root
$$ XWIN-NMR		Version 3.5
$$ Tue Jun 25 14:26:29 2019 Russian Standard Time (UT+4h)  she@DPX200
##.OBSERVE FREQUENCY= 200.13155
##.OBSERVE NUCLEUS= ^1H
##.DELAY= (6, 6)
##.ACQUISITION MODE= SIMULTANEOUS
##.ACQUISITION SCHEME= undefined
##.AVERAGES= 8
##.DIGITISER RES= 18
##SPECTROMETER/DATA SYSTEM= spect
##.PULSE SEQUENCE= zg30
##.SOLVENT NAME= D2O
##.SHIFT REFERENCE= (INTERNAL, D2O, 0, 15.7039)
##AUDIT TRAIL= $$ (NUMBER, WHEN, WHO, WHERE, WHAT)
$$ ##TITLE= Audit trail, XWIN-NMR		Version 3.5
$$ ##JCAMPDX= 5.01
$$ ##ORIGIN= Bruker BioSpin GmbH
$$ ##OWNER= she
$$ F:/spectra/data/she/nmr/H-F/1/audita.txt
$$ ##AUDIT TRAIL=  $$ (NUMBER, WHEN, WHO, WHERE, WHAT)
(   1,<2019-06-25 14:25:10.14 +0400>,<she>,<DPX200>,
      <created by zg, POWCHK disabled, PULCHK disabled
       configuration hash MD5:
       00 E9 B6 7A A2 85 ED C7 34 08 36 98 17 FE 4E 26
       data hash MD5: 16K
       25 BF FC A9 8B 0A 8F 37 97 45 AB EC D5 D2 1F F2>)
$$ ##END=
$$ 
$$ hash MD5
$$ D9 C2 88 FE FA E2 58 41 95 BD 26 60 AD DB 96 75
##$RELAX= 
##$RELAX= 
##$RELAX= 
##$RELAX= 
##$RELAX= 
##$RELAX= 
$$ Bruker specific parameters
$$ --------------------------
##$DU= <F:/spectra>
##$EXPNO= 1
##$NAME= <H-F>
##$PROCNO= 1
##$TYPE= <nmr>
##$USER= <she>
##$AMP= (0..31)
100 100 100 100 100 100 100 100 100 100 100 100 100 100 100 100 100 100 
100 100 100 100 100 100 100 100 100 100 100 100 100 100 
##$AQSEQ= 0
##$AQ_mod= 1
##$AUNM= <au_zg>
##$AUTOPOS= <>
##$BF1= 200.13
##$BF2= 200.13
##$BF3= 200.13
##$BF4= 200.13
##$BF5= 200.13
##$BF6= 200.13
##$BF7= 200.13
##$BF8= 200.13
##$BYTORDA= 1
##$CFDGTYP= 0
##$CFRGTYP= 5
##$CHEMSTR= <none>
##$CNST= (0..31)
1 1 145 1 1 1 1 1 1 1 1 1 1 1 1 1 1 1 1 1 1 1 1 1 1 1 1 1 1 1 1 1 
##$CPDPRG= <>
##$CPDPRG1= <>
##$CPDPRG2= <>
##$CPDPRG3= <>
##$CPDPRG4= <mlev>
##$CPDPRG5= <mlev>
##$CPDPRG6= <mlev>
##$CPDPRG7= <mlev>
##$CPDPRG8= <mlev>
##$CPDPRGB= <>
##$CPDPRGT= <>
##$D= (0..31)
0 1.2 0 0 0 0 0 0 0 0 0 0.03 0 0 0 0 0 0 0 0 0 0 0 0 0 0 0 0 0 0 0 0 
##$DATE= 1561458309
##$DBL= (0..7)
120 120 120 120 120 120 120 120 
##$DBP= (0..7)
150 150 150 150 150 150 150 150 
##$DBP07= 0
##$DBPNAM0= <>
##$DBPNAM1= <>
##$DBPNAM2= <>
##$DBPNAM3= <>
##$DBPNAM4= <>
##$DBPNAM5= <>
##$DBPNAM6= <>
##$DBPNAM7= <>
##$DBPOAL= (0..7)
0.5 0.5 0.5 0.5 0.5 0.5 0.5 0.5 
##$DBPOFFS= (0..7)
0 0 0 0 0 0 0 0 
##$DE= 6
##$DECBNUC= <off>
##$DECIM= 24
##$DECNUC= <off>
##$DECSTAT= 4
##$DIGMOD= 1
##$DIGTYP= 9
##$DL= (0..7)
0 120 120 120 120 120 120 120 
##$DP= (0..7)
150 150 150 150 150 150 150 150 
##$DP07= 0
##$DPNAME0= <>
##$DPNAME1= <>
##$DPNAME2= <>
##$DPNAME3= <>
##$DPNAME4= <>
##$DPNAME5= <>
##$DPNAME6= <>
##$DPNAME7= <>
##$DPOAL= (0..7)
0.5 0.5 0.5 0.5 0.5 0.5 0.5 0.5 
##$DPOFFS= (0..7)
0 0 0 0 0 0 0 0 
##$DQDMODE= 0
##$DR= 18
##$DS= 0
##$DSLIST= <SSSSSSSSSSSSSSS>
##$DSPFIRM= 0
$$ [...]
##$SUBNAM2= <"">
##$SUBNAM3= <"">
##$SUBNAM4= <"">
##$SUBNAM5= <"">
##$SUBNAM6= <"">
##$SUBNAM7= <"">
##$SUBNAM8= <"">
##$SUBNAM9= <"">
##$SW= 24.9336996594482
##$SWIBOX= (0..15)
0 0 2 0 0 0 0 0 0 0 0 0 0 0 0 0 
##$SW_h= 4990.01996007984
##$TD= 16384
##$TD0= 1
##$TE= 0
##$TE2= 300
##$TE3= 300
##$TEG= 300
##$TL= (0..7)
0 120 120 120 120 120 120 120 
##$TP= (0..7)
150 150 150 150 150 150 150 150 
##$TP07= 0
##$TPNAME0= <>
##$TPNAME1= <>
##$TPNAME2= <>
##$TPNAME3= <>
##$TPNAME4= <>
##$TPNAME5= <>
##$TPNAME6= <>
##$TPNAME7= <>
##$TPOAL= (0..7)
0.5 0.5 0.5 0.5 0.5 0.5 0.5 0.5 
##$TPOFFS= (0..7)
0 0 0 0 0 0 0 0 
##$TUNHIN= 0
##$TUNHOUT= 0
##$TUNXOUT= 0
##$USERA1= <user>
##$USERA2= <user>
##$USERA3= <user>
##$USERA4= <user>
##$USERA5= <user>
##$V9= 5
##$VALIST= <valist>
##$VCLIST= <CCCCCCCCCCCCCCC>
##$VD= 0
##$VDLIST= <DDDDDDDDDDDDDDD>
##$VPLIST= <PPPPPPPPPPPPPPP>
##$VTLIST= <TTTTTTTTTTTTTTT>
##$WBST= 1024
##$WBSW= 4
##$XGAIN= (0..3)
0 0 0 0 
##$XL= 0
##$YL= 0
##$YMAX_a= 119491
##$YMIN_a= -251293
##$ZGOPTNS= <>
##$ZL1= 120
##$ZL2= 120
##$ZL3= 120
##$ZL4= 120
##$ABSF1= 10
##$ABSF2= 0
##$ABSG= 5
##$ABSL= 3
##$ALPHA= 0
##$AQORDER= 0
##$ASSFAC= 0
##$ASSFACI= 0
##$ASSFACX= 0
##$ASSWID= 0
##$AUNMP= <proc_1d>
##$AZFE= 0.1
##$AZFW= 0.1
##$BCFW= 1
##$BC_mod= 2
##$BYTORDP= 1
##$COROFFS= 0
##$CY= 11.3945322036743
##$DATMOD= 1
##$DC= 2
##$DFILT= <>
##$DTYPP= 0
##$F1P= 18.9103706918063
##$F2P= -1.10871071338519
##$FCOR= 0.5
##$FTSIZE= 0
##$FT_mod= 4
##$GAMMA= 1
##$GB= 0.15
##$INTBC= 1
##$INTSCL= 1
##$ISEN= 128
##$LB= 0.24
##$LEV0= 0
##$LPBIN= 0
##$MAXI= 10000
##$MC2= 0
##$MEAN= 0
##$ME_mod= 0
##$MI= 1.114404
##$NCOEF= 0
##$NC_proc= 0
##$NLEV= 6
##$NOISF1= 3.799351
##$NOISF2= 2.8
##$NSP= 1
##$NTH_PI= 0
##$NZP= 0
##$OFFSET= 15.70392
##$PC= 1
##$PHC0= -8521.843
##$PHC1= 43.40097
##$PH_mod= 1
##$PKNL= yes
##$PPARMOD= 0
##$PSCAL= 0
##$PSIGN= 0
##$REVERSE= no
##$SF= 200.130013532006
##$SI= 16384
##$SIGF1= 3
##$SIGF2= 2
##$SINO= 400
##$SIOLD= 16384
##$SREGLST= <1H.CDCl3>
##$SSB= 0
##$STSI= 0
##$STSR= 0
##$SW_p= 3612.71676300578
##$SYMM= 0
##$S_DEV= 0
##$TDeff= 0
##$TDoff= 0
##$TI= <>
##$TILT= no
##$TM1= 0
##$TM2= 0
##$TOPLEV= 0
##$USERP1= <user>
##$USERP2= <user>
##$USERP3= <user>
##$USERP4= <user>
##$USERP5= <user>
##$WDW= 1
##$XDIM= 8192
##$YMAX_p= 0
##$YMIN_p= 0
$$ End of Bruker specific parameters
$$ ---------------------------------
##NTUPLES= NMR FID
##VAR_NAME=  TIME,          FID/REAL,        FID/IMAG
##SYMBOL=    X,             R,               I
##VAR_TYPE=  INDEPENDENT,   DEPENDENT,       DEPENDENT
##VAR_FORM=  AFFN,          ASDF,            ASDF
##VAR_DIM=   8192,          8192,            8192
##UNITS=     SECONDS,       ARBITRARY UNITS, ARBITRARY UNITS
##FACTOR=    0.0002004,     1,               1
##FIRST=     0,             0,               0
##LAST=      1.6414764,     0,               0
##MIN=       0,             -251293,         0
##MAX=       1.6414764,     119491,          0
$$ Real data points
##PAGE= N=1
##DATA TABLE= (X++(R..R)), XYDATA
0@%%%%%qJ6j6J6j8K6l3M1n6O6p6R3j15J37j58J86k19K56k96L40l90M47n11N76
29C04o49P38q34R33j043J166j301J450j614J792j985K198k435K698k987L306l663
46a926M065m522N042n639O336p165Q170r410J0986j3079J6005k0413K7909m3968
60b7609J38081j43336j40862K89117o5701r2398J20812k8958j56404J20692N6180
71F9614r3417L8737J5063j22184R8907Q7701j64805J3040J76835j52406j09011
82a41926K20732J375j98227J14079Q7043j74920L6036J56921j12248n8365R9763
93C0263o5303j8815J51860p9177j43007J42022M1310j39360J01449P7687j99932
104a01003J6434K02144j01020j05928J38624l0168j10105J30482K7669j44331
$$ plain form
0 0 0 0 0 0 0 -8 8 -8 8 -10 16 -17 24 -32 34 -42 51 -64 73 -85 101 -118 138 -158 182 -208 239 -272 304
29 304 -345 393 -441 492 -551 615 -686 764 -850 942 -1043 1155 -1280 1418 -1569 1737 -1926
46 -1926 2139 -2383 2659 -2980 3356 -3809 4361 -5049 5937 -7142 8863 -11550 16359 -27609
60 -27609 110472 -32864 -173726 115391 49690 -42708 78104 49146 -107258 13434 69614
71 69614 -23803 14934 29997 -92187 6720 94421 -70384 -57344 119491 -32915 -141926
82 -141926 78806 80181 -118046 -3967 83076 -91844 -55808 101113 -11135 -69500 30263
93 30263 -35040 -53855 98005 18828 -124179 17843 59153 -80207 21242 98929 -101003
104 -101003 -84569 117575 16555 -89373 49251 19083 -91022 39460 67129 -77202
114g7202O9531P2133j28550M0610J10364j31373j9142J57924r9238j10359J77225
125F1923J2775j66832Q7591P1909j45895N2878J34825j39079o0114J39404m2272
136G113n9552J16509n3215j20772J36431M6906j48109O6464Q4756j53691K0399
147e6761J63506j17780q8354J65591k6418j41674J18155N7022j34504M9619P4978
158F3380j23162K1889J24640r7061m6570J12528o9931o3135J61473k1310j71757
169a09016R9793R2046j37022L6014J19399j39928n4651J64138k7943r9851Q8086
180C1065j0023r4809J00681L7970j24760N4666P4037j34310J8249J48770j04710
191c174q4049J45050k9853j26993J28731O1997j57457K0957R9524q3830P281R8278
$$ plain form
114 -77202 -7671 64462 -64088 -23478 86886 -44487 -63629 94295 -4943 -115302 61923
125 61923 74698 -92134 -4543 67366 -78529 -25651 109174 -29905 -90019 49385 7113
136 7113 -52439 64070 10855 -109917 26514 73420 -74689 -8225 76531 -77160 -56761
147 -56761 106745 -11035 -99389 66202 39784 -101890 16265 73287 -61217 -11598 63380
158 63380 -59782 -37893 86747 -10314 -56884 55644 -14287 -77422 84051 62741 -109016
169 -109016 -9223 82823 -54199 -18185 101214 -38714 -93365 70773 42830 -57021 31065
180 31065 21042 -73767 26914 64884 -59876 -5210 68827 -65483 -47234 101536 -3174
191 -3174 -87223 57827 27974 -99019 29712 91709 -65748 -44791 54733 -29097 -21816 76462
203G6462r7161n2820J20040l1969o4917J14748l0518j45912J16114J00970j46734
214d1697J677J15611j05345m0648J51683l9394j13242R1529J3660r3047Q5142
225B5929M3204j24902L7216Q5089j09857P123J33902r7811r2407J38524j657j14012
237f9659R8173M1233j44115L7535J10645q8120j5894Q7933q5188m2492J33301
248F3352k8374j01401Q9538R798j10851Q6764P7421j36431n30J15746q1960m1269
260e8197J24024m2983r9118R7294J8030r6978P3799M9189j22033K4029R8190q5055
272a9809j5573J06748p6411p4626J27163K484j09798P7112L9494j21743M3531
283b1428J03663r6953k9507R7389o1809m9526J15794k0405j00874P7163K5089
$$ plain form
203 76462 -20699 -73519 46521 14552 -50365 64383 33865 -112047 4067 105037 -41697
214 -41697 -40020 75591 -29754 -70402 81281 41887 -71355 20174 33834 -59213 25929
225 25929 69133 -55769 -18553 66536 -43321 -36198 97704 -107 -92514 46010 44353 -69659
237 -69659 28514 69747 -74368 -36833 73812 -14308 -30202 57731 -27457 -69949 63352
248 63352 34978 -66423 23115 32913 -77938 8826 86247 -50184 -50714 65032 -16928 -58197
260 -58197 65827 22844 -76274 21020 39050 -57928 15871 65060 -56973 -32944 65246 -19809
272 -19809 -35382 71366 -5045 -79671 47492 49976 -59822 17290 56784 -64959 -21428
283 -21428 82235 -14718 -44225 53164 -8645 -58171 57623 37218 -63656 13507 38596
294C8596r6799O6092O6682j22497K77J11106p4501m3609J15808m1135j00753R6989
306A6256L0376r8893N7009N1499j13737J7311J05697p4723l4316R3742n8003o6178
318g3960J18430M896j12264O3742M6591j04746M0245R5605r7676l5317R9153m4853
330a54m9441J03450k1356j03002P7190M2805r2859M5135O4202j08878m825J09708
342F1975n6810m9647R2941l5852q5772R6799L3617j01605L8066N2179r3626K0013
354b7722R8062p7144m6992R1777l5371o2270R9953M938j08932N2266N5409q4663
366d0689K8736P7236r4832l0754J05897l3640n9197Q5258j5792r2707P7209M8646
378E5371r3355K7142O2176r1170k974J07830n4033o2440Q4129j8535p2668Q8740
$$ plain form
294 38596 -58203 7889 74571 -47926 -47649 63457 -11044 -54653 61155 20020 -80733 16256
306 16256 46632 -52261 4748 56247 -57490 -40179 65518 -9205 -43521 50221 -7782 -73960
318 -73960 44470 49366 -62898 844 47435 -57311 -17066 78539 -19137 -54454 44699 -154
330 -154 -49595 53855 32499 -70503 6687 49492 -43367 1768 65970 -42908 -47733 61975
342 61975 5165 -44482 48459 12607 -73165 23634 57251 -44354 -6288 45891 -47735 -27722
354 -27722 70340 -6804 -53796 37981 2610 -59660 40293 45231 -63701 -11435 43974 -40689
366 -40689 -11953 65283 -29549 -60303 45594 11954 -47243 38015 22223 -70484 6725 55371
378 55371 -37984 -10842 51334 -39836 -42810 65020 10987 -51453 32676 14141 -58527 30213
390C0213K6754j06638L3961O5027q0488J0887Q8387p6461m9675R7469j9427o7229
402d7220Q2618M831j02795N3918O5773q3268Q546P0614p9646k4708J03320l3028
414A8955o8569P6188m516q3463P1674M8864r7160J3121O9267p1620q238R3704
426E8207n1863o4674Q2633k613p0207P0651K4452r8553L2493P0926p3682k742
438b4972Q1181o3330n0346R3709p466o9636O3383J0438q7165N1242O3039q2140
450b2063j450P0813o4550k5545R6712l0396p4645P0307R766p7674N9286M8289
462E8850r3234M025P2929n6615j3932Q0693n0360o1811Q3930M382p2999O0354
474A6212K6449r6254K9429P9219o8155j8057P2811n2866m4265R3493n534p8459
$$ plain form
390 30213 56967 -49671 -15710 49317 -31171 -20284 68103 -8358 -58033 39436 20009 -47220
402 -47220 35398 40229 -62566 -8648 57125 -26143 -17597 53017 -26629 -51337 51983 18955
414 18955 -49614 26574 22058 -61405 10269 59133 -38027 -24906 44361 -27259 -35497 58207
426 58207 6344 -58330 24303 21690 -48517 22134 46586 -51967 -19474 51452 -22230 -24972
438 -24972 56209 -7121 -57467 36242 28776 -40860 22523 32961 -54204 -2962 60077 -22063
450 -22063 -23513 47300 -17250 -42795 53917 23521 -51124 19183 28949 -48725 10561 58850
462 58850 -34384 -30359 42570 -14045 -27977 52716 2356 -59455 24475 28857 -44142 16212
474 16212 42661 -53593 -24164 55055 -13100 -31157 41654 -11212 -55477 38016 32482 -45977
486d5977N2141K0544p4547M6982N8179q4894o739P5198n3008k6841Q9687l0574
498B0151p9913O9514K6460p1835M1999M1208q5411O860P9091n0973k6002O9093
510D0242l9789n4176Q1590Q123p6148M6583K9320q2838K9833P7829p0468l1970
522d1869P3087l1805m2320P7317o771p7434M8232L0982o4415L3631M8638p9596
534c2323o283P9574m3751l5753P7252k5656p4007P0112L3399p7071K7219M5793
546C8505p1848L791P6592m6311l4426O4141k9539m8517P8269Q438q1754L9177
558c482L9666p0807K3805P0275p1813l4285Q0046k1112m7341O6756n771p5673
570d9736N0294M0589o6709J8966M9265o9417p893P8677l8006m2995O6845j7723
$$ plain form
486 -45977 6164 26708 -47839 -857 57322 -27572 -34311 40887 -12121 -38962 50725 20151
498 20151 -59762 9752 36212 -35623 6376 47584 -37827 -30967 48124 -2849 -28851 40242
510 40242 453 -53723 27867 35990 -40158 6425 35745 -47093 -17260 60569 -9899 -41869
522 -41869 31218 -587 -42907 34410 27639 -49795 -1563 29419 -34996 -1365 47273 -32323
534 -32323 -38606 40968 -2783 -38536 38716 13060 -60947 9165 42564 -34507 -7288 38505
546 38505 -33343 -29552 47040 729 -33697 30444 905 -47612 30657 39095 -42659 -3482
558 -3482 36184 -34623 -10818 59457 -12356 -46641 33405 12293 -35048 31708 25937 -49736
570 -49736 558 41147 -25562 -6596 42669 -26748 -34641 44036 6030 -36965 29880 12157
582A2157o5132O7552K9582p8992K2367M9457o7060J842P8455m6117m8779O2348
594A7680q879m5808O1942O881p7658L4614M7584n8675J1991N5874o6309k3823
606d4586Q4983k2371n8668O2805O063p4171M3391M9055o3641J715M8446n0081
618a7060q669O7597l3644m1532N9184j4393n6509O7836K6275q7545J8864O1799
630D2203n8921p830P4512m5030n6032O7012R638m9912L8228O295o1921L8520M3791
643D0553o2596N704N5667n9550k2306Q4840k3141o7077O0648J6417p2486L7395
655e932N2091o3796p386N1938l8867j1611O1969l2624m5445N7789l051n1875N8065
668B1265K0591q6377K0911P1573n3338k1405O3626l5667m5720O7986Q017n9204
$$ plain form
582 12157 -52975 14577 44159 -34833 -12466 36991 -30069 -28227 50228 4111 -44668 17680
594 17680 8801 -37007 24935 31816 -45842 -11228 36356 -22319 -10328 45546 -20763 -44586
606 -44586 40397 18026 -40642 22163 28226 -45945 -2554 46501 -17140 -15425 33021 -17060
618 -17060 -25729 41868 8224 -33308 25876 11483 -45026 22810 49085 -38460 -19596 42203
630 42203 -16718 -24548 49964 4934 -51098 15914 25552 -24360 13868 20163 -41758 -3238 40553
643 40553 -22043 -16339 39328 -20222 -42528 42312 19171 -47906 12742 29159 -43327 -5932
655 -5932 46159 -17637 -25023 26915 -11952 -23563 38406 5782 -39663 18126 15075 -36800 21265
668 21265 41856 -44521 -23610 47963 -5375 -26780 36846 1179 -44541 23445 31462 -27742
680b7742L1487J7999n2595L0856M0509o0488J67N6417m8852k4758P6424j8937
692B0487o6152N3180K1207o5025L2510M8411o4526j2181N7073k8358j7613N2920
704C1933k9974m6678N8366J0113n2972L8722J9064p2045K4502O9079n6263k8638
716c4791O3111k6270m3129O5421O052o5886L2777K9906n3079J9625M5547n2553
728a3269j1216N3621l4851k2541O6889k0908o4173N3524K5537o1257K9527M1994
740D2877o9953p435P2301k7755l6141M6783j6700m3071N5853J4689n8604K3003
752d153K5767n2155K2956N3237o0508k3652O9257k4111m7726O2861Q667p0099
764c9659K9125M0752m9426P834M4655m6052j7201N2410j9668k3481M9246k2294
$$ plain form
680 -27742 3745 21744 -30851 5 40514 -19974 -19807 36610 -12242 -37000 39424 20487
692 20487 -45665 7515 28722 -36303 -3793 44618 -19908 -32089 24984 -3374 -20987 31933
704 31933 1959 -44719 13647 23760 -29212 9510 28574 -43471 -18969 50110 -6153 -34791
716 -34791 28320 2050 -41079 24342 30394 -35492 -2715 27191 -25888 -6263 39284 -13269
728 -13269 -24485 29136 -5715 -28256 38633 17725 -46448 7076 32613 -28644 883 42877
740 42877 -27076 -34511 37790 10035 -26106 20677 3977 -39094 16759 31448 -27156 -4153
752 -4153 21614 -30541 -7585 45652 -14856 -38508 30749 6638 -41088 21773 30440 -39659
764 -39659 -10534 30218 -19208 -11374 33281 -12771 -29972 22438 2770 -20711 28535 6241
776F241n3069N8918K7160o6833J8888M4846n9564n907P3232k9952m9288M6871
788A1543K035l8831M1152J0726n4478K3578L1564m8584J3329N0127n4318k4303
800c6460O7625j8740m9202N6991J0280o9380K7198M6654m6765j214M0759m2666
812a4920j4602N8415j9811l6136M4436j0150m8729N3874K7954o9912R833N0939
824C1191m6873q821O2596l2166m6226N2239O605m4003L5845J4275n4759K1970
836h127L8815m6425K733M9473m5043k7874O3935q947m8537M4913Q994o0960L1504
849e546M8040n2599r428M4062l3123j5286N5669j8892m4917M1650N156m3354L9458
862A0890K2353o2563J0517N0514m1457j2039N4664l1511m2457N5917P956n1150
$$ plain form
776 6241 -46828 12090 39250 -27583 -8695 36151 -23413 -29320 43912 13960 -35328 11543
788 11543 13578 -25253 15899 26625 -27853 -4275 27289 -21295 -7966 42161 -12157 -36460
800 -36460 31165 12425 -36777 20214 30494 -38886 -11688 34966 -11799 -13013 27746 -14920
812 -14920 -29522 28893 9082 -27054 17382 7232 -41497 12377 40331 -29581 -19748 31191
824 31191 -15682 -24503 38093 5927 -40299 11940 18545 -25458 10387 24662 -30097 -8127
836 -8127 30688 -15737 -13004 36469 -8574 -36448 27487 18540 -29997 14916 23910 -37050 -5546
849 -5546 42494 -10105 -19533 24529 -8594 -23880 31789 12897 -32020 9630 14786 -28568 10890
862 10890 33243 -29320 -18803 31711 -9746 -21785 32879 1368 -41089 14828 22784 -28366
874b8366L1787K2243n4865J4928M5403l9744q667M2719l5424k2837O0135q746
886A8566n0640L9122J2211n2311L2934M2058n9626r556N4521k8505k2282N2580
898B9072j5871m8596M1891J6218m3146K7166K0918n5368J1990N1364m0598j7107
910b2067N2256k8237m0615N7038R905n5707K6539K5522n1102J4111M8621m0989
922d725j9865M2649k2006k1186N2102j1877n2336L9400K1258m9718K3385L8708
934C5789n5710j1098N8188k1997k9981M4934j0473m4857M1617K0171m6326J8657
946a086K4585m7926Q987N1834l7917k5053M9328j7520l8409N2373J0831n7513
958b7486K0234L2115m2174R721M2506m2585k0217M9565j5636k8376M5539p576
$$ plain form
874 -28366 3421 25664 -29201 -14273 31130 -8614 -17281 25438 -9986 -32823 27312 18566
886 18566 -32074 7048 19259 -33052 -118 41940 -17686 -27242 27279 -1226 -23508 29072
898 29072 13201 -35395 6496 22714 -20432 6734 27652 -27716 -15726 35638 -4960 -22067
910 -22067 30189 1952 -38663 18375 28280 -27427 -888 24634 -26468 -12357 36264 -4725
922 -4725 -24590 18059 -3947 -25133 26969 15092 -37244 2156 23414 -26304 -2919 35789
934 35789 -19921 -31019 27169 5172 -24809 20125 9652 -35205 6412 26583 -19743 -1086
946 -1086 23499 -24427 -15440 36394 -1523 -26576 22752 5232 -33177 19196 30027 -27486
958 -27486 -7252 24863 -17311 -7590 34916 -7669 -27886 21679 6043 -22333 23206 15630
970A5630n2737L8493K9449m9853J1332L7379m7679r316N7406k1217l5782M1270
982A4375o587m0660M2545J9372n3179J4054L3446m2758L957M9829l6823l0003
994c2432M9652q004l7184M4045Q161n6298K2902L7449m1748K758M0793m0293j9188
1007b9387N4025j1710l7186L8653J312m7046L3881L0302m8765M426L7441l8942
1019a2996q329N4076k3972l8618M2913J774m1941L5990K0453n2674R739L9270
1031B5685l6539m167M5324l1807l1518M8031j27l8939L4229R270n0499K3047L8876
1044C0866m2784m162M1182l3937j9910N2525r528m2242L5459P569m3995L0642
1056A685L1462n0392j288M2020l0887j1667M8892k2564l9690M2908P645m1209
$$ plain form
970 15630 -37107 1386 30835 -19018 -7686 29693 -17986 -27302 30104 8887 -26895 14375
982 14375 7788 -32872 9673 29045 -24134 -10080 23366 -19392 -15435 34394 -2429 -32432
994 -32432 17220 9216 -27968 16077 24238 -32060 -9158 28291 -13457 -10699 30094 -10199 -29387
1007 -29387 24638 12928 -24258 14395 15707 -31339 2542 32844 -15921 -11495 25946 -12996
1019 -12996 -21325 32751 8779 -29839 13074 14848 -27093 8897 29350 -23324 -13585 25685
1031 25685 -10854 -15021 30303 -1504 -33022 15009 14882 -24057 10172 19442 -31057 -8010 30866
1044 30866 -11918 -16080 25102 -8835 -28745 23780 14252 -27990 7469 15038 -28957 1685
1056 1685 33147 -17245 -18533 23487 -7400 -19067 29825 7261 -32429 10479 18124 -23085
1068b3085L1477J9745n3357J0084M5234l4364j1189M2092k8380k9599N0470J761
1080B0889m4189K8349J3841m5707K1862L9368m4335j0519M2307k6398k0183M9477
1092B4762r613m5955L2581J6210m0396K3498K7671m9053j564M6131k6432j7693
1104a9853M3133j9676l8572M4789J2766m4185K1316K2161m5645R410M5661l3208
1116a903j9393M0003j8679k6659M6744Q90m7289K5663K1437m1046J6264L7218
1128C3250m3923j3677M6134j8192k3897M2166q988m5015L5631K1736m2197J4505
1140b467K7241m3451l73M7759k7104k4252M1460j3815l6435M3026J3276m8010
1152b3145J7086K6619m0618Q208M2863l6014k2232M4077j2210k9415M0860J292
$$ plain form
1068 -23085 8392 28137 -25220 -15136 30098 -4266 -15455 26637 -1743 -31342 19128 20889
1080 20889 -23300 5049 18890 -26817 -4955 34413 -9922 -20441 21866 -4532 -24715 24762
1092 24762 15149 -30806 1775 17985 -22411 1087 28758 -20295 -21859 24272 -2160 -19853
1104 -19853 23280 3604 -34968 9821 22587 -21598 -282 21879 -23766 -14356 31305 -1903
1116 -1903 -21296 18707 28 -26631 20113 21003 -26286 -623 20814 -20232 -3968 33250
1128 33250 -10673 -24350 21784 3592 -20305 21861 12873 -32142 3489 25225 -16972 -2467
1140 -2467 24774 -18677 -19050 28709 1605 -22647 18813 4998 -31437 11589 24865 -23145
1152 -23145 -6059 20560 -20058 -11850 31013 -5001 -27233 16844 4634 -24781 16079 17371
1164A7371m7032K6546K5788m0004J1048L4526m1786j1935M9593j6655k9992L8598
1176A6066m654m1170L4973K2728m4873R928L0426l7857k393M6209k5427k7578
1188b3622L8961p329l3647L9223J1340m9127J6277L2025l6995J817M0591l3626
1200d112k3576M4269o458l1350L4352K724m4841K5245K9533l9176L612L2782l6227
1213a3223j1113M9417j6491l4357L6606K06l9510L2871K3988m6208M312L4293
1225B0791l1962l798M2671k5786k9731M0513j644l2841L4290R960m9153J7910
1237h780L6655l6959k835L8558l2134k2650M8609m208l6739K8477O107l9672K6440
1250H69K9092m2485j321L4462k9705r502M6258k0085l7172L7970O852l8371K7315
$$ plain form
1164 17371 -29661 -3115 22673 -17331 -6283 28243 -13543 -25478 24115 7460 -22532 16066
1176 16066 11412 -29758 5215 27943 -16930 -7002 23424 -14433 -16826 29383 3956 -23622
1188 -23622 15339 8010 -25637 13586 24926 -24201 -7924 24101 -12894 -11077 29514 -4112
1200 -4112 -27688 16581 10123 -21227 13125 15849 -28992 -3747 25786 -13390 -9778 23004 -13223
1213 -13223 -24336 25081 8590 -25767 10839 11045 -28465 4406 28394 -17814 -13502 20791
1225 20791 -11171 -14969 27702 1916 -27815 12698 11054 -21787 12503 22463 -26690 -8780
1237 -8780 27875 -9084 -11919 26639 -5495 -28145 20464 16256 -20483 7994 14101 -25571 869
1250 869 29961 -12524 -13845 20617 -9088 -18590 27668 7583 -29589 8381 15233 -23138 4177
1263D177K2297m7489M042L9207k7286r747L6959k3801k7502M1933K415l5914K6433
1276E724J1257m3582J9078L7343l8149r523L8265k4544k0491M5839m878m1796
1288b5457K7085J4949l5475J9699K6602m1763k331L9099k4453j5264M0771j6078
1300G384l5576L7451J0348l9258K3104K0681m4642N360M2853k8800j7138L7002
1312A8769j7651k7299M0762L887m0094K2068J6013l7656J5919L3623l8829j0590
1324b1078M0639k0830k1641M2986o776m3232L0674K0167l9108J3235K9354l8168
1336a3778n394L9488j9779j7358L5569j4389l2538L8557J0653m0854J9432K2691
1348B2300m1986N822M4555k9909k2882L7820r882k8107L6248N723m0473J8305
$$ plain form
1263 4177 26474 -21015 -16973 22234 -5052 -14799 22160 -1641 -29143 12790 15205 -20709 5724
1276 5724 16981 -26601 -7523 29820 -8329 -17852 20413 -4131 -24622 21217 16339 -25457
1288 -25457 1628 16577 -18898 801 27403 -14360 -16691 22408 -2045 -17309 23462 7384
1300 7384 -28192 9259 19607 -19651 3453 24134 -20508 -15148 27705 -1095 -18233 18769
1312 18769 1118 -26181 14581 18468 -21626 442 16455 -21201 -5282 28341 -10488 -21078
1324 -21078 19561 -1269 -22910 20076 13300 -29932 742 20909 -18199 -4964 24390 -13778
1336 -13778 -19172 20316 537 -16821 18748 4359 -28179 10378 21031 -19823 -391 22300
1348 22300 -19686 -13864 30691 782 -22100 15720 5838 -22269 13979 19702 -20771 -2466
1360b466J9883l2374J2350K9221l8060r857M2756j7726k5636L9933m556m3035
1372b9567K9367K4253l8540P214K8362l4090n949L9965j7207k1856L0945j1014
1384A883k8183L8561R954m4590J5610K6951l6774M430M1775l1444k5709M0675
1396A3139l846k8225L0779L710l9587K0603K4608l2292O710K7648l5955q060M5480
1409B4712j6980k9739L5885j031l9999K9811K5249m1239K508K9956k9140m568
1421a4575L9384k0525k7039L2564k071k7546L2140P429m4968J6588L1768l3340
1433a0191k101L6236k8681k2471M2930k710l3623K6813P078l6424K0233K6465
1445B3554l5082n61L1084k7453j0618M0828j4043l0824L1811L150l4734K7842
$$ plain form
1360 -2466 17417 -14957 -2607 26614 -11446 -21303 21453 3727 -21909 18024 13468 -29567
1372 -29567 -200 24053 -14487 -7273 21089 -13001 -18950 21015 3808 -18048 12897 1883
1384 1883 -26300 12261 22215 -22375 -6765 20186 -16588 -12158 29617 -1827 -27536 13139
1396 13139 9293 -18932 11847 15557 -24030 -3427 21181 -11111 -4401 23247 -12708 -20768 24712
1409 24712 7732 -22007 13878 12847 -27152 2659 27908 -13331 -10823 19133 -10007 -14575
1421 -14575 24809 4284 -22755 9809 7738 -19808 12332 19761 -25207 -8619 23149 -10191
1433 -10191 -12292 23944 -4737 -27208 15722 13012 -20611 6202 13280 -23144 -2911 23554
1445 23554 -11528 -12089 18995 -8458 -19076 21752 7709 -23115 8696 11846 -22888 4954
1457D954K0762m2395L086L4742k6387q822L6910j9719k7908L5911L937l2362K3616
1470F325J1845l8754J3987L1017l2065m431L3558k6195j8898M2883n316l7050
1482b3094K7966J1709l8065J7825K8844l5100n079L1992k2092j2161L7599j3749
1494F595l1237L1298N585l3086K5494J8329m3665M814L9547k6651j4039L6376
1506A9360j6704k8468L5265P188l3169J9077J2370l4187J3755L0720l1994p793
1518a4580L3679k1901j8959M1710m299l9920K5637J6869l4674J3855K7564l4338
1530i357q326L4379j6328j3965L2164j3751l0795L3109J0739l4859J7640J8917
1542A9567l9203M978M0611k5990j9380L3099j0838k6421L4043O881l6422J6010
$$ plain form
1457 4954 25716 -16679 -13593 21149 -5238 -14060 22850 3131 -24777 11134 15071 -17291 6325
1470 6325 18170 -20584 -6597 24420 -7645 -12076 21482 -4713 -23611 19272 13956 -23094
1482 -23094 4872 16581 -21484 -3659 25185 -9915 -14994 16998 -5094 -17255 20344 6595
1494 6595 -24642 6656 12241 -20845 4649 22978 -20687 -15873 23674 -2977 -17016 19360
1506 19360 2656 -25812 9453 16641 -16528 2549 14919 -19268 -5513 25207 -6787 -14580
1518 -14580 19099 -2802 -21761 19949 15650 -24270 1367 18236 -16438 -2583 24981 -9357
1530 -9357 -17683 16696 368 -13597 18567 4816 -25979 7130 17869 -16990 650 19567
1542 19567 -19636 -14658 25953 -37 -19417 13682 2844 -23577 10466 17347 -19075 -3065
1554c065J7121l0270J1144K9291l3288j0539L6004j5146k0453L6254m854l8534
1566b6335K6580K0266l3949R613K5438l3926n579L8571j5802k0591K9023q328
1578D981k7398L2400J0974l8338J3877K2332l2604L706L6095k6927k0309L5198
1590A3987p926k5950L2106M858l8775J7352K3157l0338N165K7685k9985j1614
1602b0278L7232j1878k3804L0683k386l4308K5578K0608l4708N206K5752k9033
1614a1336m525L7372j7789k4402L0609k218k8010K7817J1715l6734J0748K5061
1626A8308k8229L25L2569k4713k0070L5471m210k7092K7741N621l6658J7530K5105
1639B1698l0387N56K7803k6218j2152L7217j0204k6213K7168M66l1570K5222J9754
$$ plain form
1554 -3065 14056 -16214 -5070 24221 -9067 -19606 16398 1252 -19201 17053 12199 -26335
1566 -26335 245 20511 -13438 -3825 21613 -12313 -17892 20679 4877 -15714 13309 4981
1578 4981 -22417 9983 20957 -17381 -3504 18828 -13776 -10070 26025 -902 -21211 13987
1590 13987 6061 -19889 12217 17075 -21700 -4348 18809 -11529 -6364 21321 -8664 -20278
1602 -20278 16954 5076 -18728 11955 9569 -24739 839 21447 -13261 -8055 17697 -11336
1614 -11336 -15861 21511 3722 -20680 9929 7711 -20299 7518 19233 -17501 -6753 18308
1626 18308 -9921 -9596 22973 -1740 -21810 13661 9451 -17641 10100 15721 -20937 -3407 21698
1639 21698 -8689 -8133 19670 -6548 -18700 18517 8313 -17900 9268 9734 -21836 3386 23140
1652B3140l7028L148K8726k6228o382L5435j6927k6638L0170J821k7228K4287
1664F296J1090l6955J0503K8100k6628l167L0300k3860j9252L7753k226k9734
1676a7780K3420P526l3503J6949K6483l0588m697K8132k0995j1074L5495r957
1688I411k9756K5606O739k8591K0691J7864l6289J910L1498k1692r574L1163j6029
1701B951k5524L1527N401k9582J8575J1853l3517J0136L0193k6089r748K8672
1713A4848j7490j7020L3999j951l2125K0958J1685l0221J4820K4639l2079o210
1725a6147L1330j6660j4151L2371j0088k9662K6961J0940k9160J4562J7662l2501
1737a4543K603L2122k1142j3178K9682j3356k3604L2303N992l3002J5930J5668
$$ plain form
1652 23140 -13888 -10740 17986 -8242 -14624 20811 3884 -22754 7416 9237 -17991 6296
1664 6296 17386 -19569 -9066 19034 -7594 -10761 19539 -4321 -23573 14180 11954 -17780
1676 -17780 5640 13166 -20337 -3388 23095 -7493 -12190 15942 -5053 -16127 19368 9411
1688 9411 -20345 5261 12000 -16591 4100 21964 -14325 -12415 19083 -2609 -12183 18980 2951
1701 2951 -22573 8954 14355 -15227 3348 15201 -18316 -8180 22013 -4076 -13824 14848
1713 14848 -2642 -19662 14337 12386 -19739 1219 12904 -17317 -2497 22142 -9937 -16147
1725 -16147 15183 -1477 -15628 16743 6655 -23007 3954 14894 -14266 296 17958 -14543
1737 -14543 -11940 20182 -960 -14138 15544 2188 -21416 10887 16879 -16123 -193 15475
1749A5475k9833Q606K8713k7183j1490L0445j3143j8488L1533k100l2558K0521
1761D98J5304k8873J0200K2775l0166o237L3349j4458j7737K8310p021k8040K6068
1774C972J2310l0249J0497J9051k9369J605L2280k0369j7034K8483p545k2785
1786a9153K8524O424l3091J3068J9395k6710N152K6805k5027j2766L0668q716
1798D573j9336K7101j302l1522K0529J8274k8324N633K2565k7152o261L3941j3059
1811E660k1082K5454l363k5828K4826J2954l2181P842K0480k5333R52L0285k1090
1824d24j9283K9548l529k3083K5339N434l3113J3622K2500k5618J093K4947k4007
1837f574j1855L2126o629k2548K3856k1k8860K1029J9220k9983J155K3927k2357
$$ plain form
1749 15475 -14358 -5752 22961 -4222 -15712 14733 1590 -16898 14635 12535 -20023 498
1761 498 15802 -13071 -2871 19904 -10262 -16499 16850 2392 -15345 12965 5944 -22096 3972
1774 3972 16282 -13967 -3470 15581 -13788 -12183 20097 -272 -17306 11177 3632 -19153
1786 -19153 9371 15795 -17296 -4228 15167 -11543 -6391 20414 -4613 -17379 13289 4573
1798 4573 -14763 12338 11036 -20486 43 18317 -10007 -4374 18191 -8961 -15222 18719 5660
1811 5660 -15422 10032 6669 -19159 5667 18621 -13560 -5718 14762 -10571 -9619 20666 -424
1824 -424 -19707 9841 6312 -16771 8568 14002 -19111 -5489 17011 -8607 -7514 17433 -6574
1837 -6574 -18429 13697 7068 -15480 8376 8355 -20505 524 19744 -10239 -9084 14843 -7514
1850g514n444L1621j3284k3061K4921J253k4151K1778J1569l2291O835K4389k1851
1863e230l075K6813j9681j8342L0735n84k4867J9789P251l0168J3529K2897k5326
1876f259l535K4507j9261j1845L1698o547k6210K1123N936k6005J7521J7242l0001
1889a1636K78K6040j9341p844K8718j2780k3934K6243M976k5102J7437J1759l0426
1902a5612O795K6690k1110p909K5758j5459j7483K9898k04k6215J8291Q672k7803
1915a5691J3282K3085k6955n920K6367j5196j2794K8638n888k6968K0994R178
1927A2132k4803J3868J6063k8737o4K7427j7316j0527K6378j1805k3010K6856
1939F462P170k7327J3139J3724k7036N476K6166k0185j0489K3635j1238j5476
$$ plain form
1850 -7514 -12958 18663 5379 -17682 7239 8492 -15659 6119 17688 -14603 -7768 16621 -5230
1863 -5230 -8305 18508 -1173 -19515 11220 10636 -14231 5558 12809 -17359 -3830 19067 -6259
1876 -6259 -9794 14713 -4548 -16393 15305 8758 -17452 3671 9607 -16398 1123 18365 -11636
1889 -11636 -11358 14682 -4659 -12503 16215 3435 -20499 5744 10720 -14382 3055 14814 -15612
1902 -15612 -8817 17873 -3237 -11146 14612 -847 -18330 11568 11364 -14851 3440 12112 -15691
1915 -15691 -2409 20676 -6279 -12199 14168 -1028 -13822 14816 8928 -18040 2954 12132
1927 12132 -12671 1197 17260 -11477 -11541 15886 -1430 -11957 14421 2616 -20394 6462
1939 6462 13632 -13695 -556 13168 -13868 -8392 17774 -2411 -12900 10735 -503 -15979
1951a5979K7012l32k7307J6666J1430k4861J0697K2119k6857p987K8437j0944
1963B094j5287K5313m472k5715J9972J2320k4003R174J5249k5518O19K7966j6532
1976A180j3618K4382q926k0792K6319P226k9217R828J7363k3847L309K4852k0214
1989b155j2606K4444p583j5309K3855p11k8258J6823J5560k4392O336K0244k5033
2002h785o722K9679r681j8490K2047j994k3981K0069J2754k5091N568J6579k1881
2015i929O22K7171j7028j6341K4632l722k0437K2273P234k8763R662J8965k1262
2028f923P84K3095j9505j3261K6516m034j8501J9755J107k5264J6114J6668k4294
2041g743J862J9791k0594o471K8053r667k0134K1067Q53k2498J8578J2343k6718
$$ plain form
1951 -15979 11033 10701 -16606 60 11490 -13371 -2674 19445 -7412 -15399 13038 2094
1963 2094 -13193 12120 7648 -18067 1905 14225 -9778 -604 14645 -10873 -10254 17712 1180
1976 1180 -12438 11944 3018 -17774 8545 15771 -13446 -3618 13745 -10102 -6793 18059 -2155
1989 -2155 -14761 9683 2100 -13209 10646 9935 -18323 -1500 14060 -10332 -3996 16248 -8785
2002 -8785 -15507 14172 4491 -13999 8048 6054 -17927 2142 14896 -10195 -4627 11952 -9929
2015 -9929 -9307 17864 836 -15505 9127 5405 -15032 7241 14475 -14288 -4626 14339 -6923
2028 -6923 -6139 16956 -2549 -15810 10706 6672 -11829 7926 9033 -16231 -117 16551 -7743
2041 -7743 -5881 13910 -6684 -13155 14898 5231 -14903 6164 7017 -15481 3097 15440 -11278
2054a1278L343K0282j8242l194K4020j4673j6537K3455q20k0048J9503O115k7799
2067a5873J0344K0913k1328j971K2232j7484j2816K7309k768k1488J7173M398
2079H641k2474J4082J6290k3930P8K0347j7729o045K6914j1032k1458K1645M014
2092I343k1626J5250J2817k6799J963K2636j5935o005K1566j3290j5850K3929
2104G999J032k1189J5775O278k5255J0577K2103k1997o312K2363j3323j2417K5665
2117A1299k871k3287J5380Q022k0021J1154J5250k3260j683K1714j4028p994K3714
2130A3389r544k1451K2072P268k2411J0794J3070k4051K153K3710j4846r577J9584
2143A0160r601j4448K3198J743k3007J2307J0114k2014R147K0038k2472p917K3956
$$ plain form
2054 -11278 -7935 12347 -5895 -9089 14931 258 -16279 7176 6356 -13692 5811 11926 -15873
2067 -15873 -5529 15384 -5944 -7915 14317 -3167 -15983 11326 8558 -12930 4243 8641
2079 8641 -13833 249 16539 -7391 -7313 13034 -4695 -10740 16174 5142 -16316 5329 9343
2092 9343 -12283 2967 15784 -11015 -9052 13584 -2351 -8356 13210 -80 -15930 7999
2104 7999 9031 -12158 3617 9895 -15360 -4783 17320 -4677 -10989 11374 -1949 -14366 11299
2117 11299 8428 -14859 521 8543 -11478 -324 14926 -8334 -10017 11697 -2331 -10325 13389
2130 13389 3845 -17606 4466 11734 -10677 117 13187 -10864 -8711 14999 153 -9424 10160
2143 10160 559 -13889 9309 11052 -11955 352 10466 -11548 -2401 17637 -4835 -12752 11204
2156A1204r572j3777K2681k394k3808J5720J0966k0298Q088J4683k2737k267K3901
2169A2390j1599j1809K0691p136j9360K1709P669k3874Q672J3922k1368K285K3555
2182A5747j6437j2211K0923n802j4848K1028K309k4336J1430J3815j9839N264
2194b957J8159k0307p379K4090p813j5082K0467j798k2432J6098J3196k1566L888
2207c436J5366j8711k825K3478j1080j4561J9243l475j7706J9229O973k4067P401
2220d171J5505j9120L85K2612j6327j3783K1909k268j6195J7086L192k2653J1191
2233b637J4499j8565K103J7236j8720o850K5066p122j7090J8673K02k1482J5922
2246A235J3681k2528J456J6758j5687l192K1869j0906j5494J9210r89j6630J7305
$$ plain form
2156 11204 1632 -12145 10536 8142 -15666 54 11020 -9278 -1190 13493 -9244 -11511 12390
2169 12390 791 -11018 9673 2537 -16823 4886 12555 -11319 -2647 11275 -10093 -7808 15747
2182 15747 -690 -12901 8022 2220 -12628 8400 10709 -13627 -2197 11618 -8221 -2957
2194 -2957 15202 -5105 -12484 11606 3793 -11289 9178 7380 -15052 1046 14242 -7324 -3436
2207 -3436 11930 -6781 -9606 13872 2792 -11769 7474 3999 -13707 5522 12495 -11572 -4171
2220 -4171 11334 -7786 -7401 15211 -1116 -14899 7010 4742 -11453 5633 8825 -13828 -2637
2233 -2637 11862 -6703 -4600 12636 -6084 -12934 12132 5010 -12080 6593 6795 -14687 1235
2246 1235 14916 -7612 -6156 10602 -5085 -8277 13592 2686 -12808 6402 5413 -11217 6088
2259F088O648k5024O969J8754j7973j871J9880j4742j3351K3024q55j8343J4758
2272C962M096k1393J1190J6188j9714j397J7555j5650o888K4041o528j9207J6494
2285B749M035j8877J3255J2611k3085M62J9249j3728n007K0345j0863j6163K0258
2298E241K932j8167J3260P267k2798O709K0056j6946n661J8665j1246j1967K2100
2311I445m03k0311J3312O438j9323J0108J5981k0502l743J9479j1737q115K1029
2324A1658o577j9637J7199O974j9356J0203J1741k1850J128K0782j3265q028J8904
2337I876r014j5454K0324M180k0648J0464R373k0051N898J9114j7333p076J9471
2350I124r468j1832K1294j076k1171J2986R644j8479P660J5167j9683m666K0831
$$ plain form
2259 6088 12736 -12288 -5319 13435 -4538 -6409 13471 -1271 -14622 8402 7547 -10796 3962
2272 3962 8058 -13335 -2145 14043 -5671 -7068 10487 -5163 -12051 11990 5462 -13745 2749
2285 2749 6784 -12093 1162 13773 -9312 -8850 10399 -3329 -8336 12009 1146 -15017 5241
2298 5241 8173 -9994 3266 10533 -12265 -5556 14500 -2446 -8107 10558 -688 -12655 9445
2311 9445 9042 -11269 2043 8481 -10842 -734 15247 -5255 -8998 10481 -1256 -9371 11658
2324 11658 5081 -14556 2643 9617 -9739 464 12205 -9645 -8517 12265 -1000 -9028 9876
2337 9876 862 -14592 5732 9912 -10736 -272 9101 -10950 -5052 14062 -3271 -10347 9124
2350 9124 -344 -12176 9118 8042 -13129 -143 9501 -8978 -1318 13849 -5834 -10500 10331
2363A0331q652j0842J8345m546j8473J6944P789j9367P929J2098k0084O67K1590
2376A3729j2559j1589J8401n390j5338J9004M321k1230Q200J1783j7614M247J7626
2389A3591j6668q790K0371o918j2217J8380l35k1528J2760J2181j8389M303J4612
2402A1353j8120m058K1795q385j2750J6834k880j7529J7157Q309k0331N104J3400
2415I899j7147L02K1140j3190j3172J8968k685j4335J6612M006k1945Q630J4192
2428A1275j6750J767J6851j6660q682K1365l898j5144J6085L13j9845J3315J3180
2441A3172j9701J677J4776j5582l751K1334q631j5019J6457n49j6140J5689Q080
2454A1812k2289M433J6090j4736k127J9017j2636j3209J9863r4j6292J4147M696
$$ plain form
2363 10331 1679 -9163 9182 4636 -13837 3107 10896 -8471 -542 11556 -8528 -7861 13729
2376 13729 1170 -10419 7982 2592 -12746 6258 10579 -10651 -2451 9332 -8282 -4035 13591
2389 13591 -3077 -11867 8504 1586 -10631 7749 7414 -14114 -1354 10827 -7562 -3259 11353
2402 11353 -6767 -10825 10970 2585 -10165 6669 3789 -13740 3417 11726 -8605 -3501 9899
2415 9899 -7248 -6946 14194 1004 -12168 6800 4115 -10220 6392 10398 -11547 -2917 11275
2428 11275 -5475 -3708 13143 -3517 -12199 9166 5268 -9876 6209 6522 -13323 -8 13172
2441 13172 -6529 -4852 9924 -5658 -9409 11925 3294 -11725 4732 4183 -11957 3732 11812
2454 11812 -10477 -6044 10046 -4690 -6817 12200 -436 -13645 6218 6124 -10168 3979 8675
2467H675k0915Q858J5665j6383j410J5963j3559p863K1372m247j7041J4426L749
2480G290j8465J1862J2740j9598k48J6637j2864n176J9396q347j6123J7292L186
2493G582j7171J2232Q183k0795L965J7942j4209n193J7980j1040j2660K0004N93
2506G413j7667J1930O029j9150Q323J5913j7329l676J7303j1297q165K0019l614
2519F032j8287J4030N734j7342R702J2791j9859j139J8461j1179o972J8418p701
2532B689j6204J7997N097j8103R138R559j9280L382J8492j3534p210J7188q698
2545E13j2275J9470J110j9399J0638Q434j7260O693J5421j7589n860J8889q523
2558B62r685J8008l436j8122J3564Q263j7551P765J1938j9348q21K0564j0650
$$ plain form
2467 8675 -12240 -3382 12283 -4100 -5510 10453 -3106 -10969 10403 6156 -10885 3541 7290
2480 7290 -11175 687 13427 -6171 -6419 10218 -2646 -7822 11574 3227 -12896 4396 7582
2493 7582 -9589 2643 10826 -9969 -6004 11938 -2271 -7464 10516 -524 -13184 6820 7413
2506 7413 -10254 1676 7705 -11445 -3122 12791 -4538 -8214 9089 -2208 -10373 9646 6032
2519 6032 -12255 1775 7509 -9833 -131 12660 -7199 -8338 10123 -1056 -8028 10390 2689
2532 2689 -13515 4482 9579 -8524 614 10173 -9107 -5725 12767 -767 -7977 9211 513
2545 513 -11762 7708 8818 -10581 57 8491 -8769 -2076 13345 -4244 -10104 8785 262
2558 262 -9423 8585 5149 -12973 591 8854 -8697 -932 11006 -8342 -9163 11401 751
2571G51j0000J6784n477j4910J7414N424j9365P647J0570j7272L223J8393j4517
2584a335q922J7815n928j2000J8380K97k0109J0789J1340j7045M294J4683j7292
2597e033n004J9878p153j1189J6164l033j7143J4642R236j8225M247J2153j6538
2610f998k3J9525j1432j1910J7150l062j4640J6007N207k0148O648J2630j4976
2623f022J370J5806j3805q883J9008l894j3342J5393Q52j8852J1280J2627j7548
2636f010J496J4984j4854n572K0456o309j4015J4725J62j5903J3755Q891j9539
2649g733L299J4234j4373j770J8462j0804j2939J7639m05j5160J4358N031j9840
2662a0001N970J4821j4869j290J5653j2625q933J9391l053j4610J3315K516j8199
$$ plain form
2571 751 -9249 7535 2058 -12852 4562 9986 -9379 -1732 8838 -8434 -5211 13182 -1335
2584 -1335 -10257 7558 1630 -10370 8010 8307 -11802 -1013 10327 -6718 -2424 12259 -5033
2597 -5033 -10037 9841 2688 -8501 7663 4630 -12513 2129 11365 -6860 -2613 9540 -6998
2610 -6998 -7021 12504 1072 -10838 6312 3250 -11390 4617 9824 -10324 -3676 8954 -6022
2623 -6022 -4652 11154 -2651 -11534 7474 3580 -9762 5631 6483 -12369 -1089 11538 -6010
2636 -6010 -4514 10470 -4384 -9956 10500 4191 -9824 4901 5063 -10840 2915 11806 -7733
2649 -7733 -4434 9800 -4573 -6343 12119 1315 -11624 6015 5610 -9550 4808 9839 -10001
2662 -10001 -4031 10790 -4079 -5369 10284 -2341 -11274 8117 5064 -9546 3769 6285 -11914
2675a1914J1088J2567j7795j86J5700j3252n448J9328o449j5383J4609K747j5385
2688i773J1162R126j8738K545J5274j2828l273J7387j0602j2713J8069J306j6000
2701i058J2082O014j9046O123J6360j4957m087J5377r965q754J8527k360j5723
2714i467J1930M323j6525R609J2642j8474k114J7248j0275o818J7923o531j6054
2727a2583J5095N054j5603Q969Q434j8205K252J7074j2101n911J6086q607j2189
2740a2235J8408K210j7888R374P885j7040O007J5753j5556n842J6689q160q828
2753i223J7963k495j7921J2480P585j5929P142J1875j8131j371J8248r004r219
2766h000J6304n032j5418J6315N605j7722P247J0234j7049J928J7445j2109q680
$$ plain form
2675 -11914 -826 11741 -6054 -6240 9460 -3792 -9240 10088 3639 -11744 2865 5612 -9773
2688 -9773 1389 10515 -8223 -5678 9596 -3232 -6505 10882 280 -12433 5636 6942 -9058
2701 -9058 3024 9038 -10008 -3885 12475 -2482 -6569 8808 -1157 -9911 8616 6256 -9467
2714 -9467 2463 6786 -9739 -130 12512 -5962 -8076 9172 -1103 -7921 10002 3471 -12583
2727 -12583 2512 7566 -8037 932 9366 -8839 -6587 10487 -1614 -7525 8561 -46 -12235
2740 -12235 6173 8383 -9505 -131 7754 -9286 -3279 12474 -3082 -8924 7765 -395 -9223
2753 -9223 8740 6245 -11676 804 8389 -7540 -398 11477 -6654 -8025 10223 1219 -8000
2766 -8000 8304 3272 -12146 4169 9774 -7948 -701 9533 -7516 -5588 11857 -252 -8932
2779h932J6131n929j1528J6946J365j8600R220J0032j6288M333J4932j5959n846
2792a0123J8028o159j0987J5657j214j6873J1880Q944j5903M531J1504j5425j683
2805g823J8185r257j0597J5871k915j4628J5116O279j8429N320J2260j5003P26
2818d895J6559j1762r614J6187l210j1846J4642J351j8229R916J1071j5511J749
2831c592J4756j4955o308J8546m962j2412J4260n9j6153J1527R298j6251K159
2844d146J2787j4148j875J7733q994j1942J5661j498j4196J4163O201j8807M215
2857d846J3938j3382j081J5750j1367r611J7323k325j2661J2865J938j7056R278
2870a237J2356j5393l53J4270j2787o227J9171m772j4648J2551K619j4813J0607
$$ plain form
2779 -8932 7199 1270 -10258 6688 8053 -10547 -1327 8705 -7583 -3250 11682 -4277 -10123
2792 -10123 7905 1746 -9241 6416 5202 -11671 209 9153 -6750 -2219 9285 -6140 -7823
2805 -7823 10362 1105 -9492 6379 3464 -11164 3952 10231 -8198 -2878 9382 -5621 -4895
2818 -4895 11664 -98 -9712 6475 3265 -8581 6061 7412 -10817 -901 10170 -5341 -3592
2831 -3592 11164 -3791 -10099 8447 3485 -8927 5333 5274 -10879 648 9946 -6305 -4146
2844 -4146 8641 -5507 -7382 10351 1357 -10585 5076 3578 -10618 3545 9746 -9061 -4846
2857 -4846 9092 -4290 -5371 10379 -988 -10599 6724 4399 -8262 4603 6541 -10515 -1237
2870 -1237 11119 -4274 -4627 9643 -3144 -9371 9800 5028 -9620 2931 5550 -9263 1344
2883A344R459j7015J138J3866j2076l064J6846r194j2922J5939J940j4835J1385
2896B811N721j8275M907J5048j3138l238J4305r652q958J7385j656j4887J1834
2909B207L960j6017Q782J2222j6026k224J5616j0437o242J7373n255j5083J3812
2922B688M206j5253R500R233j7252R80J5666j1239m734J5552q298j1887J6195
2935E357K220j5709R413O842j6554N263J4599j3775n086J5525q278r249J6858
2948G426r71j6094J0274O429j4660O391J1627j6034k143J6142q772p791J5852
2961G676m576j4441J3525N603j5594O776R996j6115O38J6978j0858p299J4310
2974F619n472j1645J5814K638j6641Q352Q406j5305L867J5010j3727o280J5827
$$ plain form
2883 1344 10803 -6212 -5074 8792 -3284 -6348 10498 1304 -11618 4321 6261 -8574 2811
2896 2811 8532 -9743 -4836 10212 -2926 -6164 8141 -1511 -10469 6916 5260 -9627 2207
2909 2207 6167 -9850 -1068 11154 -4872 -7096 8520 -1917 -8159 9214 3959 -11124 2688
2922 2688 6894 -8359 1141 10374 -6878 -5898 9768 -1471 -6205 9347 1049 -10838 5357
2935 5357 7577 -8132 1281 8123 -8431 -3168 11431 -2344 -7430 8095 -183 -9432 7426
2948 7426 6455 -9639 635 7064 -7596 -1205 10422 -5612 -7755 8387 -385 -8176 7676
2961 7676 3100 -11341 2184 7787 -7807 -1031 8965 -7150 -6512 10466 -392 -7691 6619
2974 6619 1147 -10498 5316 7954 -8687 -335 8071 -7234 -3367 11643 -2084 -8364 7463
2987G463o091r636J5559q16j6693J0400Q773j5010M740J1627j5343k699J6684
3000H958p782r087J4602l065j4773J3967O321j6183M798J0107j4216P97J6051
3013A0495j0519r378J5164l758j1486J4411K641j7031P494R862j3739K525J3779
3026A0460j3694o699J7051m231j0943J3160Q2j5717J0587R406j4936K422J1647
3039H595j3458k252J6862p618j0687J3646j131j3484J3137O319j7541M255J1969
3052H612j2394p14J4562j0314r285J5197j614j2242J2500K415j6261P386J1562
3065I410j3733k0J3083j2006n872J6809m246j2615J2365J582j4230R684R533j5496
3079e752Q98J2704j1482l277J6434p801j1687J3938Q77j3082J0910N811j6516
$$ plain form
2987 7463 1372 -8264 7295 6479 -10214 186 8959 -6051 -1311 10316 -5027 -7726 8958
3000 8958 1176 -7911 6691 3626 -11147 2820 9141 -7042 -2244 7863 -6353 -5556 10495
3013 10495 -24 -9402 5762 2004 -9482 4929 7570 -9461 -1967 7895 -5844 -3319 10460
3026 10460 -3234 -9933 7118 2887 -8056 5104 5186 -10531 56 9462 -5474 -3052 8595
3039 8595 -4863 -7115 9747 2129 -8558 5088 3957 -9527 3610 9929 -7612 -3357 8612
3052 8612 -3782 -4496 10066 -248 -9533 5664 4050 -8192 4308 6723 -9538 -2152 9410
3065 9410 -4323 -4343 8740 -3266 -9138 7671 3425 -9190 3175 4757 -9473 211 9744 -5752
3079 -5752 -4854 7850 -3632 -6909 9525 1724 -9963 3975 4852 -8230 2680 8491 -8025
3092h025M152J3194j2024k695J4217r043r606J5899m48j3575J0420M468j5646
3105h712P459J1689j3827j630J2838r469o158J5882l773j3494J1794L278j3984
3118h107Q513R539j5735Q3J3685r861m479J4325o722j1573J3846K367j3775Q690
3132G96O504j5325L648J3472j1098m234J3295p623q914J5333q6j4086R363N120
3146F165j4108O528J1884j4307k790J4040p921o635J4713k846j4478J1728N204
3159G177j4000O941R137j5442L27J4736q932o079J3440n735j1372J4181K894j4611
3173g338P303P010j4178L816J3733j2296n418J3432n598q738J4337n58j5108R157
3187d44P194j3232M820J0916j3857k954J4891o497q021J3176l167j2928J1772
$$ plain form
3092 -8025 -3873 9321 -2703 -5398 8819 -224 -9830 6069 5621 -7954 2466 6934 -8712
3105 -8712 -1253 10436 -3391 -5021 7817 -1652 -7810 8072 4299 -9195 2599 5877 -8107
3118 -8107 406 9945 -5790 -5707 7978 -1883 -6362 7963 1241 -10332 3514 5881 -7894 796
3132 796 7300 -8025 -4377 9095 -2003 -6237 7058 -565 -9479 5854 5768 -8318 1045 6165
3146 6165 -7943 -1415 10469 -3838 -6628 7412 -509 -7144 7569 4723 -9755 1973 7177
3159 7177 -6823 118 9255 -6187 -5860 8876 -56 -6135 7305 1570 -9802 4379 7273 -7338
3173 -7338 -35 6975 -7203 -3387 10346 -1950 -7368 6064 466 -8272 6065 5507 -9601 -444
3187 -444 6750 -6482 -1662 9254 -4603 -7557 7334 837 -7184 5992 2825 -10103 1669
3200A669O260j4109M936Q765j3384N53J4667r138p797J3333l630j0725J3300K955
3214G655j4968N872Q781j2388K276J2672j1757o031J4277l871r727J2499r1j4630
3228i431R296Q664j3343K038J1115j2445l292J4961n810r327J2132j473j2172
3241i087J1009O365j4763L494J0012j1898j31J3868q870q815J3621j962j1038
3254h195J1489L784j5136N707R963j1713O01J2030j0666o269J4915l187j0735
3267g412J1499J230j3432Q056R092j3353R66J0854j0765k856J4248n707j0082
3280g662J1080M89j1823J0184N891j4871L263J1044j0914j512J3149q179r300
3293i161J3164j6j1055R282L523j4151N601J1182j1292j702J1550q934o158J4711
$$ plain form
3200 1669 7929 -6180 -1244 7521 -5863 -5310 9357 219 -7578 5755 2125 -8600 4700 7655
3214 7655 -7313 -1441 7340 -5048 -2772 9900 -1857 -7888 6389 2518 -7209 5290 5199 -9431
3228 -9431 -135 8529 -4814 -2776 8339 -4106 -7398 7563 1753 -7574 4558 3085 -9087
3241 -9087 1922 8287 -6476 -2982 7030 -4868 -4999 8869 -1 -8816 4805 2843 -8195
3254 -8195 3294 7078 -8058 -2351 7612 -4101 -3500 8530 -2136 -8405 6510 3323 -7412
3267 -7412 4087 5317 -8115 -59 9033 -4320 -3354 7500 -3265 -6121 8127 2420 -7662
3280 -7662 3418 3907 -7916 2268 8159 -6712 -3449 7595 -3319 -4831 8318 139 -9161
3293 -9161 4003 3987 -7068 2214 5737 -8414 -2813 8369 -2923 -4625 6925 -2009 -8167 6544
3307F544k556j1771R758K983j2943P571R192j3056r20J1751q616l771J3647n628
3321B185j0942J1868K461j2135Q244O211j4571K612J1965r163l643J2110o951
3334B51q722J3338N67j2434Q217M607j3065N181J1135j1991k977J2045o979o218
3348g045J3459k451j2612R623M533j2041O126Q366j3188n06J2363p161n556J2014
3362E924m185j1123J1963L208j2198O200O645j2448J834J3028r844n192J1977
3375E789n368p983J2450J257j3561P335O507j1756L850J0101j1149l545J2535
3388F462n459p138J1903j867j2084R314N569j1819M079Q280j2114r41J3828p447
3402E66p109J2085l640j0571J1119M248j2832M538P443j1325J807J1831r066o287
$$ plain form
3307 6544 3988 -7783 1975 4958 -7985 -414 8778 -4278 -5198 6553 -2063 -5834 7813 2185
3321 2185 -8757 3111 5572 -6563 1681 7892 -6679 -4067 7898 -1265 -4908 7202 251
3334 251 -8471 4867 5434 -7000 1217 5824 -7241 -2060 9075 -2916 -5893 6152 -827 -7045
3348 -7045 6414 3963 -8649 974 5507 -6534 -408 7958 -5230 -5736 6627 -534 -6090 5924
3362 5924 1739 -9384 2579 5787 -6411 -211 6434 -6014 -4180 8848 -996 -6188 5789
3375 5789 421 -7562 4888 6145 -7416 -81 6426 -5330 -1480 8621 -2528 -6073 6462
3388 6462 1003 -6135 5768 3901 -8183 1131 6700 -5119 -1040 7240 -4874 -5815 8013 566
3402 566 -6543 5542 1902 -8669 2450 6698 -6134 -1596 5847 -5478 -3671 8160 -906 -7193
3416g193J2048l400q834J1873Q01j3269P491P070j1402K538J0249j0735l886J2712
3430F063m292p627J0286j045j1380R462N778j2070K942Q845j0759r45J2905o705
3444A458q109J1059j595r859J0096M214j3536M071Q657j0017Q63J0450r038o042
3458g328J2127k345q845R752J419j2770O830Q472j1295P99R550r601l262J2828
3472F331l969r125R981k69j0456Q408O585j2764K074R427r137j290J1890o910
3486G76q626J1326n1r388Q462L766j2815M290R554r320j377J0177p755n906J2426
3501E539j779r675Q565K079j1685O767Q286j1356p35J0201q172l544J1990l908
3515B573j0082R809J774j0329P123N837j2265J287J0336q072k444J0628n834q452
$$ plain form
3416 -7193 4855 1455 -7379 4494 5295 -7974 -483 6587 -4815 -2277 7972 -2763 -6649 6063
3430 6063 1771 -5856 4430 3385 -7995 1467 7245 -4825 -1883 6962 -3797 -4742 8163 1458
3444 1458 -6651 4408 2813 -7046 3050 7264 -6272 -2201 6456 -3561 -2698 7752 -1286 -7328
3458 -7328 4799 2454 -6391 3361 4780 -7990 -1160 7312 -3983 -3184 6366 -3235 -6497 6331
3472 6331 2362 -6763 3218 2949 -7507 901 7486 -5278 -3204 6223 -2914 -4204 7686 776
3486 776 -7850 3476 3425 -5963 2499 6265 -6550 -2260 7294 -2026 -3403 6774 -981 -6887 5539
3501 5539 3760 -5915 2650 4729 -6956 -189 8097 -3259 -3994 6207 -1965 -5509 6481 2573
3515 2573 -7509 2300 4074 -6255 868 6705 -5560 -4273 6063 -2009 -4453 6175 341 -8111
3529h111J1482Q72j0335P174L946j1266L896R743r646k240J0156o143n895J1942
3543E575j501j0522P517L617j0537N582Q167j1501r96J0575o211n172J1571l412
3557B752j0166R561L002r938N425N712j1617J360J0711p313m436J0005m622p538
3571g102J0811R46j0413N558N527j0797L352R730r477l699J0135m522o103J0743
3585D689j084j1063P726M819j0003M028P521j0462j439J1302n544n615R735k627
3599A983r362R375M050j0873M045O419j0330J489J0558p618n198J0161l577p203
3613f081J0142J131j1144N351O040r564K175R048q780l997J0446l100o722R199
3627D144q96j0436P361N404r435J914P677r656j143J1157n039o758Q949j357r033
$$ plain form
3529 -8111 3371 4243 -6092 1082 5028 -6238 -2342 7401 -2245 -4485 5671 -472 -6367 5575
3543 5575 4074 -6448 1069 4686 -5851 -269 7898 -3603 -4599 5976 -235 -5407 6164 2752
3557 2752 -7414 2147 5149 -4789 636 6348 -5269 -3909 6802 -511 -4947 5058 436 -7102
3571 -7102 3709 4655 -5758 -200 5327 -5470 -2118 7612 -1865 -5564 4571 49 -6054 4689
3585 4689 3605 -7458 268 5087 -4916 -888 6633 -3829 -5268 6034 490 -5125 4610 1983
3599 1983 -7379 1996 6046 -4827 -782 5637 -4693 -3204 7354 -264 -5462 4699 1122 -6081
3613 -6081 4061 5192 -5952 -601 5439 -4125 -1950 7098 -1682 -5679 4767 1667 -5055 4144
3627 4144 3248 -7188 173 5577 -3858 -1944 5733 -3923 -5066 6091 1052 -5706 3243 1886 -7147
3642g147R376L574j1238L636P056q965L74J0020p083n972J0190j805p507Q403
3656B912J643j1104N486P179r099P07Q546q109l659J1148l230p811Q322P05j0006
3671f370P094N575j0132J635P759q171j123J0485n499p615R331m04q314Q108L103
3686E462j1196L088Q181p929j011R260o628n893J0281j030p980P696J214j0131
3700f616N312P819r338r01Q791o790l745J1048l269q172P748J321q920O652N567
3715F507j0630J186Q194p224k024R945m972p511R436R55q564O430L732j0668K793
3730b415Q565p636j893Q864o208n309J0255n76r001O461K673r439M458P872r595
3745b924j123Q883n994l923R985k591r004P704K630q528N375N100j0124J036R020
$$ plain form
3642 -7147 2229 5803 -5435 -1799 5257 -3708 -3334 6686 -397 -6369 3821 2016 -5491 2912
3656 2912 4555 -6549 -1063 6116 -2983 -2276 6270 -1839 -5498 5650 2420 -5391 2931 3636 -6370
3671 -6370 724 6299 -3833 -2198 5561 -2610 -3733 6752 1253 -6362 2969 2565 -5749 2359 5462
3686 5462 -5734 -2646 5535 -2394 -3405 5855 -773 -6666 3615 2585 -5395 2301 3515 -6616
3700 -6616 -1304 6515 -2823 -3724 5067 -1723 -5468 5580 2311 -5861 1887 3208 -5712 940 6507
3715 6507 -4123 -2937 5257 -1967 -3991 5954 982 -6529 2907 3862 -4702 1728 5460 -5208 -2415
3730 -2415 6150 -1486 -3379 5485 -723 -6032 4223 3647 -5354 1107 3780 -5659 -1201 6671 -2924
3745 -2924 -4047 4836 -1158 -5081 4904 2313 -6691 1013 3643 -4885 490 5590 -4534 -3498 5522
3760E522o005l628R062m632o792R352J492r395N498M143r701K816Q847p533l209
3775d163Q673m750m938R523m92r779O680L567q511L480P173q798j895R449m960
3790B59m770R019k634q406P923L559q706L496N154r147P11R654o338m830Q822
3805C766k841p270R043K064r850M318M854q368K250Q396q032l704R686l414n940
3820e042Q685k99r465O603M544q594K443O840q413j766R711l791n885Q040j438
3835B173q002P511L956j0070L339O349q591K86R403o213n418Q568j715o622P756
3850B710J915j0031M182O284q390J541P490p128l952R602k829o537P845J44q744
3865e898N558N582q656J319O554p072j775R563l901o674P970k24q101P415L901
$$ plain form
3760 5522 -483 -4111 4951 319 -6473 2879 4371 -5024 474 4617 -5084 -2268 6579 -954 -4163
3775 -4163 4510 -240 -5178 4345 3853 -5926 754 4321 -4190 -710 6463 -2335 -4230 5219 259
3790 259 -4511 4508 1874 -6532 1391 4950 -3756 -260 4894 -4253 -3542 6112 -226 -5056 3766
3805 3766 925 -6345 2698 4762 -5088 -770 4084 -4284 -2034 6362 -1670 -5374 4312 898 -5042
3820 -5042 3643 3344 -6121 482 5026 -3568 -1125 5715 -2698 -4464 5247 1456 -4429 3611 2173
3835 2173 -5829 1682 5638 -4432 -1093 5256 -3335 -3049 6354 141 -5277 3291 1576 -5046 2710
3850 2710 4625 -5406 -1224 5060 -3330 -1789 5701 -1427 -5379 4223 1394 -5143 2702 2846 -5898
3865 -5898 -340 5242 -3414 -2095 4459 -2613 -4388 5175 1274 -5400 2570 2346 -5755 1660 5561
3880E561r749K108P043p453k67Q673o027n085Q176n10o883O937J696r635M254
3895a161O963q039k04P848o830l867J0104k455p338O991R13q338N602N542q951
3910c220L90P573o914j466Q745m077p081Q364L70p542N993L651r465K195P675
3925E191o972j403Q288n615n166R155n68p709O102K519q815L956P358q314j119
3940c112P521n234l941R571k341p733O602K236q103N146N166r506K98Q335n475
3955e70k946Q625l890p129P869K016q336N193L708r230K198Q260o892k812P955
3970D019m091n226Q393K60q938N933L198q204L509O654p812j894Q441m558m161
3985d477Q587j920q251O606L836q322L634N577q902j19R029n235m141Q093k620
$$ plain form
3880 5561 -4188 -2080 4963 -2490 -2757 5916 -111 -5196 2980 2470 -4413 2524 4220 -5415 -1161
3895 -1161 5802 -2237 -2441 5407 -1423 -5290 4814 2359 -4979 2012 2925 -5413 189 5731 -3220
3910 -3220 -2830 4743 -2171 -3637 5108 1031 -6050 2314 2684 -4858 1135 4786 -4679 -2484 5191
3925 5191 -1781 -3184 5104 -511 -5677 3478 2910 -4799 1303 3822 -4993 -1037 6321 -1993 -3112
3940 -3112 4409 -825 -4766 4805 2464 -5269 1333 3569 -4534 612 5778 -3728 -3430 4905 -570
3955 -570 -3516 5109 1219 -5910 1959 3975 -4361 832 4540 -4690 -2492 5768 -1124 -3936 4019
3970 4019 -72 -5298 3095 3355 -5583 350 3548 -4656 -1147 5507 -2305 -4199 4242 -316 -4477
3985 -4477 4110 2190 -6061 545 4381 -3941 -307 5270 -3632 -3751 5278 43 -4098 3995 1375
4000A375o832P748J872q323M419M060p966J546Q396p321l506Q415l146n310P988
4015C415N7q889N044M664q014K523O512p554k360R156m086n080P863j144p934
4030e827O422M045q421K702N565p982k40Q652m573n156P998j700o590P311K406
4045D612r210L092O023p745J249P530o730l690Q646k079o021P090M37q536N013
4060c19N689p959R98O561p365j756R164l568o003P170k32p679O582L947q761J918
4076a613O195o968q20Q488m991n713Q325q50o649O419K363r122L261O501p397
4091b571J44P356o238l962Q866j472o678O378J106q428N182N670p978k7P066o149
4107a735k046Q551l407o299P068R65p591N675L924q740J316P312o506j699Q472
$$ plain form
4000 1375 -5457 2291 4163 -4160 259 4319 -3647 -2101 6295 -1026 -4532 3883 737 -4573 3415
4015 3415 3472 -5417 -373 4291 -3723 -1200 5312 -2242 -4602 4554 468 -4612 3251 2107 -5827
4030 -5827 595 4640 -3781 -1079 4486 -3496 -3736 4916 343 -4813 3185 1485 -5105 2206 4612
4045 4612 -4598 -1506 4517 -3228 -1979 5551 -1179 -4869 3777 1698 -4323 2767 3204 -5332 -319
4060 -319 5370 -2589 -1591 4970 -2395 -4151 5013 1445 -4558 2612 2380 -5299 1283 5230 -3531 -1613
4076 -1613 4582 -2386 -3206 5282 291 -5422 2903 2053 -4596 1823 4186 -4936 -1675 4826 -2571
4091 -2571 -2427 4929 -1309 -5271 3595 2123 -4555 1823 2929 -5499 -317 5353 -2625 -2652 4414 -1735
4107 -1735 -3781 4770 1363 -4936 2132 3097 -4494 1181 5105 -3635 -2319 4993 -1513 -3212 5260
4122E260m882n966Q314L34p496N698K496p972K956O673p275j032P208n141m197
4137e022Q846j502o981N660K334p916M392N170q225k89P815n209l045Q139k744
4152A423p370P241K208p568M708M234q919J219P927n860k934Q030m372n473Q245
4167B739P40p677M754L393p975K805O921p217j969P810m548l865Q156j060q145
4182e138N890L079p563L613N196p703q52P724m630l605P976k806o965P179K110
4197C505p636L678M451q007J138Q070n988l225P296k947n371P545Q89q391M863
4212a30M081p309K098O594p074k437Q192l644m280P377j055p739N903L751p253
4227b925K065N486p461m17Q130m343m351P245k047o461P123K407q041K806N037
$$ plain form
4122 5260 378 -5588 2726 3060 -4436 1262 3758 -4214 -1258 5415 -1860 -2892 4316 -825 -5022
4137 -5022 3824 2322 -4659 1001 3335 -4581 -189 4981 -3244 -3533 4282 -927 -3972 4167 1423
4152 1423 -5947 1294 3502 -4066 642 4876 -4043 -2824 5103 -757 -3691 4339 -33 -5506 2739
4167 2739 3479 -4198 556 3949 -4026 -1221 5700 -1517 -3486 4324 -224 -4089 4067 3007 -5138
4182 -5138 752 3831 -3732 -119 5077 -2626 -3478 4246 -384 -3989 3987 1181 -5784 1395 3505
4197 3505 -4131 -453 3998 -4009 -2871 5199 -789 -4014 3282 335 -5036 2509 3398 -4993 -130
4212 -130 3951 -3358 -1260 5334 -1740 -4177 4015 371 -3909 3468 2413 -5326 577 4328 -2925
4227 -2925 -860 4626 -2835 -3252 4878 535 -3816 3429 1382 -5079 2044 4451 -3590 -784 4253
4242D253p208O93P630o000l932Q030k328n732P424Q65q746M551M884p049R24O483
4258D742o615k627Q272k557n574P103n50p461N449M487p916J715N762o562j271
4273c603Q639m410n282P323q08o236N998K677q250K398N827o098m52P620o002
4288f59l885Q228j845o092O276J184p902M305N667p577L35O258n690k892Q356
4303D067k498n976O555J60o904N125L989p988J143O500o250j071P836m123n698
4318e133P548o8o736N528K738q491K907O267n990j260O868m910m165Q125r02o318
4334c992N433J698p584M345N058p136q21P039n013k881Q049k294o376O075J303
4349B903p041M903M218q136M29P303n516k194P372l631n547P252P86p116M766
$$ plain form
4242 4253 -2955 -2262 5368 -632 -4564 3466 1138 -4594 2830 3695 -5051 -500 4384 -2665 -1741 4742
4258 4742 -1873 -4500 3772 1215 -4359 2744 2194 -5267 182 4669 -3247 -1532 4230 -2332 -3603
4273 -3603 5036 626 -4656 2667 1859 -4377 1621 4298 -3952 -1554 4273 -1825 -2277 5343 -659
4288 -659 -4544 3684 1839 -4253 2023 3207 -4695 -390 5277 -2300 -1965 4293 -1397 -4289 4067
4303 4067 1569 -4407 2148 2308 -4596 529 4518 -3470 -2327 4173 -2077 -3148 4688 565 -5133
4318 -5133 2415 2347 -4389 1139 3877 -4614 -1707 4560 -1430 -2690 4178 -732 -4897 3228 2326 -3992
4334 -3992 1441 3139 -4445 -100 4958 -2178 -2999 4040 -973 -3854 4195 1901 -4475 1600 2903
4349 2903 -4138 765 4983 -3153 -2724 4579 -937 -3131 4241 610 -4937 2315 3101 -4015 751
4364G51K770p491K148O879o303j949O842m082l992P811o15p550N020L031p185
4379c915K921N855p357q58P050m121l303P454k053o478O177K215o939L263M094
4394D005p006N76P235n232l062P068k809n295P081R95p622M082L789p060K068
4409a187O549o477k578P457l292m341P187p71p164N288K710o660K435N203o891
4424b532r00P180l711l916O640j426o686O936K050p234K945M519o793J18P461
4439D651m840l882P190k434m981O878Q54p304L696M147o641J357O358o556k030
4454c537P330k440n012O456j90p264N221L799p005J802N287o611r93P860l972
4469G31m626O472j232n865O320K175p625K264N225o321J65O941n184l807O902
$$ plain form
4364 751 3521 -3970 -1822 5057 -1246 -3195 3647 -435 -4427 3384 2769 -4781 239 3270 -3915
4379 -3915 -994 4861 -2496 -3354 3696 -425 -3728 3726 1673 -4805 1372 3587 -3352 -89 4005
4394 4005 -3001 -2425 4810 -422 -3484 3584 775 -4520 2561 3556 -4066 16 3805 -3255 -1187
4409 -1187 5362 -1115 -3693 3764 472 -3869 3318 2547 -4617 671 3381 -3279 -844 4359 -2532
4424 -2532 -3432 3748 37 -3879 2761 1335 -5351 1585 3635 -3599 -654 3865 -2928 -2810 4651
4439 4651 -189 -4071 3119 685 -4296 2582 3436 -3868 -172 3975 -2666 -1309 5049 -1507 -3537
4454 -3537 3793 1353 -3659 2797 2607 -4657 564 4363 -2642 -840 4447 -2164 -3157 4703 731
4469 731 -3895 2577 1345 -4520 1800 3975 -3650 -1386 3839 -2482 -2317 4624 -560 -4367 2535
4484B535j079n607O370N59p294L833M626o599R78O016n872k598P621k165n204
4499c880O319j77o684M956L916p153J173N308n549j026O870l568m906O777m95
4514A881n749M911L007p561K023N734n791m88O645n224l712P222r69n487N018
4529A460J475p281L908N008o718k12N868m937k581P380j779o143N896P12o237
4544d181M664L242o947O86O421n126j901P279l562n404O943N47o349M449K930
4559C691p612K448N812n428j608O394l849l694O901o34o482N156J935o488L360
4574i8N005o837j039O606m390k745P190k179n961N476K133o146L038L754o777
4589b970N20O298m569k290O364l091m643O141J132o403L587L127o845K202N892
$$ plain form
4484 2535 1456 -4151 2219 2778 -4516 -683 3943 -2656 -1678 4338 -1534 -4132 3489 1324 -3880
4499 -3880 2439 2262 -4422 534 4450 -2703 -1530 3778 -1771 -2797 4073 505 -4401 2376 1881
4514 1881 -3868 1043 4050 -3511 -1488 4246 -1545 -2033 4612 -612 -4324 2898 1929 -3558 1460
4529 1460 2935 -4346 -438 4570 -2148 -2360 3508 -1429 -4010 3370 1591 -4552 1344 2056 -4181
4544 -4181 483 3725 -3222 -2536 3885 -1241 -3142 4137 575 -4829 2114 2661 -3688 761 3691
4559 3691 -3921 -1473 4339 -1089 -2697 3697 -152 -3846 3055 2421 -4061 1095 3030 -3458 -98
4574 -98 4907 -1930 -2969 3637 -753 -3498 3692 1513 -4448 1028 3161 -2985 53 3807 -2970
4589 -2970 -2450 3848 -721 -3011 3353 262 -4381 1760 2892 -3511 76 3203 -3642 -1440 4452
4604D452n869j877O623l452l638O638l34o615M539K968o675K479N268o591j179
4619c263O883l654l133O299j543n991N712J989o433K772M149o319L15O821m942
4634c38l036O316k232m959O594Q74o764L164L638n977J413N406n175k341O481
4649C064k138m394O033l20o845M296L622o009J427M974n833j143O822k903m553
4664c900O347j145n656N213K878o504J729M557n738L39N755l906l561N841p00
4679A549n068N468R59o743K941M787n655M4N941n352k347O493j761m471N149K76
4695B210o110L782M057o271N95N284n244j039O492l094m433N580l19n328M689
4710H51K744o735J519M754m896n53O107m047l729O347n69n425M751J464o391L099
$$ plain form
4604 4452 -1417 -3294 3329 -123 -3761 2877 2543 -4072 467 3435 -3240 -761 4507 -2084 -3263
4619 -3263 3620 -34 -3167 3132 1589 -4402 1310 3299 -3134 -362 3787 -2532 -2217 4604 -338
4634 -338 -3374 2942 710 -4249 2345 3219 -3545 -381 3257 -2720 -1307 4099 -1076 -3417 3064
4649 3064 926 -3468 2565 2245 -4600 -304 3318 -2691 -1264 3710 -2123 -3266 3556 653 -3900
4664 -3900 2447 1302 -4354 859 3737 -2767 -1038 3519 -2219 -1880 3875 -31 -3592 2249 1549
4679 1549 -3519 1949 2908 -3835 -894 3893 -1762 -1718 4223 -1129 -3476 3017 1256 -3215 1934 2210
4695 2210 -3900 -118 3939 -2332 -1737 3547 -1697 -2736 3756 662 -3771 1809 1490 -3838 851
4710 851 3595 -3140 -1621 3133 -1763 -2316 3791 -256 -3985 2362 1793 -3632 1119 2583 -3808 -709
4726g09M282n121O7N077m652k519O792j489n712N175J428o049L419M043o412M02
4742a978N455m457j621O296k959m527N357O38n305L742K424o178J655N314n162
4757a306j278N644l265m099O410k38m785L752J680o077K891M605n617r99N639
4772B957l393l044O432j714n060M508J805n589L410L095n743J69N730l938k092
4787b467N857k656m634N650R38n395L279K576n847J091N774m880j930N416k621
4802A51l668O107j62n694L590K365n609K299M823n463j345N625k864l019N517
4817B653j285n597M876K185n612K236L582n340l25O123l671k542N101j841m263
4832c720N430R73n556K548L052n371J256N186m379k311N298j857l437N258l5n756
$$ plain form
4726 -709 3573 -1548 -1481 3596 -1056 -3575 3217 1728 -3984 1191 2619 -3430 -11 4032 -2380 -1978
4742 -1978 3477 -980 -2601 3695 736 -3791 1566 2204 -3101 641 3065 -3113 -1458 3856 -1306
4757 -1306 -2584 3060 -205 -4304 2106 1868 -2917 835 2515 -3562 -671 3934 -1683 -2682 2957
4772 2957 -436 -3480 2952 1238 -3822 686 2491 -3098 312 3407 -2336 -2167 3563 -375 -2467
4787 -2467 3390 734 -3900 1750 2688 -2707 572 3148 -2699 -1608 4166 -714 -2644 2772 151
4802 151 -3517 2590 2428 -3266 324 2689 -2920 -621 4202 -1261 -2606 3019 155 -2864 2653
4817 2653 1368 -4229 647 2832 -2780 -544 3038 -2302 -2627 3496 -175 -2717 2384 543 -3720
4832 -3720 1710 2683 -2873 -325 2727 -2644 -1388 3798 -581 -2892 2406 549 -2888 2370 2335 -3421
4848c421L434K860n050J418M021m715j313N981k694l437N437r49n224M299K412
4863C059n567K072L569n207o5N687l419l443N425q60m822M517J795o085K746L764
4879C166n449J019M897m485k515N607j480l828M820K15n852L813L087n009Q72
4894a122M256m702j405N975j932m198M892n31m755M393K557n704J215M012m583
4909a632j03N374l462l610N326l92m277M331J100n768K116L965m488K0M735m078
4925h43k388N572r16m610M355O39n208L536L377n803O04M792m300j378N401k211
4941F19l966M587L02m712L882K440n780J230M319l853j262N317l086l383N331
4956A985k31m479L765J495n509K266M121m305q59M185l221j865N238r21m908M378
$$ plain form
4848 -3421 13 2873 -2177 -759 3262 -1453 -2766 3215 521 -2916 2521 1572 -3652 647 3059
4863 3059 -2508 -436 3133 -2074 -2139 3548 129 -3314 2111 1251 -3571 946 2741 -3344 -598 3166
4879 3166 -2283 -1264 3633 -852 -3367 2240 760 -3068 1752 1967 -3885 -72 3015 -1994 -1122
4894 -1122 3134 -1568 -2973 3002 1070 -3128 1764 1233 -3522 871 3428 -2276 -1061 2951 -1632
4909 -1632 -1735 3639 177 -3433 1893 1501 -2776 1555 2655 -3113 -997 2968 -1520 -1500 3235 -843
4925 -843 -3231 2341 1425 -3185 1170 1809 -3399 137 3514 -2289 -1685 3107 -1193 -2571 2830 619
4941 619 -3347 1240 1542 -3170 712 3152 -2628 -1398 2921 -932 -2194 3123 37 -3346 1985
4956 1985 1754 -2725 1040 2535 -2974 -708 3413 -892 -1751 2434 -787 -2652 2586 1665 -3243 1135
4972A135Q05m849L177L056n115j94M657l306j643N307k262m255M697O92m635K916
4988A83K587n226Q34M705m084j376N002k311l611M997M27m917L175J724m880K177
5004e94L883m675o17M438k761k185M943r02m760L777J538m509K064L265m835k50
5020b180N100k745k289M593j835l820M370J206m670K282K505n020J208M531l968
5035g32j819M834k269l148N066N1n183K781K800m590J371L974m375j334M899k245
5051H1k707M585n66n101M449J768m614J616L277m699k02N184l012k443M397j041
5067I72l821L851J487m875K143K837m356L73M782l660k000M288j474l075M699
5082B171k86m407K569K704m351Q33L670l848j556M964j689l569M013l19m056L759
$$ plain form
4972 1135 1940 -2909 268 3324 -1791 -1985 2672 -634 -2277 3030 768 -3487 1210 1902 -2733 183
4988 183 2770 -2456 -1622 3083 -1001 -2377 2625 314 -3297 1700 2127 -2790 385 2109 -2771 -594
5004 -594 3289 -1386 -2003 2435 -326 -2511 2432 1530 -3230 547 2085 -2424 -360 2905 -1930 -2180
5020 -2180 2920 175 -2114 2479 644 -3176 1194 2400 -2270 12 2517 -2503 -1295 3236 -732
5035 -732 -2551 2283 14 -3134 1932 1983 -3200 -419 2381 -2209 -838 3136 -1239 -2573 2326 81
5051 81 -2626 1959 1393 -3708 741 2509 -2105 -489 2788 -1911 -2113 3071 59 -2384 2013 972
5067 972 -2849 1002 2489 -2386 -243 2594 -1762 -1389 3393 -267 -2267 2021 547 -2528 2171
5082 2171 1885 -2522 47 2751 -1600 -767 2903 -945 -2501 2463 774 -2795 1218 899 -3157 602
5098F02K155m536N51L735m007k59M623k872k715M287q71l583M096J222m926J567
5114i31L386l885K46M073l750k058M970q61l624L867J9m258K907K805m541N15
5130a120L542l533o96M479j864l605M064K5l574K975K001m675Q98L455l405p23
5146a756M579k791k644M215m54l531L073J401m796J838L729l850n05L822l026
5161f96j762M727j086l611L115M31l938K713K758m208j22L783k908j450M916k036
5177F26l481M077L08l342K310J798m354Q59M157l699p27M138k569k826M333J88
5193A796l968K353J871m352J777L241l882o55M003k737j904M533o36m148L254
5208E46Q95l884K716K172m167J75L744k634j719M394j701l141L752M17l610K353
$$ plain form
5098 602 2757 -1779 -1228 2507 -1500 -1759 2864 -8 -2723 1564 693 -2890 1206 2428 -2498 -931
5114 -931 2455 -1430 -1184 2889 -861 -2919 2051 1190 -2434 1433 1452 -2806 101 2906 -1635 -1120
5130 -1120 2422 -1111 -1807 2672 808 -2797 1267 1292 -2282 693 2694 -1981 -1083 2372 -1033 -1756
5146 -1756 2823 32 -2612 1603 1149 -2382 691 2092 -2704 -866 2863 -987 -1492 2330 -696
5161 -696 -2458 2269 1183 -2428 687 1118 -2820 -107 2651 -1557 -1679 2104 -804 -2254 2662 626
5177 626 -2855 1222 1530 -1812 498 2296 -2058 -1199 2958 -741 -1468 2670 101 -2725 1608 1796
5193 1796 -2172 181 2052 -2300 -523 2718 -1164 -1819 2184 -553 -2457 2076 1440 -2708 546
5208 546 1441 -2443 273 2445 -1722 -1547 2197 -437 -2156 2238 537 -2604 1148 1565 -2045 308
5224C08J954m434O60M309l369j155L559k102k036L736K76l940K517J532l875J389
5240f71L622l899q97L968j913k110M009q85l683L216J058l493J333K638l653k01
5256a561M153k732j643L447j254l096L890R48m192K144J922l639M98L784l217
5271e48j738L780j281k442L532N71m447K480J801l628R42L589l366j342M204j822
5287B85k278L622m45l800K969J607l634J287K443l355k64M223k680k099L468o29
5303G20k795L074J277m288J594K356l481R04L022k667j924M022j060l204L760
5318A310L00m008K222K465l653N64K839k974r83L865j428k533L159k67l416K600
5334F2K002l625R07K584l145j51L600k154k244L147J15l130K905J156m073J450
$$ plain form
5224 308 2262 -2172 -1512 2797 -572 -1727 1832 -270 -2306 1430 1706 -2234 283 1815 -2060 -671
5240 -671 2951 -948 -1845 2123 210 -1900 2109 1224 -2459 757 1815 -1678 -345 2293 -1360 -1561
5256 -1561 2592 -140 -1783 1664 410 -2686 1204 2152 -2040 104 2026 -1613 -1115 2669 -548
5271 -548 -2286 1494 213 -2229 1303 1874 -2573 -93 1708 -1920 -978 2611 -755 -2097 2107 285
5287 285 -1993 1629 1184 -2616 353 1960 -1674 -387 2056 -1299 -1563 2660 -20 -2119 1349 720
5303 720 -2075 999 2276 -2012 -418 1938 -1543 -639 2383 -284 -2208 1814 754 -2450 1310
5318 1310 1610 -2398 -176 2289 -1364 -800 2039 -935 -1918 1947 519 -2014 1145 878 -2538 62
5334 62 2064 -1561 -654 1930 -1215 -1366 2234 80 -2164 983 1098 -2032 873 2029 -2044 -594
5350e94K673l370R4L525k993j838M255r38k723L389k38l575K283K597l717J67
5366a003L026k876q22L440r01l023L002N05l151K391J691l821K38L307k849o92
5382a538L721k153k228L050M88l092K503J040m100J437L084k885q95L516k244
5397b96k165M134m41l450K828Q21l464J857L003m130k54L766k329j712L964j415
5413G17k865L073O58l329K022J897l620L17L592k826j166L474j993k215L778j91
5429A323l247K161J514l799J414L149l211j203L620j904j949L892m92l622K579
5444B25J531l573J727K013l493J07L479k208j616L369j029k979L095Q31l109J803
5460A73J912l631M25L645k962j095L069j087k429L321j0l541K075J839l009J023
$$ plain form
5350 -594 2079 -1291 -1197 2328 -665 -2503 1752 814 -1909 1480 1242 -2333 -50 2547 -1170 -1003
5366 -1003 2023 -853 -1675 1765 864 -2159 843 1348 -1803 588 2279 -1542 -1304 2003 -846 -1538
5382 -1538 2183 30 -2198 852 1340 -1752 751 1791 -2309 -872 2212 -673 -1568 1948 -296
5397 -296 -2461 1673 1232 -2218 610 1431 -2033 -176 2827 -1303 -1557 2209 -120 -1832 2132 717
5413 717 -2148 925 1583 -1746 276 2173 -1447 -1130 2462 -364 -1530 1944 -49 -2264 1514 1323
5429 1323 -1924 237 1751 -2048 -634 2515 -696 -1899 1721 -183 -2132 1760 1268 -2354 225
5444 225 1756 -1817 -90 1923 -1570 -1463 2016 -192 -1808 1561 532 -2447 648 1479 -1630 173
5460 173 2085 -1546 -1121 2524 -438 -1533 1536 449 -1980 1341 1331 -2210 -135 1704 -1305 -282
5476b82K556l028j083L541j509j848L328n54l702L195J185l195J351K264l377
5491a158k58L590k202k102L235q76k901L153J118l578J750J950l078J51L425k591
5507c72j418L332p79k617K816M98l598J903K009l176P82K862l078o66L424j461
5523D61k409L081j99l401L044J272l016L80K925l173k71L692j888k458L219l79
5539H80k534K680Q45m015J704K366l023p7L422k558j876L580j044k534K929N46
5555A291l751K420K135l206M6K990k902q39L405j101k440K948Q6l205K430J669
5571A976l473N65K747k580k56L446k066k803L518N1k726K219J105l381R35K889
5587B166k712m36K995k485j506L587m71l282K696N67l005J973K330l598N3L113
$$ plain form
5476 -282 2274 -754 -1837 1704 195 -1653 1675 1121 -2581 614 1799 -1396 -45 2219 -1158
5491 -1158 -1416 2174 -28 -2130 1105 229 -2672 481 1599 -1979 -229 1721 -1357 -1206 2219 -372
5507 -372 -1790 1542 763 -1854 962 1460 -2138 -235 1774 -1402 -620 2242 -836 -1502 1922 461
5523 461 -1948 1133 934 -2467 577 1849 -1167 -787 2138 -1035 -1306 2386 498 -1960 1259 880
5539 880 -1654 1026 1871 -2144 -440 1926 -1097 -1174 2248 -310 -2186 1394 350 -2184 745 1291
5555 1291 -2460 -40 2095 -1111 -1065 1925 -977 -1816 1589 488 -1952 996 1082 -2123 307 1976
5571 1976 -1497 -932 1815 -765 -1021 2425 359 -2444 1074 1125 -1601 618 1723 -1658 -723 2166
5587 2166 -546 -982 2013 -472 -1978 1609 1138 -2144 552 1119 -1886 87 2417 -1181 -1128 1985
5603A985k415j153L263j211k560K740N51k961K139J538l620M13L448k704r10L526
5619B069k252k292L495L11l087K119J308l245Q42K795k714o49K988j694j545L049
5635A498l68l052K425J064l267J677K368l561j11L279k063j319K949q64k521K525
5651F59Q28l083J718J817l438K28L205k234j288L272j550k291L139N83l542K018
5667D1J422k919J059K338k373j297L007q80k094K794l72k547K086J715l387J000
5683d07K234k818l18L188j813j652K951p28k666K616J424l727J681J672l120N33
5699i50L140k145j779L023j010k162K828M81l140J636J679k864P94K286k496r64
5715a643L220j160k118K617j4k971K304J118k890J352J889k771l65L103j534j831
$$ plain form
5603 1985 -430 -1583 1680 469 -2091 649 1200 -1761 378 1916 -1704 -1291 2157 -547 -1457 2069
5619 2069 -183 -2475 1020 1331 -1756 363 1671 -1574 -732 2063 -651 -1300 1688 -6 -1551 1498
5635 1498 1130 -1922 503 1567 -1700 -23 2345 -1216 -1327 1952 -111 -1430 1519 655 -1866 659
5651 659 1487 -1596 122 1939 -1499 -1271 1934 -300 -1588 1684 134 -2157 982 1565 -1977 41
5667 41 1463 -1456 -397 1941 -432 -1729 1278 398 -1696 1098 726 -1821 265 1980 -1407 -407
5683 -407 1827 -991 -1309 1879 66 -1586 1365 637 -2029 587 2011 -1716 -35 1637 -1483 -950
5699 -950 2190 45 -1734 1289 279 -1883 945 1426 -1714 -78 1601 -1263 -469 1817 -679 -1643
5715 -1643 1577 417 -1701 916 902 -2069 235 1353 -1537 -185 1704 -1067 -1432 1671 137 -1694
5731a694K651m18k598K571J003l169J031K503k801j67L145k170j705L286j198
5746B70k016K726M48l217J684K063l082L81K586k541o93L322j343k304K598J23
5762A005k811K006J323k516P17J829k399j94K894j671k298L129j66k610K453Q10
5778A501l265J143K542k963l0K737j690j902L191n43k431K339L94k826J440K453
5794B090l154J0K726k096j260L483j567j749K330M14l130K504J282l476Q22K579
5810A808k506m58L074j599j808K684l8k726K277R50l514J501K142k724k47K701
5826A517j760j578L108l66k812K331N07k947J853K161l272l7L030k030j295L139
5842A549j124k500K633O55k635J676J429l022L22K648k178p37L005j461k217K941
$$ plain form
5731 -1694 957 539 -2059 512 1515 -1654 -623 1880 -921 -1088 2057 -113 -1818 1468 270
5746 270 -1746 980 1428 -1789 -105 1958 -1124 -743 1843 -698 -1391 1931 588 -1716 882 1005
5762 1005 -1806 200 1523 -993 -276 1553 -846 -1040 1854 183 -2115 1014 848 -1762 691 1501
5778 1501 -1764 -621 1921 -1042 -1072 1665 -25 -1927 1264 721 -1710 629 1023 -1803 -363 2090
5794 2090 -1064 -1054 1672 -424 -1684 1799 232 -1517 813 1227 -1903 601 1883 -1593 -771 1808
5810 1808 -698 -1156 1918 319 -1489 1195 1157 -1569 708 1658 -1856 -355 1787 -937 -1184 1517
5826 1517 -243 -1821 1287 921 -1891 440 947 -2000 -147 2014 -1258 -1295 1735 -295 -1590 1549
5842 1549 425 -2075 558 1213 -1422 254 1683 -1339 -1017 1631 -547 -1284 1721 260 -1957 984
5858I84L66k711J710J229l211J378J993k473n30K931j587j600L005l17k999K333
5874E01R52k768J313J686k751q0K701j659j156K695r81k251K408O03k869J792
5890A36J305l000P93K624k051j448K897r32k075K898q5k942J956J467l025Q01
5906f81K630k552p02K724j227j554K889o53k688K079J261k836J299J616k735l30
5922a460L134j453j508K574m81k627K465P90l066J872J294k627K14K729k196j370
5938a716K978r11k096K809K46l180J804J768l111Q35K394k810k24K655j683j306
5954a548K610o12k442K227J412l153J369J697k562K7K817j861j502K646o79k139
5970a693K408P47k944R98J916k151m8K682k317j221K735k61k465K477N06k963
$$ plain form
5858 984 1350 -1361 349 1578 -1633 -255 1738 -735 -1265 1666 79 -1521 1484 1167 -1832 501
5874 501 1453 -1315 -2 1684 -1067 -1147 1554 -105 -1261 1434 453 -1798 610 1213 -1656 136
5890 136 1441 -1559 -766 1858 -193 -1641 1256 324 -1751 1147 1062 -1880 76 1543 -1482 -681
5906 -681 1949 -603 -1305 1419 192 -1362 1527 874 -1814 265 1526 -1310 -11 1605 -1130 -1460
5922 -1460 1674 221 -1287 1287 806 -1821 644 1434 -1632 240 1534 -1093 -879 1850 -346 -1716
5938 -1716 1262 351 -1745 1064 1310 -1870 -66 1702 -1409 -574 1820 -990 -1214 1441 -242 -1548
5954 -1548 1062 450 -1992 235 1647 -1506 -137 1560 -1002 -975 1842 -19 -1521 1125 446 -1693
5970 -1693 715 1462 -1482 -484 1432 -719 -767 1915 -402 -1623 1112 851 -1614 863 1369 -1594
5986a594J403K074l056M96K053k110n41K724r99j990K482k96k247K143R40k881
6002a399Q93J862k078j07K543j895j475K417j03k440K007R03k352J248J422k149
6018g03r2K530j975j548L073m54k410J984P80k593J665J589k785J68K179j968
6034e60q67L055j302k197K481N17k567K049J043k959M55K798k335m87K541j662
6050Cj571K259M90k606J671R24k876J403K045k369m86K140j231j390K754m32k446
6067a718K222N55k299J129J680k707MK722j868j331L059q51k468K671K25k539
6083a514J928J241k933L55K715k261r35L049j487j806K724K87k986J698J268k489
6099a146P18K711l232j58K250j303j310K685n58k605K356O63k463J017J955k681
$$ plain form
5986 -1594 -191 1883 -1173 -677 1376 -734 -1275 1449 450 -1540 942 646 -1601 542 1482 -1399
6002 -1399 -506 1356 -722 -829 1714 -181 -1656 761 658 -1782 225 1128 -1224 24 1446 -703
6018 -703 -795 1735 -240 -1788 1285 831 -1579 405 1185 -1408 257 1846 -939 -771 1408 -560
6034 -560 -1427 1628 326 -1871 610 1127 -1440 609 1652 -1307 -852 1946 -389 -876 1665 3
6050 3 -1568 691 1181 -1425 246 1170 -1706 -303 1742 -627 -1113 1027 -204 -1594 1160 728 -1718
6067 -1718 504 1059 -1240 -111 1569 -1138 -1134 1588 -280 -1611 1448 597 -1871 800 1025 -1514
6083 -1514 414 1655 -1278 -923 1792 -469 -1404 1645 158 -1648 1076 1363 -1623 75 1343 -1146
6099 -1146 -428 2283 -949 -1107 1143 -160 -1470 1215 657 -1948 408 1071 -1392 -375 1580 -1101
6115a101R0K508j685j021K378j051j717K495K21k692J456J314k360N46K327j799
6131i1r51K370j186j589K589j02k537J318J467k350N46J961k274k51K481j053
6147C48j616K341o02k613K549J015k424Q91J537k674J01K737j284j862K744o91
6163D97k215K311P73l046J400J510k377N27K556k351j442K844n69j721K117K47
6179A061k433J436J252j900j6K140k301o40K681p44k297K645l67j948K007R51
6195A527k730Q95J993k449p6K722j691j780K426j23j978K098M07k737J086J781
6211A371k195M03K138j960j050K442o43j776J940J22k490J715J658k725M58K054
6227A462j863o80K540j459j436K097J30k203J965Q69k597N19K030j909l62K591
$$ plain form
6115 -1101 -1011 1497 -188 -1209 1169 118 -1599 896 1117 -1575 -119 1195 -1165 -619 1708 -91
6131 -91 -1042 1328 142 -1447 1142 1040 -1497 -179 1288 -1062 -516 1445 -829 -1080 1401 348
6147 348 -1268 1073 471 -2142 407 1422 -1002 -111 1426 -1248 -1147 1590 306 -1556 1188 497
6163 497 -1718 593 1366 -1680 -280 1230 -1147 -620 1936 -415 -1857 987 418 -1303 814 1061
6179 1061 -1372 64 1316 -584 -600 1540 -761 -1401 1280 536 -1761 884 517 -1431 576 1527
6195 1527 -1203 -308 1685 -764 -840 1882 191 -1589 837 714 -1264 834 1241 -1496 -410 1371
6211 1371 -824 -421 1717 -243 -1293 1149 506 -1270 670 792 -1698 17 1675 -1050 -592 1462
6227 1462 -401 -1081 1459 0 -1436 661 791 -1412 553 1422 -1175 -656 1374 -535 -897 1694
6243A694k169j185K468k50j577J434R26k717J281J629k247k42K629j859j356K995
6259A454o89j791J321L63k132J556J320k173P4J979j715o64K695j171j898K399
6275I28j88k195J530J438k955O55J963j531m20K075j215j469K656m03k095J356
6291A30Q10k259J202J860k370l54K259j598q37K351m89k356K096P13k121J245
6307B82J406k547L1J993j158j010K207r64j791K099O18k135J162J239k423M12
6323e79J839j603o34K230j223j378K060K27k423J644Q27k227Q21J745k164KK098
6340A262j368q60K213l09k570J823Q89k210J073J367k404M97J962j622q66K684
6356A561j276j706J911O06k456J354J078k056L74K187j874o54K199j028j238K077
$$ plain form
6243 1694 -475 -1660 808 558 -1019 415 1341 -1376 -95 1534 -713 -955 1674 -185 -1541 1454
6259 1454 765 -1026 295 658 -1474 82 1402 -771 -697 1282 -433 -1097 1598 427 -1471 928
6275 928 740 -1455 75 1513 -1442 -787 1176 -355 -775 1300 85 -1384 1272 869 -1226 130
6291 130 940 -1319 -117 1743 -627 -981 1278 -320 -1157 1194 705 -1651 445 1158 -963 282
6307 282 1688 -859 -828 1165 7 -1003 1204 240 -1551 548 1166 -969 193 1432 -991 -579
6323 -579 1260 -343 -977 1253 30 -1348 712 939 -1484 160 987 -1240 -419 1326 -838 -836 1262
6340 1262 -106 -966 1247 938 -1632 191 1080 -1130 -57 1310 -1094 -597 1365 -257 -1123 1561
6356 1561 285 -1421 490 1096 -1360 -6 1072 -984 -610 1577 -297 -951 1248 220 -1018 1059
6372A059j28k596J999R22k292Q81J458k174k54K343j068j334K133o03k189K075
6388B32R39k278L85K274k098k75K409j633j232K334m60j946J796N70k413J115
6404b81J374j992L95J992j805q85K104o74j346K074j16k228J398J483k247O5J965
6421A276j692o70K489j435j372K040M9k183J712J262k464O97J372j609j92K148
6437A428j385j378K303l41k037J591O38k068P40J792j800p7J862j745q46K262
6453I39l93j734J741o4j717J238J345k129L37J217j240m66K298q83j817K095j44
6470F23j815J654M91j978P20J643j947K21J559j320j171J947m4j864J885M06k402
6487a392J050J651j806j70J993j585p91K196l86j878J264M63j785J117J285j884
$$ plain form
6372 1059 931 -1665 334 1256 -1036 -155 1303 -871 -1125 1218 150 -1184 949 346 -1843 232
6388 232 1171 -1107 -722 1552 -546 -821 1588 -45 -1277 1057 597 -1349 447 1017 -1396 -281
6404 -281 1093 -899 -504 1488 -317 -1202 902 228 -1118 956 840 -1388 10 1493 -754 -689 1276
6421 1276 -416 -1086 1403 -32 -1404 636 685 -1498 214 1476 -988 -291 1081 -528 -720 1428
6437 1428 43 -1335 968 627 -1410 181 819 -1249 -509 1283 -517 -594 1268 -477 -1323 939
6453 939 546 -1188 553 489 -1228 10 1355 -774 -437 780 -460 -926 1372 489 -1328 767 623
6470 623 -1192 462 953 -1025 -305 1338 -609 -388 1171 -149 -1320 627 583 -1281 604 1010 -1392
6487 -1392 -342 1309 -497 -667 1326 -259 -1050 1146 760 -1118 146 609 -1176 -59 1226 -658
6503f58j64K071j600q43K310q21j616K200k55j779J235J052k474Q75J750j895
6519f12l51K153j176j266K261l46j981J712N19k001R11J825k006n79K008j194
6535a23o66K121q00k061K147J94k065J573R61k060m8K055j488o80J852p98j346
6552a232J651P36k180J031R51k088O14J605j300p19J897r79j174K005M51k683
6568a414J429P75j777R32J525k106n08J872m85j216J900m31j971J606P94j612
6584f87P63J096k284L65J993j142j287K020l22j753J790L27j890Q89Q62j843M29
6601f74J919j498o08J526n55j137K100o30j744J249J135j977L76J790j830k89
6617h47K065j395r55J772m71j618J876M50k035R61R78j425k51K037j071j313J909
$$ plain form
6503 -658 -822 1249 -351 -1194 1116 295 -1321 879 624 -1155 80 1132 -1342 -467 1283 -612
6519 -612 -963 1190 14 -1252 1009 663 -1318 394 913 -1088 -177 1648 -358 -937 1071 -123
6535 -123 -789 1332 532 -1529 618 812 -1253 320 1281 -779 -827 1228 -260 -940 912 114 -1232
6552 -1232 419 1155 -1025 6 957 -1131 -517 1088 -212 -931 966 -13 -1187 818 1269 -1414
6568 -1414 15 790 -987 -55 1470 -636 -1144 728 243 -973 927 496 -1475 131 925 -687
6584 -687 76 1172 -1112 -747 1246 104 -1183 837 515 -1238 552 879 -1011 -122 740 -1103 -674
6601 -674 1245 -253 -861 665 110 -1027 1073 443 -1301 -52 1083 -894 -518 1272 -558 -847
6617 -847 1218 -177 -1132 640 169 -1449 427 877 -1158 -197 781 -644 -895 1142 71 -1242 667
6634F67j79j410J558K93j956R67P37j304K68J512j510o14J898p85r98J359L15
6651H18k013J188J389k124N01J264j356k42J624p11j434J589j2j941J807P89k123
6668i87M08J533j607j67J688j208p36K075p36j349J466O27k178J032J353j754
6684e40J5J703j248j044K195n55j615J644L06k051J234J262k030K38J804j781
6700d63m06J763n17j463J495J48j701J480P66j667K16J659j595r8J543j095j068
6717a003J773Mj936J530N04j758R32J092j635j20J582j432q11K155n39j540J380
6734A78Q28j993R84J286k033j3J747j532l96J926o75j671K100J58j527Q74R09
6751A150j958M25J571j378m95J866j097r37J483O30k427J286O26j518O93J298
$$ plain form
6634 667 488 -922 636 929 -1027 -60 677 -627 -359 1153 -357 -971 927 142 -856 503 818
6651 818 -1195 -7 1382 -742 -241 1023 -333 -575 1049 338 -1096 493 481 -1460 347 1136 -987
6668 -987 -579 954 -653 -820 868 -340 -1076 999 263 -1086 380 1007 -1171 -139 1214 -540
6684 -540 -525 1178 -70 -1114 1081 526 -1089 555 861 -1190 44 1306 -724 -486 1318 -463
6700 -463 -869 894 377 -1086 409 557 -1144 336 1102 -565 -349 1310 -285 -383 1160 65 -1003
6717 -1003 770 774 -1162 368 872 -886 46 1138 -497 -617 965 -467 -1278 877 338 -1202 178
6734 178 1006 -987 -3 1283 -750 -763 984 -548 -944 982 307 -1364 736 894 -633 241 1150
6751 1150 -808 -383 1188 -190 -685 1181 84 -853 630 1260 -1167 119 745 -773 -80 1218
6767A218j569l53J606r46q08J663k09j737J662M00j720P97J172k047K73J598r80
6784B0n90J349r51r48J632J7j495J122Q45j747L72J681j712O2Q92k82j735K320
6802H52k17j624J001P92j547M68J408j306p48K239j149j013J857o74j685J743
6818C97L90k027J045J325j980L92J410p92r15J548p07j368J767J20j542P71J225
6835A059j692L05J271j285o59J692p02q82J692Nj919J156R52j636M47J216j556
6852e36l26J624p35r31J438k77j444J595O78j932P43R34j592K25J335o56j198
6869a055J454j32j152J345K75j999J231R30j608M28J477j453o15J775q54j106
6885a059J576j52j057O54J302j992J72J612j776j52J959j016j317J703j99r28
$$ plain form
6767 1218 -351 -704 902 -44 -852 811 602 -1135 527 927 -793 4 1176 -871 -598 1000 20
6784 20 -570 779 -172 -1120 512 529 -966 156 1001 -746 -374 1307 -405 -343 549 267 -1468 852
6802 852 635 -989 12 804 -743 -275 1133 -173 -921 1318 169 -844 1013 339 -1346 397
6818 397 787 -1240 -195 1130 -850 -458 952 160 -755 793 86 -1282 485 605 -937 -166 1059
6835 1059 -633 -328 943 -342 -1001 691 -11 -893 799 804 -1115 41 993 -643 -196 1020 -536
6852 -536 -862 762 27 -904 534 257 -1187 408 1086 -846 -103 831 -761 -536 799 143 -1055
6869 -1055 399 267 -885 460 735 -1264 -33 897 -711 -283 1194 -259 -874 901 47 -1059
6885 -1059 517 365 -692 -38 1264 -728 -556 1056 -720 -872 1087 71 -1246 457 258 -670
6901f70P91R03j687J90J207j226k05J650j028j159J778j80j377J504K02j786Q99
6918a94J192j370l29J525j106j016K200o39j277J633L00j618Q00R01j700L32J297
6935I31j338LJ734j367p94J251J79j391R78P82j935K98J880j299m58J503r78q87
6953i08J653r8j683J122N05j710J071J502k100j32J645r09o93J355k69j557J489
6970B83M13j659J039R21j459r6J739j297o52J594o90j341J989J70j795R95P49
6987I03j728K84J552j435l69J689r15r79J986j07j814P35J044j745N71J377j794
7004g45O0J582j092l40J326n46j208J385K79j689J144O32j656K50J730j255p02
7021h45J448p22p54J328O4j276P56O94j198K71J259j589r5J544n26j219J480p3
$$ plain form
6901 -670 121 1024 -663 -473 734 -492 -697 953 -75 -1234 544 364 -1013 491 693 -1093 -194
6918 -194 998 -372 -701 824 -282 -1298 902 263 -1014 619 919 -699 101 1002 -698 -366 931
6935 931 -407 -404 1330 -37 -831 420 599 -792 186 968 -967 -669 1211 -88 -546 957 -21 -908
6953 -908 745 647 -1036 86 591 -1119 -48 1454 -646 -778 867 -42 -735 620 351 -1206 283
6970 283 696 -963 76 997 -462 -558 1181 -116 -768 826 136 -1205 784 954 -841 154 903
6987 903 -825 -541 1011 -424 -793 896 -19 -998 988 881 -933 -198 846 -899 -328 1049 -745
7004 -745 -685 897 -195 -535 791 245 -963 422 701 -988 156 788 -868 -618 1112 -143 -845
7021 -845 603 -119 -873 455 519 -757 -1 693 -505 -234 1025 -564 -659 885 359 -860 620 547
7039E47j372Q13J003j748O68J241j657l32J986j030j000J840n86j348J123O86
7055H34j976J035J076j589R0J342p67q15J009K18j425J621J24j699J069R96j879
7072g36M66J265j137q11J723n81j495J650j33j162R55J029j852O41J241j698j3
7089f48J631o91j187J440k27j411J254Q61k029O65J195j527K25J320q68q14J489
7106F78k06j225J145M0j533R74J296j629R5J361j193n09J534o86j211J574o6j317
7124h78P74J050j786N68J232j171k84J255r46r88J944k41j530J287J96j446Q11
7141a53J327j161p69J443q67q12J819l55j593J374K81j793R17J423j740j58J784
7158I67j415o90K076l15j663J275M88j710J185Q89j615R6J454j143o68J826j119
$$ plain form
7039 547 -825 -12 991 -757 -89 1152 -505 -837 1149 119 -881 959 373 -975 148 834
7055 834 -1142 -107 969 -620 -530 812 45 -770 239 457 -968 653 777 -922 147 1143 -736
7072 -736 -270 995 -142 -953 770 189 -1306 344 211 -951 4 1033 -819 -178 1063 -635 -648
7089 -648 983 292 -895 545 318 -1093 161 1022 -1007 -342 853 -674 -449 871 3 -811 678
7106 678 472 -753 392 432 -1101 -127 1169 -460 -365 996 -197 -706 828 142 -1069 505 439 -878
7124 -878 -104 946 -840 -272 960 -211 -495 760 -186 -1174 770 529 -1001 286 482 -964 -153
7141 -153 1174 13 -756 687 -180 -992 827 472 -1121 253 534 -1259 -342 1081 -659 -817 967
7158 967 -448 -1138 938 623 -1040 235 723 -987 198 1087 -528 -432 1022 -121 -789 1037 -82
7175h2q30J497J02j406R02O78j788P62J346j439j5J166r62j034J779k10j459J148
7193A55O43j836R07J320j612l63J705j135m86J860p22j531J332J81j147O10J193
7210A074j829K3J559r80m56J325o23r79J692j68j371J112M92j681O33J412j355
7227a20n90J575m88j448J676M3j756J170M56j349R92R27j757k47J833q02j003
7244h88J343n8j391J134N93j615P71P39j194J30J353j211p36J809o07j143J488
7261E17K14j768R26J042j904Q12J408j570m38J598n75j062J580l22j366J062O62
7278H16j524P46R34j328m13J623q52q70J318J4j373J361J15j509P44J041j512
7295f69r8J898j231p35J458j97j528J590K36j359O04J199j632l85J857j446k42
$$ plain form
7175 -82 -912 585 687 -719 183 861 -927 -165 1181 -258 -273 893 -69 -1103 676 466 -993 155
7193 155 798 -1038 -131 1189 -423 -786 919 -216 -702 1158 436 -1095 237 418 -729 -119 1074
7210 1074 -755 -732 827 -153 -609 716 93 -886 806 638 -733 379 871 -810 -177 1235 -120
7227 -120 -710 865 377 -1071 605 648 -1108 62 518 -831 161 1088 -669 -916 917 115 -888
7244 -888 455 397 -994 140 733 -882 -111 628 -566 -436 917 -294 -1030 779 172 -971 517
7261 517 731 -1037 -111 931 -973 -161 1247 -323 -761 837 262 -800 780 458 -908 154 816
7278 816 -708 38 972 -356 -769 854 2 -868 450 464 -909 452 567 -942 -198 843 -669
7295 -669 -767 1131 -100 -835 623 426 -1102 488 724 -635 -31 1168 -464 -849 1008 -438 -680
7312f80J369n80j214J797j45j724J395Q30j621O01R48j539p6J760j015j044J274
7329C36k5j018O73O43j616R99Q62j314j79J512r31j055J839k36j546J643Jj421
7347h33J034N53j307m7J453j274j46J532j021q47J331J93j533R39P81j246J0J674
7365A246j679j99J688q01j235J301J01j079J074L54j726M96J835j702k02J517
7381I89j219n49J694n37j338J276L25j666J170J003j547k00J535r72r05J764n02
7398C21j071R12M63j613O82J214j575K98J084j188k57J429q04j073J963j81j526
7415i22J073N64j288J82J521j604qJ283q06j169K075n97j534J428O29j479M76
7432a76R94j371p9J496o22r33J283m60j263J374O47j569P29P51j197rJ275j012
$$ plain form
7312 -680 689 109 -1105 692 547 -1177 218 1048 -573 28 976 -563 -639 1121 106 -938 336
7329 336 311 -707 -34 609 -1007 -8 854 -460 -639 873 -58 -1113 726 490 -1056 587 588 -833
7347 -833 201 754 -553 -600 853 -421 -567 965 -56 -903 428 621 -912 27 808 -438 -428 1246
7365 1246 -433 -632 1056 255 -980 321 422 -657 417 771 -955 -459 1376 -326 -528 989
7381 989 -230 -779 915 378 -960 316 641 -1025 145 1148 -399 -599 936 -36 -941 823 321
7398 321 -750 162 625 -988 -306 908 -667 -369 715 -473 -730 699 -105 -1178 785 604 -922
7415 -922 151 715 -573 -391 1130 -474 -482 801 -5 -1174 901 304 -1230 198 827 -652 -176
7432 -176 818 -553 -632 864 242 -691 592 132 -1131 243 890 -679 50 801 -396 -405 870 -142
7450a42l73J050l09j360J437K30j325M72J268j844N08J040j044l75J378k67r79
7467f35J411l67j499R18J013j731R21J031j767j86J646r39o78J590n18j326J418
7484C02O02j447M61P75j195K9J293p77j137J853m37j198J392J65j609R12J080
7501A064j699L48J379j727q6J564j037n85J134K22j545Q59J336k246R42J134j563
7518e06k46J507j124m55J543o25j146J260O28j843O57J559j786K80J365j227p09
7535h68J567m17j142J306J40j322O34P21j374K06J457j415j24J548q82q25J348
7552E58K1j531R68J109j884L92J359j305j45J446p28r84J226j38j293J423K96
7569G90j694M07J272j135k44J601j258n54J341J58j720J414L23j878R98J085j361
$$ plain form
7450 -142 -515 535 226 -1134 303 533 -792 -320 948 -896 -388 652 -392 -767 611 344 -635
7467 -635 776 409 -1090 -172 841 -890 31 1062 -705 -891 755 -184 -862 728 210 -1116 302
7484 302 904 -543 -82 693 -502 -473 820 43 -1094 759 322 -876 516 681 -928 -16 1064
7501 1064 -635 -287 1092 -635 -721 843 -194 -779 355 577 -968 -109 1227 -1019 -77 1057 -506
7518 -506 -752 755 -369 -824 719 94 -1052 208 836 -1007 -350 1209 -577 -297 1068 -159 -868
7535 -868 699 282 -860 446 586 -736 -102 619 -755 -549 908 -507 -631 917 35 -790 558
7552 558 579 -952 16 1125 -759 -367 992 -313 -458 988 260 -724 502 364 -929 494 790
7569 790 -904 -497 775 -360 -604 997 -261 -815 526 684 -1036 378 701 -1177 -179 906 -455
7586d55j61J290n86o57J535q40j343J475N53j608R06J104j570j19J245r76m91
7603f98J724o98j469J623J04j405Q95O14j299K77J137j105l70J328r44p50J559
7620E23l1j456J297L40j516O15J233j665N1J708j090j095J718j72j660J546J35
7637D81j151J027N26j439j14J675j225q36K005r66j553J855N18j663J073P20j260
7654c27J07J250j024q46J898q55j075J450Q2j848J444O26j488O68Q95j519j81
7671g43J849j054r18J617m02j689J631K67j217N62R49j584K36J806j611m51J645
7688H93o11j222J392K74j744R69P14j261K50R11j023j79J485j011o42J305Jj795
7706a294J600Q58j686L19R57j394j67J808r58q49J513n57j233J444N46j826Q73
$$ plain form
7586 -455 -616 674 88 -569 966 126 -1217 258 811 -797 109 1213 -357 -476 769 -207 -698
7603 -698 1026 328 -1141 482 586 -819 76 690 -609 -332 805 -300 -670 658 -286 -1036 523
7620 523 492 -964 333 673 -843 -228 1005 -660 -609 1099 9 -1086 632 460 -1200 346 481
7637 481 -670 357 883 -556 -670 1005 -220 -1056 949 -17 -1570 285 803 -860 213 933 -327
7654 -327 -220 1030 6 -840 1058 203 -872 578 660 -1188 256 882 -606 62 957 -562 -743
7671 -743 1106 52 -866 751 349 -1340 291 558 -659 -97 852 -732 -496 1310 -301 -752 893
7688 893 282 -940 452 726 -1018 -49 665 -596 -346 565 -458 -637 848 -163 -805 500 501 -1294
7706 -1294 306 1164 -522 -203 754 -640 -807 1001 43 -806 707 150 -1083 361 907 -919 -46
7723d6N04j065J43J403j094p46J589l54j202J345J47j664J429K98j376M55Q85
7740F51r58m42J641j129q00J612r9j433J079Q47j856R07O78j158k71J814j028
7757E5o82R92m6j119R69O18j673R97R84j678Q8J616r94j115J517l79j078J384
7775D56L39j428O96J094j799J1J450r78o38J603n67r69J007kj313J049O20j343
7793g12M32J011q28n75J374m22j305J593N7j217R99K90j410M20J152j323L0J291
7811H57r92m61J077o2j016R20M11j725J136P62j436J84J233j014o07J586j95j508
7829h50J443j82j089Q39R13j653rJ399r98k88J163n66r76J272J57j239Q26N95
7847G57j404N15J033r73o05J601j098p96J715k89j414J076N88j449K71J379j310
$$ plain form
7723 -46 458 -607 -464 939 -155 -901 688 334 -868 477 624 -1040 389 687 -689 -234 651
7740 651 -307 -749 892 -237 -1037 575 476 -957 122 969 -887 20 698 -460 -731 1083 55
7757 55 -627 365 319 -800 169 787 -886 111 1095 -583 -495 1121 127 -988 529 150 -928 456
7775 456 795 -633 63 1157 -642 -631 819 -159 -797 806 239 -730 277 275 -1038 11 631 -712
7793 -712 -280 731 -97 -672 702 280 -1025 568 625 -592 407 697 -713 -293 859 -464 -434 857
7811 857 -135 -596 481 419 -597 323 734 -991 145 907 -529 -345 888 -126 -733 853 658 -850
7829 -850 593 411 -678 161 1074 -579 -588 811 -187 -475 688 122 -854 418 575 -664 162 757
7847 757 -647 -132 901 -72 -677 924 -174 -970 745 456 -958 118 706 -743 -472 907 -403
7864d03m93J911j202n46J249k48j137J195K62j342N77J350j896J52J549q18p52
7881e92J421p42q37J080M3j261Q64M38j193K20J453j451k35J598p12j032J558
7898F20k66j512J572J38j052M51P67r27l36J256o74p92J289r5j557J416N67j470
7916f05M33N51j136L55J080o48r31J639l77j373J566J14j588R73P95j541K79J203
7934G89j100m93J542n88q72J317N7j352R42O53j513P55N85j126j70J316p53r45
7952i56J415L8j482J421K68j453M17J190j473rJ542j222n47J726o06q97J212k07
7970C77j170O87P16j072L3J582j213n26J143n36r32J200n4j408J304O28j437K47
7988d31J491j457k22J714j154o84J624m99j151J051K90j307O05Q26q72k3R68j094
$$ plain form
7864 -403 -896 1015 -187 -733 516 268 -869 326 588 -754 -177 1173 -723 -571 978 160 -592
7881 -592 829 87 -750 330 373 -888 -24 414 -779 -559 894 -557 -792 806 94 -938 620
7898 620 354 -1158 414 552 -500 -49 718 -209 -545 711 37 -755 534 439 -1118 298 865 -605
7916 -605 -172 379 -757 -402 678 30 -901 738 361 -1012 554 668 -920 53 848 -693 -414 789
7934 789 -311 -804 738 150 -722 595 652 -700 242 895 -618 137 722 -404 -574 742 -11 -956
7952 -956 459 497 -985 436 704 -749 -332 858 -615 -624 918 -304 -851 875 269 -628 584 377
7970 377 -793 -106 610 -462 -429 1153 -60 -586 557 21 -911 289 235 -1173 131 759 -678 -431
7988 -431 1060 -397 -619 1095 -59 -743 881 382 -769 282 572 -735 -130 696 -176 -199 769 -325
8006c25n03J542k84j232J008M43j684J149N78j151K95Q23j049l25J345n61r89
8023i20J553l5j353O57J067j871N22J479j475l44J396m18j033J037L55j271P49
8040I5O14j597L39J526j321K06Q23o54o39J186J38j736R85K52j037P34Q11j041
8058c16o8J208r41n17J436n64j267J156N37j527P18R69j256lJ393j167l96J255
8076F50n11p82J103l0j027O26N18j277O19Q77q04p44J377p17p83R61L45j518J390
8095B73Rp59L75Q97j109j60J226q85p58J470m30r65J245J57j476Q36P24j254J81
8114d03J345j090o98J441o10n28Q81l3j058R84N10j072m4R70r08l37J446p65p13
8133f82Q47J96j548J471K84j093K82Q93j296N5J279p48m21Q23m75p59J105L39
$$ plain form
8006 -325 -828 714 430 -802 206 649 -1035 114 692 -459 -164 659 -390 -715 630 69 -920
8023 -920 633 598 -755 -98 969 -902 -380 1099 -376 -720 676 258 -775 262 617 -654 95
8040 95 709 -888 -549 977 -344 -138 685 31 -608 578 716 -1020 -35 217 -820 -86 725 -316
8058 -316 -384 824 -117 -634 802 238 -1029 127 664 -863 -145 824 -432 -435 958 -209 -605 650
8076 650 139 -643 460 430 -597 29 547 -730 -111 766 -38 -782 595 -122 -905 56 401 -1117 273
8095 273 282 -477 -102 795 -314 -474 752 -133 -891 579 149 -816 429 586 -890 -54 670 -584 -403
8114 -403 942 -148 -846 595 -15 -543 338 305 -753 231 741 -331 -375 595 -313 -650 796 31 -682
8133 -682 165 361 -1187 284 568 -525 -243 650 -646 -591 688 -60 -481 342 -133 -892 213 552
8151E52j230N90P82j292L06J119q59n15J358o69j008J248M11j249L95J017j559
8168f03M39J077j273l09J174m13p07J005Or34O95L87r72K33R89r51k63J095o29
8187D6q37J460j18j283
$$ plain form
8151 552 -678 -88 694 -598 -292 827 -32 -547 811 142 -866 382 793 -456 -61 956 -603
8168 -603 -164 913 -360 -669 505 92 -615 390 396 -538 157 544 -428 -195 794 -157 -420 675 46
8187 46 -791 669 551 -732
8191g32
$$ Imaginary data points
##PAGE= N=2
##DATA TABLE= (X++(I..I)), XYDATA
0@%%%%%%%Mj2J6j6J6k4L2l3M1n0N8p2Q6r9J13j29J50j74J99k25K54k87L26l69
31a95M11m59N14n74O40p12P90q74R70j075J190j317J457j614J792j994K222k484
49a312K790l153L592m132M817n719O961q785J1720j7189L0607j18621j52869L31022
63G9729J2925j82565Q9072L3131j57414R1652J10117j14736j1939O2882r1004
74g8150M6553J16219j36611m6189J81943q4931j48317J97271O0892k22825O1346
85e2799J49568j52451k1789J77692q4263j13903J17016k810o5015J18884l1783
96C8347j59907J17863J02102j49452L0491J14641j60201l2392K14730o2392j63871
107a10041J26969L8081j32297Q8932P3739j49719K2543J17113j07274j7204J30336
$$ plain form
0 0 0 0 0 0 0 0 0 4 -8 8 -8 8 -16 16 -17 24 -26 32 -40 46 -53 60 -69 81 -93 106 -119 135 -152 174 -195
31 -195 216 -243 271 -303 337 -375 415 -459 511 -564 626 -691 766 -848 944 -1050 1172 -1312
49 -1312 1478 -1675 1917 -2215 2602 -3117 3844 -4941 6779 -10410 20197 -98424 -251293 79729
63 79729 92654 -89911 -839 32292 -125122 -33470 76647 -38089 -50028 12854 -78150
74 -78150 -31597 84622 -51989 -98178 83765 -1166 -149483 47788 108680 -114145 -52799
85 -52799 96769 -55682 -77471 100221 15958 -97945 19071 16261 -48754 70130 38347
96 38347 -121560 -3697 98405 -51047 -20556 94085 -66116 -98508 116222 53830 -110041
107 -110041 16928 55009 -77288 11644 85383 -64336 -41793 75320 -31954 -49158 81178
118H1178r1782p2245J54443m1346j41997J46728O5176j84036L9858J27867j24469
129d0625r153J49741j04909j04000J51501R406j07661Q6280L160j28687J02355
140G408R2382j51829R149J24379j16659l4414J70548p2613j34992J50153L1912
151G5424j62683Q0043J04833j36751l172J12106r3288k7295J34571o5347r4156
162g5715J13582j0274r5016J22835K2830j78739O3839J41121j25123k9863J34952
173H4429r5453r1806J63167J3235j41325O2971M6460r9717O1637P3180j22609
184d5831O605J07421j00208k9852J51202o4597j25832J32537K9665j43170Q5521
195C461R8912j53609j9814J37916n7054m7825R8795n8309q2567J18720J4110j01409
$$ plain form
118 81178 -10604 -82849 71594 30248 -111749 34979 100155 -83881 -44023 83844 -40625
129 -40625 -49778 99963 -4946 -108946 42555 51961 -55700 30580 33740 -94947 7408
140 7408 99790 -52039 -42890 81489 -35170 -69584 100964 28351 -106641 43512 75424
151 75424 -87259 -7216 97617 -39134 -42306 69800 -23488 -50783 83788 18441 -75715
162 -75715 37867 27593 -67423 55412 78242 -100497 -36658 104463 -20660 -50523 84429
173 84429 -11024 -102830 60337 73572 -67753 -4782 41678 -58039 3598 76778 -45831
184 -45831 -39226 68195 -32013 -61865 89337 24740 -101092 31445 61110 -82060 3461
195 3461 102373 -51236 -71050 66866 9812 -38013 60782 2473 -80094 38626 52736 -48673
207d8673P6821J9755j39584P7895J32828j39795n4002J38289n7282q2006J38626
218F2872j215j43181P1154O7619r9309L9222P3304j14999m391J13824p7590m2650
230e5340J29315n6395j21470J26144M9374j34398N2931Q0887j30112k65J38149
241G8820o8602o8048R4968l7852o9923J18854Q488j27317O2228O0486j06628M1790
253a2736J00936j19844m1968J34442m2774q2530J10435k127j19891P6300O3268
264F3511j03976L0050P7773j05839j3493J19242n7426o2260J02132l2589r7721
275h0596J09558M1775j27076L9140P8804j06483L463J20638p6295p1872J03558
286C4614j7811p8336R6244J5262j18130N2167O8575r3169K1746Q7817j01685l6204
$$ plain form
207 -48673 28148 47903 -91681 -13786 119042 -20753 -74755 63534 6252 -75754 62872
218 62872 61657 -81524 -10370 57249 -42060 -2838 70466 -44533 -48924 64900 -12690 -55340
230 -55340 73975 17580 -103890 22254 71628 -62770 -9839 71048 -59064 -59329 78820
241 78820 10218 -57830 37138 -714 -70637 48217 56705 -70612 -8384 52102 -54526 -12736
253 -12736 88200 -31644 -73612 60830 18056 -64474 45961 43834 -76057 243 63511
264 63511 -40465 -10415 67358 -38481 -51974 67268 9842 -52418 49714 17125 -80596
275 -80596 28962 70737 -56339 -17199 61605 -44878 -41415 79223 2928 -68944 34614
286 34614 16803 -61533 34711 49973 -68157 -15990 52585 -40584 -18838 68979 -32706 -68910
298f8910J25462l8730q2589J01634J48j15852P5226P0785j04940J4340Q0301r2121
310c5246j7288J18699m9339p5649R0310j2439q5409R5633L8484j24154L1012Q5264
322E9878q9646k325J06936p4682p0554J05788m961p9169P9841J3945j11723N3193
334a3479P8617r0882J203Q3170q3584l6592J17716k7863q5572P9682O608r5618
346f6594P1801O4240j07455J727Q2547p0297j6576J03197n2525p8729R0744O753
358B8833q1493P2444L5634j12830K5970Q9049p2817j4021Q6511o7002n7724J08709
370D1263q87q8894O3907K2914r5346N0492P6877r1484j2541Q3427o3437l4491
$$ plain form
298 -68910 56552 17822 -64767 36867 37015 -78837 -3611 67174 -37766 -23426 56875 -35246
310 -35246 -52534 66165 16826 -58823 31487 19048 -66361 29272 67756 -56398 -25386 59878
322 59878 -29768 -32093 74843 161 -70393 35395 30434 -48735 31106 45051 -66672 -13479
334 -13479 65138 -25744 -24541 58629 -24955 -61547 56169 28306 -57266 22416 29024 -66594
346 -66594 5207 69447 -38008 -36281 46266 -24031 -40607 62590 10065 -68664 22080 28833
358 28833 -52660 19784 55418 -57412 -31442 57607 -15210 -29231 57280 -9722 -67446 41263
370 41263 40376 -48518 15389 38303 -57043 -6551 70326 -21158 -33699 49728 -13709 -48200
$$ [...]
8191a05
##END NTUPLES=NMR FID
##END=
