##TITLE=1H_Ser 3061-A-319
 200.13MHz,CDCl3,
 8 sc
 
 26.6.2025
##JCAMPDX= 6.0         $$ Bruker NMR JCAMP-DX V2.0
##DATA TYPE= NMR FID
##DATA CLASS= NTUPLES
##ORIGIN= UXNMR, Bruker Analytische Messtechnik GmbH
##OWNER= pz
$$ XWIN-NMR		Version 3.5
$$ Thu Jun 26 15:49:47 2025 Russian Standard Time (UT+4h)  she@DPX200
##.OBSERVE FREQUENCY= 200.1313
##.OBSERVE NUCLEUS= ^1H
##.DELAY= (6, 6)
##.ACQUISITION MODE= SIMULTANEOUS
##.ACQUISITION SCHEME= undefined
##.AVERAGES= 8
##.DIGITISER RES= 18
##SPECTROMETER/DATA SYSTEM= spect
##.PULSE SEQUENCE= zg30
##.SOLVENT NAME= CDCl3
##.SHIFT REFERENCE= (INTERNAL, CDCl3, 0, 14.3821)
##AUDIT TRAIL= $$ (NUMBER, WHEN, WHO, WHERE, WHAT)
$$ ##TITLE= Audit trail, XWIN-NMR		Version 3.5
$$ ##JCAMPDX= 5.01
$$ ##ORIGIN= Bruker BioSpin GmbH
$$ ##OWNER= she
$$ F:/spectra/data/she/nmr/H-C/1/audita.txt
$$ ##AUDIT TRAIL=  $$ (NUMBER, WHEN, WHO, WHERE, WHAT)
(   1,<2025-06-26 15:47:25.32 +0400>,<she>,<DPX200>,
      <created by zg, POWCHK disabled, PULCHK disabled
       configuration hash MD5:
       00 E9 B6 7A A2 85 ED C7 34 08 36 98 17 FE 4E 26
       data hash MD5: 16K
       CD B7 F9 A9 77 4C 1C 6E 79 B6 42 B2 2F EF 73 94>)
$$ ##END=
$$ 
$$ hash MD5
$$ 9C D5 BA AB 1F 5B 55 C8 04 68 5D B2 0D 2B 16 9E
##$RELAX= 
##$RELAX= 
##$RELAX= 
##$RELAX= 
##$RELAX= 
##$RELAX= 
$$ Bruker specific parameters
$$ --------------------------
##$DU= <F:/spectra>
##$EXPNO= 1
##$NAME= <H-C>
##$PROCNO= 1
##$TYPE= <nmr>
##$USER= <she>
##$AMP= (0..31)
100 100 100 100 100 100 100 100 100 100 100 100 100 100 100 100 100 100 
100 100 100 100 100 100 100 100 100 100 100 100 100 100 
##$AQSEQ= 0
##$AQ_mod= 1
##$AUNM= <au_zg>
##$AUTOPOS= <>
##$BF1= 200.13
##$BF2= 200.13
##$BF3= 200.13
##$BF4= 200.13
##$BF5= 200.13
##$BF6= 200.13
##$BF7= 200.13
##$BF8= 200.13
##$BYTORDA= 1
##$CFDGTYP= 0
##$CFRGTYP= 5
##$CHEMSTR= <none>
##$CNST= (0..31)
1 1 145 1 1 1 1 1 1 1 1 1 1 1 1 1 1 1 1 1 1 1 1 1 1 1 1 1 1 1 1 1 
##$CPDPRG= <>
##$CPDPRG1= <>
##$CPDPRG2= <>
##$CPDPRG3= <>
##$CPDPRG4= <mlev>
##$CPDPRG5= <mlev>
##$CPDPRG6= <mlev>
##$CPDPRG7= <mlev>
##$CPDPRG8= <mlev>
##$CPDPRGB= <>
##$CPDPRGT= <>
##$D= (0..31)
0 0.7 0 0 0 0 0 0 0 0 0 0.03 0 0 0 0 0 0 0 0 0 0 0 0 0 0 0 0 0 0 0 0 
##$DATE= 1750938444
##$DBL= (0..7)
120 120 120 120 120 120 120 120 
##$DBP= (0..7)
150 150 150 150 150 150 150 150 
##$DBP07= 0
##$DBPNAM0= <>
##$DBPNAM1= <>
##$DBPNAM2= <>
##$DBPNAM3= <>
##$DBPNAM4= <>
##$DBPNAM5= <>
##$DBPNAM6= <>
##$DBPNAM7= <>
##$DBPOAL= (0..7)
0.5 0.5 0.5 0.5 0.5 0.5 0.5 0.5 
##$DBPOFFS= (0..7)
0 0 0 0 0 0 0 0 
##$DE= 6
##$DECBNUC= <off>
##$DECIM= 32
##$DECNUC= <off>
##$DECSTAT= 4
##$DIGMOD= 1
##$DIGTYP= 9
##$DL= (0..7)
0 120 120 120 120 120 120 120 
##$DP= (0..7)
150 150 150 150 150 150 150 150 
##$DP07= 0
##$DPNAME0= <>
##$DPNAME1= <>
##$DPNAME2= <>
##$DPNAME3= <>
##$DPNAME4= <>
##$DPNAME5= <>
##$DPNAME6= <>
##$DPNAME7= <>
##$DPOAL= (0..7)
0.5 0.5 0.5 0.5 0.5 0.5 0.5 0.5 
##$DPOFFS= (0..7)
0 0 0 0 0 0 0 0 
##$DQDMODE= 0
##$DR= 18
##$DS= 0
##$DSLIST= <SSSSSSSSSSSSSSS>
$$ [...]
##$SUBNAM0= <"">
##$SUBNAM1= <"">
##$SUBNAM2= <"">
##$SUBNAM3= <"">
##$SUBNAM4= <"">
##$SUBNAM5= <"">
##$SUBNAM6= <"">
##$SUBNAM7= <"">
##$SUBNAM8= <"">
##$SUBNAM9= <"">
##$SW= 18.0517328524113
##$SWIBOX= (0..15)
0 0 2 0 0 0 0 0 0 0 0 0 0 0 0 0 
##$SW_h= 3612.71676300578
##$TD= 16384
##$TD0= 1
##$TE= 0
##$TE2= 300
##$TE3= 300
##$TEG= 300
##$TL= (0..7)
0 120 120 120 120 120 120 120 
##$TP= (0..7)
150 150 150 150 150 150 150 150 
##$TP07= 0
##$TPNAME0= <>
##$TPNAME1= <>
##$TPNAME2= <>
##$TPNAME3= <>
##$TPNAME4= <>
##$TPNAME5= <>
##$TPNAME6= <>
##$TPNAME7= <>
##$TPOAL= (0..7)
0.5 0.5 0.5 0.5 0.5 0.5 0.5 0.5 
##$TPOFFS= (0..7)
0 0 0 0 0 0 0 0 
##$TUNHIN= 0
##$TUNHOUT= 0
##$TUNXOUT= 0
##$USERA1= <user>
##$USERA2= <user>
##$USERA3= <user>
##$USERA4= <user>
##$USERA5= <user>
##$V9= 5
##$VALIST= <valist>
##$VCLIST= <CCCCCCCCCCCCCCC>
##$VD= 0
##$VDLIST= <DDDDDDDDDDDDDDD>
##$VPLIST= <PPPPPPPPPPPPPPP>
##$VTLIST= <TTTTTTTTTTTTTTT>
##$WBST= 1024
##$WBSW= 4
##$XGAIN= (0..3)
0 0 0 0 
##$XL= 0
##$YL= 0
##$YMAX_a= 169584
##$YMIN_a= -318624
##$ZGOPTNS= <>
##$ZL1= 120
##$ZL2= 120
##$ZL3= 120
##$ZL4= 120
##$ABSF1= 10
##$ABSF2= 0
##$ABSG= 5
##$ABSL= 3
##$ALPHA= 0
##$AQORDER= 0
##$ASSFAC= 0
##$ASSFACI= 0
##$ASSFACX= 0
##$ASSWID= 0
##$AUNMP= <proc_1d>
##$AZFE= 0.1
##$AZFW= 0.1
##$BCFW= 1
##$BC_mod= 2
##$BYTORDP= 1
##$COROFFS= 0
##$CY= -3
##$DATMOD= 1
##$DC= 2
##$DFILT= <>
##$DTYPP= 0
##$F1P= 0
##$F2P= 0
##$FCOR= 0.5
##$FTSIZE= 0
##$FT_mod= 4
##$GAMMA= 1
##$GB= 0.15
##$INTBC= 1
##$INTSCL= 1
##$ISEN= 128
##$LB= 0.25
##$LEV0= 0
##$LPBIN= 0
##$MAXI= 10000
##$MC2= 0
##$MEAN= 0
##$ME_mod= 0
##$MI= 1.114404
##$NCOEF= 0
##$NC_proc= 0
##$NLEV= 6
##$NOISF1= 3.799351
##$NOISF2= 2.8
##$NSP= 1
##$NTH_PI= 0
##$NZP= 0
##$OFFSET= 14.38212
##$PC= 1
##$PHC0= -1198.177
##$PHC1= 10.7922
##$PH_mod= 1
##$PKNL= yes
##$PPARMOD= 0
##$PSCAL= 0
##$PSIGN= 0
##$REVERSE= no
##$SF= 200.129724274929
##$SI= 16384
##$SIGF1= 3
##$SIGF2= 2
##$SINO= 400
##$SIOLD= 16384
##$SREGLST= <1H.CDCl3>
##$SSB= 0
##$STSI= 0
##$STSR= 0
##$SW_p= 3205.1282051282
##$SYMM= 0
##$S_DEV= 0
##$TDeff= 0
##$TDoff= 0
##$TI= <>
##$TILT= no
##$TM1= 0
##$TM2= 0
##$TOPLEV= 0
##$USERP1= <user>
##$USERP2= <user>
##$USERP3= <user>
##$USERP4= <user>
##$USERP5= <user>
##$WDW= 1
##$XDIM= 8192
##$YMAX_p= 0
##$YMIN_p= 0
$$ End of Bruker specific parameters
$$ ---------------------------------
##NTUPLES= NMR FID
##VAR_NAME=  TIME,          FID/REAL,        FID/IMAG
##SYMBOL=    X,             R,               I
##VAR_TYPE=  INDEPENDENT,   DEPENDENT,       DEPENDENT
##VAR_FORM=  AFFN,          ASDF,            ASDF
##VAR_DIM=   8192,          8192,            8192
##UNITS=     SECONDS,       ARBITRARY UNITS, ARBITRARY UNITS
##FACTOR=    0.0002768,     1,               1
##FIRST=     0,             0,               0
##LAST=      2.2672688,     0,               0
##MIN=       0,             -318624,         0
##MAX=       2.2672688,     169584,          0
$$ Real data points
##PAGE= N=1
##DATA TABLE= (X++(R..R)), XYDATA
$$ [...]
$$ plain form
1978 232 -364 -550 354 360 -254 106 -110 -1466 -787 356 578 151 209 110 -952 -546 758 818 400 156
1998 156 73 -981 -51 1226 587 -132 393 -742 -1499 269 802 -283 -666 -505 -841 -784 304 994 -122
2017 -122 -502 544 -73 -85 1392 540 -386 183 605 -312 -332 365 -46 -521 -52 668 -550 -1230 546
2036 546 110 -189 956 -128 -1454 -428 551 292 258 779 311 -1442 -626 1829 643 -186 369 -714
2054 -714 -2017 -143 616 240 -20 -209 -1092 -1156 621 1633 -341 -412 1466 -229 -638 1156 459 -889
2072 -889 -270 173 -218 -735 12 -101 -674 222 1576 -760 -678 1183 -402 -336 1564 839 -1171 -1171 376
2091 376 287 87 761 378 -1854 -938 1530 460 119 547 -1375 -2092 -130 1007 408 -40 -59 -928 -1461
2110 -1461 1179 2400 -54 -54 811 -956 -1190 1178 538 -1048 -862 -161 -361 -688 663 409 -1313 201
$$ packed form
1978B32n96j86R04Oo14L60k16j356O79J143K22m27N8r9j062M06J304O0m18k44
1998A56q3j054R30J277o39p19N25j135p57J768N33j085l83J61l36N7J088O90j116
2017a22l80J046o17j2J477q52r26N69M22r17k0O97m11m75M69P20j218o80J776
2036E46m36k99J145j084j326J026R79k59l4N21m68j753Q16K455j186q29N55j083
2054g14j303J874P59l76k60j89q83o4J777J012j974p1J878j695m09J794o97j348
2072h89O19M43l91n17P47j13n73Q96J354k336Q2J861j585O6J900p25k010%J547
2091C76q9k00O74l83k232R16K468j070l41M28j922p17J962J137n99m48j9q69n33
2110a461K640J221k454%Q65j767k34K368o40j586J86P01k00l27J351k54j722J514
$$ plain form
2128 201 1390 -952 -77 1757 -333 -967 766 1371 -852 -1159 857 768 -694 349 967 -1566 -589
2145 -589 1298 -332 -434 841 -1085 -1829 522 1955 -19 -1218 423 210 -1784 958 2720 -300
2161 -300 -1037 -135 -821 -626 686 461 -1345 -1364 146 -268 -1107 1856 1243 -1668 -210 1737 52 -395
2179 -395 903 354 -1130 -307 1362 -268 -1136 589 218 -731 745 830 -1398 -790 953 -76 -471
2196 -471 494 420 -1395 -612 1289 840 -496 459 350 -1030 379 1503 204 -874 -258 -286 -1216 146
2214 146 886 -674 -1131 265 -111 -159 1300 1592 -451 -337 1101 149 -488 488 827 -862 -1013 100
2232 100 -595 -502 256 503 -401 221 391 -1191 -667 1112 383 -1179 -39 634 -1181 -1092 982 1087 -275
2251 -275 -627 123 -361 -115 663 -148 -808 -79 -756 -1031 466 1118 -315 -859 767 592 -106 312 1397
$$ packed form
2128B01J189k342Q75J834k090o34J733O05k223l07K016q9j462J043O18k533R77
2145e89J887j630j02J275j926p44K351J433j974j199J641k13j994K742J762l020
2161c00p37R02o86J95J312k25j806j9J510m14q39K963o13k911J458J947j685m47
2179c95J298n49j484Q23J669j630q68J725l71r49J476Q5k228O08J743j029l95
2196d71R65p4j815P83J901m49j336R55j09j380J409J124j299j078O16k8r30J362
2214A46P40j560m57J396l76m8J459K92k043J14J438r52o37R76L39j689j51J113
2232A00o95R3P58K47r04O22J70j582N24J779p29j562J140O73j815Q9K074J05j362
2251b75l52P50m84K46P78q11o60P29o77k75J497O52j433n44J626j75o98M18J085
$$ plain form
2270 1397 509 -895 -45 -3 -208 185 -138 -760 -325 -143 -471 153 589 642 -268 -446 621 182 -467 460
2290 460 651 -220 -401 -158 -431 322 426 511 -36 -369 -43 -407 -425 471 -333 -503 -33 -676 -518 484
2310 484 574 335 93 91 540 203 94 1134 49 -596 -37 -194 -92 417 -667 -240 297 -152 -5 194
2330 194 228 755 -107 -489 157 -108 -515 56 30 -111 -196 -1109 278 364 -8 214 52 43 480 -565 -138
2351 -138 851 22 -316 126 -8 320 92 263 812 164 -447 33 62 196 223 -586 -718 -157 -775 -414 398
2372 398 -127 -98 -176 -87 611 21 122 491 160 -237 -159 -579 464 398 -550 -401 -284 -409 -92 26 375
2393 375 610 -336 -342 10 -151 298 197 -149 322 344 -53 541 304 618 698 -83 -146 70 -46 -170 105 -659
2415 -659 -615 -360 -842 162 524 -22 -206 -237 6 74 -223 206 91 -526 -381 -371 -268 30 -10 119 -202
$$ packed form
2270A397q88j404Q50M2k05L93l23o22M35J82l28O24M36N3r10j78J067m39o49R27
2290D60J91q71j81K43k73P53J04Q5n47l33L26l64j8Q96q04j70M70o43J58J002
2310D84R0k39k42kM49l37j09J040j085o45N59j57J02N09j084M27N37m49J47J99
2330A94L4N27q62l82O46k65m07N71k6j41q5r13J387Q6l72K22j62rM37j045M27
2351a38R89q29l38M42j34L28k28J71N49o48o11M80K9J34K7q09j32N61o18L61Q12
2372C98n25K9p8Q9O98n90J01L69l31l97P8m20J043o6r48J49J17j25L17J18L49
2393C75K35r46oL52j61M49j01l46M71K2l97N94k37L14Q0p81o3K16j16j24K75p64
2415f59M4K55m82J004L62n46j84l1K43O8k97M29j15o17J45J0J03K98m0J29l21
$$ plain form
2436 -202 -476 127 390 489 865 704 -447 -135 246 48 186 331 75 -43 -602 102 389 412 260 -102
2456 -102 -456 -287 -171 -810 -176 418 -94 -790 -326 140 765 321 306 401 161 -8 -89 211 543 117 -664
2477 -664 -647 199 -89 -493 251 541 -240 -487 -150 -46 229 687 155 -117 68 -56 -375 252 916 115
2497 115 -982 -464 454 399 279 242 97 -729 -660 148 -40 126 54 -238 -308 459 566 -351 142 720 18
2518 18 -564 44 337 -304 -291 -116 -225 -604 -106 -71 -617 223 521 -199 -184 457 -50 -153 419 377 -590 -703
2540 -703 45 -377 -376 740 493 -796 9 385 -6 -184 394 159 -1050 -447 856 258 -445 405 49
2559 49 -616 755 729 -387 263 338 -119 -772 471 709 -812 -935 558 156 -147 367 358 -462 404 195
2579 195 -40 154 350 -265 -844 533 1196 -842 -1005 427 -167 -713 860 630 -399 -664 67 257
$$ packed form
2436b02k74O03K63R9L76j61j151L12L81j98J38J45k56j18n59P04K87K3j52l62
2456a02l54J69J16o39O34N94n12o96M64M66O25m44j5R5k40j69q1L00L32m26p81
2477f64J7Q46k88m04P44K90p81k47L37J04K75M58n32k72J85j24l19O27O64q01
2497A15j097N18R18n5j20l7j45q26O9Q08j88J66p2k92p0P67J07r17M93N78p02
2518A8n82O08K93o41J3J75j09l79M98L5n46Q40K98p20J5O41n07j03N72m2r67j13
2540g03P48m22JJ116k47j289Q05L76l91j78N78k35j209O03J303n98p03Q50l56
2559D9o65J371k6j116O50P5m57o53J243K38j521j23J493m02l03N14rq20Q66k09
2579A95k35J94J96o15n79J377O63k038j63J432n94n46J573k30j029k65P31J90
$$ plain form
2597 257 277 684 344 -864 -93 975 -356 231 1293 -195 -1249 245 803 343 -549 -199 -251 -748
2615 -748 80 723 -535 -555 386 -436 -646 858 421 -340 90 823 -77 -766 300 565 -790 -128 656
2634 656 -656 -821 353 -178 -605 475 888 -489 -912 348 851 -110 471 607 -1292 -679 867 421
2652 421 41 495 -16 -851 -409 1317 529 -711 -174 -215 -1071 -105 949 126 -671 119 -80 140 670
2671 670 752 -430 -499 334 113 -587 517 716 -809 -846 335 104 -203 -104 97 155 227 252 42 -195 456
2692 456 142 -176 506 708 -491 -874 390 549 95 97 264 -628 -524 212 351 -53 155 -481 -839 55
2712 55 509 -100 -340 159 -15 -145 253 647 -74 -369 -92 -41 -299 -9 -254 -374 -43 330 -56 154 275
2733 275 449 -73 -34 585 -49 -4 55 96 -77 161 385 -293 -262 -96 95 -80 27 -93 -588 -455 41 370
$$ packed form
2597B57K0M07l40j208P71J068j331N87J062j488j054J494N58m60q92L50n2m97
2615g48Q28O43j258k0R41q22k10J504m37p61M30P33r00o89J066K65j355O62P84
2634F56j312j65J174n31m27J080M13j377m23J260N03r61N81J36j899O13J546m46
2652D21l80M54n11q35M42J726p88j240N37m1q56R66J054q23p97P90j99K20N30
2671F70Q2j182o9Q33k21p00J104J99j525l7J181k31l07R9K01N8P2K5k10k37O51
2692D56l14l18O82K02j199l83J264J59m54KJ67q92J04P36J39m04K08o36l58Q94
2712E5M54o09k40M99j74j30L98L94p21k95K77N1k58K90k45j20L31L73l86K10J21
2733B75J74n22L9O19o34M5N9M1j73K38K24o78L1J66J91j75J07j20m95J33M96L29
$$ plain form
2755 370 295 -38 -404 -439 244 366 179 202 -103 34 -351 175 422 -117 -334 -280 -395 134 -245 -41 102
2776 102 7 214 -316 287 523 30 -391 363 458 -213 -189 -93 145 -294 -463 -80 2 -247 55 60 -180 220
2798 220 -231 -534 73 199 168 -45 144 105 -291 39 470 308 -509 115 -13 -102 389 35 -132 -26 -468
2819 -468 -109 -205 94 532 -81 -186 410 475 -172 57 155 304 -85 -474 -310 -192 -236 199 -300 -518 148
2840 148 -113 -137 287 -72 195 -56 -234 124 -50 198 134 -78 -110 57 -358 -35 424 0 37 332 -428
2861 -428 -138 145 -223 199 101 -311 160 -148 250 421 88 97 208 16 32 -46 -3 43 -313 -266 34 26 -56 150
2885 150 -470 307 60 -362 -16 332 174 209 -58 -181 269 -77 -161 339 -29 -480 -42 -210 -19 41 -247
2906 -247 111 -239 -361 -276 -39 269 364 -122 -151 334 154 249 436 83 240 -200 -120 65 -91 -634 -84 -274
$$ packed form
2755C70p5l33l66l5O83J22j87K3l05J37l85N26K47n39k17N4j15N29l79K04J43
2776A02r5K07n30O03K36m93m21P54R5o71K4R6K38m39j69L83Q2k49L02Nk40M00
2798B20m51l03O07J26l1k13J89l9l96L30M31j62q17O24j28q9M91l54j67J06m42
2819d68L59r6K99M38o13j05N96O5o47K29R8J49l89l89J64J18m4M35m99k18O66
2840A48k61k4M24l59K67k51j78L58j74K48o4k12l2J67m15L23M59m24L7K95p60
2861d28K90K83l68M22r8m12M71l08L98J71l33RJ11j92J6p8M3M6l56M7L00qq2K06
2885A50o20P77k47m22L46L48j58L5k67j23M50l46q4N00l68m51M38j68J91O0k88
2906b47L58l50j22Q5K37L08R5m86k9M85j80R5J87l53J57m40Q0J85j56n43N50j90
$$ plain form
2928 -274 -93 -218 -597 304 597 -63 -164 416 -170 330 -206 20 387 88 -14 -411 104 131 73 -376 351
2949 351 66 -148 47 146 284 -93 131 -154 -95 -48 -50 95 54 87 -198 -40 138 1 34 51 -166 -424 -274
2972 -274 248 -108 -38 -344 -137 -117 -179 285 428 94 89 14 -58 139 124 158 -133 -291 123 -410 -121 478 23
2995 23 -146 78 107 -190 217 466 291 -391 -57 166 193 361 390 359 7 26 5 -68 563 200 -152 -335 92
3018 92 -425 -285 -139 99 -150 -356 248 -135 176 312 413 -158 295 96 -499 -144 380 100 -435 -151
3038 -151 -167 -542 -199 445 7 -360 -67 258 62 -84 369 -185 -205 -111 -346 -453 317 171 -318 -242 133
3059 133 245 -17 73 292 -389 -568 51 289 -108 169 161 108 237 331 193 -48 130 129 -280 81 242 -382
3081 -382 -364 189 128 -498 -152 -70 37 -308 183 253 -76 -222 -30 -220 91 676 -234 -436 188 48 -101
$$ packed form
2928b74J81j25l79R01K93o60j01N80n86N00n36K26L67k99j02l97N15K7n8m49P27
2949C51k85k14J95R9J38l77K24k85N9M7kJ45m1L3k85J58J78j37L3J7k17k58J50
2972b74N22l56P0l06K07K0o2M64J43l34np5p2J97j5L4k91j58M14n33K89N99m55
2995B3j69K24K9k97M07K49j75o82L34K23K7J68K9l1l52J9k1p3O31l63l52j83M27
3018I2n17J40J46K38k49k06O04l83L11J36J01n71M53j99n95L55N24k80n35K84
3038a51j6l75L43O44m38l67K93L25j96j46M53n54k0R4k35j07P70j46m89P6L75
3059A33J12k62R0K19o81j79O19K38l97K77qn3J29R4j38k41J78jm09L61J61o24
3081c82J8N53o1o26L46Q2J07l45M91P0l29j46J92j90L11N85r10k02O24j40j49
$$ plain form
3102 -101 101 169 -138 -324 294 216 -283 -110 446 -217 -264 288 -49 135 288 212 -401 65 573 -26 -175
3123 -175 168 359 -529 -211 174 -587 -559 216 -41 43 -150 61 161 3 393 494 -313 -92 -29 -690 174
3144 174 487 55 -460 -144 -182 -327 92 513 -69 -573 -149 191 -234 404 141 -419 -190 183 107 -39 332
3165 332 231 -407 -258 570 296 -393 141 -199 -789 -239 208 -18 -236 354 125 -2 210 208 -372 7 387
3186 387 136 -482 255 187 -659 -223 305 139 -616 -103 56 -122 211 737 -99 -546 233 41 -181 332
3206 332 328 -322 -339 182 455 131 3 359 -383 6 300 25 -249 141 -186 -443 -317 226 18 -386 150
3227 150 338 -17 173 394 -313 -120 402 135 -387 -15 313 -671 -308 97 -51 -260 6 145 -423 411
3247 411 393 -74 -451 -8 -79 -398 145 259 -143 -316 51 223 -287 252 63 -137 -578 147 274 -69 87
$$ packed form
3102a01K02O8l07j86O18p8m99J73N56o63m7N52l37J84J53p6o13M66N08n99j49
3123a75L43J91q88L18L85p61K8P75k57Q4j93K11J00j58L90J01q07K21O3o61Q64
3144A74L13m32n15L16l8j45M19M21n82n04M24L40m25O38k63n60K29L73p6j46L71
3165C32j01o38J49Q28k74o89N34l40n90N50M47k26k18N90k29j27K12kn80L79L80
3186C87k51o18P37o8q46M36N28j66p55N13J59j78L33N26q36m47P79j92k22N13
3206C32mo50j7N21K73l24j28L56p42L89K94k75k74L90l27k57J26N43k08m04N36
3227A50J88l55J90K21p07J93N22k67n22L72L28r84L63M05j48k09K66J39n68Q34
3247D11j8m67l77M43p1l19N43J14m02j73L67J72n10N39j89k00m41P25J27l43J56
$$ plain form
3268 87 -98 108 124 264 91 -102 250 189 -97 294 208 -83 -448 -172 95 -217 -218 -300 -78 -378 121 45 -120
3291 -120 127 192 -94 41 214 38 -242 -160 155 -31 140 621 101 -279 38 135 47 -87 -144 -409 -259 -83
3313 -83 -192 -134 91 69 55 -246 94 332 44 229 -70 -94 3 -122 -145 -178 -220 -165 -294 -212 143 20 -80 257
3337 257 12 98 123 78 -5 96 -32 59 -363 -171 -65 -15 33 234 -92 -198 73 -45 169 350 -88 -213
3359 -213 -160 -197 -20 221 -5 345 -23 -339 30 58 19 -110 41 -331 -45 -210 96 -272 19 275 -231
3380 -231 126 -60 -138 -247 162 217 -77 -16 -106 298 -84 63 14 -57 210 -105 21 215 -188 -107 69 48 107
3403 107 8 -246 32 221 -202 -201 96 184 -211 -184 119 121 -93 -316 229 -45 -181 -181 -96 183 186 -249 178 -24
3427 -24 -24 244 25 246 310 -233 96 133 -145 114 -66 -44 -138 -302 -264 -71 -172 -69 -64 150 -151 -180 17 104
$$ packed form
3268H7j85K06J6J40j73j93L52o1k86L91q6k91l65K76K67l12jq2K22l00M99p6j65
3291a20K47O5k86J35J73j76k80Q2L15j86J71M81n20l80L17R7q8j34n7k65J50J76
3313h3j09N8K25k2j4l01L40K38k88J85k99k4R7j25k3l3m2N5j29Q2L55j23j00L37
3337B57k45Q6K5m5q3J01j28R1m22J92J06N0M8K01l26j06K71j18K14J81m38j25
3359b13N3l7J77K41k26L50l68l16L69K8l9j29J51l72K86j65L06l68K91K56n06
3380b31L57j86p8j09M09N5k94O1r0M04l82J47m9p1K67l15J26J94m03Q1J76k1N9
3403A07r9k54K78J89m23JK97Q8l95K7L03Kk14k23N45k74j36%Q5K79Lm35M27k02
3427b4%K68k19K21O4n43L29L7k78K59j80K2r4j64L8J93j01J03NK14l01k9J97Q7
$$ plain form
3451 104 172 -60 35 -110 -49 -61 59 -62 12 160 65 -48 141 58 128 -245 21 -163 -278 149 69 -237 212
3474 212 -71 -25 70 158 256 80 -216 186 25 -295 -199 -186 -154 -244 -218 -54 -207 44 -94 -100 259 15 -173 -174
3498 -174 -71 95 -27 -313 -196 224 -43 140 -88 166 149 -436 16 94 332 18 -362 21 -327 3 -71
3519 -71 18 380 22 73 136 292 88 -244 -201 39 -94 -610 -125 -27 -82 -296 -101 217 -118 -216 214 249 91
3542 91 -140 -9 -65 82 145 89 2 -35 -157 -379 77 244 51 -14 -23 -131 -62 42 176 -264 47 -43 64 -94
3566 -94 150 238 -150 -163 438 104 -82 19 -87 -241 -41 334 -43 -144 46 318 106 151 79 20 -115 327
3588 327 -244 107 46 -87 48 -180 -80 49 -210 97 14 -398 233 385 -116 -175 152 339 -137 -12 110
3609 110 80 -418 -62 203 26 360 -61 -330 151 273 -175 -256 -19 5 -476 -125 461 -191 -247 -30 6 212
$$ packed form
3451A04O8k32R5j45O1j2J20j21P4J48r5j13J89q3P0l73K66j84j15M27q0l06M49
3474B12k83M6R5Q8R8j76k96M02j61l20R6J3L2r0K6J64j53K51j38oL59k44j88j
3498a74J03J66j22k86J17M20k67J83k28K54j7n85M52P8K38l14l80L83l48L30p4
3519g1Q9L62l58N1O3J56k04l32M3K40j33n16M85R8n5k14J95L18l35r8M30L5j58
3542I1k31J31n6J47O3n6q7l7j22k22M56J67j93o5rj08O9J04J34m40L11r0J07j58
3566i4K44Q8l88j3O01l34j86J01j06j54K00L75l77j01J90K72k12M5p2n9j35M42
3588C27n71L51o1j33J35k28J00J29k59L07q3m12O31J52n01n9L27J87m76J25J22
3609A10l0m98L56K65j77L34m21k69M81J22m48q1K37K4m81L51N86o52n6K17L6K06
$$ plain form
3631 212 217 320 -171 65 357 -47 -198 332 23 -462 -300 288 168 -80 203 364 -488 -225 573 -24 -16
3652 -16 -137 -21 0 296 203 8 -264 -27 222 -339 48 393 -301 -288 101 3 -246 -106 -72 -336 -12 437
3674 437 -44 -494 116 88 -416 37 304 -57 156 -79 64 57 130 -61 -154 -428 425 5 -146 302 151 -38
3696 -38 -193 174 38 -66 194 460 59 -134 25 98 -211 328 166 -258 130 427 -153 -210 197 289 -167
3717 -167 -13 48 -64 -320 188 213 -244 208 -66 -311 71 247 -21 -211 -28 202 -141 -213 141 -112 -244
3738 -244 409 191 97 101 -71 -256 69 406 43 -325 -183 21 -436 -169 466 114 112 -3 -89 -161 -42 211
3760 211 7 29 148 120 -249 82 332 -210 -121 151 215 -195 43 -127 -33 128 -318 88 -193 -75 -53 -299
3782 -299 33 22 -117 -144 238 141 -14 -178 -50 -212 6 -20 10 -78 63 -180 -82 248 70 -113 191 0
$$ packed form
3631B12NJ03m91K36K92m04j51N30l09m85J62N88j20k48K83J61q52K63P98n97Q
3652a6j21J16K1K96r3j95k72K37K49n61L87L45o94J3L89r8k49J40L4k64L24M49
3674D37m81m50O10k8n04M53K67l61K13k35J43pP3j91r3k74Q53m20j51M48j51j89
3696c8j55L67j36j04K60K66m01j93J59P3l09N39j62m24L88K97n80n7M07R2m56
3717a67J54O1j12k56N08K5m57M52k74k45L82J76k68j90J83K30l43p2L54k53j32
3738b44O53k18r4Mj72j85L25L37l63l68J42K04m57K67O35l52kj15q6p2J19K53
3760B11k04K2J19k8l69L31K50n42Q9K72O4m10K38j70R4J61m46M06k81J18K2k46
3782b99L32j1j39k7L82r7j55j64J28j62K18k6L0q8J41k43R8L30j78j83L04j91
$$ plain form
3804 0 265 42 148 282 -108 127 -87 -104 85 205 -77 108 -12 -268 -127 -19 -63 -39 15 -117 18 130
3826 130 79 6 -99 56 426 -187 -119 57 201 225 -307 -213 -14 47 -5 234 24 17 -56 -70 -93 -65 312 164
3850 164 34 -99 292 -328 -7 69 -256 -59 205 -63 53 -254 138 176 82 -107 -129 -92 74 61 -267 -29
3872 -29 25 -307 -57 95 97 184 -62 -27 151 247 -92 -119 -249 -252 -88 -62 -102 86 146 54 -128 -76 185 -46 167
3897 167 232 -74 215 13 -136 10 -45 -23 80 -10 18 -318 -185 -83 90 -45 -87 -32 -285 205 -163 -129 -116
3920 -116 -179 -117 -28 231 87 -53 203 287 206 -10 30 243 -229 -168 -94 -205 252 -191 -135 -29 -199 -130 -90 -18
3944 -18 154 61 -123 166 230 -226 -169 -159 -26 7 -192 -1 -84 115 70 23 119 -150 -131 -65 124 -15 -176 64
3968 64 -181 -48 103 337 14 -14 360 -13 -80 -270 -80 -152 -303 -29 -80 177 158 64 81 -253 -235 161 57
$$ packed form
3804@K65k23J06J34l90K35k14j7J89J20k82J85j20k56J41J08m4K4N4j32J35J12
3826A30n1p3j05J55L70o13O8J76J44K4n32R4J99O1n2K39k10pp3j4k3K8L77j48
3850A64j30j33L91o20L21P6l25J97K64k68J16l07L92L8r4j89k2L7J66j3l28K38
3872b9N4l32K50J52KQ7k46L5J78R6l39k7j30lJ64K6m0J88O0r2j82N2K61k31K13
3897A67O5l06K89k02j49J46n5K2J03r0K8l36J33J02J73j35m2N5k53M90l68L4J3
3920a16o3O2Q9K59j44j40K56Q4q1k16M0K13m72O1P4j11M57m43N6J06j70O9M0P2
3944a8J72r3j84K89O4m56N7J0J33L3j99J91q3J99m5m7R6k69J9O6J89j39j61K40
3968F4k45J33J51K34l23k8L74l73o7j90J90p2j51K74n1K57j9r4J7l34J8L96j04
$$ plain form
3991 57 -2 110 53 -90 -78 -103 -155 -90 48 -85 -22 -81 -210 -251 0 226 -118 162 -37 -282 -81 132 157 -149
4015 -149 160 136 273 -205 71 -40 -18 -149 13 179 -215 208 11 -100 -96 -72 30 32 184 -64 43 -101
4037 -101 53 -23 -8 -242 -140 -192 -25 189 -163 -93 61 -33 -174 385 467 -227 189 383 70 -63 -250 232
4059 232 -402 10 241 -24 -115 29 -78 -91 129 20 -231 -250 56 -6 110 -143 218 180 14 -99 226 6
4081 6 -4 34 44 173 17 36 -45 63 -95 -375 -101 188 -290 127 35 46 225 81 -65 107 114 -6 -92 7
4105 7 195 -242 -520 -200 105 -240 182 -36 73 -131 23 165 -77 112 -190 -48 -143 54 128 -33 79
4126 79 136 32 190 113 15 366 -191 -112 -324 -191 251 -156 -259 -101 -80 87 172 115 -54 -36 77 200 -128
4149 -128 -64 30 -146 -194 102 91 -154 186 194 -56 -99 139 147 -60 -165 -63 177 28 260 -218 -288 324 101
$$ packed form
3991E7n9J12n7j43J2k5n2O5J38j33O3n9j29m1K51K26l44K80j99k45K01K13K5l06
4015a49L09k4J37m78K76j11K2j31J62J66l94M23j97j11MK4J02KJ52k48J07j44
4037a01J54p6J5k34J02n2J67K14l52P0J54r4j41N59Q2o94M16J94l13j33j87M82
4059B32o34M12K31k65r1J44j07j3K20j09k51j9L06o2J16k53L61l8j66j13L25k20
4081Fj0L8J0J29j56J9q1J08j58k80K74K89m78M17r2J1J79j44j46J72Pj20q6R9
4105GJ88m37k78L20L05l45M22k18J09k04J54J42k42J89l02J42r5J97P4j61J12
4126G9N7j04J58p7r8L51n57P9k12J33M42m07j03J58K1J67Q5n7j69J8J13J23l28
4149a28O4R4j76m8K96j1k45L40Qk50m3K38Qk07j05J02K40j49K32m78p0O12k23
$$ plain form
4172 101 90 4 -79 -1 102 221 376 -434 6 310 -32 -225 6 -62 -23 -33 -212 54 150 -84 -44 -253 215
4195 215 186 -132 28 155 -106 -222 36 -53 48 118 -227 186 222 68 206 117 52 -144 -177 -307 246 -169
4217 -169 -106 294 179 -14 383 -80 148 -115 53 29 -92 55 -73 -134 -242 84 -115 -131 325 81 265
4238 265 409 334 84 -166 27 147 -107 62 -65 -250 86 278 318 18 123 107 -40 -270 -43 84 74
4259 74 29 154 -118 136 52 -38 -114 43 264 -131 -221 170 34 -104 79 -81 -158 72 -1 -124 -36 385 98
4282 98 66 27 -127 -43 -123 305 -25 100 18 -105 -234 -121 12 -192 -156 149 298 -148 124 -8 -266 -104
4304 -104 187 -55 -27 49 -108 184 116 -46 83 -203 -161 341 -251 -13 -134 -235 71 64 -113 -114 -29 83 -62
4327 -62 -13 200 161 123 -257 -219 -192 65 -161 -130 115 24 205 -203 148 291 98 -243 120 336 329 232 208 -134
$$ packed form
4172A01j1q6q3P8J03J19J55q10M40L04l42j93K31o8L9j0j79K66R6k34M0k09M68
4195B15k9l18J60J27k61j16K58q9J01P0l45M13L6j54J38q9o5j96l3j30N53m15
4217a69O3M00j15j93L97m63K28k63J68k4j21J47j28o1j08L26j99j6M56k44J84
4238B65J44p5k50k50J93J20k54J69j27j85L36J92M0l00J05j6j47k30K27J27j0
4259G4m5J25k72K54q4r0p6J57K21l95r0L91j36j38J83j60p7K30p3j23Q8M21k87
4282I8l2l9j54Q4q0M28l30J25q2j23j29J13J33k04L6L05J49m46K72j32k58J62
4304a04K91k42K8P6j57K92o8j62J29k86M2N02n92K38j21j01L06pj77jQ5J12j45
4327f2M9K13l9l8l80L8K7K57k26L1K45r1J81m08L51J43j93l41L63K16pr7k4l42
$$ plain form
4351 -134 103 368 -9 49 10 -52 -150 205 131 47 -56 -38 -140 -230 191 27 -184 73 148 -336 182 -45 254
4374 254 118 -43 213 143 -130 154 151 -352 -35 157 96 -57 -1 58 -92 -135 -140 -121 194 61 155 -181 22 151
4398 151 -149 -112 -54 12 133 -53 27 32 -159 93 -84 189 82 30 -175 194 47 147 78 -61 276 -229 -138
4421 -138 171 -81 10 38 -53 134 -56 54 -34 66 -239 121 -66 257 -101 -204 -208 336 -62 -231 204 98
4443 98 -150 76 -83 -156 -130 -135 -418 260 126 295 247 -85 105 -46 166 -145 -46 83 -53 -132 27 98 6
4466 6 160 205 305 109 104 -117 67 -146 213 139 85 -198 3 -132 192 96 -209 179 -104 150 111 -259 -21
4489 -21 -207 183 139 -77 175 49 -19 155 -210 -65 -107 13 89 -116 -89 139 48 -6 -128 162 -222 24 178
4512 178 5 -42 -30 123 351 112 129 -36 -6 -220 -255 101 167 243 -116 330 124 67 -146 256 -16 -251 -80
$$ packed form
4351a34K37K65l77N8l9o2r8L55p4q4j03J8j02r0M21j64k11K57P5m84N18k27K99
4374B54j36j61K56p0k73K84ln03L17J92o1j53N6N9j50m3nJ9L15j33R4l36K03J29
4398A51l00L7N8O6J21j86Q0Nj91K52j77K73j07n2k05L69j47J00o9j39L37n05R1
4421a38L09k52R1K8r1J87j90J10q8J00l05L60j87L23l58j03mN44l98j69M35j06
4443I8k48K26j59p3K6nk83O78j34J69m8l32J90j51K12l11R9J29j36p9J59P1r2
4466FJ54M5J00j96nk21J84k13L59p4n4k83K01j35L24r6l05L88k83K54l9l70K38
4489b1j86L90m4k16K52j26o8J74l65J45m2J20P6k05K7K28r1n4j22K90l84K46J54
4512A78j73m7J2J53K28k39J7j65L0k14l5L56O6P6l59M46k06n7k13M02k72k35J71
$$ plain form
4535 -80 -143 139 -223 -222 -181 -245 102 -70 -160 -54 404 -102 -237 123 -127 106 86 85 -179 -62 286 -4 141
4558 141 59 106 43 -240 -347 -195 -253 -124 150 48 -137 159 -148 -80 184 311 149 -61 55 -194 22 5
4580 5 3 -231 -165 34 -22 82 -70 -56 -111 70 -104 168 300 29 -156 -53 80 226 -58 148 16 -177 -36
4603 -36 57 -59 -171 -105 192 35 -92 -85 69 -286 -81 -61 -163 11 60 -7 49 72 -39 291 -160 139 -54
4626 -54 62 11 51 -422 50 -101 -415 -79 -76 180 -146 161 266 177 8 -259 10 -138 171 -92 80 160
4648 160 112 -233 39 130 63 -20 -27 20 -259 -107 59 136 -328 2 184 202 174 21 -182 -12 7 255 -40 66
4672 66 207 -75 -153 137 -107 -74 -89 180 -168 188 119 -63 312 179 350 196 140 185 -78 -22 -30 204 -349
4695 -349 -355 151 263 80 -322 293 310 37 151 -193 -111 122 26 -92 39 217 3 41 87 136 157 -1 137
$$ packed form
4535h0o3K82l62JM1o4L47j72r0J06M58n06j35L60k50K33k0jk64J17L48k90J45
4558A41q2M7o3k83j07J52n8J29K74j02j85K96l07O8K64J27j62k10J16k49K16j7
4580Ekk34O6J99n6J04j52J4n5J81j74K72J32k71j85J03J33J46k84K06j32j93J41
4603c6R3j16j12O6K97j57j27PJ54l55K05K0j02J74M9o7N6K3j11L30m51K99j93
4626e4J16n1M0m73M72j51l14L36LK56l26L07J05q9j69k67K69j48L09k63J72Q0
4648A60m8l45K72R1o7q3pM7k79J52J66P7m64L30J82J8k8j53k03J70J9K48k95J06
4672F6J41k82p8K90k44L3j5K69l48L56o9j82L75j33J71j54n6M5k63N6qK34n53
4695c49oN06J12j83m02O15J7k73J14l44Q2K33r6j18J31J78k14L8M6M9K1j58J38
$$ plain form
4718 137 233 67 39 -144 -76 271 -117 -63 62 243 171 108 81 219 41 -131 109 81 329 261 -321 -24 325
4741 325 -56 -124 -121 46 -10 -284 -58 76 86 99 69 91 239 413 -101 27 3 -291 -125 130 454 184 -423
4764 -423 -22 -43 214 -92 213 -65 -233 41 228 -86 318 -23 -164 10 268 162 -502 132 -42 -118 139
4785 139 -54 42 176 14 204 158 -32 92 88 -203 -212 30 188 287 61 157 -79 -80 30 67 -241 -91 5 -29
4809 -29 37 246 154 29 66 79 44 -109 63 -23 146 139 -75 18 83 64 99 -126 30 -65 -300 73 -37 88 113
4834 113 -94 -68 -100 111 -111 209 94 185 29 114 247 235 116 -106 -15 -191 181 69 5 231 -59 -166
4856 -166 -58 -28 128 29 58 -269 -100 -139 -127 68 -294 -134 188 -86 -203 -8 -251 155 -68 -141 -282 -157
4878 -157 -104 41 29 -193 -71 11 93 -143 -32 111 -122 15 -53 -155 20 -7 -266 34 -117 101 -355 -19
$$ packed form
4718A37R6j66k8j83O8L47l88N4J25J81p2o3k7J38j78j72K40k8K48o8n82K97L49
4741C25l81o8LJ67n6k74K26J34J0J3l0K2J48J74n14J28k4k94J66K55L24k70o07
4764d23M01k1K57l06L05k78j68K74J87l14M04l41j41J74K58j06o64O34j74p6K57
4785A39j93R6J34j62J90m6j90J24mk91rK42J58R9k26R6k36jJ10L7l08J50R6l4
4809b9O6K09r2j25L7J3l5j53J72q6J69pk14R3O5j9L5k25J56r5k35L73j10J25K5
4834A13k07K6l2K11k22L20j15R1j56Q5J33j2j19k22R1j76L72j12o4K26k90j07
4856a66J08L0J56r9K9l27J69l9J2J95l62J60L22k74j17J95k43M06k23p3j41J25
4878a57N3J45j2k22J22Q2Q2k36J11J43k33J37o8j02J75k7k59L00j51K18m56L36
$$ plain form
4900 -19 -130 188 -28 -245 75 -76 70 26 -201 84 166 -131 195 197 113 52 208 42 171 -24 0 304 -196
4923 -196 -131 -280 -8 34 -96 45 32 -22 -180 -168 -165 83 -79 63 51 -89 -156 -123 -189 12 35 27 124 255 114
4948 114 -59 -28 -147 205 46 -7 -8 -45 -124 -184 -92 -214 147 38 -8 373 -29 226 35 77 -3 61 190 -94
4972 -94 -162 436 -109 -39 -193 -134 342 -60 115 220 -158 94 -305 -238 -4 55 191 -45 -175 80 -148 99
4994 99 -6 -238 -247 32 39 163 79 67 65 30 -56 8 -75 -293 -114 -24 72 139 163 91 -112 27 -109 -252 -90 -7
5020 -7 -294 159 -88 -380 123 -122 -92 33 -61 -349 -26 78 96 135 58 130 -116 42 56 42 130 -43 150 90
5044 90 91 -95 167 101 276 185 3 -15 -150 -114 -182 -93 132 68 -57 96 65 -253 -56 10 83 -36 -176 -13
5068 -13 -32 153 -40 128 76 253 -88 -13 -185 26 -187 260 -173 -198 30 238 62 -275 -66 189 -209 -30
$$ packed form
4900a9j11L18k16k17L20j51J46m4k27K85Q2k97L26Kq4o1J56j66J29j95K4L04n00
4923a96O5j49K72M2j30J41j3n4j58J2LK48j62J42j2j40o7L3o6K01K3qR7J31j41
4948A14j73L1j19L52j59n3jl7p9o0R2j22L61j09m6L81m02K55j91M2q0O4J29k84
4972i4o8N98n45P0j54N9M76m02J75J05l78K52l99O7K34N9J36k36j30K55k28K47
4994I9j05k32rK79PJ24q4j2kl5q6O4q3k18J79R0R6O7K4p2k03J39j36j43J62Q3
5020gk87M53k47k92N03k45L0J25r4k88L23J04J8L9p7P2k46J58J4j4Q8j73J93o0
5044I0Jj86K62o6J75r1j82j8j35L6o8Q9K25o4j25J53l1l18J97O6P3j19j40J63
5068a3j9J85j93J68n2J77l41P5j72K11k13M47m33k5K28K08j76l37K09K55l98J79
$$ plain form
5090 -30 320 -22 70 -47 -38 -18 22 209 -12 -131 55 45 -62 -160 288 92 121 -298 37 139 -83 -136 -19
5113 -19 -92 -75 58 371 -43 38 29 -15 -168 -187 24 -68 -81 -138 -63 232 192 -224 14 0 53 17 109 67 -23 324
5139 324 -105 -88 -158 -153 -58 -330 -30 226 -176 73 -202 -343 192 199 -10 -261 -60 60 53 47 14 69 -93 12
5163 12 -33 -90 99 -3 60 -75 92 92 -134 -73 289 112 -11 280 88 -85 7 -35 264 1 -55 -143 -211 112
5187 112 -73 -60 34 -143 65 -125 177 164 -27 -336 -74 -50 -8 189 190 82 -2 -45 36 -39 63 -217 -58 -13
5211 -13 -78 -109 -254 8 -70 -61 -18 -186 -177 -33 -120 -69 196 87 -122 -35 136 179 -16 71 101 -3 -206 16 -23
5236 -23 69 -298 -87 -56 181 58 -91 359 -91 10 312 59 45 57 -103 14 -5 107 -270 -70 111 -266
5258 -266 -20 412 -68 22 119 -32 58 -171 -87 48 -70 48 63 105 99 222 147 82 46 159 -7 -84 -51 -400
$$ packed form
5090c0L50l42R2j17RK0M0J87k21j19J86j0j07r8M48j96K9m19L35J02k22n3J17
5113a9p3J7J33L13m14Q1rm4j53j9K11r2j3n7P5K95m0m16K38j4N3l6R2m2r0L47
5139C24m29J7p0NR5k72L00K56m02K49k75j41N35Pk09k51K01J20pol3N5j62J05
5163A2m5n7J89j02O3j35J67%k26O1L62j77j23K91j92j73R2m2K99k63n6q8o8L23
5187A12j85J3R4j77K08j90L02j3j91l09K62K4M2J97Jj08q4m3Q1p5J02k80J59M5
5211a3o5l1j45K62p8RM3j68RJ44q7N1K65j09k09Q7J71M3j95Q7L0j04k03K22l9
5236b3R2l67K11L1K37j23j49M50m50J01L02k53j4J2j60J17j9J12l77K00J81l77
5258b66K46M32m80R0R7j51R0k29Q4J35j18J18J5M2oJ23p5o5l6J13j66p7L3l49
$$ plain form
5282 -400 -2 -118 -213 -280 -73 -5 147 85 -42 18 118 -96 161 -297 -9 85 127 96 9 76 -331 4 -238
5305 -238 50 -77 25 14 -8 73 26 -128 -180 82 -75 -90 145 68 -144 129 3 -14 78 190 -21 8 -39 -368
5329 -368 -236 2 -118 -34 -26 156 -164 78 -103 132 -5 -100 47 -103 53 -173 -220 88 21 -58 43 195
5351 195 55 -24 -234 -7 -87 117 185 81 -100 16 140 209 217 -23 160 -152 -61 -43 -86 143 -70 -5 269
5374 269 -133 -46 -299 23 71 335 216 -94 110 22 220 -141 33 39 176 57 -146 -225 -148 125 -118 -50 142
5397 142 265 118 55 -15 290 -120 -16 -124 -26 335 -233 -141 84 89 -29 12 91 59 -28 -225 300 116 -67
5420 -67 16 -322 -25 219 -252 -215 260 40 193 -17 4 30 92 -229 319 135 -188 58 -128 55 138 58 65
5443 65 148 33 -2 172 230 124 114 -13 -227 97 -134 -162 -214 -130 -2 -52 -195 -35 -14 62 -67 -71 -19 60 -88
$$ packed form
5282d00L98j16r5o7K07O8J52o2j27O0J00k14K57m58K88R4M2l1q7O7m07L35k42
5305b38K88j27J02j1k2Q1m7j54n2K62j57j5K35p7k12K73j26j7R2J12k11K9m7l29
5329c68J32K38j20Q4QJ82l20K42j81K35j37r5J47j50J56k26m7L08o7p9J01J52
5351A95j40p9k10K27q0K04O8j04j81J16J24O9Qk40J83l12R1J8m3K29k13O5K74
5374B69m02Q7k53L22M8K64j19l10K04q8J98l61J74OJ37j19k03p9P7K73k43O8J92
5397A42J23j47o3p0L05m10J04j08R8L61n68R2K25Nj18M1P9l2q7j97N25j84j83
5420f7Q3l38K97K44m71L7M75k20J53k10K1K6O2l21N48j84l23K46j86J83Q3q0P
5443F5Q3j15l5J74N8j06j0j27k14L24k31k8n2Q4J28n0j43J60K1P6j29mN2P9j48
$$ plain form
5468 -88 232 196 -273 -41 -53 -79 127 -156 113 29 -63 -56 -28 -96 -13 -57 -122 -162 51 -97 216 -90 79 302 -407
5493 -407 110 -10 95 28 389 -198 -67 245 34 -16 -85 -101 54 86 170 -228 -12 41 280 -106 -13 327 -24
5516 -24 -139 102 -1 -39 -229 61 -1 -170 18 322 109 -202 -138 77 227 -1 -110 157 -102 -210 -73
5537 -73 108 -41 -83 46 138 -114 57 192 -310 -44 192 -18 -126 -68 -91 -117 -243 15 130 4 121 -196
5559 -196 257 89 -158 -77 -2 72 -3 167 128 59 200 5 -312 7 -209 33 -118 273 -58 -85 -107 -125 178
5582 178 45 -102 99 -50 -373 171 29 33 21 242 -29 -50 -312 -116 -46 -261 -80 59 -21 -119 60 169
5604 169 10 -81 -49 -40 -38 -56 66 189 -242 -15 -325 100 344 212 -126 -41 -270 -141 -49 99 68 -347 -76
5627 -76 -1 -143 33 117 -211 68 -29 90 165 -121 17 57 -66 172 -20 -109 95 -133 -37 188 201 80 -29
$$ packed form
5468h8L20l6m69K32j2k6K06k83K69q4r2PK8o8Q3m4o5m0K13j48L13l06J69K23p09
5493d07N17j20J05o7L61n87J31L12k11n0o9j6J55L2Q4l98K16N3K39l86R3L40l51
5516b4j15K41j03l8j90K90o2j69J88L04k13l11O4K15J50k28j09K67k59j08J37
5537g3J81j49m2J29R2k52J71J35n02K66K36k10j08N8k3k6j26K58J15j26J17l17
5559a96M53j68k47Q1P5P4p5J70l9o9J41j95l17L19k16K42j51L91l31k7k2j8L03
5582A78j33j47K01j49l23N44j42Mj2K21k71k1k62J96P0k15J81J39q0r8J79J09
5604A69j59r1L2RKj8J22J23m31K27l10M25K44j32l38Q5k29J29R2J48l1m15K71
5627g6P5j42J76Q4l28K79r7J19P5k86J38M0j23K38j92q9K04k28R6K25J3j21j09
$$ plain form
5650 -29 -118 20 -35 83 39 -47 -20 87 61 -145 -22 -111 -283 126 -39 -122 -143 24 293 55 95 -8 -102 33
5674 33 106 11 113 155 -8 -122 171 -165 -96 15 98 61 -91 116 271 147 -276 -40 205 153 -10 56 -49
5697 -49 -186 81 -176 251 20 -82 -271 -295 53 -217 54 -43 10 -44 114 -131 -91 -216 100 74 16 85 -7
5720 -7 -180 -66 225 -105 -137 -15 -118 -69 45 70 -22 -239 -23 372 -38 48 254 162 148 137 214 -166 -11 284
5744 284 139 140 -106 -61 -253 146 -115 -191 -184 8 -94 -284 91 233 -178 -47 185 -263 153 -25 45 -149
5766 -149 -64 59 -271 231 170 86 -96 -3 38 -67 -79 299 -100 -146 79 116 -96 29 -227 -7 253 -20 318
5789 318 113 -169 -258 183 -68 9 -59 -3 145 -28 -26 -169 219 -163 -115 -177 79 -86 -186 -83 233 29 -321
5812 -321 98 134 -11 -75 200 -106 -22 100 186 5 -136 -56 -33 25 -183 -140 -57 49 -234 -278 46 85 -220 -156
$$ packed form
5650b9q9J38n5J18m4q6K7J07k6k06J23q9j72M09j65q3k1J67K69k38M0j03r4J35
5674C3P3r5J02M2j63j14K93l36O9J11Q3l7j52K07J55j24m23K36K45n2j63O6j05
5697d9j37K67k57M27k31j02j89k4L48k70K71r7N3n4J58k45M0j25L16k6n8O9r2
5720gj73J14K91l30l2J22j03M9J14K5r2k17K16L95m10Q6K06r2j4j1P7l80J55K95
5744B84j45Jk46M5j92L99k61p6PJ92j02j90L75J42m11J31K32m48M16j78P0j94
5766a49Q5J23l30N02o1q4j82R3M1j05j2L78l99m6K25L7k12J25k56K20K60k73L38
5789C18k05k82q9M41k51P7o8N6J48j73Kj43L88l82M8o2K56j65j00J03L16k04l50
5812c21M19L6j45o4K75l06Q4J22Q6j81j41Q0K3N8k08M3Q3J06k83m4L24L9l05O4
$$ plain form
5836 -156 145 206 -166 96 -31 -132 -165 316 -139 63 61 167 -37 139 3 201 -64 -11 79 -125 -46 -11 -91
5859 -91 -218 -249 137 -42 -110 -192 -80 234 140 -140 52 103 -179 -35 -57 -35 -400 -214 -211 -202 -169 103 -112 -169 -179
5884 -179 -60 -145 -157 -52 -116 -7 48 146 -118 -249 -220 61 67 -64 64 -143 -107 -4 -319 -48 17 105 -129 -47
5908 -47 188 121 -123 126 178 38 43 -50 -43 54 -227 -54 -47 -13 20 -50 0 205 -214 -62 -133 27 -39 69 214 -91
5934 -91 -165 -179 21 -3 -109 -24 103 52 57 -166 -141 -36 -118 -100 -101 -70 14 32 30 31 37 21 112 -311 315 -125 59 158
5962 158 -8 238 -137 -29 -81 80 -61 -29 -119 248 124 103 299 -190 20 190 -158 13 -139 100 68 304
5984 304 -64 3 223 124 47 -24 -95 64 122 68 3 -164 308 87 369 -8 -179 124 34 -125 47 226 -190
6007 -190 48 -11 154 -74 -176 26 17 88 21 37 125 111 -93 68 5 -149 -51 -330 157 -176 9 -89 198 125
$$ packed form
5836a56L01O1l72K62j27j01l3M81m55K02kJ06k04J76j36J98k65N3R0k04P9L5q0
5859i1j27l1L86j79o8q2J12L14r4k80J92N1k82J44k2K2l65J86LRL3K72k15n7j0
5884a79J19q5j2J05o4J09N5R8k64j31K9K81Oj31J28k07L6J03l15K71O5Q8k34Q2
5908d7K35o7k44K49N2j40Nr3PR7k81J73PL4L3p0N0K05m19J52p1J60o6J08J45l05
5934i1p4j4K00k4j06Q5J27n1Nk23K5J05q2J8jL1Q4J8kJOj6R1m23O26m40J84R9
5962A58j66K46l75J08n2J61j41L2r0L67j24k1J96m89K10J70l48J71j52K39l2K36
5984C04l68O7K20r9p7p1p1J59N8n4o5j67M72k21K82l77j71L03r0j59J72J79m16
6007a90K38n9J65k28j02K02rP1o7J6Q8j4k04J61o3j54R8k79M87l33J85r8K87p3
$$ plain form
6031 125 -133 -147 195 74 -330 -114 11 -254 317 -278 238 76 44 191 -79 28 -252 -12 -14 9 191 105
6053 105 -118 92 137 -154 -80 -131 84 36 -325 9 148 -250 -265 -126 120 -76 251 146 -160 -1 -232 160
6075 160 -48 -61 -25 236 -152 -371 -369 -100 -188 -37 58 -167 34 -142 -374 72 13 -123 -44 11 280 203 29
6098 29 -18 18 -21 -116 68 146 -10 112 -205 74 -375 175 -44 -43 191 -2 50 66 -170 96 41 -227 4 20
6122 20 -157 -34 -7 109 194 28 -56 -30 -113 -161 -16 -1 145 -33 -41 -279 -3 132 -126 -211 20 96 -167 -17
6146 -17 -268 -145 117 -200 -28 6 -34 -88 107 32 187 33 58 -125 69 -113 -308 -119 54 -43 270 21
6168 21 92 0 134 88 -35 -41 -40 -158 -79 -82 20 24 206 -178 63 25 85 -34 147 -13 29 236 249 335 -179 -38
6194 -38 -6 -227 -115 -311 189 47 -17 150 18 83 -167 -5 -151 131 64 101 -16 -66 -94 -29 45 6 122 30
$$ packed form
6031A25k58j4L42j21m04K16J25k65N71n95N16j62l2J47k70J07k80K40kK3J82q6
6053A05k23K10M5k91P4n1K15m8l61L34J39l98j5J39K46j96L27j05l06J59k31L92
6075A60k08j3L6K61l88k19KK69q8J51R5k25K01j76k32M46n9j36P9N5K69p7j74
6098B9m7L6l9r5J84P8j56J22l17K79m49N50k19JK34j93N2J6k36K66n5k68K31J6
6122B0j77J23K7J16Q5j66q4K6q3m8J45J5J46j78qk38K76J35k58q5K31P6k63J50
6146a7k51J23K62l17J72L4m0n4J95p5J55j54K5j83J94j82j95J89J73r7L13k49
6168B1P1r2J34m6j23oJj18P9lJ02MJ82l84K41l8O0j19J81j60M2K07J3Q6n14J41
6194c8L2k21J12j96N00j42o4J67j32O5k50J62j46K82o7L7j17n0k8O5P4l9J16r2
$$ plain form
6218 30 -28 -30 172 125 234 190 23 176 -108 -11 -11 72 -211 -11 -104 -77 -267 -54 40 32 17 -54 -4 -154 18 -104
6244 -104 -240 11 7 -90 -288 -258 25 -63 -48 -121 -156 -172 117 -123 17 -50 124 -54 166 -27 106 134 121 118 -124
6269 -124 -231 10 -95 -14 65 273 -85 128 218 57 239 122 42 111 -5 -234 95 92 -106 81 -166 171
6291 171 23 105 101 192 156 -249 -141 -261 223 156 -215 -202 -76 -103 198 36 79 -117 383 -140 147 -114 -406
6314 -406 -175 53 -157 41 95 -7 -235 -113 -60 25 -61 128 -52 -138 -142 -7 -14 -98 -62 -313 -239 168 -130 126
6338 126 125 -200 184 -164 417 159 -39 128 95 -50 5 -63 95 -95 -192 -27 37 27 -40 -145 31 89 97 15
6362 15 -51 -5 176 -40 219 -10 -165 47 230 -92 0 54 -105 14 -117 -43 -78 -97 -21 57 -83 -180 85 124
6386 124 188 9 -13 -10 -16 104 177 85 -115 128 -114 56 54 -69 -18 48 161 -11 -199 -29 37 134 180 164 36
$$ packed form
6218C0n8kK02m7J09m4j67J53k84R7%Q3k83K00r3K7j90K13R4qj5p1N0j50J72j22
6244a04j36K51mr7j98L0K83q8J5p3l5j6K89k40J40o7J74j78K20j93J33K8j3lk42
6269a24j07K41j05Q1P9K08l58K13R0j61J82j17q0O9j16k29L29lj98J87k47L37
6291A71j48Q2mR1l6m05J08j20M84o7l71J3J26k7L01j62M3j96N00n23K87k61k92
6314d06K31K28k10J98N4j02k28J22N3Q5q6J89j80q6mJ35pq4L6k51P4M07k98K56
6338A26jl25L84l48N81k58j98J67l3j45N5o8J58j90r7J65O4j0o7j05J76N8Qq2
6362A5o6M6J81k16K59k29j55K12J83l22R2N4j59J19j31P4l5j9P6P8j40r7K65L9
6386A24O4j79k2LoJ20P3r2k00K43k42J70kj23N1O6J13j72j88J70O6R7M6j6j28
$$ plain form
6411 36 145 87 173 -44 5 -42 -157 125 -4 -93 -187 46 -28 129 155 39 -50 210 -52 -235 92 160 107 15
6435 15 -206 197 55 -252 55 -148 156 -67 -346 -57 -211 169 161 105 73 -114 57 -5 -4 127 68 -146 120
6458 120 196 -22 45 155 147 -11 -65 -56 99 73 -273 -45 -15 -28 18 186 -217 -7 65 137 -22 178 70 -265
6482 -265 130 -53 -121 -165 138 -22 278 -183 -95 121 104 -41 151 306 -104 45 185 8 -243 32 60 -27
6504 -27 -40 -95 -154 -5 -91 12 254 -270 -135 202 -161 313 -159 44 112 -77 16 -23 72 -15 -289 108 158 -109
6528 -109 -202 -189 218 -242 -25 -55 -108 -83 -47 -342 -209 203 115 -174 170 140 -128 -194 3 45 -217 20 -84
6551 -84 76 45 110 43 -137 153 -31 -167 105 35 -165 -78 40 -81 -91 55 62 130 31 49 178 -55 110 7
6575 7 -208 -403 105 53 134 113 -17 -5 63 94 -77 304 -298 18 -83 -1 -177 -59 56 -42 9 -244 159 10
$$ packed form
6411C6J09n8Q6k17M9m7j15K82j29q9r4K33p4J57K6j16q9K60k62j83L27O8n3r2
6435A5k21M03j42l07L07k03L04k23k79K89j54L80qn6l2j87J71o2JJ31n9k14K66
6458A20P6k18O7J10qj58n4RJ55k6l46K28L0j3M6J68m03K10P2P2j59K00j08l35
6482b65L95j83o8m4L03j60L00m61Q8K16j7j45J92J55m10J49J40j77k51K75K8q7
6504b7j3n5n9J49q6J03K42n24J35L37l63M74m72K03O8j89R3l9R5q7k74L97N0k67
6528a09r3J3M07m60K17l0n3K5L6k95J33M12q8k89L44l0k68o6J97M2k62K37j04
6551h4J60l1O5o7j80K90j84j36K72p0k00Q7J18j21j0J46PO8r9J8J29k33J65j03
6575Gk15j95N08n2Q1k1j30J2O8L1j71L81o02L16j01Q2j76J18J15r8N1k53M03j49
$$ plain form
6599 10 -179 49 90 35 157 -54 -84 183 227 -28 64 15 -160 41 175 -347 318 -145 20 151 54 -123 -31
6622 -31 253 122 -115 102 -87 311 -182 86 133 153 174 4 18 28 189 31 -118 -280 -181 69 -37 -67 -172
6645 -172 -339 -89 -63 -141 59 -139 -26 -306 380 -109 276 -43 160 181 -58 -47 -138 -103 58 -193 142 43
6667 43 43 -182 170 1 -193 191 152 -188 -131 73 209 47 -67 -154 115 -36 -160 -131 -43 108 294 45 -117
6690 -117 -169 -40 227 -116 51 76 -258 -36 51 -118 223 -10 -91 -43 302 -47 -72 82 -193 -179 -99 221 17
6713 17 -199 -69 11 -210 169 -27 162 -263 -63 18 -42 42 -134 -111 -277 36 44 66 -50 115 -4 70 29 -84
6737 -84 49 -10 106 -101 34 -92 130 277 87 34 -184 49 -83 -84 79 -27 114 -223 -182 -86 -114 -155 -93
6760 -93 85 -400 20 175 -168 4 59 -77 35 -52 19 -285 280 105 -69 -117 -50 103 126 0 103 9 -199
$$ packed form
6599A0j89K28M1n5J22k11l0K67M4k55R2m9j75K01J34n22O65m63J65J31r7j77R2
6622c1K84j31k37K17j89L98m93K68M7K0K1j70J4J0J61j58j49j62R9K50j06l0j05
6645a72j67K50K6p8K00j98J13k80O86m89L85l19K03K1k39J1r1L5J61k51L35r9
6667D3%k25L52j69j94L84l9l40N7K04J36j62j14q7K69j51j24K9Q8J51J86k49j62
6690a17n2J29K67l43J67K5l34K22Q7j69L41k33q1M8L45l49k5J54k75J4Q0L20k04
6713A7k16J30Q0k21L79j96J89m25K00Q1o0Q4j76K3j66L13QK2j16J65j19P4m1j13
6737h4J33n9J16k07J35j26K22J47j90n3k18K33j32jJ63j06J41l37M1R6k8m1O2
6760i3J78m85M20J55l43J72N5j36J12q7P1l04N65j75j74m8O7J53K3j26J03r4k08
$$ plain form
6783 -199 197 137 69 -47 -111 -102 115 388 183 -185 134 96 -167 -4 272 -16 -167 -32 96 42 -32 -83 3
6806 3 -117 -49 -91 -95 53 37 20 -70 6 235 35 -33 -54 -119 -65 10 22 -16 -148 79 26 9 32 155 108 25 69 1
6834 1 186 103 12 -147 -317 -97 -275 -158 117 11 -265 47 -132 -202 -153 151 -92 -154 14 78 -214 -27 44
6857 44 -176 -91 -50 -218 -164 -138 261 12 -41 36 136 25 -110 -24 131 -14 33 168 322 61 -109 -43 11 -91
6881 -91 14 -20 -146 -134 -229 -92 54 -102 42 -1 -39 -35 252 -97 -97 181 -147 42 190 -12 25 -367 -6 -69
6905 -69 153 -55 23 -3 239 20 -23 89 -42 -137 -11 23 160 -63 -118 -121 -61 58 293 -81 202 35 -120
6928 -120 -11 -148 -48 -287 -311 -157 271 -211 -197 -6 171 279 -54 165 214 -80 36 -110 119 -122 -38
6949 -38 120 -35 160 57 89 -43 85 -115 -224 123 190 124 -25 -18 2 18 -135 -218 228 245 6 69 202 -183
$$ packed form
6783a99L96o0o8j16o4RK17K73k05l68L19l8k63J63K76k88j51J35J28n4p4n1Q6
6806Cj20O8m2mJ48j6j7r0P6K29k00o8k1o5N4P5J2l8j32K27n3j7K3J23m7q3M4o8
6834AJ85q3r1j59j70K20j78J17K75j06k76L12j79p0M9L04k43o2J68O4k92J87P1
6857D4k20Q5M1j68N4K6L99k49n3P7J00j11j35Q6J55j45M7J35J54k61j70O6N4j02
6881i1J05l4j26J2r5J37J46j56J44m3l8MK87l49%K78l28J89J48k02L7l92L61o3
6905f9K22k08P8k6K42k19m3J12j31r5J26L4J37k23n5lO0J19K35l74K83j67j55
6928a20J09j37J00k39k4J54M28m82J4J91J77J08l33K19M9k94J16j46K29k41Q4
6949c8J58j55J95j03L2j32J28k00j09L47O7o6j49PK0J6j53q3M46J7k39O3J33l85
$$ plain form
6973 -183 254 85 -173 -31 -24 -333 -361 161 -80 -83 -280 34 -43 16 12 -193 43 35 -174 -43 -417 -98 229 -160
6997 -160 -132 -163 70 175 138 -133 -99 189 181 61 -52 -69 -198 -48 -202 90 199 -96 275 148 102 -90 -291
7020 -291 10 -53 62 -33 287 217 -114 116 -76 -75 -162 103 180 -110 -189 -85 -171 143 146 46 222 -155 42 -5
7044 -5 25 83 34 121 135 -48 236 15 157 -154 -14 -35 22 -167 -230 57 143 -1 -67 -261 2 45 -229 -82
7068 -82 77 75 -80 153 -205 -217 89 -6 46 -1 23 84 -64 -151 173 130 -136 287 -101 74 159 222 138 -188 -30
7093 -30 36 256 127 -196 72 -80 -43 40 -60 -113 88 38 9 14 110 112 30 144 -176 183 123 199 -25 -54 32 198
7119 198 -135 14 112 -160 153 23 22 -85 214 30 -132 60 172 142 325 -16 172 -50 -34 63 -62 -117
7141 -117 -52 -143 -34 224 -6 -78 101 -48 -85 83 -128 -31 189 168 121 -101 12 98 -27 -4 -223 243 29
$$ packed form
6973a83M37j69k58J42Pl09k8N22k41lj97L14p7N9mk05K36qk09J31l74L19L27l89
6997a60K8l1K33J05l7k71L4K88qj20j13j7j29J50j54K92J09k95L71j27m6j92k01
7020b91L01o3J15r5L20p0l31K30j92Jq7K65P7k90p9J04q6L14Lj00J76l77J97m7
7044eL0N8m9Q7J4j83K84k21J42l11J40k1N7j89o3K87Q6j44o6j94K63M3k74J47
7068h2J59kj55K33l58j2L06r5N2m7K4O1j48q7L24m3k66M23l88J75Q5O3q4l26J58
7093c0O6K20j29l23K68j52L7Q3j00n3K01n0k9NR6Kq2J14l20L59o0P6k24k9Q6J66
7119A98l33J49R8k72L13j30jj07K99j84j62J92J12l0J83l41J88k22J6R7j25n5
7141a17O5r1J09K58k30p2J79j49l7J68k11R7K20k1m7k22J13Q6j25K3k19M66k14
$$ plain form
7164 29 87 257 -327 -229 42 143 -165 46 325 122 -49 107 -33 -213 -110 -35 -86 -92 -273 -119 95 259
7186 259 -280 -78 61 -9 65 -200 92 -240 261 -35 72 31 124 -80 -93 92 163 312 221 26 103 -187 -151
7209 -151 112 -18 35 38 -120 -16 104 -130 213 51 -281 -12 77 112 -195 -292 140 -106 40 -194 -56 241
7231 241 -111 267 22 11 62 136 -68 115 296 177 243 64 3 7 -120 59 -166 54 131 -218 20 218 125
7254 125 -61 70 12 58 -35 -151 162 151 217 -44 -17 74 94 150 -39 -71 188 8 -31 272 -99 -214 83 -54
7278 -54 -220 -287 69 -160 45 -110 222 28 -183 94 -185 -56 20 -31 -59 -50 -35 57 129 139 -38 99 262 86
7302 86 12 -36 -311 -195 -34 -65 27 -213 55 -252 189 -97 -128 -63 133 -19 -52 -39 230 -135 -39 1 84 -194
7326 -194 -43 74 -118 320 -108 301 231 149 21 -46 -69 200 -291 -88 246 60 -169 -103 -40 -91 172 -101
$$ packed form
7164B9N8J70n84R8K71J01l08K11K79k03j71J56j40j80J03P5n1oj81J54K14J64
7186B59n39K02J39p0P4k65K92l32N01k96J07m1R3k04j3J85P1J49r1j95P7k90L6
7209a51K63j30N3Lj58J04J20k34L43j62l32K69Q9L5l07r7M32k46J46k34J38K97
7231B41l52L78k45j1N1P4k04J83J81j19O6j79o1Mj27J79k25K20P7l49K38J98r3
7254A25j86J31n8M6r3j16L13j1O6k61K7R1K0N6j89l2K59j80l9L03l71j15K97j37
7278e4j66o7L56k29K05j55L32j94k11K77k79J29P6n1k8RJ5R2P2J0j77J37J63j76
7302H6p4m8k75J16J61l1R2k40K68l07M41k86l1O5J96j52l3J3K69l65R6M0Q3k78
7326a94J51J17j92M38m28M09p0q2j28o7k3K69m91K03L34j86k29O6O3n1K63k73
$$ plain form
7348 -101 222 -175 -61 -48 -121 -10 -175 40 -14 54 -180 -2 20 -71 -60 154 -196 -217 85 78 -76 143 12
7371 12 -222 -53 -47 125 -24 -205 -70 -186 -76 109 -2 -153 -532 -15 262 -11 -238 70 150 1 110
7392 110 -133 193 -24 -337 -171 0 98 58 -161 103 83 -37 85 -273 16 287 112 -71 281 68 -73
7413 -73 187 -122 245 66 178 84 272 73 101 -289 -23 132 -291 -14 -219 -200 106 -148 -127 -314 9 -16
7435 -16 65 101 -206 -123 -153 -188 -151 -54 101 -149 -128 -90 43 -179 236 308 -216 -278 300 197 -88 -117 150 -95
7459 -95 94 -149 -22 -124 -128 240 35 112 7 80 73 -1 108 -146 -14 143 57 65 29 45 94 -41 -169 -96 -72
7484 -72 281 28 132 -5 -144 27 97 306 167 6 -90 15 140 267 -51 19 -4 -40 -106 -42 -148 -23 16
7507 16 307 17 -53 -259 8 263 -172 -106 -82 101 -29 3 -67 -30 -255 -24 -71 59 -79 -205 107 101 0
$$ packed form
7348a01L23l97J14J3p3J11j65K15n4O8k34J78K2r1J1K14l50k1L02pj54K19j31
7371A2k34J69OJ72j49j81J35j16J10J85j11j51l79N17K77k73k27L08Q0j49J09
7392A10k43L26k17l13J66J71R8m0k19K64k0j20J22l58K89K71j75j83L52k13j41
7413g3K60l09L67j79J12r4J88j99K8l90K66J55m23K77k05J9L06k54K1j87L23k5
7435a6Q1L6l07Q3l0l5L7R7J55k50K1L8J33k22M15P2n24o2N78j03k85k9K67k45
7459i5J89k43J27j02mL68k05P7j05P3pp4J09k54J32J57q6Ql6J6M9j35j28P3K4
7484g2L53k53J04j37j39J71P0K09j39j61r6J05J25J27l18P0k3l6o6O4j06J25L9
7507A6K91k90p0k06K67K55m35O6K4J83j30L2p0L7k25K31m7J30j38j26L12oj01
$$ plain form
7530 0 -262 -95 57 -20 -211 -75 16 8 -58 93 5 25 203 83 -120 47 -10 -9 87 -166 134 -156 -64 -24 -107
7555 -107 -48 212 -24 91 58 68 -251 -115 55 97 -58 120 -20 38 118 82 147 -23 -146 -84 -218 -20 -40
7578 -40 -243 -126 -103 -72 -90 53 -59 131 -54 157 -30 115 -147 357 52 2 372 135 18 -53 160 -105
7600 -105 -148 20 105 55 -264 29 -267 -265 -250 242 186 36 173 -108 -60 -3 -48 -59 -236 223 318 -62 -393 -241
7624 -241 169 80 9 299 96 22 206 -158 -60 95 156 -74 -66 -439 -46 -94 7 67 -62 270 -38 -30 -43 21
7648 21 228 51 -298 -17 76 43 -328 25 34 -48 127 111 165 305 -87 185 122 -198 -4 11 -108 29 -26 -73
7672 -73 56 -25 131 -69 -199 -110 -67 -93 372 220 -141 93 126 -4 -216 -140 -90 95 105 -89 0 -190 -42
7695 -42 0 -58 -162 133 17 137 -122 52 -27 -73 -94 -59 339 9 -50 -271 22 -214 -263 204 14 -105 -103 297
$$ packed form
7530@k62J67J52p7j91J36R1qo6J51q8K0J78j20k03J67n7JR6k53L00k90R2M0q3
7555a07N9K60k36J15l3J0l19J36J70M2j55J78j40N8Q0l6O5j70j23O2j34J98k0
7578d0k03J17K3L1j8J43j12J90j85K11j87J45k62N04l05n0L70k37j17p1K13k65
7600a05m3J68Q5n0l19K93k96KJ5M92n6j50J37k81M8N7m5j1j77M59R5l80l31J52
7624b41M10q9p1K90k03p4J84l64R8J55O1k30Ql73L93m8J01O0j29L32l08Qj3O4
7648B1K07j77l49K81R3l3l71L53Rq2J75j6N4J40l92K72o3l20J94J5j19J37n5m7
7672g3J29q1J56k00j30Q9M3k6M65j52l61K34L3j30k12P6N0J85J0j94Q9j90J48
7695d2M2n8j04K95j16J20k59J74p9m6k1L5L98l30n9k21K93k36m9M67j90j19KM00
$$ plain form
7719 297 -156 -10 -156 146 75 214 213 -190 -62 -26 28 -172 -166 -170 -191 9 10 -134 55 -298 83 -73 -35 -199
7743 -199 -72 147 -191 -45 -68 -228 45 -42 30 -99 83 85 -16 97 40 67 64 229 29 -22 5 -68 152 150 34
7768 34 74 25 231 115 96 -152 -31 22 218 108 -85 242 5 8 9 -124 -4 -14 22 14 99 -24 171 192 -164
7793 -164 -43 -98 -276 80 298 93 -115 -3 -58 -86 158 -113 -58 98 57 -160 229 -20 -150 -175 -296 150
7815 150 -88 27 171 89 -35 -104 41 166 239 -86 245 64 12 -126 39 101 221 68 160 171 -167 59
7837 59 150 76 102 91 115 -87 -158 68 -34 19 -130 -10 -74 -93 42 -110 11 -88 -20 -138 30 265 -138 -64
7861 -64 179 93 -170 232 -120 -115 -14 -40 145 -326 1 -121 157 -47 -55 -63 26 55 -441 53 146 165 288 49
7885 49 63 -70 124 78 -32 -59 -217 -83 153 -77 -87 -16 -35 217 -66 -45 71 41 7 8 26 -8 -12 170 102 76
$$ packed form
7719B97m53J46j46L02p1J39jm03J28L6N4k00Omk1K00Jj44J89l53L81j56L8j64
7743a99J27K19l38J46k3j60K73q7P2j29J82Kj01J13n7K7lJ65k00n1K7p3K20kj16
7768C4M0m9K06j16j9k48J21N3J96j10j93L27k37LJj33J20j0L6qQ5j23J95K1l56
7793a64J21n5j78L56K18k05k08J12n5k8K44k71N5J56m1k17L89k49j30k5j21M46
7815A50k38J15J44q2j24o9J45J25P3l25L31j81n2j38J65O2J20j53R2J1l38K26
7837E9R1p4K6j1K4k02p1K26j02N3j49J20o4j9J35j52J21r9O8j18J68K35m03P4
7861f4K43q6k63M02l52NJ01k6J85m71L27j22K78k04qqQ9K9m96M94R3J9J23k39
7885D9J4j33J94m6j10k7j58J34K36k30j0P1j9K52k83K1J16l0l4JJ8l4mJ82o8k6
$$ plain form
7911 76 49 -67 560 45 109 -33 47 83 147 49 -99 -91 -84 -279 -35 255 53 40 -103 200 10 255 66 -312
7935 -312 178 134 81 -116 80 345 108 -192 168 -31 199 -123 43 -48 136 138 -43 -44 -34 -70 -346 143 -209
7958 -209 220 49 -207 102 136 18 150 344 65 -203 16 -131 -67 -53 -84 134 96 44 199 73 -3 -112
7980 -112 -49 -280 1 95 -150 130 118 -127 178 -96 33 -65 107 -92 133 196 -85 -25 -253 79 50 -88
8002 -88 -193 178 -104 27 -206 50 -17 -327 234 258 190 -16 93 178 17 -222 125 170 43 75 6 -17 108
8025 108 83 190 155 -300 -301 -114 -17 -107 225 -55 50 -280 -12 39 -138 -333 -94 162 51 78 126 -280 -87
8048 -87 8 -193 -189 -207 39 -3 64 -55 73 -337 166 176 64 84 -19 -264 -11 32 -283 -89 -57 -39 122 3
8072 3 -35 -46 -35 121 148 -74 -144 16 50 -114 59 178 -32 -61 -332 73 -231 21 60 89 174 -91 23 -47
$$ packed form
7911G6k7j16O27n15O4j42Q0L6O4r8j48QPj95K44K90k02j3j43L03j90K45j89l78
7935c12M90m4n3j97J96K65k37l00L60j99K30l22J66r1J84Kj81jJ0l6k76M89l52
7958b09M29j71k56L09L4j18J32J94k79k68K19j47O4J4l1K18l8n2J55j26p6j09
7980a12O3k31K81R4k45K80j2k45L05k74J29r8J72j99K25O3k81O0k28L32k9j38
8002h8j05L71k82J31k33K56o7l10N61K4o8k06J09Q5j61k39L47M5j27L2o9k3J25
8025A08k5J07l5m55jJ87R7r0L32k80J05l30K68N1j77j95K39K56j11K7M8m06J93
8048h7R5k01Mj8K46m2O7j19J28m10N03J0j12K0j03k45K53M3l15J94L2J8J61j19
8072Cl8j1J1J56K7k22p0J60L4j64J73J19k10k9k71M05l04K52L9K9Q5k65J14p0
$$ plain form
8096 -47 160 91 -106 196 -83 -268 -210 32 77 -243 144 114 -266 46 11 10 -151 -154 29 -276 39 227 -11
8119 -11 288 -66 40 136 194 -54 303 -21 -49 105 92 -57 22 -26 229 145 -158 181 101 156 128 -20 189 143
8143 143 118 109 -14 215 -126 79 68 111 41 169 210 61 227 60 -92 94 -117 -173 -44 173 -98 149 -37
8166 -37 -304 116 110 60 -133 -121 -132 230 -13 162 225 -36 25 -1 -142 -154 -95 39 110 154 -27 -149 125 39 -175
$$ packed form
8096d7K07o9j97L02k79j85N8K42M5l20L87l0l80L12l5jj61lJ83l05L15J88k38
8119a1K99l54J06R6N8k48L57l24k8J54j3j49P9m8K55q4l03L39q0N5k8j48K09m6
8143A43k5rj23K29l41K05j1M3p0J28M1j49J66j67j52J86k11n6J29K17k71K47j86
8166c7k67M20on0j93J2j1L62k43J75O3k61O1k6j41j2N9J34P1M4j81j22K74q6k14
8191a75
$$ Imaginary data points
##PAGE= N=2
##DATA TABLE= (X++(I..I)), XYDATA
$$ plain form
0 0 0 0 0 0 0 0 0 0 0 0 6 -8 8 -8 8 -16 16 -24 25 -32 40 -48 56 -65 80 -93 105 -125 143 -165 189 -215 245
33 245 -278 311 -351 395 -442 494 -550 614 -682 757 -837 926 -1024 1129 -1245 1374 -1513
50 -1513 1667 -1837 2024 -2232 2467 -2731 3032 -3375 3776 -4248 4812 -5505 6376 -7510 9053
65 9053 -11291 14843 -21374 37425 -167820 -123546 141592 -11647 -5472 23424 -74471 -171294
77 -171294 -10154 120924 60571 -30098 -12433 -60102 -63751 35458 71953 37380 63189 27296
89 27296 -37960 -8210 59500 46584 19430 41827 40813 -36148 -38609 27802 13596 -2318 47320
102 47320 7786 -62835 -27138 18705 5804 14746 39754 -1902 -71584 -39738 28266 7001
114 7001 -1835 28655 -34681 -89065 -20928 27678 7236 10964 18366 -18739 -39729 14494 56328
$$ packed form
0@%%%%%%%%%%Oj4J6j6J6k4L2m0M9n7P2q8J04j21J45j73J98k30K68l08L54m04M60
33B45n23N89o62P46q37R36j044J164j296J439j594J763j950K153k374K619k887
50a513L180l504L861m256M699n198N763o407P151q024R060j0317J1881j3886J6563
65I053k0344K6134l6217N8799k05245M4274K65138j53239O175K8896r7895r6823
77a71294J61140J31078o0353r0669J7665m7669l649R9209L6495l4573K5809l5893
89B7296o5256K9750O7710j2916k7154K2397j014p6961k461O6411j4206j5914M9638
102D7320l9534p0621L5697M5843j2901Q942K5008m1656o9682L1846O8004k1265
114G001q836L0490o3336n4384O8137M8606k0442L728P402l7105k0990N4223M1834
$$ plain form
127 56328 16975 -2744 10310 -25141 -29189 26208 21684 -11591 5814 15467 -4542 4126 34955
140 34955 27758 -6582 4650 24696 -7786 -17849 10217 302 -9892 12902 4372 -20334 -7948
153 -7948 8103 -4226 -9526 10241 -96 -44294 -35577 6349 -3188 -16803 1289 -6160 -25842
166 -25842 -7893 16777 20865 17944 6787 -15931 -16102 22500 35546 4461 -829 10086 -18314
179 -18314 -26236 23695 41384 2031 -19379 -7546 -5994 -7419 12097 23651 5038 -9985 -12273
192 -12273 -16584 -6814 13429 7576 -8343 -3569 -5808 -20710 -9224 16900 16774 2196 -2937 -8937
206 -8937 -19810 -12025 8677 8630 -3147 -2215 -7993 -16453 4007 27260 21861 10313 2801 -9291
220 -9291 -13138 -1140 12644 9454 -4278 -11584 -17851 -14141 12579 22965 5533 -2235 -5382 -14256
$$ packed form
127E6328l9353j9719J3054l5451m048N5397m524l3275J7405R653k0009Q668L0829
140C4955p197l4340J1232K0046l2482j0063K8066r915j0194K2794q530k4706J2386
153g948J6051j2329n300J9767j0337m4198Q717M1926r537j3615J8092p449j9682
166b5842J7949K4670M088k921j1157k2718j71L8602J3046l1085n290J0915k8400
179a8314p922M9931J7689l9353k1410J1833J552j425J9516J1554j8613j5023k288
192a2273m311R770K0243n853j5919M774k239j4902J1486K6124j26j4578n133o000
206h937j0873P785K0702m7j1777R32n778q460K0460K3253n399j1548p512j2092
220i291l847J1998J3784l190j3732p306o267L710K6720J0386j7432p768l147q874
$$ plain form
234 -14256 -6085 10966 15219 5948 -7325 -8862 -5838 -140 13426 12641 -2713 -3542 -7558 -17229
248 -17229 -3459 12907 11300 1917 -8262 -9193 -5769 -4676 8485 14975 258 -8919 -12647 -10902
262 -10902 10187 19480 11926 8227 -1873 -11656 -10544 -4535 9505 10479 -9637 -15048 -10922 -8899
276 -8899 6914 17647 14617 8929 -7784 -14544 -935 6135 9985 7176 -8286 -9573 -5376 -5960
290 -5960 7849 15023 5014 -2611 -13665 -12952 1385 1943 2798 6537 -4747 -8250 -4808 -2260 13418
305 13418 16741 1400 -3782 -6432 -5538 3691 3934 8562 8942 -10733 -14427 -1728 942 4840 3691
320 3691 -4209 -3106 -8031 -7610 8369 11710 7568 3593 -7967 -5901 2554 -753 3725 5826 -6067
335 -6067 -9283 -8697 -2818 10212 6227 -237 973 -6891 -6688 2801 2954 6600 5110 -5520 -3706
$$ packed form
234a4256Q171J7051M253r271j3273j537L024N698J3566p85j5354q29m016r671
248a7229J3770J6366j607r383j0179r31L424J093J3161O490j4717r177l728J745
262a0902K1089R293p554l699j0100r783J112O009J4040R74k0116n411M126K023
276h899J5813J0733l030n688j6713o760J3609P070L850k809j5462j287M197n84
290e960J3809P174j0009p625j1054P13J4337N58Q55L739j1284l503L442K548J5678
305A3418L323j5341n182k650Q94R229K43M628L80j9675l694J2699K670L898j149
320C691p900J103m925M21J5979L341m142l975j1560K066Q455l307M478K101j1893
335f067l216N86N879J3030l985o464J210p864K03R489J53L646j490j0630J814
$$ plain form
350 -3706 -316 2325 12522 10163 2412 735 -7737 -6644 3411 2461 2545 -1860 -13116 -10569 -3122
365 -3122 1396 8338 4023 -2190 -1609 -7777 -4039 9325 7703 1957 -2504 -9013 -5144 42 2559
380 2559 8926 4861 -4594 -6583 -8610 -556 10785 5248 -785 -217 -5680 -5719 1485 9066 12689 2024
396 2024 -7347 -4026 -2836 765 9005 6466 2297 -2571 -11519 -8095 6212 9121 1685 -6236 -7093
411 -7093 -6472 -8876 1340 15553 8017 -5318 -5297 -3218 168 5310 4343 78 -5253 -10452 -10833 -3604
427 -3604 7693 9096 -1807 -2626 3396 -2249 -2713 9734 11614 -265 -5044 -1397 -65 1261 8823
442 8823 10649 2555 -3330 -3041 -4949 -413 7725 2787 -7292 -7829 -7515 -9800 295 10313 2902
457 2902 -8727 -7567 -4293 -4134 4636 14473 5771 -7929 -5894 -174 710 7624 9342 -3284 -9920
$$ packed form
350c706L390K641J0197k359p751j677q472J093J0055r50Q4m405j1256K547P447
365c122M518O942m315o213N81o168L738J3364j622n746m461o509L869N186K517
380B559O367m065r455j989k027Q054J1341n537o033N68n463l9P204P581L623j0665
396B024r371L321J190L601Q240k539m169m868q948L424J4307K909p436p921q57
411g093O21k404J0216J4213p536j3335K1K079L386N142r67m265n331n199l81P229
427c604J1297J403j0903q19O022n645m64J2447J880j1879m779L647J332J326P562
442H823J826q094n885K89j908M536Q138m938j0079n37L14k285J0095J0018p411
457B902j1629J160L274J59Q770R837q702j3700K035N720Q84O914J718j2626o636
$$ plain form
472 -9920 -6101 -4594 -208 9996 10330 -2535 -6198 4476 4606 -2029 6843 10355 -4913 -8946 -859
487 -859 -1056 -1049 3642 5516 817 -1533 -1178 -4835 -3286 7964 3958 -10473 -5123 49 -9210 -3291
503 -3291 12004 9643 -3729 -6938 -107 1784 2864 9881 4584 -9694 -7817 -5261 -6631 6487
517 6487 10784 -6992 -13717 -4399 1408 443 5174 13016 2394 -11565 -126 8140 1853 6197
531 6197 7850 -2347 -3381 -136 -2156 -286 5371 7054 -927 -4731 1500 -4145 -10471 6080 9759
546 9759 -6533 -8153 -4451 -9056 -4148 8288 12082 1226 -8555 -4461 -2434 815 13748 8304
560 8304 -10035 -9011 -6591 -6695 6914 14262 2312 -9465 -7146 3503 5735 6995 13575 1738
574 1738 -13801 -5011 3113 1854 6959 3196 -7111 -6713 -2743 415 2497 4822 5208 -5135 -8692
$$ packed form
472i920L819J507M386J0204L34j2865l663J0674J30o635Q872L512j5268m033Q087
487h59j97PM691J874m699k350L55l657J549J1250m006j4431N350N172r259N919
503c291J5295k361j3372l209O831J891J080P017n297j4278J877K556j370J3118
517F487M297j7776o725R318N807r65M731P842j0622j3959J1439Q266o287M344
531F197J653j0197j034L245k020J870N657J683p981l804O231n645o326J6551L679
546I759j6292j620L702m605M908J2436L794j0856r781M094K027L249J2933n444
560H304j8339J024K420j04J3609P348j1950j1777K319J0649K232J260O580j1837
574A738j5539Q790Q124j259N105l763j0307L98L970L158K082K325L86j0343l557
$$ plain form
589 -8692 2241 696 -4879 6113 7138 -2709 -4015 -3502 -2224 1984 5441 5862 -396 -6584 -5135
604 -5135 -6393 -265 11298 2524 -10069 -6103 -5324 -5025 4877 9851 3974 -4625 -5004 2988 6858
619 6858 9390 10434 -1541 -6554 684 -668 53 6823 604 -8883 -5424 1854 3642 323 936
634 936 1562 -6049 -5248 2996 -650 -2835 2068 -1960 -3858 1654 1037 -2651 83 4598 2596 -3162
650 -3162 -1494 1281 -4967 -1464 8238 2555 -4394 -2336 -1967 -1329 4670 7473 2683 -3542 -2926 241
666 241 1562 6711 7768 -3062 -7657 -2617 -2355 -1378 3419 1331 -5765 -6746 -1131 2528 3055 4876
682 4876 3485 -3283 -3038 1506 -177 422 3082 -888 -5026 -1899 586 -170 742 3980 1855 -3961
698 -3961 -3375 -385 -547 1333 4505 596 -4140 -2645 -439 1010 5564 7041 626 -4280 -2982 -61
$$ packed form
589h692J0933j545n575J0992J025r847j306N13J278M208L457M21o258o188J449
604e135j258O128J1563q774j2593L966P79K99R902M974n877q599l79P992L870
619F858K532J044j1975n013P238j352P21O770o219r487L459P278J788l319O13
634I36O26p611Q01Q244l646k185M903m028j898N512o17l688K734M515k002n758
650c162J668K775o248L503R702n683o949K058L69O38N999K803m790o225O16L167
666B41J321N149J057j0830m595N040K62R77M797k088p096r81N615L659N27J821
682D876j391o768K45M544j683N99K660l970m138L127K485p56R12L238k125n816
698c961N86K990j62J880L172l909m736J495K206J449M554J477o415m906J298K921
$$ plain form
714 -61 1926 5035 4623 -3355 -8442 -4960 -895 1198 4438 2502 -4442 -5251 -1302 1841 5115 6427
730 6427 2796 -3445 -5240 -547 2059 1538 3050 455 -5362 -4585 -771 1255 3721 2982 -414 -2419
746 -2419 -3127 -1046 1864 2830 3819 -452 -4878 -1864 674 831 4844 4545 -440 -3664 -3615 -659 2667
763 2667 1917 385 -2330 -5985 -3990 -828 2002 6230 2798 -2889 -1102 -4 1076 4350 3973 1929
779 1929 -2503 -5646 -1524 1355 1146 2510 -612 -4113 -1965 -2465 -303 5813 3176 -1106 -2303 -2471
795 -2471 650 1257 1177 4117 -165 -5651 -2183 -183 1443 4122 847 -1429 -1697 -3859 -1065 1947
811 1947 1624 1023 -4037 -5728 -100 699 999 5176 3152 -1034 -1246 -767 3745 4475 312 25 -2353
828 -2353 -5799 -2049 541 1212 3049 -1309 -3628 -644 -109 2380 4076 1451 579 -2827 -4698 1910
$$ packed form
714f1J987L109m12p978n087L482M065K093L240j936o944q09L949L143L274J312
730F427l631o241j795M693K606n21J512k595n817P77L814K026K466p39l396k005
746b419p08K081K910R66R89m271m426L014K538J57M013k99m985l224M9K956L326
763B667p50j532k715l655J995L162K830M228l432n687J787J098J080L274l77k044
779A929m432l143M122K879k09J364l122l501K148n00K162O116k637m282j197j68
795b471L121O07q0K940m282n486L468K000J626K679l275k276k68k162K794L012
811A947l23o01n060j691N628P99L00M177k024m186k12M79M512P30m163k87k378
828b353l446L750K590O71J837m358k319K984N35K489J696k625q72l406j871O608
$$ plain form
844 1910 2867 766 1870 -1192 -4323 -3262 -1167 2790 3439 -1711 -1761 -2007 -3612 775 2539 2395 2083
861 2083 -3056 -4576 496 1902 2969 3982 845 230 -1861 -2584 3871 4501 -504 -1574 -3710 -4461
877 -4461 -1571 -692 2743 4246 -1412 -3029 -354 1347 3538 3171 905 1207 -3726 -5782 -30 2264
893 2264 1301 -371 -3754 -2972 -1859 -2328 1534 3948 75 -2752 -4749 -1415 3139 1470 1517 3094
909 3094 -813 -3283 -150 3666 5512 3313 -222 -1278 -1612 -987 1625 1803 1798 -478 -5681 -3928 1523
926 1523 1726 1045 2636 1072 -2566 -2783 709 3154 1105 -43 -761 -4679 -4762 -762 445 1309 1688
943 1688 -1726 -4417 -1636 1673 2420 3157 3047 -889 -5124 -1299 4174 2939 2252 2486 -1132 -3773
959 -3773 -19 4116 3524 2062 -438 -3878 -3646 186 1099 172 859 -346 -4673 -3819 3847 4211 -786
$$ packed form
844A910R57k101J104l062l131J061K095L957O49n150n0k46j605M387J764j44l12
861B083n139j520N072J406J067J013l137o15k091p23O455O30n005j070k136p51
877d461K890Q79L435J503n658j617K675J701K191l67k266L02m933k056N752K294
893B264r63j672l383P82J113m69L862K414l873k827j997L334M554j669M7J577
909C094l907k470L133L816J846k199l535j056l34O25K612J78nk276n203J753N451
926A523K03o81J591j564l638k17L492K445k049j148p18l918q3M000J207Q64L79
943A688l414k691K781L309P47P37j10l936m235L825N473j235o87K34l618k641
959c773L754M135n92j462k500l440K32L832R13r27O87j205m327Q54P666L64m997
$$ plain form
976 -786 921 1962 -2593 -3118 1179 2085 -235 -1315 -2069 -3776 -2670 649 -624 -597 3701 459 -5640
993 -5640 -971 4899 2010 1057 4037 1450 -4224 -2962 3661 4622 1650 1918 -1902 -4862 1044 3372
1009 3372 148 2188 1550 -5368 -5903 1056 3319 -1254 -2255 1393 -1779 -4566 3237 4440 -1798
1024 -1798 439 1182 -3157 -1259 1759 -676 -3280 -708 1779 -2388 -3135 3498 1412 -2764 4332
1039 4332 4555 -3616 -943 3248 579 649 3837 1920 -5140 -4357 3688 2500 -363 3823 -1467 -8635
1055 -8635 -1112 4524 1123 1756 1762 -4613 -7732 131 6836 1116 -1655 3144 -2496 -6577 3798 6198
1071 6198 -707 201 115 -4187 -3447 1898 2201 -3245 -1281 3375 -3254 -3915 6457 3282 -3900 3092
1087 3092 5048 -2185 -2339 2060 1392 -1176 1258 2025 -5216 -3955 4553 309 -2457 5372 -89 -9062
$$ packed form
976g86J707J041m555n25M297R06k320j080p54j707J106L319j273K7M298l242o099
993e640M669N870k889r53K980k587n674J262O623R61k972K68l820k960N906K328
1009C372l224K040o38o918n35O959K263m573j001L648l172k787P803J203o238
1024a798K237P43m339J898L018k435k604K572K487m167p47O633k086m176P096
1039D332K23q171K673M191k669P0L188j917p060P83Q045j188k863M186n290p168
1055h635P523N636l401O33Oo375l119P863O705n720k771M799n640m081J0375K400
1071F198o905R08q6m302P40N345L03n446J964M656o629o61J0372l175p182O992
1087C092J956p233j54M399o68k568K434P67p241J261Q508m244k766P829n461q973
$$ plain form
1103 -9062 -974 6421 1953 -2481 -75 -1264 -6118 -25 8680 2230 -2670 1810 -3393 -5230 6026
1118 6026 6738 -2783 -3761 23 -2698 -4526 3145 6462 -3591 -4582 3212 -283 -1304 6364 3691
1133 3691 -3366 550 2858 -1737 -2431 2869 1207 -5618 -1052 4156 -3493 -4703 3931 1319 -2794
1148 -2794 2413 1831 -4241 -1840 3787 1541 -2245 1131 923 -5618 -579 8034 1764 -3032 1033
1163 1033 -897 -4062 2023 5117 -738 -3996 -1056 -1702 -3408 2991 6145 -1741 -3107 2578 90
1178 90 -1822 4248 3970 -1792 -1561 364 -1940 -2743 1769 1713 -3497 -1166 2475 -2724 -3043 3208 3270
1195 3270 -1067 775 1453 -2110 -2447 2122 2215 351 931 -713 -4866 -623 5222 1698 -1939 459
1211 459 -644 -4642 -642 4520 1561 -3121 -2253 -1064 -1150 2012 3702 574 2 833 -1224 -1632 3453
$$ packed form
1103i062Q088P395m468m434K406j189m854O093Q705o450m900M480n203j837J1256
1118F026P12r521r78L784k721j828P671L317j0053r91P794l495j021P668k673
1133C691p057L916K308m595o94N300j662o825M566N208p649j210Q634k612m113
1148b794N207n82o072K401N627k246l786L376k08o541N039Q613o270m796M065
1163A033j930l165O085L094n855l258K940o46j706O399L154p886j366N685k488
1178I0j912O070k78n762K31J925k304q03M512n6n210K331L641n199l19O251O2
1195C270m337J842O78l563l37M569R3j864N80j644m153M243N845l524l637K398
1211D59j103l998M000N162k959m682Q68J189q6L162J690l128n72Q31k057m08N085
$$ plain form
1228 3453 3741 -2710 -3215 -208 -1842 -2710 596 2592 -283 -2126 -742 107 507 2942 1732 -1076
1244 -1076 618 591 -2365 -302 3374 1139 -2098 -1090 131 -1064 -1530 2154 2649 -1238 -1372 -1435 -2013
1261 -2013 1293 2790 -443 -1325 -756 -1330 -490 1710 3779 937 -1979 -60 344 -1464 1295 1677
1277 1677 -2010 -2143 -1457 -1937 -547 1074 1859 533 -1513 127 1069 577 3076 2007 -1507 -533 -769
1294 -769 -2161 738 1715 565 -1612 -2460 223 220 -1404 1987 2597 -1235 -1731 -1041 -297 2120 1012
1311 1012 81 640 -1487 -1029 -54 1269 3368 788 -3312 -1389 601 -800 -382 29 305 -1219 -3670
1328 -3670 -1016 2844 1062 738 1086 224 251 -501 -236 3476 2209 -1536 -2179 -2142 157 833 -834 1168
1346 1168 1145 -2909 -1785 957 2288 1959 -338 -726 67 -1892 -1166 1746 956 543 -380 -2755 -493
$$ packed form
1228C453K88o451n05L007j634q68L306J996k875j843J384Q49M00K435j210k808
1244a076J694k7k956K063L676k235l237J008J221j195m66L684M95l887j34o3n78
1261b013L306J497l233q82N69n74Q40K200K069k842k916J919M04j808K759L82
1277A677l687j33O86m80J390J621P85j326k046J640R42m92K499j069l514R74k36
1294g69j392K899R77j150k177q48K683lj624L391O10l832m96O90P44K417j108
1311A012r31N59k127M58R75J323K099k580m100J923J990j401M18M11K76j524k451
1328c670K654L860j782l24L48q62K7p52K65L712j267l745o43L7K299O76j667K002
1346A168k3m054J124K742J331l29k297l88P93j959P26K912p90m13r23k375K262
$$ plain form
1363 -493 987 547 1426 422 -1422 -2070 -2571 228 2206 -228 -840 61 -1479 3 1855 2241 2636
1380 2636 181 -732 -201 -808 274 2228 399 -1480 -1938 -2406 -1043 409 1064 1400 -434 -2255 -669
1397 -669 423 1924 2881 -252 -1083 37 -1271 -880 1217 2196 903 -2088 -1885 916 58 -187 1516
1414 1516 340 -1097 -1788 -1958 620 2328 717 -635 -635 342 254 -180 2290 3227 -475 -2332 -157
1431 -157 176 -794 -277 354 -61 -1463 -2087 -1104 1199 2327 1241 -1068 -496 502 -998 182 2876
1448 2876 1381 -2031 -2637 -666 140 247 984 318 -1518 -1071 -203 141 1515 2295 -623 -1830 -79
1465 -79 673 -22 1223 2614 488 -1351 107 1214 51 836 1046 -701 -2295 -393 -526 -1932 -275
1482 -275 1057 -1605 -1869 432 -48 -221 1338 2340 -418 -738 831 -310 -548 2129 1492 -2830 -1992
$$ packed form
1363d93J480m40Q79j004j844o48n01K799J978k434o12R01j540J482J852L86L95
1380B636k455r13N31o07J082J954j829j879m58m68J363J452O55L36j834j821J586
1397f69J092J501R57l133q31J120j308L91K097R79j293k991K03K801q58k45J703
1414A516j176j437o91j70K578J708j611j352%R77q8m34K470R37l702j857K175
1431a57L33r70N17O31m15j402o24R83K303J128j086k309N72R98j500J180K694
1448B876j495l412o06J971Q06J07P37o66j836M47Q68L44J374P80k918j207J751
1465g9P52o95J245J391k126j839J458J107j163P85K10j747j594J902j33j406J657
1482b75J332k662k64K301m80j73J559J002k758l20J569j141k38K677o37m322Q38
$$ plain form
1499 -1992 951 190 69 1647 513 -1916 -1462 959 1363 731 1621 -1012 -3106 550 1928 -498
1515 -498 529 1802 -1046 -2637 244 2095 398 -763 119 -736 -2556 44 453 -1700 572 1433
1531 1433 -1603 -453 2153 333 -1312 701 3006 368 -2271 62 -202 -1911 1093 1544 -1938
1546 -1938 -1471 -461 -1433 537 3070 1659 -2066 -1712 1970 1156 -322 2603 1018 -3847 -1063 1773
1562 1773 414 1144 1244 -1444 -2503 -139 1781 -417 -994 1324 -1662 -4386 1083 2146 -990 122
1578 122 1696 -221 -796 1118 1571 -58 353 2603 -515 -2921 681 -291 -2220 1641 2261 -1912
1594 -1912 -2437 -532 270 921 2394 2654 -1678 -3274 1004 949 184 3228 275 -3760 -2043 1386 1259
1611 1259 801 568 -687 -3001 -1280 2634 1237 -708 779 -1654 -3035 1615 2916 261 -410 633
$$ packed form
1499a992K943p61j21J578j134k429M54K421M04o32Q90k633k094L656J378k426
1515d98J027J273k848j591K881J851j697j161Q82q55j820K600M09k153K272Q61
1531A433l036J150K606j820j645K013K305k638k639K333k64j709L004M51l482
1546a938M67J010r72J970K533j411l725L54L682q14j478K925j585m865K784K836
1562A773j359P30J00k688j059K364J920k198n77K318k986k724N469J063l136J112
1578A22J574j917n75J914M53j629M11K250l118k406L602r72j929L861O20m173
1594a912n25J905Q02O51J473K60m332j596M278n5p65L044k953m035J717L429j27
1611A259m58k33j255k314J721L914j397j945J487k433j381M650J301k655o71J043
$$ plain form
1627 633 -27 -1075 828 2391 16 -1276 567 -1292 -1929 1300 -305 -1897 667 1267 -890 -1271
1643 -1271 999 1433 -70 619 2337 -704 -2746 356 241 66 1422 -521 -2983 -603 717 485
1659 485 498 1186 175 -2936 -1208 2281 786 -906 170 -410 -1347 756 1479 594 255 51 -673 -427
1677 -427 1333 938 -1738 -1662 554 -813 -1417 819 588 -812 -117 988 989 75 38 630 120 873 925
1696 925 -1222 -1206 17 -964 -282 1476 5 -1776 -1247 383 851 734 995 -319 -1848 -912 524
1713 524 831 724 463 -879 -1258 381 1437 561 720 153 -1353 -1217 518 780 -845 -653 81 -830
1731 -830 -1208 565 1291 398 182 454 -11 200 497 78 145 536 -924 -2014 -923 470 69 -478 803
1750 803 520 -1214 -563 1221 1673 676 97 -578 -510 -402 358 1061 843 460 -1403 -1645 933 1359 -333
$$ packed form
1627F33o60j048J903J563k375j292J843j859o37L229j605j592K564O00k157l81
1643a271K270M34j503O89J718l041k042L102j15j75J356j943k462K380J320k32
1659D85J3O88j011l111J728L489j495j692J076n80r37K103P23q85l39k04p24K46
1677d27J760l95k676P6K216j367o04K236k31j400O95J105Jr14l7N92n10P53N2
1696I25k147J6J223r81O82J758j471j781N29J630M68j17K61j314j529R36J436
1713E24L07j07k61j342l79J639J056q76J59n67j506J36J735K62j625J92P34r11
1731h30l78J773P26q93k16K72m65K11K97m19O7L91j460j090J091J393m01n47J281
1750H03k83j734O51J784M52r97n79o75O8J08P60P03k18l83j863k42K578M26j692
$$ plain form
1769 -333 -68 110 -926 -1716 -805 758 779 -998 -783 -169 -198 894 1014 988 1277 182 -1171 17 683
1788 683 223 -274 -535 -461 -1168 -1416 818 1287 225 388 -154 -87 410 402 876 1520 -317 -961 -855 -521
1808 -521 487 737 -33 485 -516 -1373 324 916 563 364 -857 -940 -731 -1045 310 1261 248 -109
1826 -109 -497 -132 1232 836 508 1233 -349 -1680 -483 36 325 -39 -1057 -413 -572 -872 892 1845
1844 1845 959 1098 30 -216 856 233 324 729 -183 -781 -1030 -770 905 475 -468 570 -470 -1035
1862 -1035 -10 115 649 379 -1037 -1040 -269 -464 346 704 323 695 -782 -666 1150 628 252 263 -397
1881 -397 -318 -739 -830 884 598 -711 -15 -30 34 1082 605 950 903 -642 -766 -225 -73 485 -581 -943
1901 -943 -254 -789 -1061 784 616 99 -163 -426 25 572 302 836 235 -725 -260 -329 329 646 469 364
$$ packed form
1769c33K65J78j036p90R11J563K1j777K15O14k9J092J20k6K89j095j353J188O66
1788F83m60m97k61P4p07k48K234M69j062J63n42O7M97qM74O44j837o44J06L34
1808e21J008K50p70N18j001q57J697N92l53j99j221q3K09l14J355R51j013l57
1826a09l88L65J364l96l28P25j582j331J197N19K89l64j018O44j59l00J764R53
1844A845q86J39j068k46J072o23R1M05r12n98k49K60J675m30r43J038j040n65
1862a035J025J25N34k70j416lP71j95Q10L58l81L72j477J16J816n22l76J1o60
1881c97P9m21r1J714k86j309O96j5O4J048m77L45m7j545j24N41J52N58j066l62
1901i43O89n35k72J845j68n17k62k63M51N47k70N34o01r60M65o9O58L17j77j05
$$ plain form
1921 364 422 -408 5 175 291 -15 -682 -1298 -581 -676 -379 542 351 2 233 -478 742 1443 796 702 294
1942 294 -814 -787 -506 -85 400 -676 -648 -645 -823 77 582 294 301 237 -540 -464 541 417 71 -457 -229 -380
1964 -380 -571 451 1098 262 -206 136 -97 -56 317 655 -503 -517 -323 -558 -541 748 674 383 121 508
1984 508 -659 -322 913 1029 -176 -507 -688 -1444 -555 537 409 -163 -235 -345 -569 634 1995 1003
2002 1003 -109 37 160 -500 395 1103 -309 -1218 -486 -151 -320 411 781 -211 -920 13 139 -555 396
2021 396 182 -1281 -304 565 -408 27 708 780 -73 75 1168 90 -805 697 190 -681 178 -412 -1729
2040 -1729 -575 896 368 185 446 -15 -1012 -152 2170 948 -750 48 -447 -1550 316 810 -223
2057 -223 -515 -395 -512 -559 739 1331 -358 -1047 934 78 -1271 849 706 -1175 -187 967 85 -319
$$ packed form
1921C64N8q30M13J70J16l06o67o16P17r5K97R21j91l49K31p11J220P01o47r4m08
1942B94j108K7K81M21M85j076K8Lj78R00N05k88Po4p77P6J005j24l46n28K28j51
1964c80j91J022O47q36m68L42k33M1L73L38j158j4J94k35J7J289p4k91k62L87
1984E08j167L37J235J16j205l31j81p56Q89J092j28n72p2j10k24J203J361r92
2002A003j112J46J23o60Q95P08j412r09P32L35j69P31L70r92p09R33J26o94R51
2021C96k14j463R77Q69r73M35O81P2q53J48J093j078q95J502n07q71Q59n90j317
2040a729J154J471n28j83K61m61r97Q60K322j222j698P98m95j103J866M94j033
2057b23k92J20j17m7J298N92j689o89J981q56j349K120j43j881R88J154q82m04
$$ plain form
2075 -319 215 788 -10 103 1399 -577 -1466 546 41 -1050 620 65 -1910 -904 965 1319 53
2092 53 230 619 -887 -361 2234 981 -939 40 -1397 -1847 791 1373 217 -791 -853 -531 -501 878
2110 878 2426 -512 -1230 561 -602 -606 1536 1151 -921 -826 227 505 40 435 825 -1407 -373 1413
2128 1413 -916 -977 1270 -132 -1590 696 1269 -582 -936 1151 1391 -470 229 1296 -1085 -838 2068
2145 2068 -269 -950 305 -656 -1763 476 1792 -83 -1681 235 797 -795 432 2610 -661 -1965
2161 -1965 313 163 -252 838 669 -1032 -1133 614 666 -374 878 823 -2270 -1029 1904 43 -1166
2178 -1166 609 452 -909 -256 948 497 -548 556 911 -642 503 918 -1238 -1094 922 220 -1132
2195 -1132 -42 534 -1275 -653 1396 800 -930 -100 867 -652 5 1823 -143 -1106 -237 79 -705
$$ packed form
2075c19N34N73p98J13J296j976q89K012n05j091J670n55j975J006J869L54j266
2092E3J77L89j506N26K595j253j920R79j437m50K638N82j156j008o2L22L0J379
2110H78J548k938p18J791j163mK142l85k072R5J053K78m65L95L90k232J034J786
2128A413k329o1K247j402j458K286N73j851l54K087K40j861O99J067k381K47K906
2145B068k337o81J255r61j107K239J316j875j598J916N62j592J227K178l271j304
2161a965K278j50m15J090j69j701j01J747N2j040J252n5l093J241K933j861j209
2178a166J775j57j361O53J204m51j045J104L55j553J145M15k156J44K016p02j352
2195a132J090N76j809O22K049n96j730Q30R67j519O57J818j966r63Q69L16p84
$$ plain form
2212 -705 445 827 -635 -1463 -74 52 -681 576 1093 -1299 -1117 909 189 -1018 349 1101 -89
2229 -89 -603 1042 500 -198 454 828 -543 -137 52 -1043 -666 890 287 -1463 -414 799 -553 -702
2247 -702 1295 988 -841 -557 213 133 172 810 -10 -771 -359 -116 -831 507 1251 -530 -1008 33 552
2266 552 -154 209 1047 -42 -1213 -263 631 274 695 583 -346 -123 297 -121 -173 492 229 -670 -765 227
2286 227 115 -644 172 622 -106 -425 -38 361 513 693 580 158 -240 -32 -117 -67 212 -91 -912 -638 -476
2307 -476 -644 118 373 -193 -439 -457 15 22 -153 567 -49 -322 -215 235 429 562 116 -146 290 -251 74
2328 74 276 385 518 -617 -502 111 418 -562 332 116 -241 51 -350 269 736 -395 -375 -320 -490 -540 -516
2349 -516 -486 532 -421 -1004 5 354 187 186 5 690 295 -808 67 814 112 406 -128 -97 398 -214
$$ packed form
2212g05J150L82j462q28J389J26p33J257N17k392J82K026p20j207J367P52j190
2229h9n14J645n42o98O52L74j371M06J89j095L77J556o03j750J049J213j352j49
2247g02J997l07j829K84P70q0L9O38q20p61M12K43p15J338P44j781m78J041N19
2266E52p06L63Q38j089j171R50Q94l57M21j12r29K23M20m18n2O65k63q99r5R92
2286B27j12p59Q16M50p28l19L87L99J52J80j13m22l98K08q5N0K79l03q21K74J62
2307d76j68P62K55n66k46j8M72Pj75P20o16k73J07M50J94J33m46k62M36n41L25
2328G4K02J09J33j135J15O13L07r80Q94k16l57K92m01O19M67j131K0N5j70n0K4
2349e16L0J018r53n83J009L49j67jj81O85l95j103Q75P47p02K94n34L1M95o12
$$ plain form
2369 -214 14 504 205 -137 -507 -744 392 -158 -681 -70 240 -496 -66 -50 645 790 -131 216 464 288
2389 288 124 73 -419 15 -408 -1099 -333 -173 -39 -115 -777 -200 49 -85 379 429 -16 221 -395 108 585
2410 585 219 34 446 145 -173 255 -71 181 511 -266 -71 -353 -386 277 41 6 219 -492 -603 213 -28
2431 -28 561 334 -531 -87 -112 -3 130 -230 -181 -266 -737 -391 374 302 450 132 473 262 -4 85 763 881
2453 881 370 -118 -723 -99 362 -171 -102 229 -100 -760 -272 139 274 -299 -87 171 11 -99 -260 -71
2473 -71 589 223 -590 -53 275 744 -6 197 737 106 -526 -280 446 38 51 -377 -502 -345 218 118 186
2494 186 860 24 -444 33 639 262 -503 66 90 -681 -303 377 499 -219 -106 -374 -401 503 849 -33 -97
2515 -97 247 -69 -599 243 733 -322 -543 235 349 -687 604 423 -514 461 495 -428 -585 259 139 -198
$$ packed form
2369b14K28M90k99l42l70k37J136n50n23O11L10p36M30J6O95J45r21L47K48j76
2389B88j64n1m92M34m23o91P66J60J34p6o62N77K49j34M64N0m45K37o16N03M77
2410E85l66j85M12l01l18M28l26K52L30p77J95k82l3O63k36l5K13p11j11Q16k41
2431b8N89k27q65M44k5J09J33l60M9q5m71L46P65p2J48l18L41k11k66Q9O78J18
2453H81n11m88o05O24M61n33O9L31l29o60M88M11J35n73K12K58j60j10j61J89
2473g1O60l66q13N37L28M69p50K03N40o31o32K46P26m08J3m28j25J57N63j00O8
2494A86O74q36m68M77O06l77p65N69K4p71L78O80J22p18J13k68k7R04L46q82o4
2515i7L44l16n30Q42M90j055k21P78J14j036J291j81r37R75L4r23j57Q44j20l37
$$ plain form
2535 -198 150 325 -406 -362 527 678 -21 516 496 -787 -20 574 156 -433 41 -17 -979 -418 759 251
2555 251 -704 -46 -356 -739 447 646 25 163 196 -56 -299 437 742 -707 -737 871 356 -530 119 209
2575 209 -515 297 457 -232 -146 -263 -237 -290 691 1222 -495 -1286 647 246 -480 652 557 -770 -868 144
2595 144 325 -115 176 -173 -990 -60 1110 172 -428 663 -39 -1139 420 1560 468 -630 17 44
2613 44 -631 188 1025 -144 -685 260 -338 -469 935 527 -654 -250 459 -10 -750 -43 604 -470 -169
2632 -169 1294 -281 -976 554 660 -197 415 416 -979 -1161 391 652 -216 -297 59 -724 -370 857 313
2651 313 -98 495 -66 -463 97 981 455 -782 -700 285 -348 -54 1017 -194 -1259 -138 -71 27 844
2670 844 505 -644 -677 330 244 -522 185 890 -593 -565 815 437 -598 12 -54 -85 -78 -188 -502 -716 -127
$$ packed form
2535a98L48J75p31M4Q89J51o99N37k0j283P67N94m18n89M74n8r62N61J177n08
2555B51r55O58l10l83J186J99o21J38L3k52k43P36L05j449l0J608n15q86O49R0
2575B09p24Q12J60o89Q6j17K6n3R81N31j717p91J933m01p26J132r5j327r8J012
2595A44J81m40K91l49q17R30J170r38o00J091p02j100J559J140j092j098O47K7
2613D4o75Q19Q37j169n41R45n98j31J404m08j181M04P09m69p40P07O47j074L01
2632a69J463j575o95J530J06q57O12Jj395j82J552K61q68q1L56p83L54J227n44
2651C13m11N93n61l97N60Q84n26j237Q2R85o33K94J071j211j065J121O7R8Q17
2670H44l39j149l3J007q6p66P07P05j483K8J380l78j035O10o6l1Pj10l14k14N89
$$ plain form
2691 -127 267 -519 537 462 -304 -429 1242 493 260 -46 179 -131 -237 377 181 -283 -438 -226 -637 341
2711 341 595 -279 -368 115 -132 -203 11 756 59 -636 -189 103 -157 204 -300 -503 -59 147 130 -203 -166
2732 -166 -139 -303 -42 413 -228 -590 -43 286 306 506 180 -272 -122 574 660 410 -207 -197 -350 -471 -33
2753 -33 301 74 -187 -328 -233 -1 301 75 23 447 -111 -347 77 485 -90 -341 -139 -373 -53 202 -103
2774 -103 90 2 -185 -147 -301 189 -100 -297 19 302 -368 -398 -12 612 31 -142 330 48 -3 292 -80
2795 -80 -395 -58 -306 -539 -15 291 -228 -182 -117 195 98 37 549 301 -401 -29 228 186 201 -45 -293 -155
2817 -155 -271 -385 134 107 364 -132 -479 218 -19 -154 148 123 -152 170 -64 106 302 172 13 161 -274
2838 -274 78 -104 -475 20 -47 -335 -148 -308 -575 -46 -334 294 7 -30 -234 142 250 483 61 -140 97
$$ packed form
2691a27L94p86J056p5p66j25J671p49k33l06K25l10j06O14j96m64j55K12m11R78
2711C41K54q74q9M83k47p1K14P45o97o95M47K92k60L61n04k03M44K06j7l33L7
2732a66K7j64K61M55o41l62N47L29K0K00l26m52J50O96Q6k50o17J0j53j21M38
2753c3L34k27k61j41R5K32L02k26n2M24n58k36M24M08n75k51K02k34L20K55l05
2774a03J93q8j87L8j54M90k89j97L16K83o70l0L86O24n81j73M72k82n1K95l72
2795h0l15L37k48k33N24L06n19M6O5L12r7o1N12k48p02L72K57m2J5k46k48J38
2817a55j16j14N19k7K57m96l47O97k37j35L02k5k75L22k34J70J96j30j59J48m35
2838b74L52j82l71M95o7k88J87j60k67N29k88O28k87l7k04L76J08K33m22k01K37
$$ plain form
2859 97 -17 60 148 137 -81 -85 -279 322 246 34 327 16 -191 109 -155 -124 309 -3 -27 60 -452 243 81
2882 81 -161 242 -244 -65 -191 -402 59 154 -158 -153 11 -365 128 293 94 729 -60 -437 84 117 224 190
2904 190 -12 75 -93 -317 -277 -60 -21 -51 -198 -383 216 179 33 4 364 298 -399 -309 199 296 -78 37 111
2927 111 28 87 -261 190 170 -41 -191 -129 -78 -31 185 111 54 -99 -386 -147 250 148 348 -153 394 421 -477
2950 -477 18 229 -248 -76 -165 -503 74 166 49 168 -24 447 188 -170 318 298 -233 83 223 -95 -47
2971 -47 -98 -104 -59 -327 -42 -174 -312 283 116 -132 -113 -57 -48 -162 -162 173 -78 237 249 -81 304 443 152 -210
2995 -210 -395 -79 -220 -66 -59 72 -460 -56 -47 83 218 143 205 163 496 374 71 336 343 -349 -371 54 132 -354
3019 -354 -176 107 -439 -282 204 425 -36 144 -108 43 -28 248 -467 -20 355 183 -378 41 98 -128 64
$$ packed form
2859I7j14P7Q8j1k18mj94O01p6k12K93l11k07L00k64L1M33l12k4Q7n12O95j62
2882H1k42M03m86J79j26k11M61R5l12NJ64l76M93J65j99O35p89l77N21L3J07l4
2904A90k02Q7j68k24M0K17L9l0j47j85N99l7j46k9L60o6o97R0N08R7l74J15P4
2927A11q3N9l48M51k0k11j50O2N1M7K16p4n7j53k87K39L97j02K00n01N47K7q98
2950d77M95K11m77J72q9l38N77R2j17J19j92M71k59l58M88k0n31L16J40l18M8
2971d7n1oM5k68K85j32j38N95j67k48J9N6Rj14%L35k51L15J2l30L85J39k91l62
2995b10j85L16j41J54PJ31n32M04RJ30J35p5O2m2L33j22l03K65Po92k2M25P8m86
3019c54J78K83n46J57M86K21m61J80k52J51p1K76p15M47L75j72n61M19N7k26J92
$$ plain form
3040 64 577 56 -344 -316 -230 332 -199 48 -207 -561 89 11 263 508 519 -50 -393 329 504 -164 17 270
3062 270 -473 -384 362 221 -504 -30 99 -19 202 275 313 -268 62 180 -211 -134 334 -38 -415 466 315
3083 315 -251 -132 -11 -287 276 -37 165 -197 -396 180 -276 -31 421 -3 -371 195 518 132 356 531
3103 531 -233 -341 79 252 -391 -438 434 -330 -517 -51 122 -27 -10 -54 65 266 426 144 -481 102 520
3124 520 -291 112 483 -266 -358 536 441 -239 -112 -70 -9 -248 337 121 -255 -235 -34 -292 -65 576 -4 -629
3146 -629 52 295 236 292 543 -161 -592 -281 280 -276 -74 134 -847 -393 150 -177 -109 505 109 -217 73
3167 73 484 -95 -568 96 391 -425 -85 351 26 -552 149 276 -191 313 121 -315 -283 360 317 -375 2
3188 2 350 -373 -18 632 144 -274 185 362 99 -55 187 -152 -658 -196 65 -304 -121 282 -430 -200 401
$$ packed form
3040F4N13n21m00K8Q6N62n31K47k55l54O50p8K52K45J1n69l43P22J75o68J81K53
3062B70p43Q9P46j41p25M74J29j18K21P3L8n81L30J18l91P7M68l72l77Q81j51
3083C15n66J19J21k76N63l13K02l62j99N76m56K45M52m24l68N66L23l86K24J75
3103E31p64j08M20J73o43m7Q72p64j87M66J73j49J7m4J19K01J60k82o25N83M18
3124E20q11M03L71p49r2Q94r5o80J27M2O1k39N85k16l76K0K01k58K27O41n80o25
3146f29O81K43n9N6K51p04m31L11N61n56K02K08r81M54N43l27O8O14l96l26K90
3167G3M11n79m73O64K95q16L40M36l25n78P01J27m67N04j92m36L2O43m3o92L77
3188BL48p23L55O50m88m18M59J77k63j54K42l39n06M62K61l69J83M03p12K30O01
$$ plain form
3209 401 315 77 107 435 -26 -247 395 490 -518 -292 122 -373 -34 25 -104 -337 78 113 -125 5 291
3230 291 -210 -345 235 374 -99 19 379 -106 24 672 279 -75 -97 24 -45 -301 105 -126 -545 -34 -27
3251 -27 135 256 387 -179 -236 253 330 54 75 277 -288 -230 100 41 -220 -106 139 -126 -126 228 278 -26 161
3274 161 300 -63 -441 212 63 -191 86 154 -181 -201 330 219 -325 242 220 1 24 -43 -250 -241 225 19
3296 19 -537 -3 559 67 23 287 -63 -174 -80 17 83 -152 65 -480 -248 -56 39 -103 88 374 -198 -340
3318 -340 275 206 75 -12 -12 244 74 2 66 140 -235 412 66 9 255 -131 -19 -106 33 -195 166 183 93 -273
3342 -273 -314 -246 -100 -142 161 226 -76 161 79 85 122 79 -274 -283 55 -159 -296 -131 49 -35 -6 146 -100 -220
3366 -220 128 19 -98 311 125 -21 -135 -297 -85 124 140 97 -324 232 61 -244 -320 321 -33 -184 -196
$$ packed form
3209D01q6k38L0L28m61k21O42R5j008K26M14m95L39N9j29k33M15L5k38J30K86
3230B91n01j35N80J39m73J18L60m85J30O48l93l54k2J21o9k56M06k31m19N11P
3251b7J62J21J31n66n7M89P7k76K1K02n65N8L30n9k61J14K45k65%L54N0l04J87
3274A61J39l63l78O53j49k54K77O8l35k0N31j11n44N67k2k19K3o7k07RM66k06
3296A9n56N34N62m92m4K64l50j11R4R7O6k35K17n45K32J92R5j42J91K86n72j42
3318c40O15o9j31q7%K56j70p2O4P4l75O47l46n7K46l86J12q7J39k28L61J7r0l66
3342b73m1O8J46m2L03O5l02K37q2OL7m3l53rL38k14j37J65J80q4K9J52k46j20
3366b20L48j09j17M09j86j46j14j62K12K09J6m3m21N56j71l05p6O41l54j51j2
$$ plain form
3387 -196 -82 -128 -112 -211 314 -62 -78 138 -101 213 452 -158 -7 -57 -297 26 -40 13 -36 -341 35 376 81
3410 81 60 -50 -71 273 100 6 7 69 36 -64 -244 -25 190 -157 126 296 -102 -124 82 13 -7 -169 -136 -86
3434 -86 55 126 132 60 -84 -101 132 -27 156 -73 90 131 -144 -226 -163 -158 -52 -245 -272 -34 122 -26 252 3
3458 3 169 202 99 145 -124 -215 85 -210 131 -269 -172 -43 190 -24 -170 66 -207 -224 69 -7 -10 -126 35
3481 35 -196 -100 -152 -117 521 382 -197 89 119 24 202 -274 -243 -44 -198 -178 52 107 -135 -161 45 82 157 320
3505 320 193 100 257 -157 -128 104 -3 -112 -282 210 -14 -247 -62 151 361 38 -53 84 -34 148 -89
3526 -89 -197 287 84 -528 -128 175 157 -278 96 17 -105 -66 198 349 -226 -237 -227 -24 22 7 -227 50 -69
3549 -69 101 -82 120 318 71 -265 165 -42 -204 -36 134 -183 6 -158 -11 -94 222 298 -334 -234 229
$$ packed form
3387a96J14m6J6r9N25l76j6K16k39L14K39o10J51n0k40L23o6N3m9l05L76L41k95
3410H1k1j10k1L44j73r4JO2l3j00j80K19K15l47K83J70l98k2K06o9k0j62L3N0
3434h6J41P1Op2j44j7K33j59J83k29J63M1k75q2O3NJ06j93k7K38J56j48K78k49
3458CJ66L3j03M6k69r1L00k95L41m00R7J29K33k14j46K36k73j7K93p6lj16J61
3481C5k31R6n2L5O38j39n79K86L0r5J78m76L1J99j54K0K30N5k42k6K06L7P5J63
3505C20j27r3J57m14K9K32j07j09j70M92k24k33J85K13K10l23r1J37j18J82k37
3526h9j08M84k03o12M00L03j8m35L74p9j22L9K64J51n75j1J0K03M6j5k34K77j19
3549f9J70j83K02J98k47l36M30k07j62J68J70l17J89j64J47q3L16P6o32J00M63
$$ plain form
3570 229 191 -362 -158 30 -6 -56 158 -95 -156 262 63 -22 109 161 -249 -525 191 118 -206 -257 160 -136 236
3593 236 292 22 -172 -74 -6 -280 99 142 -470 -359 -137 133 -180 -28 55 0 -238 -120 140 45 -127 249
3615 249 -179 272 328 -84 -462 -22 303 -293 -191 -201 -24 -374 -217 285 -104 8 272 -194 -323 139 199
3636 199 169 95 -164 -315 -271 468 472 -474 -292 116 23 -79 119 -87 4 48 -168 -138 183 235 33 -211 -60
3659 -60 439 48 -144 407 -244 -241 -61 -41 -34 -23 134 38 -222 9 296 -639 -70 389 -235 164 145 -393 -259
3682 -259 163 113 -331 134 219 -2 -173 128 97 -378 95 275 -261 -114 339 128 -188 78 128 198 326 282
3704 282 -146 -161 207 327 -83 138 253 -230 -412 96 91 -288 -384 26 -134 -216 313 -10 -124 -297 38 -197
3726 -197 87 307 -103 -297 267 188 -289 -85 235 -52 18 382 -29 40 -21 -121 -162 -147 8 -86 -336 -100
$$ packed form
3570B29l8n53K04J88l6n0K14k53o1M18j99q5J31N2m10k76P16p3l24n1M17k96L72
3593B36N6k70j94R8O8k74L79M3o12J11K22K70l13J52Q3n5k38J18K60r5j72L76
3615B49m28M51N6m12l78M40L25n96J02j0J77l50J57N02l89J12K64m66j29M62O0
3636A99l0p4k59j51M4P39Mr46J82M08r3j02J98k06R1M4k16L0L21N2k02k44J51
3659f0M99l91j92N51o51LJ80K0PJ1J57r6k60K31K87r35N69M59o24L99j9n38J34
3682b59M22n0m44M65Q5k21j71L01l1m75M73J80n36J47M53k11l16K66N0P0J28m4
3704B82m28j5L68J20m10K21J15m83j82N08nl79r6M10j60q2N29l23j14j73L35k35
3726a97K84K20m10j94N64p9m77K04L20k87P0L64m11O9o1j00m1J5J55r4k50K36
$$ plain form
3748 -100 49 187 -32 175 29 -232 -63 133 -69 -282 80 -236 -232 -202 82 -241 -24 263 -181 -260 356
3769 356 46 -3 100 107 -302 -146 -116 -207 -133 71 -28 32 -79 -243 23 44 358 47 -34 -209 40 -4 -34 228
3793 228 -106 -98 -52 48 -120 264 -3 -85 -101 -132 284 184 221 -43 138 -52 -70 -66 -255 188 20 -89 -53 374
3817 374 250 -177 -196 154 32 -350 265 138 184 33 83 -92 96 -288 103 38 96 91 2 204 217 252 -351
3840 -351 102 97 -1 -95 89 35 258 -107 17 175 -267 -41 -73 104 68 -28 -162 49 -152 338 -202 59 154
3863 154 -95 -237 94 -20 -96 -197 -255 13 -115 -91 -176 126 18 97 -2 -217 71 -27 60 -28 48 -113 -128 -185
3887 -185 166 68 58 54 21 -213 52 93 -232 87 19 -116 -37 -120 -162 72 89 89 120 -101 -109 -236 -96 121 30 0
3913 0 98 -205 -88 7 -312 -153 196 69 138 0 -164 -2 -85 115 260 -199 16 69 -19 -48 13 31 56 147
$$ packed form
3748a00J49J38k19K07j46k61J69J96k02k13L62l16ML0K84l23K17K87m44p9O16
3769C56l10m9J03Pm09J56L0r1P4K04r9O0j11j64K66K1L14l11q1j75K49m4l0K62
3793B28l34QM6J00j68L84k67q2j6l1M16j00L7k64J81j90j8Mj89M43j68j09L6M27
3817C74j24m27j9L50j22l82O15j27M6j51N0j75J88l84L91o5N8nq9K02J3L5o03
3840c51M53nr8r4J84n4K23l65J24J58m42K26l2J77l6r6j34K11k01M90n40K61R5
3863A54k49j42L31j14p6j01n8K68j28K4q5L02j08P9r9k15K88r8Q7q8P6j61j5n7
3887a85L51r8j0ml3k34K65M1l25L19o8j35P9q3m2K34J7%L1k21qj27J40K17r1l0
3913@R8l03J17R5l19J59L49j27O9j38j64J62q3K00J45m59K15N3q8k9O1J8K5R1
$$ plain form
3937 147 -74 211 152 -91 168 -230 -70 112 -137 -118 80 146 144 -77 -117 264 134 -8 99 219 288 160
3959 160 -54 -20 -4 -261 -38 269 78 11 205 -51 214 360 84 30 77 83 -196 314 -12 -229 -96 -153 72
3982 72 -4 -12 226 -313 -39 -13 1 40 -257 155 -142 -87 -197 4 -122 270 141 104 -66 -5 6 32 207 9
4006 9 -283 -144 -113 -110 -7 84 30 -296 -121 -29 71 40 -19 301 -78 -19 83 218 284 181 -224 -53 -190 194
4030 194 -147 183 -106 15 -91 -181 315 -166 -45 -26 45 35 290 13 -165 130 -115 -81 -141 131 39 4 -51
4053 -51 -87 -104 10 284 -8 -88 0 -14 -11 8 507 -165 -251 54 93 -69 -36 -168 417 -9 232 -77 -51 -22 2
4078 2 -80 -86 185 -159 -166 77 479 -75 -29 29 -111 8 -21 180 -158 -126 222 40 -362 385 -190 -97 -78 -16 150
4103 150 -114 268 -18 -175 -150 188 -115 126 21 46 -168 -126 99 -174 -49 -149 2 -367 182 106 -272
$$ packed form
3937A47k21K85n9k43K59l98J60J82k49J9J98O6kk21m0L81j30j42J07J20O9j28
3959A60k14L4J6k57K23L07j91o7J94k56K65J46k76n4M7Ok79N10l26k17J33n7K25
3982G2p6qK38n39K74K6J4L9k97M12k97N5j10K01j26L92j29l7j70O1J1K6J75j98
4006Ik92J39L1LJ03R1n4l26J75R2J00l1n9L20l79N9J02J35O6j03m05J71j37L84
4030A94l41L30k89J21j06r0M96m81J21J9P1j0K55k77j78K95k45L4o0K72r2l5n5
4053e1l6j7J14K74k92q0Q8j4LJ9M99o72q6L05L9j62L3j32N85m26K41l09K6K9K4
4078Bq2oK71l44pK43M02n54M6N8j40J19k9K01l38L2L48j82m02P47n75R3J9O2J66
4103A50k64L82k86j57K5L38l03K41j05K5k14M2K25k73J25j00J51l69N49p6l78
$$ plain form
4124 -272 113 156 63 170 78 274 204 -72 -143 284 -188 121 -86 -214 -16 222 15 -182 -81 -259 -89 -155
4146 -155 73 24 224 -75 38 -93 320 114 121 14 -29 -145 -45 57 104 -307 34 -27 -127 -102 -195 166 8
4169 8 126 122 151 -48 83 -64 25 131 14 -269 -72 -31 232 -63 376 72 -104 145 -46 -291 45 -161
4191 -161 -160 -116 88 183 89 -168 146 339 -212 388 201 1 32 -27 -41 27 -25 -140 -288 -97 -185 -11 57 374
4215 374 44 -94 108 127 -179 25 44 95 -104 -58 391 2 118 -188 155 -6 101 -236 21 102 71 -91
4237 -91 -356 238 -42 -136 106 315 -405 -68 -53 -108 44 22 -4 -63 -64 40 32 59 116 -63 -284 99 19 41 106
4262 106 637 -119 68 197 23 -237 -293 9 118 -232 95 7 -121 -124 -52 -202 -89 391 27 -233 115 49
4284 49 120 -127 170 124 -186 181 -34 -43 -127 156 205 19 -65 198 -70 -196 12 -85 45 137 -68 -133 -57 236
$$ packed form
4124b72L85M3r3J07r2J96p0k76p1M27m72L09k07j28J98K38k07j97J01j78J70o6
4146a55K28m9K00k99J13j31M13k06Pj07m3j16J00J02M7m11L41o1j00K5r3L61j58
4169HJ18mK9j99J31j47Q9J06j17k83J97M1K63k95M39l04j76K49j91k45L36k06
4191a61JM4K04R5r4k57L14J93n51O00j87k00L1n9j4O8n2j15j48J91q8J74O8L17
4215C74l30j38K02J9l06K04J9N1j99M6M49l89J16l06L43j61J07l37K57Q1l1j62
4237i1k65N94k80r4K42K09p20L37J5n5J52k2k6n9jJ04qK7N7j79k21L83q0K2O5
4262A06N31p56J87J29j74k60n6L02J09l50L27q8j28lP2j50J13M80l64k60L48o6
4284D9P1k47K97m6l10L67k15rq4K83M9j86q4K63k68j26K08r7J30R2k05o5P6K93
$$ plain form
4308 236 -104 -256 -17 156 -5 -99 -92 139 71 146 -177 -231 200 125 -163 -158 101 -27 107 161 21 -23 65 -67
4332 -67 -102 -167 -29 -54 164 25 154 -281 -114 -65 -225 71 193 -27 -64 -151 -31 95 -268 71 -46 93
4354 93 248 -154 17 -104 -143 5 3 44 15 -185 -150 13 -136 -187 -170 105 201 -268 202 43 97 -130 209 -140
4378 -140 -13 -45 89 34 231 -67 188 -283 -78 31 -94 -1 -168 -220 77 -148 -477 12 213 -134 220
4399 220 346 208 92 26 -76 81 17 -121 8 101 -294 78 155 -192 -115 55 151 -242 -45 -8 -9 244 52
4422 52 -164 80 -177 -112 171 -170 -159 17 182 -330 167 -45 -133 -144 169 -33 35 55 56 -187 -31 -133 -253
4445 -253 44 171 -253 -34 -73 157 -22 163 -74 15 63 -297 -73 -31 -232 218 -44 70 151 -145 35 101
4467 101 18 -74 -19 -57 50 -205 139 133 114 -94 32 -394 -251 -20 -16 130 -20 130 -27 -12 -46 26 -232 69
$$ packed form
4308B36l40j52K39J73j61r4PK31o8P5l23n4M31p5k88NK59j28J34N4j40m4Q8j32
4332f7l5o5J38k5K18j39J29m35J67M9j60K96J22k20l7q7J20J26l63L39j17J39
4354I3J55m02J71j21l9J48kM1k9k00L5J63j49n1J7K75R6m69M70j59N4k27L39l49
4378a40J27l2J34n5J97k98K55m71K05J09j25R3j67n2K97k25l29M89K01l47L54
4399B20J26j38j16o6j02J57o4j38J29R3l95L72P7l47P7J70R6l93J97L7jK53j92
4422E2k16K44k57O5K83l41J1J76J65n12M97k12q8j1L13k02O8K0Jk43J56j02j20
4445b53K97J27m24K19l9K30j79J85k37Q9M8l60K24M2k01M50k62J14Q1k96J80O6
4467A01q3r2N5l8J07k55L44oj9k08J26m26J43K31MJ46j50J50j57J5l4P2k58L01
$$ plain form
4491 69 -204 -9 -182 48 -8 11 41 64 -96 12 85 105 -80 -298 80 -82 45 -146 -207 357 -186 -3 127
4514 127 116 27 12 -129 -21 257 -306 -127 25 -43 -9 63 -81 149 25 105 -5 84 -43 -43 162 -201 -230 30
4538 30 130 -82 -249 108 -35 97 27 -257 -47 139 175 34 -178 -156 -87 58 248 275 228 119 148 -109 129
4561 129 27 -34 -326 22 -108 -206 -202 -41 -403 103 -29 296 -30 -9 19 -487 237 88 140 -272 -125 -143 24
4584 24 350 0 -184 37 -133 142 -121 152 -21 -30 -127 17 -2 -94 -79 -35 -166 -279 354 213 -124 -215 5
4607 5 10 -109 164 89 -262 69 42 -42 -318 -170 -111 -234 105 306 -187 173 202 41 -6 50 122 -4 33 -190
4631 -190 -203 77 174 94 -240 -188 -33 91 -109 -131 133 -96 185 0 42 252 278 -54 218 166 -205 146 60
4654 60 150 -123 -15 -114 141 -247 -429 426 -6 -1 5 -162 108 16 155 13 78 -14 -41 17 239 462 -221 -79
$$ packed form
4491F9k73J95j73K30n6J9L0K3j60J08P3K0j85k18L78j62J27j91o1N64n43J83J30
4514A27j1q9j5j41J08K78n63J79J52o8L4P2j44K30j24Q0j10Q9j27%K05l63k9K60
4538C0J00k12j67L57j43J32p0k84K10J86L6j41k12K2O9J45J90K7m7j09K9k57K38
4561A29j02o1k92L48j30r8MJ61l62N06j32L25l26K1K8n06P24j49N2m12J47j8J67
4584B4L26l50j84K21j70K75k63K73j73rr7J44j9r2J5M4j31j13O33j41l37r1K20
4607ENj19K73p5l51L31k7q4k76J48N9j23L39K01m93L60K9j61m7N6P2j26L7k23
4631a90j3K80R7q0l34N2J55J24k00k2K64k29K81j85M2K10K6l32K72n2l71L51q6
4654F0R0k73J08r9K55l88j82Q55m32NOj67K70r2J39j42O5r2k7N8K22K23o83J42
$$ plain form
4678 -79 206 -16 168 -190 94 -48 -164 64 69 -52 52 0 -139 185 37 140 155 76 -213 -135 72 232
4700 232 52 -13 176 -185 -226 32 -20 -303 39 -133 -96 182 -88 -111 3 64 -166 -73 -145 -206 -5 -75 82
4723 82 93 -49 99 -20 -148 -39 -136 19 -147 47 -162 -44 -205 86 89 -115 49 18 24 -79 -54 -253 -4
4746 -4 63 -7 -144 -122 52 108 -142 326 -50 38 -83 -96 -64 2 226 74 -278 -4 421 -154 -93 149 -60 -281
4770 -281 -107 277 -362 188 79 -107 -25 241 238 -132 217 -34 58 227 69 -21 -209 -2 -50 -133 -46 -107 -28
4793 -28 -139 -132 -73 -100 -156 200 -140 -239 -43 369 -107 -223 -79 -88 -91 135 252 -315 -69 -111 87 -30 -17 258
4817 258 -272 34 23 -155 -88 60 67 -94 150 233 -107 -123 93 -91 -186 -208 57 -157 86 -101 -79 -50 251
4840 251 2 -232 162 8 82 -112 -21 -85 115 -83 8 -169 59 -105 108 91 -80 183 -242 -103 118 74
$$ packed form
4678g9K85k22J84l58K84j42j16K28Nj21J04n2j39L24j48J03J5p9k89P8K07J60
4700B32j80o5J89l61m1K58n2k83L42j72L7K78k70k3J14O1k30R3p2o1K01p0J57
4723H2J1j42J48j19j28J09r7J55j66J94k09J18j61K91Lk04J64l1Oj03K5j99K49
4746dO7p0j37K2J74N6k50M68l76Q8j21j3L2O6K24j52l52K74M25n75O1K42k09k21
4770b81J74L84o39N50j09j86Q2K66ll70L49k51R2J69j58r0j88K07m8q3Q7o1P9
4793b8j11PN9k7n6L56l40r9J96M12m76j16J44rlK26J17n67K46m2J98j17J3K75
4817B58n30L06j1j78O7J48Pj61K44Q3l40j6K16j84r5k2K65k14K43j87K2K9L01
4840B51k49k34L94j54P4j94R1o4K00j98R1j77K28j64K13j7j71K63m25J39K21m4
$$ plain form
4862 74 208 160 181 -124 -9 -61 18 -29 201 -41 -59 167 -35 -77 18 -192 -272 37 -79 -51 47 119 76 -8 37
4887 37 54 -70 -128 97 -9 223 -204 -52 135 278 -22 92 77 -125 -24 -125 -131 31 -205 -4 -68 131
4909 131 10 -84 -24 59 156 64 138 -91 -79 -138 133 22 59 153 -43 24 5 -50 -104 57 92 152 99 -25 -262 76
4935 76 -35 -339 -225 -107 58 265 -142 149 32 82 297 -16 19 138 -103 -111 47 74 -31 197 -82 -13
4957 -13 -170 44 377 -57 -19 172 139 -22 -19 -148 -80 -42 -132 -89 50 -102 35 -220 -1 221 134 26 62 -55
4981 -55 35 -311 -203 -304 55 -59 156 331 75 -186 -250 -68 -5 231 86 143 115 25 -123 174 225 181 25
5004 25 49 -41 90 -137 62 124 106 41 77 -143 -142 113 -337 -41 191 67 -125 30 -118 109 208 -71 -137 179
5028 179 122 -362 1 -139 6 269 -256 281 17 142 -133 -59 356 311 104 -173 176 -46 149 254 130
$$ packed form
4862G4J34m8K1l05J15n2P9m7K30k42j8K26k02m2R5k10q0L09j16K8R8P2m3q4M5
4887C7J7j24n8K25j06K32m27J52J87J43l00J14j5k02J01j01oJ62k36K01o4J99
4909A31j21r4O0Q3R7r2P4k29J2n9K71j11L7R4j96O7j9n5n4J61L5O0n3j24k37L38
4935G6j11l04J14J18J65K07m07K91j17N0K15l13L5J19k41qJ58K7j05K28k79O9
4957a3j57K14L33m34L8J91l3j61Lj29O8L8r0M3J39j52J37k55K19K22q7j08L6j17
4981e5R0l46J08j01L59j14K15J75k56k61o4J82O3K36j45N7k8r0j48K97N1m4j56
5004B5K4r0J31k27J99O2j8o5L6k20JK55m50K96K32j24j92J55j48K27R9k79o6L16
5028A79n7m84L63j40J45K63n25N37k64J25k75P4M15m5k07k77L49k22J95J05j24
$$ plain form
5049 130 177 30 221 257 150 71 -77 91 -21 -26 38 -153 -315 281 -189 -87 61 91 -45 92 258 -89
5071 -89 192 132 -140 -151 142 112 -68 2 66 -175 -147 -4 161 151 148 -117 81 37 69 7 196 -69 -286 205
5095 205 -186 195 -122 78 -152 72 98 28 -35 9 -150 97 138 61 45 212 53 -1 140 145 164 141 -21 -313
5119 -313 -98 48 202 -246 -459 575 -246 -100 12 27 -277 -104 -52 241 -185 13 11 10 123 -159 136 -26
5141 -26 -113 105 -91 27 162 -101 -21 -171 -81 -31 125 54 -3 -88 19 -248 -80 -3 29 -167 182 43 -124
5164 -124 -111 62 -71 -85 -160 77 -175 -25 170 -123 -144 -3 -125 -288 157 -90 62 188 132 -209 157 35
5186 35 193 -190 -348 -47 -280 -71 44 91 -251 -167 72 57 -192 -378 12 22 -161 -88 -142 -127 -103 123 89
5209 89 265 169 -53 92 -59 -71 -279 317 -136 -102 18 46 19 -76 30 32 19 21 -89 13 -208 179 77 -77
$$ packed form
5049A30M7j47J91L6j07p9j48J68j12nO4j91j62N96m70J02J48L0j36J37J66l47
5071h9K81o0k72j1K93l0j80P0O4k41K8J43J65j0lk65J98m4L2o2J89k65k17M91
5095B05l91L81l17K00k30K24K6p0o3M4j59K47M1p7j6J67j59n4J41NJ9k3j62k92
5119c13K15J46J54m48k13J034q21J46J12J5l04J73N2K93m26J98kjJ13k82K95j62
5141b6q7K18j96J18J35k63Q0j50R0N0J56p1n7q5J07k67J68P7L2j96L49j39j67
5164a24J3J73j33j4p5K37k52J50J95k93k1J41j22j63M45k47J52J26n6l41L66j22
5186C5J58l83j58L01k33K09J15M7l42Q4K39j5k49j86L90J0j83P3n4J5K4K26l4
5209H9J76r6k22J45j51j2k08N96m53L4J20K8k7r5J06Kj3Kj10J02k21L87j02j54
$$ plain form
5233 -77 -152 -251 -88 -23 31 -13 -165 112 215 -79 -150 -69 97 -201 -62 156 -91 -10 5 -109 -6 -79 37 10
5257 10 -13 74 -190 -223 6 -123 121 -97 -52 74 -174 77 7 201 -83 80 293 -15 -21 -42 34 -21 -170 -12
5281 -12 -217 15 56 242 173 80 -153 65 -29 105 60 -47 -249 31 -89 123 -108 -7 152 -15 -271 26
5303 26 6 -101 -125 -56 -159 -111 -107 100 -108 216 99 -10 -56 -89 13 -141 83 31 -12 4 90 -104 105 30 127
5328 127 151 23 -235 -67 36 -50 -29 -121 126 32 118 169 -223 -249 -255 -310 33 39 -340 16 -18 32 353 263 150
5353 150 -48 -200 -80 -258 86 -27 -26 183 79 111 27 45 138 291 -30 214 9 60 -163 -85 71 7 344
5376 344 -105 41 126 -12 130 62 37 53 182 -35 -56 -269 225 38 -204 223 102 42 0 346 -209 -97
5398 -97 -104 97 -347 139 -50 9 -150 191 200 52 184 372 -44 -2 -160 52 2 -205 10 -245 -119 -195 11
$$ packed form
5233g7p5r9J63O5N4m4j52K77J03k94p1Q1J66k98J39K18k47Q1J5j14J03p3J16k7
5257A0k3Q7k64l3K29j29K44k18M5J26k48K51p0J94k84J63K13l08ok1P6n5j49J58
5281a2k05K32M1J86o9r3k33K18r4J34m5j07k02K80j20K12k31J01J59j67k56K97
5303B6k0j07k4O9j03M8MK07k08L24j17j09m6l3J02j54K24n2m3J6Q6j94K09p5R7
5328A27K4j28k58J68J03q6K1r2K47r4Q6N1l92k6on5L43Ol79L56l4N0L21r0j13
5353A50j98j52J20j78L44j13JK09j04L2q4J8R3J53l21K44k05N1k23P8J56o4L37
5376C44m49J46Q5j38J42o8k5J6J29k17k1k13M94j87k42M27j21o0m2L46n55J12
5398i7pK01m44M86j89N9j59L41Rj48J32J88m16M2j58K12n0k07K15k55J26p6K06
$$ plain form
5421 11 -47 -396 62 179 301 -66 -1 206 165 3 9 43 3 177 -244 -277 75 -149 64 246 44 216 35
5444 35 -47 33 93 -65 -296 24 153 187 102 -157 -44 -116 158 115 138 304 45 -165 35 70 -123 -72 37 -84
5468 -84 70 -36 258 120 -328 -127 75 66 61 240 224 -191 -244 82 89 -155 150 -11 -48 -411 -3 243 181 -78
5492 -78 -63 -197 79 -27 -26 -244 14 -152 11 177 -42 -17 43 -79 -107 -152 -201 36 195 -221 197 -24 87
5515 87 121 58 124 25 138 44 230 -38 2 167 -152 131 -16 52 -118 -151 -11 -221 -19 132 -55 -119 -152 24
5539 24 147 23 45 -130 123 -32 24 259 -68 -209 -366 -90 69 -332 200 -132 180 262 97 91 -150 3
5561 3 114 29 131 103 272 334 -221 -40 -122 269 -140 -33 180 -69 -204 -59 133 133 -231 -114 7 -49 150
5584 150 315 94 123 -58 -34 24 -81 92 -78 -190 221 165 186 84 -177 -54 -307 80 -150 -186 225 256
$$ packed form
5421A1n8l49M58J17J22l67O5K07m1j62OL4m0J74m21l3L52k24K13J82k02J72j81
5444C5q2Q0O0j58k31L20J29L4q5k59J13p2K74m3K3J66k59k10K00L5j93N1J09j21
5468h4J54j06K94j38m48K01K02rnJ79j6m15n3L26Pk44L05j61l7l63M08K46o2k59
5492g8J5j34K76j06Jk18K58j66J63J66k19K5O0j22k8m5m9K37J59m16M18k21J11
5515H7L4o3O6r9J13r4J86k68M0J65l19K83j47O8j70l3J40k10K02J51j87o4l3J76
5539B4J23j24K2j75K53j55N6K35l27j41j57K76J59m01N32l32L12Q2j65ok41J53
5561CJ11q5J02k8J69O2n55J81q2L91m09J07K13k49j35J45J92%l64J17J21n6J99
5584A50J65k21K9j81K4N8j05J73j70j12M11n6K1j02k61J23k53L87k30l6M11L1
$$ plain form
5606 256 145 -19 117 294 14 -225 248 -21 120 122 -12 -163 -116 -233 -195 -109 -99 27 18 -52 20 -161 -200 33
$$ packed form
5606B56j11j64J36J77k80k39M73k69J41Kj34j51M7j17L8Q6J0J26rp0P2j81l9K33
$$ [...]
8191D9
##END NTUPLES=NMR FID
##END=
