##TITLE=1H_Ser 247-V
 CDCl3, 8 sc, 
 26.2.2020
##JCAMPDX= 6.0         $$ Bruker NMR JCAMP-DX V2.0
##DATA TYPE= NMR FID
##DATA CLASS= NTUPLES
##ORIGIN= UXNMR, Bruker Analytische Messtechnik GmbH
##OWNER= root
$$ XWIN-NMR		Version 3.5
$$ Wed Feb 26 14:47:38 2020 Russian Standard Time (UT+4h)  she@DPX200
##.OBSERVE FREQUENCY= 200.1315
##.OBSERVE NUCLEUS= ^1H
##.DELAY= (6, 6)
##.ACQUISITION MODE= SIMULTANEOUS
##.ACQUISITION SCHEME= undefined
##.AVERAGES= 8
##.DIGITISER RES= 18
##SPECTROMETER/DATA SYSTEM= spect
##.PULSE SEQUENCE= zg30
##.SOLVENT NAME= CDCl3
##.SHIFT REFERENCE= (INTERNAL, CDCl3, 0, 15.7039)
##AUDIT TRAIL= $$ (NUMBER, WHEN, WHO, WHERE, WHAT)
$$ ##TITLE= Audit trail, XWIN-NMR		Version 3.5
$$ ##JCAMPDX= 5.01
$$ ##ORIGIN= Bruker BioSpin GmbH
$$ ##OWNER= she
$$ F:/spectra/data/she/nmr/H-F/1/audita.txt
$$ ##AUDIT TRAIL=  $$ (NUMBER, WHEN, WHO, WHERE, WHAT)
(   1,<2020-02-26 14:46:21.53 +0400>,<she>,<DPX200>,
      <created by zg, POWCHK disabled, PULCHK disabled
       configuration hash MD5:
       00 E9 B6 7A A2 85 ED C7 34 08 36 98 17 FE 4E 26
       data hash MD5: 16K
       06 C3 22 E4 11 B8 CD 57 6D 73 98 D4 64 B7 20 0D>)
$$ ##END=
$$ 
$$ hash MD5
$$ 29 DF EF 8C E9 F2 02 58 71 A1 9B B7 05 87 BD 88
##$RELAX= 
##$RELAX= 
##$RELAX= 
##$RELAX= 
##$RELAX= 
##$RELAX= 
$$ Bruker specific parameters
$$ --------------------------
##$DU= <F:/spectra>
##$EXPNO= 1
##$NAME= <H-F>
##$PROCNO= 1
##$TYPE= <nmr>
##$USER= <she>
##$AMP= (0..31)
100 100 100 100 100 100 100 100 100 100 100 100 100 100 100 100 100 100 
100 100 100 100 100 100 100 100 100 100 100 100 100 100 
##$AQSEQ= 0
##$AQ_mod= 1
##$AUNM= <au_zg>
##$AUTOPOS= <>
##$BF1= 200.13
##$BF2= 200.13
##$BF3= 200.13
##$BF4= 200.13
##$BF5= 200.13
##$BF6= 200.13
##$BF7= 200.13
##$BF8= 200.13
##$BYTORDA= 1
##$CFDGTYP= 0
##$CFRGTYP= 5
##$CHEMSTR= <none>
##$CNST= (0..31)
1 1 145 1 1 1 1 1 1 1 1 1 1 1 1 1 1 1 1 1 1 1 1 1 1 1 1 1 1 1 1 1 
##$CPDPRG= <>
##$CPDPRG1= <>
##$CPDPRG2= <>
##$CPDPRG3= <>
##$CPDPRG4= <mlev>
##$CPDPRG5= <mlev>
##$CPDPRG6= <mlev>
##$CPDPRG7= <mlev>
##$CPDPRG8= <mlev>
##$CPDPRGB= <>
##$CPDPRGT= <>
##$D= (0..31)
0 1.2 0 0 0 0 0 0 0 0.06 0 0.03 0 0 0 0 0.0002 0 0 0 0 0 0 0 0 0 0 0 0 
0 0 0 
##$DATE= 1582713980
##$DBL= (0..7)
120 120 120 120 120 120 120 120 
##$DBP= (0..7)
150 150 150 150 150 150 150 150 
##$DBP07= 0
##$DBPNAM0= <>
##$DBPNAM1= <>
##$DBPNAM2= <>
##$DBPNAM3= <>
##$DBPNAM4= <>
##$DBPNAM5= <>
##$DBPNAM6= <>
##$DBPNAM7= <>
##$DBPOAL= (0..7)
0.5 0.5 0.5 0.5 0.5 0.5 0.5 0.5 
##$DBPOFFS= (0..7)
0 0 0 0 0 0 0 0 
##$DE= 6
##$DECBNUC= <off>
##$DECIM= 24
##$DECNUC= <off>
##$DECSTAT= 4
##$DIGMOD= 1
##$DIGTYP= 9
##$DL= (0..7)
0 120 120 120 120 120 120 120 
##$DP= (0..7)
150 150 150 150 150 150 150 150 
##$DP07= 0
##$DPNAME0= <>
##$DPNAME1= <>
##$DPNAME2= <>
##$DPNAME3= <>
##$DPNAME4= <>
##$DPNAME5= <>
##$DPNAME6= <>
##$DPNAME7= <>
##$DPOAL= (0..7)
0.5 0.5 0.5 0.5 0.5 0.5 0.5 0.5 
##$DPOFFS= (0..7)
0 0 0 0 0 0 0 0 
##$DQDMODE= 0
##$DR= 18
##$DS= 0
##$DSLIST= <SSSSSSSSSSSSSSS>
$$ [...]
##$SUBNAM2= <"">
##$SUBNAM3= <"">
##$SUBNAM4= <"">
##$SUBNAM5= <"">
##$SUBNAM6= <"">
##$SUBNAM7= <"">
##$SUBNAM8= <"">
##$SUBNAM9= <"">
##$SW= 24.9337058887773
##$SWIBOX= (0..15)
0 0 2 0 0 0 0 0 0 0 0 0 0 0 0 0 
##$SW_h= 4990.01996007984
##$TD= 16384
##$TD0= 1
##$TE= 0
##$TE2= 300
##$TE3= 300
##$TEG= 300
##$TL= (0..7)
0 120 120 120 120 120 120 120 
##$TP= (0..7)
150 150 150 150 150 150 150 150 
##$TP07= 0
##$TPNAME0= <>
##$TPNAME1= <>
##$TPNAME2= <>
##$TPNAME3= <>
##$TPNAME4= <>
##$TPNAME5= <>
##$TPNAME6= <>
##$TPNAME7= <>
##$TPOAL= (0..7)
0.5 0.5 0.5 0.5 0.5 0.5 0.5 0.5 
##$TPOFFS= (0..7)
0 0 0 0 0 0 0 0 
##$TUNHIN= 0
##$TUNHOUT= 0
##$TUNXOUT= 0
##$USERA1= <user>
##$USERA2= <user>
##$USERA3= <user>
##$USERA4= <user>
##$USERA5= <user>
##$V9= 5
##$VALIST= <valist>
##$VCLIST= <CCCCCCCCCCCCCCC>
##$VD= 0
##$VDLIST= <DDDDDDDDDDDDDDD>
##$VPLIST= <PPPPPPPPPPPPPPP>
##$VTLIST= <TTTTTTTTTTTTTTT>
##$WBST= 1024
##$WBSW= 4
##$XGAIN= (0..3)
0 0 0 0 
##$XL= 0
##$YL= 0
##$YMAX_a= 248627
##$YMIN_a= -115623
##$ZGOPTNS= <>
##$ZL1= 120
##$ZL2= 120
##$ZL3= 120
##$ZL4= 120
##$ABSF1= 10
##$ABSF2= 0
##$ABSG= 5
##$ABSL= 3
##$ALPHA= 0
##$AQORDER= 0
##$ASSFAC= 0
##$ASSFACI= 0
##$ASSFACX= 0
##$ASSWID= 0
##$AUNMP= <proc_1d>
##$AZFE= 0.1
##$AZFW= 0.1
##$BCFW= 1
##$BC_mod= 2
##$BYTORDP= 1
##$COROFFS= 0
##$CY= 11.3945322036743
##$DATMOD= 1
##$DC= 2
##$DFILT= <>
##$DTYPP= 0
##$F1P= 16.9975609425685
##$F2P= -3.02152046262296
##$FCOR= 0.5
##$FTSIZE= 0
##$FT_mod= 4
##$GAMMA= 1
##$GB= 0.15
##$INTBC= 1
##$INTSCL= 1
##$ISEN= 128
##$LB= 0.24
##$LEV0= 0
##$LPBIN= 0
##$MAXI= 10000
##$MC2= 0
##$MEAN= 0
##$ME_mod= 0
##$MI= 1.114404
##$NCOEF= 0
##$NC_proc= 0
##$NLEV= 6
##$NOISF1= 3.799351
##$NOISF2= 2.8
##$NSP= 1
##$NTH_PI= 0
##$NZP= 0
##$OFFSET= 15.70392
##$PC= 1
##$PHC0= -9784.158
##$PHC1= 9.200819
##$PH_mod= 1
##$PKNL= yes
##$PPARMOD= 0
##$PSCAL= 0
##$PSIGN= 0
##$REVERSE= no
##$SF= 200.130013532006
##$SI= 16384
##$SIGF1= 3
##$SIGF2= 2
##$SINO= 400
##$SIOLD= 16384
##$SREGLST= <1H.CDCl3>
##$SSB= 0
##$STSI= 0
##$STSR= 0
##$SW_p= 3612.71676300578
##$SYMM= 0
##$S_DEV= 0
##$TDeff= 0
##$TDoff= 0
##$TI= <>
##$TILT= no
##$TM1= 0
##$TM2= 0
##$TOPLEV= 0
##$USERP1= <user>
##$USERP2= <user>
##$USERP3= <user>
##$USERP4= <user>
##$USERP5= <user>
##$WDW= 1
##$XDIM= 8192
##$YMAX_p= 0
##$YMIN_p= 0
$$ End of Bruker specific parameters
$$ ---------------------------------
##NTUPLES= NMR FID
##VAR_NAME=  TIME,          FID/REAL,        FID/IMAG
##SYMBOL=    X,             R,               I
##VAR_TYPE=  INDEPENDENT,   DEPENDENT,       DEPENDENT
##VAR_FORM=  AFFN,          ASDF,            ASDF
##VAR_DIM=   8192,          8192,            8192
##UNITS=     SECONDS,       ARBITRARY UNITS, ARBITRARY UNITS
##FACTOR=    0.0002004,     1,               1
##FIRST=     0,             0,               0
##LAST=      1.6414764,     0,               0
##MIN=       0,             -115623,         0
##MAX=       1.6414764,     248627,          0
$$ Real data points
##PAGE= N=1
##DATA TABLE= (X++(R..R)), XYDATA
$$ [...]
2134B208R55j353k315j777O36J547K158N28j399j726j772O43K467K054n37k326
2150ij910j17J966J322l70l41m11Q3k40o41n3O75J227k78n58j457J09L82J017
2169C96J153L05q79j822j318R06K095K423n50k742k450j89L060K197M12j968k308
2186a279o57P63J329J676j4j185j577n74L36J421R52j31j400p88J78O19OP1K53
2205aP68p5j470j559J16K088J909k29j474j742m67J027J820J218j10j539j933
2222a653q82J466K539J719j124k716k032Q67K732J695r90j655j342K4J022P45
2238D15K18Q7j79n59j018j43Q70N49L69k42k38l71l73m40K88J122J311o94j992
2257a020j625L70K716K130n22k479k107k13J938J696O96n00j684j781K8J784J979
$$ plain form
2134 2208 3163 1810 -505 -2282 -1646 -99 2059 2587 1188 -538 -2310 -1667 800 2854 2317 -9
2150 -9 -1919 -2036 -70 1252 882 541 130 213 -27 -668 -721 -46 1181 903 345 -1112 -1003 -621 396
2169 396 1549 1854 975 -847 -2165 -1259 836 3259 2709 -33 -2483 -2672 388 2585 2997 1029 -1279
2186 -1279 -1936 -1173 156 1832 1818 633 -944 -1518 -1182 239 1191 1060 -340 -1128 -950 -331 -325 -254 -1
2205 -1 767 692 -778 -2337 -2221 -133 1776 1547 73 -1669 -2136 -1109 711 1929 1819 280 -1653
2222 -1653 -2535 -1069 1470 3189 2065 -651 -2683 -1816 916 2611 1621 -34 -1376 -1352 -330 415
2238 415 633 720 541 -18 -1036 -1179 -309 240 609 367 129 -242 -615 -1055 -767 355 1666 972 -1020
2257 -1020 -2645 -2275 441 2571 2049 -430 -2537 -2750 -812 884 1580 1080 -604 -2385 -2357 -573 1406
2274A406Q26j495k160q09J171J811P92n31j460j83O62J66j12K06N32P39m17j222
2292g8o41L56Q69J323Qo66q50j065m55J497J371Q53n86k501j576J489K688J233
2310C269r73k507j487O94J628J309j26o21j043j035q4R53J772K90j188j431m16
2327i96P47J011%m97Q0P31m91m70j082K72J611P67l63k031p82M72J552J259l23
2346A467q25j189j224L53J526J873Q2j863k300o10J835K005R24j605k004n92J160
2363i87J102J85m27q5K44m41l29j91R59N15j34o04K0k74K72j03N27P21M76q28
2383F18k111j39J035K163P04j029k086j129O64K328J002p08j088j133o39P97J315
2400E64J325k41j562j343P8J780J091j85j199p42O00N29J64j78N7O67L61l60q81
$$ plain form
2274 1406 2232 737 -1423 -2232 -1061 750 1542 1011 -449 -632 30 196 84 290 822 1561 1144 -78
2292 -78 -719 -363 506 1829 1837 1171 321 -744 -1199 298 1669 2522 1936 -565 -2141 -652 2036 3269
2310 3269 2296 -211 -1698 -1004 624 1933 1807 1186 143 -892 -976 -23 1749 2039 851 -580 -996
2327 -996 -249 762 762 265 345 1076 585 115 -967 -695 916 1683 1320 -711 -1493 -1021 531 1790 1467
2346 1467 642 -547 -1771 -1418 108 1981 2063 200 -2100 -2710 -875 1130 2054 449 -1555 -2147 -987
2363 -987 115 300 -127 -212 32 -409 -738 -929 30 545 411 -193 -173 -447 -175 -278 249 970 1446 618
2383 618 -1493 -1632 -597 1566 2270 1241 -845 -1974 -1310 1018 2020 1312 224 -909 -1548 -751 564
2400 564 1889 1648 86 -1257 -1179 601 1692 1507 308 -434 166 695 859 681 738 1405 1766 1406 525
2419E25r10Q09Q40Q33p3r88j029j18L21J157P71j66r11k113p12K029K145M31j986
2438H55k172n64J564J688L69j262r84o53J91N32P31K00K16q17j294K69N73L21
2456b37K9l57P3M74l16l92m97O08J202N87o27j670o22J032J921R16q97j158j372
2475a303P1J215J345O93k39j684j559J91J870J457L34k136j621N94J000P51q4
2492H95o45l38L1o3J50j3L81M36k27m71l67oK23K36Q73J99J44j275j099m3J415
2513D36J501L54j694k104m08J797J848M15j522j650n44N63R46Q27Q5n08j490m46
2531a594J86J401J108m13r30j224N85R11J69m45K23J72O10o05j449M3J092R53
2549G93N97p53j120m89J71J500J047P7q15j209q74O62J820J549o19k114j454O70
$$ plain form
2419 525 -385 424 1264 2097 2024 1036 7 -111 210 1367 2138 1972 1061 -1052 -1764 265 2410 2841 855
2438 855 -1317 -1881 -317 1371 1740 478 -506 -1159 -968 -436 295 495 711 -106 -1400 -1131 -558 -237
2456 -237 -208 -565 -492 -18 -334 -726 -1223 -615 587 1174 547 -1123 -1745 -713 1208 2124 1227 69 -1303
2475 -1303 -1232 -17 1328 2021 1782 98 -1461 -1270 600 2057 2391 255 -1366 -772 228 979 895
2492 895 250 -88 -57 -120 30 17 398 834 607 136 -231 -237 -14 222 1095 1294 1438 163 -936 -979 436
2513 436 1937 2291 597 -1507 -1915 -118 1730 2145 623 -1027 -1571 -1008 -62 765 850 342 -1148 -1594
2531 -1594 -1408 -7 1101 688 -242 -1466 -881 30 199 -246 -23 149 759 154 -1295 -1252 -160 793
2549 793 1390 637 -483 -972 -801 699 1746 1823 1008 -201 -1075 -413 1407 2956 2337 223 -1231 -561
2567e61J669J167k59j504q22k69R26K39N65j15o12l13m77N5K99L57K30r15n3M78
2587H5l22l67l01R65R09L75j463j674L56J597K001j1j481j344p88J041J365Q81
2605A824k97j038j428n18J344J475P46j004j624j357J091J446Q29p47j057l44
2621f59K43N50k00k06M95J51N5q72m71K75M51Q19K44m75m19o89k51L05J435R49
2641A730p99j411j611P30K166J497p72j696j228k36J358J345L57m49j516o42M24
2658g53N77R86K43o29j070p93R22P00N53m06p56L07J74k41m66L8P06R83j94j234
2678c53r73M21J207J184j85l16r53q90N41R50R04J127j130j655o64P85J739N79
2696B318o53j653q88N19J611j7l6o56p98lq7L39L43K76k18m13o17K51P2M1K37
$$ plain form
2567 -561 1108 2275 2016 512 -310 -579 347 586 1151 1036 424 111 -366 -311 -12 345 575 -340 -393 85
2587 85 -237 -604 -905 60 969 1344 -119 -1793 -1437 160 2161 2150 669 -675 -1463 -422 943 1824
2605 1824 1527 489 -939 -1457 -113 1362 2108 1104 -520 -1877 -786 660 1489 742 -315 -659
2621 -659 -416 134 -66 -272 223 374 429 -443 -914 -639 -188 631 875 400 -19 -708 -959 -654 781 1730
2641 1730 931 -480 -2091 -1361 805 2302 1530 -166 -1394 -1630 -272 1073 1430 981 -535 -1177 -753
2658 -753 -176 810 1053 424 -646 -1439 -517 183 736 330 -426 -119 55 -186 -652 -614 92 1075 881 -353
2678 -353 -1326 -905 302 1486 1301 985 32 -858 -317 633 1537 2664 1534 -121 -785 0 1739 2318
2696 2318 1665 12 -876 -357 1254 1237 1201 545 -253 -256 -343 -4 339 615 397 -16 -633 -382 -310 -269 -32
2717c2P2K81n53o72q81Q79J293J006m13j750j108N94J607J067k16j042j020m34
2735a322P06J060Q68j84r52j511l44J062J505L66j093q92q5M35O63J74n63m7K40
2754H6M31r81p31P38M20P67k81n51m89l15M66O40Q34k03p56j581j53R66J802N21
2774A630j048j756q64R43J262J191l49j245n33j76J096P50K79j90q58n54N0M20
2792D8M60K78j12o36J2o2J72m06k0N31N24j83j223p15M61J088J157l62j093r96
2812a077j22R79Q50M75K20j704o73K6J373J183J45j148j719J0J040J363N1o41
2830F31p99m07J83K28L09J40J16k61l41j57J03K35k99M25P7j75m67m12N0O51Q44
2851F74L21r70j234m80R18J516O95r85j308p40N86J190Q89l03m15j281k55R2Q61
$$ plain form
2717 -32 40 321 -232 -904 -1785 -906 387 1393 980 -770 -1878 -1284 323 1390 1174 132 -888 -1322
2735 -1322 -616 444 1312 1128 176 -1335 -1679 -617 888 1254 161 -731 -816 -381 282 456 -107 -154 86
2754 86 517 -464 -1195 -457 -37 730 449 -102 -591 -906 -440 200 1034 831 75 -1506 -1659 -693 1109 1630
2774 1630 582 -1174 -2038 -1095 167 1358 1009 -236 -769 -945 151 901 1180 990 132 -422 -372 48
2792 48 508 786 674 38 50 -12 160 -246 -266 265 789 606 -617 -1332 -871 217 1374 1012 -81 -1077
2812 -1077 -1199 -220 630 1105 1325 -379 -1052 -1026 347 1530 1675 527 -1192 -1182 -142 1221 1272 631
2830 631 -168 -575 -392 -164 145 285 401 140 -201 -358 -255 -20 -319 106 183 8 -459 -871 -821 -170 674
2851 674 995 25 -1209 -1689 -771 745 1440 455 -853 -1593 -1007 183 1072 769 354 -927 -1182 -1090 -229
2870b29R25j79o63j117M87J87P82J41n68qK24J69k21n97N20N35R8o6p74n76L89
2891e41P42N38pk48j433n52N60J175J086m50j049j428j70J426J315J73j033j245
2909a141m38Q83J173N69o97k32p57j8M72N25Q2j54k12j72J01J66j60j35M0N53
2929D48J33n23r74o1J044R45Q9n43j538j23N43J146P74l38r80p63j00O43J278
2948A100N33q44j355o49L47R76Q34j90j003r65K82M04N92O7m92r7j24O7q0K72
2968c25Q3P7J68p2N6m62j02J55P74M88n5r71j099M10R54J192l3j275r05l27Q69
2989d00Q11P78p94q68p24K28M91Q04qn77n64m32N05N44R23m71o69k90J88M50j48
3010b23J5L03r7L32k74k42n78L53R19J55p03m24m09L6M84J117k26p89p63n44R43
$$ plain form
2870 -229 696 517 -146 -1263 -776 -589 193 334 -234 -242 -18 151 -70 -667 -147 388 486 420 -354 -930 -541
2891 -541 201 739 732 484 -949 -1501 -941 234 1320 870 -179 -1607 -1777 -351 964 1137 104 -1141
2909 -1141 -1579 -696 477 1046 349 117 -640 -658 -186 339 421 267 55 -117 -16 150 -10 -145 -105 448
2929 448 581 58 -916 -977 67 1012 1101 558 -980 -1103 -560 586 1360 1022 42 -721 -821 -178 1100
2948 1100 1633 789 -566 -1215 -868 108 942 752 -251 -1216 -934 -530 62 129 -363 -460 -584 -517 -597 -325
2968 -325 -242 -165 3 -69 -13 -475 -577 -422 352 840 785 -186 -1285 -875 79 1271 1238 -37 -942 -1269 -400
2989 -400 411 1189 395 -473 -1197 -969 -478 326 318 -259 -823 -1255 -750 -206 717 246 -423 -713 -525 -75 -223
3010 -223 -208 95 -2 330 56 -186 -764 -411 508 663 -40 -464 -873 -837 -353 764 538 -251 -1014 -1558 -615
3031f15Q29O57o04p74q99NJ234P69N5r02m30K0K78L04J86mm22O5J25j19L41k39
3053a40k50N64L36m23m39l33J78R83K32K4o11q14J89O93J310m8q60p97n62P47
3073b1N62Q90k95n76j143l82J170O03K31p84o44l81M15L81N39n27l72j65K02K00
3093i7n0j65j63L50Q7k88L84q59k8P25N33j1m11o32m87J018M11N69n91r55n39
3114a199M72Q00R34o67k79q35l97P43P50M65o17r96m20L59P31N14j69l67l70L07
3134b41K96K47n66q3K40L56q2o13L0p5K95N15J78n18o90k13M97O10P35n74p89
3155d45o48M3J323N54p6n50r18k67P26O42N32n01o52n68O82N6K53K00o03o1n0
3176c28O3J83l1k77L43K5l8q6n43oK29O44J45k69n81l49L32J090P11m62o71o45
$$ plain form
3031 -615 214 871 267 -507 -1406 -1401 -167 602 657 -245 -675 -655 -377 -73 113 109 -313 -248 -123 -242 99 -140
3053 -140 -390 174 510 87 -352 -685 -507 476 708 732 121 -693 -504 189 1499 1451 591 -206 -768 -21
3073 -21 541 1431 1136 560 -583 -965 205 808 1039 255 -389 -770 -355 26 565 38 -334 -499 -297 -97
3093 -97 -147 -312 -475 -125 -38 -326 58 -801 -829 -104 429 418 7 -625 -1112 -94 317 886 295 -660 -1199
3114 -1199 -727 73 1007 340 61 -774 -1171 -428 322 787 170 -826 -1246 -887 -156 358 189 -178 -548 -241
3134 -241 55 302 -264 -347 -107 249 167 -446 -416 -491 -196 319 497 -21 -711 -924 -427 183 918 344 -445
3155 -445 -1093 -1050 273 827 751 201 -717 -984 -258 384 916 415 -237 -805 -123 -67 186 386 -217 -278 -328
3176 -328 -265 -82 -113 -390 -47 -22 -60 -146 -689 -695 -466 178 323 54 -527 -876 -544 546 1257 795 124 -521
3198e21P0R23N64J72o57q11o60J067O67M43n45o41n79j06P58M47n4p52M7j30L46
3219D8J3m44J02J15L92M0m02k86o1J9O85K59k93m05p62K53J037L16R4p71o95O7
3241f79M36O03M32q39n87l67M41M47P05kp15k75m46N49L35K98n56m10N01j00L61
3262A32M8k60J98o4K41k36l01m79N52L74J84k01m98o66J1P88Q89l20n16q07j77
3283a108P07P51M83j35q75q50K55Q28N55N5p81l80J9N12L73Q9l98m69r2K57K3
3304a81J14k02o0L26O3pl23k46Q1M3N04Q5n75k68k78J009M54L95m52q49m12K45
3326e34J164N78m34q05k90o8O61M58J64l42p05r6L18K83J28p1n10J27o4P5M92
3347E29m20j0k8N74q6n89q8k27O66J39j6m34k39m72L19P27J73o8p21r20L07Q68
$$ plain form
3198 -521 -451 472 1036 1208 551 -260 -920 147 814 1257 712 71 -508 -614 144 591 537 -215 -168 -298 48
3219 48 61 -383 -281 -166 226 266 -136 -422 -483 -464 221 480 187 -218 -980 -727 310 626 720 -51 -746 -679
3241 -679 -243 360 792 -47 -634 -1001 -560 -113 592 590 -125 -400 -846 -297 38 336 -220 -630 -129 -229 132
3262 132 180 -80 118 54 295 59 -242 -721 -169 205 389 188 -310 -976 -965 -177 712 392 -124 -931 -1108
3283 -1108 -401 350 833 698 -177 -1027 -772 56 611 666 -115 -495 -476 36 409 498 100 -369 -461 -204 -181
3304 -181 -67 -269 -329 -3 60 53 -270 -516 -435 -392 112 197 -378 -646 -924 85 539 934 482 -367 -779 -534
3326 -534 630 1208 774 -31 -321 -389 272 730 894 552 -153 -249 69 352 480 409 -101 26 -38 37 529
3347 529 109 99 71 645 559 -30 -118 -345 321 460 444 10 -229 -701 -382 345 518 450 -271 -1191 -884 -16
3369a6M78j76p20m38K80M07N63k80K76o07o06M21L05N64k45l17j53M17P6K01l89
3390D1j3k08L49j32j3n34K91L03J06J22k47p27j89N25M86K15j83r32o2L3P65Q67
3412H63j94o56p27j98O55N18M94l44l66q07O11K81K35J72m63l60j6N74J01n67
3432a94m9M00k77L84k13N8j63p0M90O1k55m33m81O82M31M88n46m85n24m5J138
3453C97M48j27k56r12j76P14M16L05k49n79m44K13K04L28J30m44l05K7M01mK58
3474C45l95M8J51L86j64n52k75M06K42L04K98o94o05L71L99Q49n34n48m41j98
3494f07O30N92R5n92n62k59M88L29L84j88p53p5J39K71N58j40l32k82k03M11L63
3515B67k39R6j19Q7L9J29j31k20R1M4J19K98p73k22J56P72J71Pm40o21N8K09O70
$$ plain form
3369 -16 462 286 -434 -872 -592 -185 378 98 374 -233 -839 -418 -113 451 206 -111 -264 153 229 430 41
3390 41 28 -180 169 37 24 -510 -219 84 190 312 65 -662 -851 -326 160 375 192 -740 -802 -769 -4 863
3412 863 669 13 -714 -912 -257 261 755 411 45 -762 -151 130 365 537 74 -286 -302 272 373 -194
3432 -194 -243 157 -120 264 51 109 -54 -124 366 427 172 -261 -742 -60 371 859 313 -172 -696 -741 397
3453 397 845 718 462 -450 -626 88 504 809 560 -19 -463 -250 -46 282 412 -32 -337 -310 91 87 345
3474 345 -50 -2 149 535 371 -181 -456 -50 192 496 794 100 -505 -134 265 1114 580 32 -409 -607
3494 -607 23 615 710 118 -444 -703 -215 114 498 310 -443 -518 -379 -108 450 310 -22 -304 -507 -96 267
3515 267 28 124 5 92 131 260 129 -91 0 44 163 461 -312 -534 -378 394 565 572 132 -489 -431 -222 448
3538D48K74l95n09n13K58N56O61j20p39m39r4N98K81L46l90m77j91K88J18n6r9
3559a94J19J93j88K77o7q9k54K23N72k7l63p05j83Q03N38Q7l07n43l61O42L76
3580E49O43o62p48l39M23O44K9Q7p89l03j25N70O69k62n2q11NK02L42K03k69j12
3602a06J94k08J73j15j08n4K73K57K67l23n29J64M27LN44k50j077k46M57N80K79
3623F02K0n91m08k17N44N90J57p85m71k19M76N19K46k47n56k94K34O50j16L1l38
3644a73lJ94J93l20J78m66NO58mk53m45l48O36M29P3k74l71k68Q5O34O04m7o17
3667A00p28K37M93N92K00m20q18M8J59K84O35l14o97n3M9K35K54j20Jn94K78q8
3689b67pn6m2KL96K76k01n01j8J60N34M61n54j99j00j78K55J011k03m52n14O1
$$ plain form
3538 448 722 327 -182 -695 -437 119 780 660 -79 -518 -612 -14 267 613 223 -254 -445 -157 -39 -95 -194
3559 -194 -75 118 -70 207 140 51 -203 20 592 565 202 -503 -686 117 655 742 435 -108 -469 173 549
3580 549 1192 530 -218 -557 -134 510 539 626 -163 -466 -591 -21 648 386 334 -477 -472 -270 72 275 6 -106
3602 -106 88 -120 53 -62 -170 -224 49 306 573 250 -279 -115 312 315 859 609 -468 -714 -257 323 602
3623 602 622 31 -377 -594 -50 540 697 -88 -559 -778 -302 217 463 216 -340 -634 -400 250 134 165 -173
3644 -173 -176 18 211 -109 69 -397 -392 266 262 9 -436 -784 -148 281 354 80 -291 -559 -474 160 764 717 100
3667 100 -628 -391 102 694 894 474 -344 -296 -137 147 782 468 -229 -282 -233 2 256 136 137 -457 -179 -267
3689 -267 -274 -330 -372 -370 26 302 101 -400 -418 -258 276 737 183 -16 -116 -294 -39 972 769 317 -197 -136
3711a36K84O86J08m36p45q8R6M77N4J25o39O9k56N52O2k15Nq4Moo0l2j44L35L1
3736D7M3j03l51r0J67L31N05l49m56m22r0P19M13K47m84n11j26J58P96L19n29
3757B34l99m07K40L83M51On26J9k37M22M2r0k61K85k71L67j37k73L5L6K08JK54
3780C82o70l58J85K91N98K09r13j32n15R73M41K90l80m96m89M62O44K73k38n18
3800C9j29j27M35O23m06l89j74o03Q10k2J74k49J07j83r0J91O8k52k0J39J27j55
3822h6O0n66j59P53O45k02k47m30l22L65N63J76qp29j85nP47M73l52m32n61M9
3844d53O79K29K76l06o31J34J43J54J37k41k23mm4M04p2l2k68L45o8j2J11l74
3866a16J05j0K72K60p55j80n0L10K65L33j55q36r1M15L87K25L45n50m80l39Q58
$$ plain form
3711 -136 148 834 942 506 -239 -327 -231 246 300 425 -214 -145 -401 151 213 -2 3 -81 -77 -83 -143 -175 -319 16 47
3736 47 90 -13 -364 -454 -287 44 549 200 -256 -678 -768 -49 364 611 127 -384 -510 -352 444 763 234
3757 234 -165 -572 -332 51 502 508 -18 1 -236 186 228 138 -123 162 -109 258 121 -152 -117 -81 127 128 382
3780 382 -288 -646 -461 -170 428 637 -276 -408 -923 50 491 781 401 -95 -584 -122 522 795 557 39
3800 39 -90 -217 218 841 435 46 -128 -731 79 57 231 -18 89 -94 -184 7 75 -177 -197 -58 69 -86
3822 -86 -26 -592 -751 2 647 445 198 -232 -554 -189 374 550 542 -187 -372 -377 370 843 491 59 -502 -453
3844 -453 226 455 731 425 -206 -72 71 225 362 121 -102 -106 -150 254 182 150 -118 227 159 147 258 -116
3866 -116 -11 -21 251 511 -244 -424 -474 -164 101 434 279 -557 -648 -233 154 379 724 174 -306 -645 213
3887B13N3L16l22m67k6J80L69L34l17m10r3J21L19j66o2k59Q4P2K64J1m46k34
3909d66K62K51M54l04q14M0R8N59L77m76m11j07K1L59M91J54q8r61O4N82kL25
3931D08m56k76J4J1M69K61j36l66j45j86N26O6l48k15L79K43J4j44l73kK48K65
3953B57K94J1o55p22M86N02L69j13m12m01q5M23O40l0m49o28p3O55j7N13k42k02
3975A21m21K14O4L36p8K9m77N44J56j80J38j77l54K05K55k11n5n13M19J26K72
3996D13j78k24k21k07N38R6K51p47k33r9M22L70L40n65l58k62K59O41k2K57l68
4017A03n48l4L57J87Rj53j24k57O49J11m18J5j31J12L92l42j26k02K02j77L60
4038a5J68m77j58p6N84L50j62k42m93q3L02O51J92j23o09l59P1O42M14j93o43
$$ plain form
3887 213 266 582 260 -207 -233 -53 316 650 333 -77 -170 -49 270 104 42 -217 -133 -61 203 214 -232 -466
3909 -466 -204 47 501 197 -617 -577 -479 80 457 -19 -430 -537 -516 -157 334 488 400 -561 -497 85 83 408
3931 408 -48 -324 -310 -299 170 431 295 -71 -216 -402 124 190 -158 -373 6 249 263 119 -254 -256 -8 257
3953 257 551 562 -93 -815 -329 173 542 429 17 -384 -469 -46 594 564 115 -513 -586 69 52 565 323 121
3975 121 -300 -86 -22 314 236 265 -212 332 488 308 446 269 -85 120 375 164 109 -404 15 141 413
3996 413 235 11 -210 -417 121 217 468 -279 -512 -611 -189 181 521 -44 -402 -664 -405 236 214 471 103
4017 103 -445 -479 -122 65 74 -79 -203 -460 189 300 -118 -103 -234 -122 270 -72 -198 -400 -198 -375 -15
4038 -15 153 -324 -482 -558 26 376 214 -28 -521 -604 -302 349 541 418 -191 -550 -479 163 577 384 -259
4059b59k69K06M78N1K38p28K54l31N21J07k39K99l59J73K94k27k18o1J09J72m
4080B07L7q1l71j8N70K66J98n13k13m01K3N28J74l74m00Kk6L12N01k63k70L4l42
4103d20K72K97j19J94m99Q7K79L48k25l06O1K26m9J09k93k92j18N58J07K80o1
4124D36q04n7K21M30J24j42l86k84R9M42M36k35j21m34N2J24K36K49j90n68k1
4145c93J82M94L1m23n9LQ0q4J68j19r3j22K85M1j1j24P7k16L03M38m18k67k83
4168e10L16J48M04j55j31k16o5J35J96J18j06m15P7r8K99K26R8m48r9L51j0K46
4190C61o08l2MK75k40K1n3L23k06K84j1j1j41k92L16o1N75k92j68j57m06O76L1
4213A88o3j68j63l50P85j4J08j73m16j22M46K73O2k81k41j74J04M07l1K14l99
$$ plain form
4059 -259 -528 -322 156 207 445 -283 -29 -360 161 268 29 328 -31 142 436 209 -9 -70 39 211 207
4080 207 244 163 -208 -226 344 610 808 295 82 -319 -296 232 406 32 -368 -366 -392 -80 421 158 -112 -78 -420
4103 -420 -148 149 30 224 -275 -188 91 439 214 -92 -31 195 146 255 -38 -330 -448 110 217 497 436
4124 436 -368 -425 -204 226 350 208 -178 -462 -363 79 515 280 159 -275 -223 -99 137 386 196 -372 -393
4145 -393 -211 283 314 -109 -168 -165 -85 -169 -1 -120 -213 -335 -50 -9 -20 -144 -67 -283 20 458 40 -227 -510
4168 -510 -194 -46 358 203 72 -144 -209 -74 122 240 134 -281 -204 -302 -3 223 321 -127 -226 125 115 361
4190 361 -247 -279 -275 0 -240 -219 -272 51 -155 129 118 107 -34 -326 -10 -71 504 212 44 -113 -519 157 188
4213 188 125 -43 -206 -556 229 215 323 150 -266 -388 58 331 393 112 -129 -303 -199 208 177 391 -8
4234hr0O0K02k75Q2Kk41O03j09j42n2j00j99M45k08K00l7o46L70j6P05l58l35
4257a47n4k54L82K70Q9j22l74k39L95K4K72M65q14m5j8N30l36O4j34M5L6L17j64
4280A88J41n65M5J37j24K08k04M5l02M20P2m33K18m33K54K87J50J94M4p19J54
4301b23q0M66q1k19j8l31J60L68O91l81p09K6M44k54K67R7l45L2j05m4o2L65k16
4324a52o6P7J41J2k19K78k41J07M63k92r4j92p4k02O79N0j55j37k76J23L12M41
4346E83k13m58r7R8J16M54k17j46m42J59P4L32O9k58P4Mk22K69O4j7m10m4K49
4369B1p5K85j60m17K70K11j41K72n14Q4J37J69K75K7o36o6k7O5O21K07m70n98
4391d60L38K0O00k55kl71k97N3N29k5L4k72p4J65J82r6jj98J20J27J39m30j98
$$ plain form
4234 -8 -98 -38 164 -111 -29 -27 -268 335 226 84 32 -68 -267 178 -30 170 133 -513 -143 -159 546 188 -147
4257 -147 -201 -455 -73 197 286 164 -210 -449 -54 -30 242 707 -107 -152 -170 360 24 88 -46 -1 35 352 188
4280 188 329 -236 -191 -54 -178 30 -174 -129 -431 -11 61 -372 -154 -587 -333 -46 104 298 342 -377 -223
4301 -223 -303 163 82 -137 -155 -486 -326 42 733 352 -357 -331 113 -141 126 223 -122 -90 -195 -239 -301 64 -152
4324 -152 -218 -141 0 12 -207 71 -170 -63 400 108 14 -178 -252 -454 225 275 120 -17 -293 -170 142 583
4346 583 370 -88 -185 -87 29 483 266 120 -322 -163 -89 243 312 54 128 132 -90 179 243 226 -184 -228 21
4369 21 -54 231 71 -346 -76 135 -6 266 -248 -164 -27 142 417 444 -192 -258 -285 -220 401 608 138 -460
4391 -460 -122 -102 498 243 241 -130 -427 -374 155 130 164 -108 -182 -17 165 69 68 -130 -10 117 256 -174 -372
4414c72L45j52j98L43j85p0j6o3M40J71k97j5n78Q2O96R3K0l34j19m88N49N40
4436C92J35p10o8j13l3O42J12j58m57J34K3J97J55j92K4l13M03j92p0J38l32L09
4458B6q3M14k66o1l75J21L11J53j13m21K52l99N21N4P4r3l48j31O1O43m2l35o6
4481a03k53J08M15Q1n2k81J36k1J57r7K61j75k87N98p7m44J49j28k47K42K16j55
4503D3K21k81m95N34Q5K64k26n16M43j88M50Oj21l72l25K29L76m0k1j32l39K49
4525a56J55L17M3m51Q8l70L77n6J86J0k77M4J36J3J5k87r6L62o0l9j78N2l51L61
4549a62K41K57l68l82J30O8K97J24j71q4n89M24M45n1R8o60J71K9J28K87k7l08
4571a03Q7l25K49L34M5l16k11K13j0p3M34k77q4K6m4L56k08m04j50M13N22k97
$$ plain form
4414 -372 -27 -179 -377 -34 -219 -289 -305 -368 72 243 -54 -69 -647 -565 131 224 244 -90 -209 -697 -148 392
4436 392 527 -183 -251 -364 -397 245 357 199 -258 -124 -101 96 251 59 83 -230 173 -19 -89 49 -283 26
4458 26 -57 357 91 30 -345 -224 87 240 127 -294 -42 -441 80 134 208 115 -233 -364 -303 340 298 -37 -103
4481 -103 -356 -248 167 248 196 -85 51 30 187 90 351 176 -111 487 410 -34 115 -13 -260 -18 198 43
4503 43 264 -17 -512 22 107 371 145 -371 72 -116 334 340 219 -153 -478 -249 127 87 66 -66 -405 -156
4525 -156 -1 316 359 -92 -4 -374 3 -53 133 143 -134 -90 46 59 74 -213 -309 53 -7 -46 -224 -172 -523 -162
4549 -162 79 336 -32 -414 -284 -216 81 205 34 -50 -639 -215 230 179 277 -383 -212 -183 -55 232 205 -103
4571 -103 -16 -341 -92 242 287 -29 -240 -27 -37 -110 324 47 -37 -11 -55 301 93 -311 -461 -48 474 177
4593A77j27R3o03K48M97L28m62o3j69k14K92L94J04l73m14pN32J63j58k25k90
4614b77J10J71K07l2l0j04N8J15j75K66l30N9J75M0q8k35Q9j12q0L03k72P4P6
4637Hk35PL8L76J14l81k04K54J21K49j82j52m59L94j23K95K57l60l77K01jK24
4659F4K9k25Q4k09J76K81j68j66l4J52K94j11k55J34n37L81J53RM01n27n0j5J28
4682a1J50K03m76j31L37j26L66L2j60k81k08J77L08k51K3k36K27k53M09K7m68
4703c42K13J75l1RL6J55n00L18K4k7J20j44k5J79j6j18J04k01l3O0K22J50j02
4726B26o07P4M4J85M50j13J19n71k53O71l40K80j15j68p5L61Kn3k40P0k83N20
4748A84j23k11LL02K4l0lM2r1j70p9L84j45K5k09J88l85K97K47j31ml53m9K3L92
$$ plain form
4593 177 50 143 -460 -212 285 613 151 88 -81 -295 -3 391 495 122 -292 -299 233 396 238 13 -277
4614 -277 -167 4 211 179 149 45 103 218 43 309 -21 38 213 253 165 -70 19 -93 -173 130 -142 -68 8
4637 8 -227 -220 -182 194 308 -73 -277 -23 98 347 165 13 -446 -52 -175 120 377 17 -360 -159 -160 64
4659 64 93 -132 -48 -257 -81 200 32 -134 -168 -16 278 167 -88 46 -491 -110 43 52 453 -74 -124 -139 -11
4682 -11 139 342 -134 -265 72 -54 312 344 184 -97 -305 -128 180 -71 -48 -284 -57 -310 99 126 -342
4703 -342 -129 46 15 24 60 215 -285 33 57 30 150 6 -19 160 144 26 130 -71 -104 -44 178 328 226
4726 226 -381 -307 -263 -78 372 259 378 -193 -446 225 -115 165 50 -118 -193 168 170 117 -123 -53 -336 184
4748 184 61 -150 -147 155 179 149 146 188 97 -73 -152 232 87 112 -97 91 -294 3 250 119 115 -238 -287 -264 128
4773A28K31l70J28l78K44M48J42o35k8l1J0Q6j07K65m11J84L7Mp0P3l5k33L71
4796E3J37j37j91r1j01L78l1r8K5J16j41O5K38J38l15M8k77o6M10O1k67r5J6k80
4820d05M47K43o4l73N2O4Q2j12K07k12M1P1jJ38j73K88k46n8R3J71j9o3q06N95
4844d0J85j63J24k16n07M48L44j35L52o75j54L11K92P1j12J2l77N7j8P14k53m67
4866b07K76l61M99l00J07J49j09p8P5L9K29j19k70k40N3M0L12k15N0J36K1J76
4888B63l89k04L06k47L57R4k07j65k9J31M52l49L18m41J96mK55K2k6j86l88K58
4910A7j82K75M9p0j83N2J33K3J5O5m10K40o5L46l84L3RJ95j78M0k06j25J23q3
4934b71L38J39k9m4l28R3J72ol3l4o5j79K40O3p6j78K1R9K08o0K44m03p7O5nM02
$$ plain form
4773 128 359 -11 117 -261 -17 431 573 -62 -90 -121 -111 -25 -132 133 -278 -94 -57 -53 -123 -50 -85 -318 53
4796 53 190 53 -138 -229 -330 48 17 -81 -56 60 -81 -16 222 360 45 93 -184 -250 160 221 -46 -141 -125 -405
4820 -405 42 285 221 -152 -100 -36 46 -66 141 -71 -30 41 40 178 5 293 47 -11 82 253 234 171 -635 -40
4844 -40 145 -18 106 -110 -617 -169 175 40 392 -283 -437 -126 166 237 125 137 -240 -183 -201 513 260 -207
4866 -207 69 -292 207 -93 14 163 54 -24 51 90 319 200 -70 -310 -257 -217 95 -120 -70 66 87 263
4888 263 -126 -330 -24 -271 86 180 -27 -192 -221 -90 362 13 331 -110 86 82 337 359 333 147 -241 17
4910 17 -165 110 159 89 -94 -42 91 114 129 194 -216 24 -41 305 -79 -46 -37 158 -20 20 -186 -311 -188 -271
4934 -271 67 206 177 133 -195 -102 70 64 31 -3 -68 -247 -7 56 -20 -198 -177 -78 130 70 314 -89 -166 -101 -106 296
4960B96l57k34N04n77L80L04l05j86K45l59N07J16m57K6j74J73J30K00k8j33r8
4981b7j58KP89m66Q6l83j98L34k00K80J34k24L5j15N7K00rl4l92K98J90j04K0
5004A15Lk21L40P1l43L52l64j11K75J68j43Pl11J46K58m8J19k31M4j79l46J7P74
5027C92m78M3J94j37K25P7n66J23r0K38m5K94N2m33l1J85l1J9j93p3M02l45J98
5050B0J90L02o26p3K51K22M0k68P9n83O02m17L35l78M9L31l17K63L82j85l74k4
5072a79J27J58M4o6k91k63K61L32j19K3l1k30J9K49J10J98j94k40J7J55j54K33
5094A59k71j8K57J31j26k52j13M03q9L04L9k85m1k90M4J73J87k50j79K14L2r5
5116f6K35l0j06l01M0J51J71J31J52k22j4J30Q0k85o9P3J77o0J18q0l0n60M06
$$ plain form
4960 296 -61 -295 209 -368 12 316 11 -175 70 -289 218 334 -123 -97 -271 -98 32 232 204 71 -27
4981 -27 -185 -183 606 140 226 -157 -355 -21 -221 59 193 -31 4 -111 -54 146 137 103 -289 9 199 95 115
5004 115 118 -103 237 308 -35 317 -47 -158 117 285 142 149 -162 -16 242 194 313 82 126 -53 -399 -382 392
5027 392 -86 -43 151 14 239 316 -250 -127 -217 21 -24 270 322 -111 -142 43 12 31 -162 -235 167 -178 20
5050 20 210 512 -114 -187 64 286 326 58 137 -446 156 -261 74 -304 -255 76 -241 22 404 219 -155 -179
5072 -179 -52 106 150 84 -207 -470 -209 123 4 27 -4 -234 -215 34 144 342 148 -92 -75 80 -74 159
5094 159 -112 -130 127 258 132 -120 -233 170 81 385 424 139 98 -192 -148 25 212 -38 -217 -3 29 -66
5116 -66 169 139 33 -268 -228 -77 94 225 377 155 141 271 351 66 -3 70 247 187 305 225 195 -365 41
5139D1L73k30m22R9K15P6J16k34J80m10n4J55N5J69p6oj3m52N83r0K21l21j60
5162a85K41r4L42ql11j96R8J53M0m70N19j04m8j41K21L59n89j6K56k67M13j39
5184G4l3l20K59n9L49p5j87q5l02L87k08M86l36J81o15N46Q8L32m46j48j03M75
5206B60n15M13O3l54j97J99L68j49P2j92q7l0J05N60o13M08j31j00K8L4k74j2
5228a44K5J65K0J40l91Q4L91l12M45m62j18P8m4K11J13mk54mq8J41P3L40l29j73
5252i7J96j64J67k18L14k7l79K40J75p3j61K2j79N1L40k37j5J15l95L61K19P3
5274C28j97k85Q5M4L9M31m01j11k96K44Q1Q5k4j26q9M22k52m9K08q9j4K80l32
5297a8j08L90o33L64J98M4%m59K34j52ML28J3r5j66j24J76P3K81l79J1m51M56
$$ plain form
5139 41 414 184 -238 -139 76 152 268 34 214 -196 -250 -95 -40 129 53 47 34 -418 165 75 296 -25 -185
5162 -185 56 -38 304 296 -15 -211 -113 40 80 -390 129 25 -23 -164 57 416 -173 -189 67 -200 213 74
5184 74 41 -279 -20 -79 270 195 8 -77 -379 8 -200 286 -50 131 -484 62 150 482 36 -112 -215 260
5206 260 -255 158 221 -133 -330 -131 237 88 160 -32 -119 -149 -44 516 -97 311 180 80 108 142 -132 -144
5228 -144 -119 46 66 206 -185 -101 290 -22 423 -39 -157 -79 -123 88 201 197 -57 -61 -149 -8 65 405 76 -97
5252 -97 99 -65 102 -116 198 171 -208 32 207 134 -27 -5 -184 -133 207 -30 -45 70 -325 36 255 328
5274 328 131 -154 -69 -25 14 445 44 -67 -363 -119 -38 47 23 -103 -192 230 -22 -71 137 48 34 314 -18
5297 -18 -126 264 -369 -5 193 237 237 -222 12 -140 -136 192 205 110 -56 -180 -4 69 350 -29 -18 -469 -13
5320a3P6K64l79j88N2K40L0J55k76l20P9J55Q5J78R8k99O2j4j88K46j5r3j01k0
5344a86K33j81J55p5J36J47l95M57j49j40j81J2J2L75k0j19l47J87J71J71j18
5365A45l81J81r5K20P1R3l92J0J00J17j1J12O7m83L46j25l5M32k6l10m64M69r9
5388e8r1Pj60K51J28j36K55j17k08J68J58k37N8p2J22p8K58j4j71n5r4j66L77
5411A25R3p4P1k71m5j6J54N31p37N2L19k02p5m2k53K38J21Qm7K93m00m7L59k79
5435a24L93l12o1j37O4M63q9J71m61j64P3L60j61K78m62j87L27J96j05k60J59
5456c9k45J26K6L26K59k77k10j04p6N67k07j51j46R5O5N8k80M06l29P0K10m53
5478c09N60k28n1K3J20K13k60j68J0M3L0M9o5r5P1K78l40J97j45j06M7J84j5j76
$$ plain form
5320 -13 63 327 -52 -240 -188 52 82 237 -39 -359 -280 -125 -40 138 236 -63 -1 -15 -203 43 28 -65 -166 -186
5344 -186 47 -134 21 -54 82 229 -166 291 142 2 -179 -167 -155 220 200 81 -266 -79 92 263 145
5365 145 -236 -55 -150 70 141 234 -158 -148 -48 69 58 170 237 -246 100 -25 -60 372 346 36 -428 41 -58
5388 -58 -149 -142 -302 -51 77 -59 196 79 -129 39 197 -40 18 -54 68 -10 248 234 63 8 -86 -252 125
5411 125 218 144 215 -56 -101 -117 37 568 -169 -117 202 0 -75 -117 -370 -132 -11 -3 -50 243 -157 -204 155 -124
5435 -124 269 -43 -104 -241 -177 286 197 368 -93 -257 -184 176 15 293 -169 -356 -29 167 62 -198 -39
5456 -39 -284 -158 -132 194 453 176 -34 -138 -214 353 146 -5 -151 -56 9 67 -213 193 -136 -66 144 -309
5478 -309 251 23 -28 -5 115 328 68 -100 -90 -47 -17 32 -33 -128 -57 221 -119 78 -67 -173 -126 58 43 -133
5502a33P3J84l01L35l49L12n2l8L7r0oJ86R0L6m16L65j42M01k17k49J12k97L27
5525A68N6J26k43k42p1L55K12l16j81O6p9K32P7k49j35K56q9k0R9L51k02l22J07
5548d4l4O1Q6j44l75O99J2m96K54m7K17m54L40K88q6m92J66k25K89K39k50j8k46
5571b60L22j6J07j4n8j37o8K6K1J85P9k88J49k43L79N6j17k32q0L2L39k72K50
5594A60k45J27J08k58K13j81J96P0k53K22R7m86M31p4q3M6Q6j77J00j87MK95j55
5617E6K07k80m9p3J50J18r6m7q1qJ55N0M4m32L10j30J68J10l3j21r1J02J48k71
5641i4Q9J25j1l0k66L58k08r4j6L19o6J89l72J02q4K6L25o4k6l20P6j7J91J24
5665B56l35L05l65j7J83J91k52j10O0L8J44k83M01j32N0j09n8j36J30k10L73k82
$$ plain form
5502 -133 -60 124 -177 158 -191 121 69 31 68 -22 -28 158 248 284 -132 233 91 492 275 26 138 -159 168
5525 168 224 350 107 -135 -206 149 361 45 -136 -70 -149 83 160 -89 -224 32 -57 -77 22 373 171 -151 -44
5548 -44 -78 -17 69 -75 -450 249 261 -235 19 -28 189 -265 75 363 277 -215 -49 -274 15 254 4 -14 -260
5571 -260 62 46 153 139 81 -56 -124 -98 -77 108 187 -101 48 -195 184 240 123 -109 -189 -157 182 -90 160
5594 160 -85 42 150 -108 105 -76 120 190 -63 159 256 -230 201 127 44 90 176 -1 99 -88 -84 211 56
5617 56 263 -17 -66 -139 11 129 33 -14 -95 -103 52 102 146 -286 24 -106 62 172 139 18 -73 29 177 -94
5641 -94 -5 120 109 79 -187 171 -37 -131 -147 172 106 295 -77 25 -59 -33 292 228 202 -118 -42 -59 132 256
5665 256 -79 226 -139 -156 27 218 -34 -144 -84 -46 98 -185 216 84 134 25 -33 -169 -39 -249 124 -158
5687a58J48Q8k51O1j01nJ24K46m6k54j90O9K12P7J40k26J40Mj16K29K4l18P9k65
5711b89K84K66k79J09k37J11J17K57n79L67k66L88j56J45l32J20j36K04j31K96
5731B59j9m70K3J67J05N8l44J19J81o18N31K00o0l46L49l39R7K42j45K75l54J
5753h8L6L58l11J0q5N5J80k25l1L55l04Q3J03q0O3j80J85j94Q2K85l01J6j20L30
5777B22j35J14K40m13r3J39o4O7K53k62j83j77P7K95J38j20j15k51KL03J79l19
5799a03nK23n35K81K12l2j8k99L82P5J05n03J42j71L14J74j94j04k25K67J15O8
5821A69j68l95L73j32o1K20J79j1l47K5L36L3j68l34K29j49M49K8n3M2k72k49
5843b56Q3J55J37j5J04j07j62K50m10M85Q8n00L00J9k74M7K66j92j38J12j1O3
$$ plain form
5687 -158 -10 78 -173 -112 -213 -218 -94 152 106 -148 -338 -269 -57 20 160 -66 74 78 -38 191 215 -103 -24 -289
5711 -289 -5 261 -18 91 -146 -35 82 339 -240 127 -139 249 93 238 -94 26 -110 94 -37 259
5731 259 240 -230 -207 -40 65 123 -221 -102 79 -539 -8 192 132 -214 135 -204 -107 135 -10 265 -89 -88
5753 -88 -52 306 -5 5 -80 -25 155 -70 -101 254 -50 33 136 56 119 -61 124 -70 12 297 -4 12 -108 222
5777 222 87 201 441 28 -65 74 10 77 330 68 -115 -292 -215 80 218 98 -17 -268 -266 37 216 -103
5799 -103 -108 115 -420 -139 73 41 23 -276 106 181 286 -217 -75 -246 68 242 48 -56 -281 -14 101 169
5821 169 1 -394 -21 -153 -214 6 185 174 -173 -148 188 221 53 -281 -52 -201 248 276 223 265 -7 -256
5843 -256 -173 -18 119 104 208 101 -61 189 -221 264 352 -148 152 171 -103 -56 210 18 -120 -8 -19 44
5865D4j3j51J36p1J21J35j77j14rP5N9n8m2K2J72j67J94j4J45l97j14M56l14J23
5889D1m1n30K57K61J00l3j16J80k20J43Q3l08L32q7j10N2K2r3K32k08kP3Q1oj45
5914d2K2O3m9K15k12J14J01m79M58K7q9j24k8K44m37K71M3k91K25n9K37k39O1
5937C2L0k69l55N38K62l98J91l28K13m6J80J49l08J6j7J93o0k64%J54q9K84l0
5960G8k3k54r6L28j67K86j00J14m11o0K46K67l71j1j8J42j0o0L93l90l4P8rk9
5984a11J17O1r5j43L04j2l94K29K15K2n7o7N0k06j3P3Rk05J30J82m09J60K55j19
6008b4J69l3j73L0p5J99K32k65j38J79j4q5L1K7j33j61J37K85n13n2L78j27K54
6031A28j87J84j08L81n81L08jK42J21p38J45j29M24l86J83j18j69K94J97j70Q5
$$ plain form
5865 44 31 -120 16 -55 66 201 24 -90 -99 -24 35 -23 -65 -43 129 -38 156 142 287 -110 -224 232 -82 41
5889 41 0 -530 -273 -12 88 55 -61 119 -101 42 125 -183 149 62 -48 4 26 -67 165 -43 -45 28 109 103 -42
5914 -42 -20 43 -6 209 -3 111 212 -267 191 218 129 5 -23 221 -216 55 98 -193 32 -27 210 -29 32
5937 32 62 -207 -562 -24 238 -160 31 -297 -84 -130 50 199 -109 -93 -110 83 23 -241 -241 -87 -176 108 78
5960 78 55 -199 -295 33 -134 152 52 166 -245 -305 -59 208 -163 -174 -192 -50 -60 -120 273 -117 -151 -73 -82 -111
5984 -111 6 67 -28 -171 133 121 -273 -44 171 193 136 69 119 -87 -100 -27 -18 -223 -93 89 -320 -160 95 -24
6008 -24 145 112 -61 -31 -106 93 325 60 -78 101 87 2 33 60 -73 -234 -97 188 -325 -377 1 -126 128
6031 128 -59 125 17 398 -183 125 124 366 487 -251 -106 -235 189 -197 -14 -132 -301 -7 190 20 105
6052A05k89k50L62J40K92r8J59m76jN2P1oJ4k43L21l41M43l38k1P3k06J75J17
6075E5j43J93k95N4K33j89L60p03r7L22J93J15k19K20l04n6L77J08k05l57L73
6096C5k87J90J4r0K0l6J07Q4r9J87j64mm0OM43o94K73n3J93m4R0l10J35k28N35
6121B63J26k29l81k0J26l6K8K48P9l65p2K22k7K07j2r0n6L24j79q9J94M8j38k98
6145a27K15NR3l89j6L27j9l8j73N31k18l85J62J10q9P9k41R9J61J78j30n2l0j65
6169a12L43n5J07j24n3j05l3L64k96J50M2j28l0J85J44k03k14j2L4Np3N2l43L53
6193bM8J99k93L0m57O33L0p9K5l10K18m24M02P3K22l46j21RN00l88Q4j42J71N7
6217A39k4K00m97j0J04j29K38k3Q6o9j49P5j41P1K55k7j09J53j68k4p6J86k27
$$ plain form
6052 105 -184 -434 -72 68 360 262 421 -55 -56 -4 67 61 75 -168 153 -188 255 -83 -104 -31 -237 -62 55
6075 55 -88 105 -190 -136 97 -92 268 -435 -532 -210 -17 98 -121 99 -205 -261 116 224 19 -338 35
6096 35 -252 -62 -48 -138 -118 -154 -47 37 -62 125 -39 -43 -83 -77 366 -328 -55 -108 85 41 131 -179 -44 -272 263
6121 263 389 160 -221 -241 -115 -151 -123 125 204 -161 -233 -11 -38 169 157 67 11 335 156 67 261 309 171 -127
6145 -127 88 93 186 -203 -219 108 89 51 -122 409 191 -194 -32 78 -11 68 -173 -74 87 265 135 83 53 -112
6169 -112 231 176 283 159 106 1 -32 332 36 186 228 100 70 255 399 196 -18 -30 4 9 -64 -12 -355 -2
6193 -2 46 245 -48 -18 -475 158 188 109 134 -176 42 -382 20 93 315 -31 -152 -143 357 -31 53 -89 82 139
6217 139 115 315 -182 -192 -88 -217 21 -2 84 15 -134 -59 -200 -129 126 99 -10 143 -25 -49 -125 61 -166
6240a66J29q6J7L32p9j9J43m79N13l93O0QK6r2K86k15o2M3J73k92K13L87l21j17
6264Ij46J81l26J62K42j42J7j80K63K6o0L5q9j21P2Jk23K04K39k40J68p7n6PL9
6289EL08j62Q8k21k00K82p4j5j1l74K98J36k9k99L54m09L52l66K07O4r2K61j53
6312e0R3r2K2p8O8k3l6k20M53o5k34k5O0J79lp7J53k52L85l17K83k95K84l89K43
6337F7j30j57K97j40rr1M11j26op1ol8k08J29N36l12R5k97q4K24l7j09Kq0K16
6362G6J40k83M9j43m0K88j93K43l16J79m8Q0L3N4q6j62R1L6P1k48K98n9l90L20
6386a0k63N08k12p3j01m5N43o93J66J48n4j5J14J83j47j24K54m36J28L49n19J48
6408a51P5J25K7j43L79j83k04L3J06m4k49K30m54K43K76nj03J91k32L40n20P93
$$ plain form
6240 -166 -37 -123 -106 226 147 128 271 -208 305 -88 -28 -20 6 -86 200 -15 -77 -34 139 -153 60 447 126 9
6264 9 -137 44 -282 -120 122 -20 -3 -183 80 106 46 81 -8 -129 -57 -56 -279 -75 164 -76 92 15 -41 -34 5
6289 5 313 151 239 18 -182 100 26 11 0 -374 -76 60 31 -268 86 -323 29 -337 -130 -66 -158 103 -50
6312 -50 43 -49 -27 -105 -37 -60 -96 -316 137 72 -162 -187 -127 52 49 -28 125 -127 258 -59 224 -71 213 -176 67
6337 67 -63 -220 77 -63 -72 -163 248 122 116 45 39 1 -207 -78 458 146 241 -56 -140 84 47 -62 -60 -140 76
6362 76 216 -67 -18 -161 -201 87 -106 137 -179 0 -48 32 65 119 33 -129 -38 -2 69 -179 119 60 -330 -10
6386 -10 -273 235 23 -50 -151 -196 347 -346 -180 -32 -86 -101 13 196 49 -75 179 -257 -129 220 -299 -151
6408 -151 -76 49 76 -67 312 129 -75 -42 64 20 -229 1 -453 -210 66 61 -42 149 -83 257 -263 530
6430E30p28k12Q9K20K66j73J53k26p3P0L70k78M13n31M45k62K11o9n7q8j56p3
6452a59N1L18p6k48J57j25L41r8L4j99M0j01m8J86j77k62K28j97L33K71l67J88
6474I0l5l44j04L64R0k40J83l01L01J39k7k51M6K1M6P5QN0k77k22N79k63J41l88
6498c19K90J1J64O9q6k26M45Mk64P2P6k87k7r2K44j04q2J25l71L08L5k5J24J29
6522B13l77k3R0J15M1j25N6j27R6K22k46N7m0k30J59J02K05j13J20r9l18K49k81
6545b54M84m29L61o92N16J46j10o7K0j33K78Q8k19p3Qo2K58p7O2N3l32L22l22
6568a74J95L5oQ7j62N3K50j50j8r9P9j50J66k03J87k07j6J64o5k78J94J89l62
6591b91L76q0j73P6R7rK6nM0R6k01K0p7o5M77l84m5K83j07J31k67L07j87Q2k57
$$ plain form
6430 530 -198 -410 -321 -101 165 -8 145 -81 -154 -84 286 8 421 -110 335 73 284 215 158 70 -86 -159
6452 -159 -108 210 134 -114 43 -82 259 161 195 -4 36 -65 -113 73 -104 -366 -138 -335 -2 269 -98 90
6474 90 55 -289 -393 -29 61 -179 4 -297 4 143 116 -135 -89 -68 -22 53 61 111 -166 -388 191 -72 69 -319
6498 -319 -29 -18 146 215 129 -97 348 352 88 160 236 -51 -78 -170 74 -30 -112 13 -358 -50 -15 -40 84 213
6522 213 -164 -187 -97 18 59 -66 -10 -137 -41 181 -65 -8 -48 -278 -119 -17 188 75 195 96 -222 27 -254
6545 -254 230 -199 162 -530 -14 132 22 -45 -25 -158 120 208 -11 -84 -76 -138 120 43 105 158 -174 148 -174
6568 -174 21 56 50 137 -25 28 278 128 110 11 90 -60 106 -97 90 -117 -133 31 -34 -312 -118 71 -291
6591 -291 85 5 -168 -92 5 -4 22 17 57 153 -48 -28 -105 -170 307 -77 -122 161 54 185 -82 225 38 120 -137
6616a37m3K36l6m3J29q4l7q6l7K56Q6j96J74K6l92L02q9O8J54j61j92K61n27L75
6640GK26l30j76JL65n4J27j91Rj78J08Q9J29j06j74K78k38J36k2k07J83o4K9O4
6664A1j73K85r3j82K95Oj97L29k49O8j83m9J63m5j33JQ4P9K15r3l4k40J01q5K32
6689A13k00r5J53J94k38K06j45j67J67O1N6j63K40q9K0k01j29Q1Q7q3M1J82k66
6712a75K91pp7J1R0j02j54N7J33k97K57k34l0L04j26L4J26l8lK92m78j6l9K92
6736A11l2l5j87K60j75P3L05l12j37J57k27K10j53k91L79m0K16m01k0K77o1r1
6758a74n2J43J09j57M5L06j48j35J18P1l0j21J39k99M20j3k57Q2k25K68j17m9
6780g6Q0pj39O6Q7Q2k24J31J11M9J43l53K78m99J4L17J35j80n7J64l44K17o4L27
$$ plain form
6616 -137 -180 56 20 -23 106 22 -15 -101 -138 118 204 8 182 208 -184 118 29 97 251 90 -102 159 -368 7
6640 7 233 -97 -273 -272 93 39 166 -25 -16 -194 -86 3 132 26 -148 130 -108 28 6 -201 -18 -82 -53 11
6664 11 -162 123 30 -152 143 149 -48 281 32 100 -83 -132 31 -14 -147 -146 -62 17 232 139 105 -135 -34 -119 113
6689 113 -87 -182 -29 165 -73 133 -12 -179 -12 49 105 -58 182 93 113 -88 -217 -136 -49 -132 -91 91 -175
6712 -175 116 109 32 43 133 31 -123 -66 67 -230 27 -207 -237 67 -59 -25 101 63 60 352 -126 -142 -181 111
6736 111 79 44 -143 117 -58 15 320 8 -129 28 -199 11 -142 -433 -54 -94 122 -279 -299 -22 -83 -174
6758 -174 -226 -83 26 -131 -86 220 72 -63 55 126 96 -25 114 -185 235 222 -35 47 -178 90 -27 -76
6780 -76 4 -3 -142 -76 11 93 -131 0 111 160 303 -50 228 -271 -257 60 195 15 -42 122 -222 -5 -69 258
6804B58n43M5K71K77p7q6k09m8J13Q2K67m21K5Q7k76P9K05K89l24J80l11M7Q5
6827A5q6k35K21J85j08K2m2Qk07M7J24j17K62Ll22N08m24N02k29r0j84P2J39j17
6851e3o8K58l26J88K25j44J42l94L90m46J39Q7R9j1k11J78j96k4J18L3J01rJ0
6874H6J13m76N27k26lRnj28K26m5j82L62k78m5k8j97n1Q9J87J76k07R0m0P0M4
6899F8j35L09j22j77L7n9nJ36j72r9K44J13n9j04l89K49K14K20j55j17k31M04
6921A70n8Q2K3N7o0l36L43k04P9K64n19N5J4N1J00j67p0J61k26L79j44R0n6j70
6945a42J73o0J48k57J16QJ9P7J14N3l00L48j99m3M0l08K70J82k3Km69J72J58J4
6969I3j61K0K76j52MJ4j71J54j6K56l17O9n0J42j80j72J51k18M71m60L1L1J59
$$ plain form
6804 258 -285 -240 31 308 231 145 -64 -112 1 83 350 -71 -46 41 -235 -156 49 338 14 194 -117 -70 15
6827 15 -71 -306 -85 100 -8 14 -28 -20 -227 -180 -56 -173 89 92 -230 278 -146 356 127 37 -147 -75 64 -53
6851 -53 -121 137 -189 -1 224 80 222 -172 218 -228 -89 -2 97 86 -125 53 -143 -167 -49 -16 85 76 86
6874 86 199 -277 250 24 21 30 25 -103 123 78 -104 258 -20 -65 -93 -290 -341 -252 -65 111 -96 -6 -46 24 68
6899 68 -67 242 120 -57 -20 -79 -84 52 -120 -219 25 138 79 -25 -414 -165 49 269 114 -3 -234 170
6921 170 112 194 217 274 214 -122 221 17 96 360 -159 -104 -90 -39 61 -106 -176 -15 -241 138 -6 84 28 -142
6945 -142 31 -29 119 -138 -22 -14 5 82 196 249 -51 297 98 55 95 -213 57 239 216 218 -251 -79 79 93
6969 93 -68 -48 228 76 80 94 -77 77 61 317 0 69 19 161 -19 -191 -40 -258 213 -247 -216 -185 -26
6992b6j33J89K26m06k71K63J54M3q1K06j34j11K28Kj36R6Q1L0l53K7J25l4O4o7
7016a8L7K2q6R5l8l26L71J54k82J55m7k09J77R1O1Nj17K1j10J60j09p9j20K69
7040G7mk48M07m10K65J0N9k60L15k10k04J21J81l74L76r9L80l69m2K92m86P3O3
7063h7J61j63n9nM06j38qj43K74k33j28K46j72O9j91J24J59j79J25K48k71p1M6
7086A0N9J83l11ml39L95p7Kl5k55K50K22l41L8K85r9n6L11m2j76l4j36K56k7k82
7111b03j05L44l81K47K4J46p8L4J6j05L00k77J51k71J99q4j33K61m28L77J44l33
7133a55mJ86j55o4K19L08m7l05R1j76M7L85j74j65p9n5l0L54P2m35J05r4P2k00
7157b99K90L5O2j60J47k6r6o2L64n08L46k44K29qK46j97j86J76k02k1L02rj44
$$ plain form
6992 -26 -159 30 256 -150 -421 -158 -4 39 -42 164 30 -81 147 149 13 109 190 220 -133 -106 19 -15 49 -18
7016 -18 19 41 -45 50 12 -314 57 211 -71 84 37 -172 5 96 157 162 45 66 -44 116 7 -72 -192 77
7040 77 73 -175 232 -178 87 97 156 -104 211 1 -203 -82 99 -275 101 2 382 13 -29 263 -223 -150 -87
7063 -87 74 -89 -148 -153 253 115 107 -36 238 5 -123 123 -49 20 -171 -47 112 -67 58 306 35 -36 10
7086 10 69 252 -59 -63 -402 -7 -84 -82 -117 -372 -122 100 -241 -203 82 -17 -73 238 196 20 -14 -150 106 79 -203
7111 -203 -308 36 -345 -98 -74 72 -6 28 44 -61 239 -38 113 -158 41 -43 -176 85 -343 34 178 -155
7133 -155 -159 27 -128 -192 27 335 288 -17 74 -102 -55 330 156 -9 -88 -143 -173 181 253 -182 -77 -171 -99 -299
7157 -299 -9 26 88 -72 75 49 -47 -109 255 -253 93 -151 78 70 316 119 -67 109 -93 -114 188 179 35
7180C5p1n8Q2K3j77J16p7j42O04n60L55J83n38L1J05J12n3m5L9k61P02k64j24
7203A7M6j62K36K77o34R3k1Q5L06n2m35L05k9Q2k3o2J43k86j15J32K30jm92N70
7227B10o9j81l6k3p5J98M7p0N5J37k94J75j80p4Q1O0M17m30L78m38Q7J30k77j17
7251b89K70K88j01j71k70L43K8j09Q8j31L02k81l8J05O1J08j01j49M1K1j67K23
7273G1Rj0q5j29K42k90J52K43j05j1J80j31j80J71k44Qk8J80M9k70J90k42L15
7296H5NQ2m76J60J25n3M6K64k91O8K00j19P8n16L27l5j88P3L43o2j40q0J30j29
7320a03o7K81r8j20J29k53l8L36j05M16k69p0L9J1J49k17J19k14P8l2j26L8o1
7343a77K3M44k59Pk54K23o0KK3k37K18o8K35k0k68O3M38j75j10l6j17K51J23k61
$$ plain form
7180 35 -36 -94 -12 11 -166 -50 -127 -269 335 -225 130 313 -225 -194 -89 23 -30 -75 -36 -297 405 141 17
7203 17 63 -99 137 414 -220 -127 -148 -63 243 191 -244 61 32 114 91 29 172 -114 -229 -97 133 132 -360 210
7227 210 141 -40 -76 -99 -174 24 71 1 56 193 -101 74 -106 -180 -99 -39 378 -52 326 -112 -25 105 -172 -289
7251 -289 -19 269 168 -3 -273 70 98 -11 77 -54 248 -33 -71 34 95 203 102 -47 -6 15 -152 71
7273 71 80 70 -15 -144 98 -192 -40 203 98 87 267 136 -44 127 -117 -109 -137 43 92 -178 12 -230 85
7296 85 90 172 -304 -144 -19 -72 -26 238 -53 15 215 96 174 -342 -15 -50 -238 -165 178 116 -24 -104 26 -103
7320 -103 -170 111 13 -107 22 -231 -269 67 -38 378 109 39 78 89 238 21 140 -74 4 -28 -154 -116 -177
7343 -177 -154 290 31 38 -216 7 -53 -51 -28 -265 -47 -115 120 100 -168 -105 333 158 48 12 -105 146 269 8
7367Ho4J28j94k45N01m8k22M5L0rJ35j37j28K54L5l14K81l01M45Ql98K6p7J07
7391a34k71K92O6K2j10K09q8k77J43J40M6j28j40M81k38J37k21K26m23K65j7P7
7413E7K6p8L9J98J1l25N5L7p4L12Oj94k11k2J66P6Q4j90N3o8o5J33lj83J5m71
7439f16O18Q1o7K94j83j4M5m26J45N7J23k01k28M54Q4r9k22o8L40j63J38L39l73
7462E8rr9m4M8k25K25o8j94M35J35l67j82K34j2K66k27K07k33K06k4k40J21pk1
7486a7j79R4J22P8Mn11L71k17K24J59J46l06j51K35Mp6m6K33r9l04O5J53K3j83
7510a78J17O4J29oj07k00nJ70M4m9J17j84r2J00K96l21j14J13Q8K24n9j31M3P9
7534A38k26mp1L33m54J50o4J59k01P9J76l31J93J90J3K10k33k31K54k99K34r2
$$ plain form
7367 8 -56 72 -122 -367 134 86 -136 -91 -61 -70 65 -72 -200 54 89 -225 56 -245 200 208 -190 -164 -241 -134
7391 -134 -405 -113 -47 -25 -135 74 -14 -291 -148 -8 38 -90 -230 251 13 150 -71 155 -268 -3 -20 57
7413 57 83 5 44 242 253 -72 -17 20 -54 258 264 70 -141 -163 3 79 163 -27 26 -42 -107 26 23 -160 -145 -616
7439 -616 2 83 16 310 127 113 158 -268 -123 -66 57 -144 -372 82 166 67 -155 -223 117 -46 92 431 58
7462 58 49 -50 -94 -46 -271 -46 -114 -308 127 262 -105 -287 -53 -65 201 -26 181 -52 154 130 -110 11 4 -17
7486 -17 -196 -102 20 98 102 -409 -38 -255 -31 128 274 -32 -183 52 56 -20 -66 167 68 -236 -171 -18 5 -178
7510 -178 -61 3 132 126 19 -181 -186 -16 28 -21 96 -88 -180 -80 216 -105 -219 -106 -18 206 147 16 59 138
7534 138 -88 -92 -163 170 -284 -134 -198 -39 -240 -161 15 -316 -123 67 80 290 57 -174 80 -219 15 -77
7556g7k2j38K8K8R2L09j0k92r2J67k1J76k05L3QQ2L0j17J72j72Q8R5j48J72j84
7581Bo2J89j68N6M2j05K75l95K60L0O3k46n5K95l90K57j83J57j96Q7O1J00k54
7604a80K63j57j07J05j74K66O4R8j79oK5N4j4k63O2J2K06K8J1L8l98J0JJ20M65
7629C50k6k31k68J58j05j09J87kj13M60k51k04L72j85k9o2R0J58P6l77J53j36
7651i4N9P5m2P3J14l90J01O0p1R4j71N3N17j74l27J11K1N9J71j96J21l56L20L3
7675A61N2k28K89m60l8J57k24M22N2l33j23J34k11N99q1j26j5k6k13N6N4J28n7
7698c1p9K11r8l2K24K8k10j79K16k6J13k57J02k53J58J67p2j26j23J14J02N4K89
7721B92n07J59K89j71j94Q3J27N6K8P4l75K49j53l5P3p5J43j60Q4J17m18M53r5
$$ plain form
7556 -77 -99 -237 -209 -181 -89 220 210 -82 -174 -7 -28 148 -57 -24 -16 66 96 -21 151 -21 67 162 14 186 2
7581 2 -60 129 -39 17 59 -46 229 -166 94 124 187 -59 -114 181 -209 48 -135 22 -174 -87 -26 74 -180
7604 -180 83 -74 -181 -76 -250 16 80 178 -1 -7 18 72 58 -205 -143 -131 75 103 114 152 -246 -236 -235 -115 350
7629 350 324 93 -175 -17 -122 -231 -44 -46 -159 301 50 -154 218 33 4 -58 32 190 266 -111 42 -94
7651 -94 -35 40 -2 71 185 -205 -104 -44 -115 -21 -192 -139 378 204 -123 -12 9 68 239 43 164 -192 128 161
7675 161 213 -15 274 -186 -224 -67 -291 131 183 -150 -273 -139 -350 249 168 42 27 1 -212 -156 -102 26 -31
7698 -31 -110 101 3 -29 195 223 13 -166 50 24 137 -120 -18 -271 -113 54 -18 -144 -267 -153 -51 3 292
7721 292 -215 -56 233 62 -132 -49 78 134 162 236 -139 110 -43 -78 -5 -80 63 -97 -13 104 -314 139 44
7744D4j65J78r6L21m44n1J31L57l84O2j52L59J26j54l1l85L02l8J56j40J07K9
7766A32j7j68r2K52k26M88q2k63q7J40l17M5M19k52Lk62K05K01j81J84j03k8J33
7789A24m86J47K23K95m71K20k62M4j9K05j40j65J10L80j29k09L14k11n4M7N3k65
7811b49O2Q3P2L74l61l7jn6OJ85j67K9k16L20M1l4N4k45j27J79J09j15K07j03
7835A0k64J31R5J15j13J09k11J53j46J78l0k42R7j12K64p9K9l3oL30m41K67j74
7858g3Q6j21rK38k5j1L09l16k63Q7k7J39J38q2j81J51J87j49nK5k38M4Q0l2K90
7883B42m9j38j21o5M0j06J64j61nK76j24O3k40j64M25k18K38K1k34N95m65o7n8
7906a51j85M27j42J9L67l19r8l56J35L25N6l8mJ03l66L89m04M29k04k58L48J3
$$ plain form
7744 44 -121 57 -39 282 -162 -213 -82 275 -109 -47 -199 160 286 132 101 -284 18 -20 136 -4 103 132
7766 132 115 -53 -145 107 -119 369 287 24 -63 77 -240 -195 224 -28 -25 -287 -82 119 -62 122 19 -9 124
7789 124 -362 -215 8 303 -168 52 -210 -166 -185 20 -120 -285 -175 205 76 -133 181 -30 -84 -37 16 -249
7811 -249 -187 -104 -32 342 -19 -56 -57 -113 -107 78 -89 -60 -276 44 85 51 105 -140 -267 -88 21 -94 113 10
7835 10 -254 -123 -28 87 -26 83 -128 25 -121 57 27 -215 -118 -230 34 -45 -16 -49 -55 275 -166 101 -73
7858 -73 13 -108 -117 121 96 85 394 78 -185 -98 -125 14 152 70 -111 40 227 78 73 98 -140 -96 -16 -48 242
7883 242 193 55 -66 -131 -91 -197 -33 -194 -199 77 -47 16 -224 -388 37 -181 57 78 -156 439 -26 -93 -151
7906 -151 -336 91 -51 -32 335 16 -82 -438 -303 22 78 40 36 139 -227 162 -242 187 -17 -275 73 86
7928H6O1l53q3M85P4j48j4j04J82j34j39J12n2j10r4J19K8j09L29k25J16j3m27
7951d13N36j25L2j65L1K85j40k56K91J72j55k51J70q6K11k24L52k85j75L03JM8
7973A57k92O1o5J2L19N8l20J19K68k70j57O6K01k12J18J16m11K96k05k8J13Q1
7995B5n2j2K57k38j59K89k93K33m17L25m4K72j56j68L2J77j06P0j66J31J50l5
8017A15J01p2m16J3%J01J26J76j11J06j80o3P5Ol00L30O5k97J53J73p3K93l44
8040b3k2q9J97J24j62po9R2j59K72k2l21l3L18l11L07r1m7j56m9j2K40n5k6o9
8065a73J63K57j16k00J92j06k43J88o5K28k22j0m65N98J52n05M70K03l69P7Q9
8086A43j46J89m55L77Mj2j18K49q6j8mn25M58j27M5J69q4j39K33q6K12l24L27
$$ plain form
7928 86 147 -206 -289 196 270 122 108 4 186 52 -87 25 -27 -137 -231 -112 -84 -193 136 -89 27 14 -413
7951 -413 123 -2 30 -135 -104 181 41 -215 76 248 93 -158 12 -74 137 -87 265 -20 -195 108 109 157
7973 157 -135 -74 -139 -127 192 250 -70 49 317 47 -110 -44 157 -55 63 179 -232 64 -141 -169 -56 25
7995 25 -27 -39 218 -20 -179 110 -183 50 -367 -42 -86 186 30 -138 -106 71 -35 35 -131 0 150 115
8017 115 216 144 -272 -259 -259 -158 -32 144 33 139 -41 -104 -29 -23 -323 7 72 -225 -72 101 28 321 -23
8040 -23 -45 -134 63 187 25 18 -51 41 -118 154 132 -189 -222 96 -215 92 1 -46 -202 -251 -263 -23 -78 -104 -173
8065 -173 -10 247 131 -69 123 17 -226 -38 -103 125 -97 -107 -572 26 178 -327 143 346 -23 54 143
8086 143 -3 186 -269 108 112 100 -18 231 145 127 123 -402 56 -71 -26 143 59 -80 153 67 279 -45 282
8109B82l09n4M17l37J2j76K73j13N5k55mL06K6k09J77k38K27nQ7l97M33j44j84
8132a30M29j84j0o3j45J71r9j5K04P0k84j93J44J63r4J12j52j28j59K40L19l46
8154a50J00O1J91R3l76m1L22j49k51K11k93N5L26p7K74j18m68k2P28m69K32k94
8176a15J22L5j4k6j79P5r6J30k02M20j97K15q3j39L01
$$ plain form
8109 282 -27 -81 336 -1 11 -165 108 -5 50 -205 -209 97 123 -86 91 -147 80 75 162 -235 198 54 -130
8132 -130 299 115 105 42 -103 68 -31 -46 158 228 -56 -249 -105 58 -36 76 -76 -204 -363 -123 196 -150
8154 -150 -50 11 202 295 -81 -122 200 51 -200 11 -282 -227 99 22 296 178 -290 -312 416 -53 179 -115
8176 -115 7 42 28 2 -177 -102 -198 -68 -270 150 -47 168 85 -54 247
8191B47
$$ Imaginary data points
##PAGE= N=2
##DATA TABLE= (X++(I..I)), XYDATA
0@%%%%%%JrJ6j6J6j7K5l2M0m9N7p2Q8j04J20j37J61j87K12k42K80l20L62m10M65
31B48n24N86o55P30q17R11j011J120j241J377j526J688j867K069k295K549k837
48a495L168l552L999m533N185o000P051q471J0508j3695J9445l3113J25085J45045
62B48627j39632q9774k1466P5993M2483N502k0924P798p858l5268m6017J8023
74C7487O1025L4885n1979q1025k3431O1274N9775q757n7964k8033J2620N682l0077
87h518j6797M0657O2868k163q6253q7366M566P9772N8566j6844n2445k5306P728
100d1535K62j8258q40L6588K7594l1178o2166j0961O5512O8311j2657q1148n5147
113a15623K9061O6855K7666k0080j5701J1807M163l2799l6909J5820O6712M3378
$$ plain form
0 0 0 0 0 0 0 0 1 -8 8 -8 8 -9 16 -16 24 -25 32 -40 48 -56 64 -73 88 -99 113 -129 151 -169 193 -217 248
31 248 -276 310 -345 385 -432 479 -532 588 -653 724 -802 886 -981 1088 -1207 1342 -1495
48 -1495 1673 -1879 2120 -2413 2772 -3228 3823 -4648 5860 -7835 11610 -21503 103582 248627
62 248627 108995 19221 -2245 73748 116231 121733 100809 108607 100749 65481 19464 37487
74 37487 98512 133397 81418 393 -23038 38236 98011 89254 31290 3257 15877 21559 -8518
87 -8518 -25315 15342 78210 76047 -10206 -97572 -93006 -13234 45332 28488 -23957 -49263 -41535
100 -41535 -41273 -59531 -60371 -23783 3811 -27367 -89533 -100494 -34982 33329 20672 -60476 -115623
113 -115623 -86562 -19707 7959 -12121 -27822 -16015 -11852 -44651 -81560 -65740 972 44350
125D4350l0579o3944j9890L7569L5221q487k5085P349L3299N653l5996k3232L5419
138h353N7568M421n9441m8749K8845Q1467M6055k9419n5117j6981J8946J4321
150C3563j674J2347L6133J8943l5495o0106j5341M7882M8691j2318n4040k5903
162g318K8376L6059r151m0321j5511K4779J6503k6940l5892R254N0334K7774l4971
175B2975n9979j8062L5574L8053J266j4541J421Q385j7795l8511j2674M1378N4600
188D2090J278n5499m4190J9258N2371J6524l7399m0898L784L3713J4590j4488
200h866o693J8786J1465k6524m1407k255M6099M4539o575m0578j9715J8288J8124
213D688j3620k1253J2429M1038J6035l5879m7064J108M6628L0996k1100m0335
$$ plain form
125 44350 13771 -50173 -70063 -32494 2727 -5760 -30845 -23496 9803 15456 -20540 -43772 -8353
138 -8353 49215 53636 -5805 -54554 -25709 55758 101813 72394 17277 296 19242 33563
150 33563 31889 44236 80369 99312 63817 3711 -11630 36252 84943 72625 18585 -7318
162 -7318 21058 57117 47966 7645 -7866 16913 33416 6476 -29416 -20162 30172 57946 22975
175 22975 -37004 -55066 -19492 18561 19827 5286 6707 15092 -2703 -41214 -53888 -12510 42090
188 42090 43368 -12131 -56321 -37063 15308 31832 -5567 -46465 -42681 -8968 5622 -8866
200 -8866 -15559 3227 14692 -11832 -53239 -55494 -9395 35144 28569 -12009 -31724 -13436 4688
213 4688 -8932 -30185 -17756 23282 39317 3438 -43626 -42518 4110 35106 14006 -26329
225b6329n958L1028K4346q348j9468M83J1108q612k3094K404M4006M2260j0210
238E3616n5168l8039K0307M7814J6957k3273j9341J3734K1018q924l1681j1407
250a4387K5328K6220j1630l4335j0643K4619K2992j0805k9667j1304J4991J0762
262B141j3120j1415J8401L0399l470m6213l9539J5876N6100L5557j9844m2083
274a7210j3552J7652J3350p591q385J2305J7888o458k6115j0074K3922K5647j2151
287I228l9723j8854K4672L5275M480k4160j4444J2186J1403j6991k5803O580M1607
300E456L0635j5447m3073k0237K0929L0239N277j1817j164J0576j836j8627j0081
313a9170J9076K9327k269l6367k5877K1156M4587J6326l0139l8536p319K1829
$$ plain form
225 -26329 -32287 -1259 23087 14739 -4729 -4246 6862 -1750 -24844 -22440 21566 63826 53616
238 53616 -1552 -39591 -19284 28530 45487 22214 2873 16607 37625 28701 -2980 -14387
250 -14387 10941 37161 25531 -8804 -19447 5172 28164 17359 -12308 -23612 -8621 2141
262 2141 -10979 -22394 -3993 26406 22936 -23277 -62816 -46940 9160 44717 24873 -17210
274 -17210 -30762 -13110 240 -7351 -15736 -3431 14457 7999 -18116 -28190 -4268 21379 9228
287 9228 -30495 -49349 -24677 10598 15078 -9082 -23526 -11340 63 -16928 -42731 -36151 5456
300 5456 36091 20644 -22429 -42666 -21737 8502 13779 1962 798 11374 9538 -9089 -19170
313 -19170 -94 29233 26964 -9403 -35280 -14124 30463 46789 16650 -21886 -29205 -7376
325g376J7000l214k022J3929J1353j5524l2525j1500K5383L3109L964k3863j5519
338f805J0297J3161p388j5613K336J9625O758k3195k6813P746L6762J9648k6517
351A0002m4462j4658K6911L3648O648j5530j3364l474p685j3066L648K9617K9264
364B7499n776l5954k4878J4417L3351R821k1472j9410Q306K1074M157j4640p112
377a0617J1922J1781j4189k8874o292K8109L1161r5k7034k2008L29R564K480J624
391a2139J4341J7333p196l2568k4202J6301M1324K1043k1317l5479o725K5647
403c637K3847l040j7795q781K383J216m844N006K1569J4933j5574l6078j8628
416c9423J7487L1307J1015j2797j2772L698O394r874j5649M345K5906J7505j3076
$$ plain form
325 -7376 9624 6410 4388 18317 29670 14146 -18379 -29879 -4496 28613 32577 8714 -6805
338 -6805 3492 16653 9265 -6348 -4012 15613 22371 -824 -27637 -19891 16871 36519 10002
351 10002 -34460 -49118 -22207 11441 18089 2559 -10805 -14279 -21964 -35030 -31382 -1765 27499
364 27499 21723 -14231 -39109 -24692 8659 18480 -2992 -22402 -14096 6978 11135 -3505 -10617
377 -10617 1305 13086 -1103 -29977 -36269 -8160 23001 22906 -4128 -26136 -25807 -16243 -13763 -12139
391 -12139 2202 19535 12339 -20229 -44431 -28130 13194 34237 12920 -22559 -29284 -3637
403 -3637 20210 17170 -625 -9406 -7023 -5807 -10651 -5645 15924 30857 15283 -20795 -39423
416 -39423 -21936 9371 20386 7589 -5183 -1485 4909 -4965 -20614 -16269 9637 27142 14066
429A4066k9117q614K1947K5867j206k2720j5340M511J0660M399J292P059L556
442A6360j5581k8600j1765K5622L8847J0045k9189l4888o535K0860J6947k289
454a66q911L365Q186l226j3457l191J4687J4662o669k1431q890J6820K2349K612
468A6740j4314r971J715J164r303o221J3931K6274P697k6418l4654n189K7393
481a1156K7549J173j8299j3822J763O443N26K61Q366O506p719j6276k994J9742
495B063K3288k058k7706k1983O666K2932J1766n753p261L077K782j1379j7811
508b1377k012K0760K0600j866j9876j3390M637J1132L176n142n6O435m20j1402
522h801n433J3545K0215M56k4490k3276N420K9795K0586q672k2950j3106K704
$$ plain form
429 14066 -15051 -23665 -1718 24149 22943 223 -15117 -10606 54 4453 5745 12804 16360
442 16360 779 -27821 -39586 -13964 24883 34928 5739 -29149 -35684 -14824 2123 -166
454 -166 -9077 -5712 2474 -752 -14209 -17400 -2713 11949 5280 -16151 -25041 -8221 14128 16740
468 16740 2426 -7545 -5830 -4666 -13969 -20190 -6259 20015 27712 1294 -33360 -38549 -11156
481 -11156 16393 17566 -733 -14555 -12792 -6349 -5823 -5562 2804 9310 1591 -14685 -17679 2063
495 2063 25351 23293 -4413 -26396 -19730 3202 14968 9215 1954 5031 7813 -3566 -21377
508 -21377 -23389 -2629 17971 16105 -3771 -17161 -12524 -1392 1784 -3358 -3414 3021 2601 -8801
522 -8801 -14234 -689 19526 19982 -4508 -27784 -22364 7431 28017 19345 -3605 -16711 -14007
535a4007O063J114K213Q863O373q894j9495q732J1844J5392l6j3193o578R528
549i545J1913k186j1873k673J1591P844r145j4530K339K1517J8308n336k1863
562c639j4210N657J3465P594J373J320p64r358j4633l756J5036K0298N66k0413
576a464j6462N371J7693P845j1288j4853k08J1315N607m525k913O075M912p075
590C0j5307n711J1361J5105L661p804n736L71j806q992n091R207J8018O037j5786
605b443k0243o54J8656J6141n021j6031p708P939J1714L675j834M79o8o442q326
620a0166L097J6768J5588k707j8655j4310L624J3167M429n305k656O178M598p586
634F064j5473m622J0953J3038j862j3464p361N481J0052K184m973l953r03k669
$$ plain form
535 -14007 -7944 -6830 -4617 4246 10619 1725 -17770 -26502 -14658 734 698 -12495 -19073 -9545
549 -9545 2368 182 -11691 -14364 -2773 5071 -4074 -18604 -16265 5252 23560 18224 -3639
562 -3639 -17849 -12192 1273 8867 10240 11560 10796 1438 -13195 -16951 -1915 18383 18949 -1464
576 -1464 -17926 -12555 5138 12983 1695 -13158 -13366 -2051 3556 -969 -3882 2193 7105 30
590 30 -15277 -20988 -9627 5478 9139 1335 -4401 -4030 -5836 -14828 -19919 -10712 7306 13343 -2443
605 -2443 -22686 -23340 -4684 11457 6436 -9595 -17303 -9364 2350 6025 4191 4670 4602 -1840 -10166
620 -10166 -7069 9699 25287 22580 3925 -10385 -6761 6406 10835 5530 2874 9052 13650 6064
634 6064 -9409 -14031 -3078 9960 8098 -5366 -12727 -7246 2806 4990 17 -3936 -4839 -7508
648g508m623K699J4523J3962l971k1492j7404M827K1921J5403n319j5189p652
661i823K341K756j755l46M898M448m762j0637m348Q024Q837k891j1366o209M199
676a6634P927J699k419J913N908j939j4271j1397N505K2046J6740m705j8708j3016
690b1351M142J1674P345K024l66j930o105n564L509J3463J1063n016j6794q825
704a2731J0598J8592P980q286j1897l641N010L209Q1L943R113M183q537j5856
718A761o822P918J2600M461m943n991l016k810m803K72P236O517n347j5665j0813
733a9445R353J9859Q584j2531k0652r366Q068J4590Q177j34m722o313r330n294
747a9156O673J5266R467n816j5883q510N510J0485J988n931l822K371K178l972
$$ plain form
648 -7508 -12131 -9432 5091 19053 15082 -6410 -23814 -18987 2934 18337 13018 -2171 -9823
661 -9823 -7482 -4726 -6481 -6827 -1929 2519 -2243 -12880 -17228 -9204 -367 -3258 -14624 -20833 -16634
676 -16634 -8707 -7008 -9427 -7514 -1606 -3545 -17816 -29213 -23708 -1662 15078 10373 -8335 -21351
690 -21351 -17209 -5535 1810 3834 3468 1538 -4567 -10131 -6622 6841 17904 12888 -3906 -12731
704 -12731 -2133 16459 24439 16153 4256 615 5625 8834 8915 12858 21971 26154 17617 1761
718 1761 -5061 2857 15457 19918 14975 8984 5968 3158 -1645 -1373 5863 12380 7033 -8632 -19445
733 -19445 -10092 9767 18351 5820 -14832 -24198 -16130 -1540 6637 6503 1781 -4532 -13862 -19156
747 -19156 -12483 2783 12250 6434 -9449 -17959 -12449 -1964 24 -5907 -9729 -7358 -5180 -9152
761i152m804K827R177L468r779j4670k135J2543J4678M811o037r441o333k528
775a7375K040R928J3788O882r393j7865o876J1797J9621O531j0902j4358k383
788h565R268Q944J835j363k878l147m881k602O581J2572O432q375j4182o286N552
803a095Q918M170K74R09P85n589j1353n158R504J4476L888j1259j4945k767J0103
818H61J1421p1q244q450m128o76M191Q505Q701j083j4227j5940j245J5463J6594
833A1672J627j2148j1268m86O149L424n00J709M539P07p316p366J740Q823N546
848F852m212r499l434L892N318J143j10J598k184r100j0174J434J5508J6021j34
863A2919j6880j5104P94J2872J1114J332m984l917j452k10J179O333P907l41r089
$$ plain form
761 -9152 -13956 -11129 -1952 1516 -8263 -22933 -25068 -12525 2153 6964 927 -8514 -14847 -17375
775 -17375 -15335 -5407 8381 15263 5870 -11995 -18871 -7074 12547 19078 8176 -6182 -8565
788 -8565 703 9647 11482 10119 7241 4094 -787 -3389 3192 15764 22196 13821 -361 -6647 -1095
803 -1095 7823 11993 12267 13176 13961 8372 -2981 -8139 1365 15841 19729 8470 -6475 -9242 861
818 861 12282 12211 3967 -4483 -8611 -9287 -5096 3409 12110 11027 -3200 -19140 -20385 -4922 11672
833 11672 13299 1151 -10117 -10603 -4454 -1030 -1530 179 4718 5425 -1891 -9257 -7517 1306 6852
848 6852 2640 -6859 -10293 -6401 -1083 60 -50 1548 -636 -9736 -19910 -18476 -2968 13053 12919
863 12919 -3961 -19065 -18271 -5399 5715 7047 2063 -1854 -3306 -3516 -2337 3996 11903 11562 2473
878B473q826K353J2552R427l970j1223n365L863M739n79j043M094O166k064j2140
893D57j0175K460J2555R937k024q433n453l33P93J226K874M864o1q866r229K393
909g015J4258J0458n756j7332j0922N744J4213O141m272o176k884j179k722j069
923h513N362Q349K350q185r186o6O927M577k266l483J759M616j97o847l420O949
939a274R362k056j2705q652N890J3981P901o060j1096n150L65K741K954O280N207
954G688j093j0852r682K806J3525R741m778j1797l974P218Q589M96n571j625M013
969D704K436m365m062M082Q988K723p356j0105j225O869N522J53r65J404n56p716
985E31q357M93J2511J1513k773j4980r482N927J2625M329p027q203j099L494J801
$$ plain form
878 2473 -6353 -4000 8552 17979 14009 2786 -2579 1284 6023 5444 4401 8495 14661 12597 457
893 457 -9718 -7258 5297 15234 13210 4777 -676 -1009 -216 1010 3884 8748 8687 -179 -9408 -7015
909 -7015 7243 17701 11945 -5387 -16309 -10565 3648 9789 5517 -659 -3543 -4722 -7444 -8513
923 -8513 -3151 5198 7548 -637 -9823 -9889 -2962 1615 -651 -4134 -2375 2241 2044 -4803 -8223 -1274
939 -1274 8088 6032 -6673 -15325 -9435 4546 12447 6387 -4709 -9859 -9494 -6753 -3799 2481 7688
954 7688 6595 -4257 -13939 -11133 2392 12133 7355 -4442 -8416 -1198 7391 7887 2316 691 4704
969 4704 7140 2775 -1287 2795 11783 14506 7150 -2955 -4180 2689 8211 8364 7399 8803 8247 531
985 531 -7826 -7333 5178 16691 13918 -1062 -10544 -4617 8008 12337 5310 -2893 -3992 -498 1303
1000A303L8K806M353k027r735q118L593J1940P372n388j0712l202M871L160l228
1015b974k505N096P846r88j1046q954L858J2874O455o301r425j340N597M695L91
1030C279p79L35j282p438n598N561J4558Q146q267j6847p868P819J3429L734o939
1045A843n834Q20K607j950l083K256P046K779p004p853J503R072N350l515o332
1060b295k24L850R77l524J67P883P211n998j4266p770Q709J7150O739q673j3089
1075c153l762M884M996O14Q82K133j706p017n497M743J2035N244q833j4272k970
1090a1679J0324J0700q8p482m172K466J736m452l967M869R967K437r057j1288
1104i686j724Q981P416r80m125r83R78k921m258J947R321O357o466j3645n183
$$ plain form
1000 1303 1341 4147 8500 6473 -3262 -11380 -7787 4153 11525 6137 -4575 -7777 -2906 254 -2974
1015 -2974 -5479 -383 7463 6475 -4571 -13525 -9667 3207 9662 3361 -6064 -7404 -1807 2888 3279
1030 3279 2500 2835 1553 -5885 -11483 -5922 8636 16782 8515 -8332 -16200 -8381 5048 8782 1843
1045 1843 -3991 -3171 -564 -2514 -5597 -3341 3705 6484 -520 -8373 -6870 2202 7552 4037 -2295
1060 -2295 -2519 1331 2308 -1216 -1049 6834 14045 8047 -6219 -13989 -5280 11870 18609 9936 -3153
1075 -3153 -6915 -2031 2965 3579 4461 6594 4888 -2129 -7626 -2883 9152 14396 5563 -8709 -11679
1090 -11679 -1355 9345 9257 1775 -2397 69 1805 -2647 -6614 -1745 8222 10659 1602 -9686
1104 -9686 -11410 -2429 4987 4007 -118 -1101 -123 -3044 -7302 -5355 3966 10323 3857 -9788 -14971
1119a4971J2118J5715L187j2556j2294r99P981O232O55L29J563j827p584o021
1133h472M077J1185N621o614j1094k653P522O509k685n518Q07M622K17p217m571
1148h264O263J0825K727j0958j1701R51J1600Q769o37n926l835r62k368j975M728
1163g63J0552M943q920j3941l544J0861J2917m05j2650q318L097Q171K604l674
1177I30j529K325O82o362n905K924J0359N901o125r624l007M818M757o72j649
1192b177K888M197m314r700l907Q823J2583K545j1601j1215J512J1435P279k874
1206E474o776k722J177K32K52L948P928J899q859j1460j017J2035J0369j709r589
1221A182n270M212N398j610m963Q80O144K314p164p591J047Q889N964m090q777
$$ plain form
1119 -14971 -2853 12862 16049 3493 -8801 -9800 -1819 4413 5068 5397 6960 5133 -2451 -8472
1133 -8472 -4395 6790 12411 5797 -5297 -7950 -428 6081 3396 -2122 -1315 3307 3524 -3693 -8264
1148 -8264 -2001 8824 11551 593 -11108 -10157 1443 10212 9575 3649 -186 -1148 -3516 -5491 -763
1163 -763 9789 14732 5812 -8129 -11673 -812 12105 11700 -950 -9268 -6171 2000 4604 930
1177 930 -599 1726 2408 -3954 -9859 -6935 3424 9325 3200 -6424 -9431 -4613 144 -528 -2177
1192 -2177 711 4908 594 -9106 -13013 -4190 8393 10938 -663 -11878 -10366 1069 8348 5474
1206 5474 -1302 -4024 -2847 -2615 -2363 1585 9513 11412 2553 -8907 -9924 2111 12480 10771 1182
1221 1182 -4088 124 5522 3912 -1051 -171 5973 8287 1123 -6468 -5421 3468 9432 5342 -3435
1236c435k612M469L331p50n82K522K027n519q960q30J1110J2562q07j3207j0946
1251a1627L155J1319N818m018n769n66L049m79k592R49N333K078o032q010k78
1266g670Q866O872l100q253k465M725K870l770m096L191Q427J498q752r262J072
1281i847J0959P280k787q073l313L153K591o72J46L074K228m611p310L77R603
1296B798Q641l261j2039p392N672J0917K807n165m344J859L050k312m788L76O819
1311C638M566m191p533j732N196M529j508m484N25L357n84n222l467M910Q330
1326F330K29r664q687L164J1354O275n088q661k782L551L129l74O19L270J956
1341D621m144o341r13P461P198k570q258l032N015O374r45n743j535M779K956
$$ plain form
1236 -3435 -6047 -1578 1753 1003 421 2943 4970 -549 -9509 -10339 771 13333 12526 -681 -11627
1251 -11627 -8472 2847 8665 4647 -1122 -1688 1361 882 -1710 -761 4572 6650 618 -7392 -7670
1266 -7670 1196 8068 4968 -3285 -5750 -1025 1845 -1925 -6021 -2830 5597 7095 -1657 -10919 -9847
1281 -9847 1112 8392 5605 -2468 -5781 -2628 -37 -709 -563 2511 4739 128 -7182 -6805 2798
1296 2798 11439 8178 -3861 -11253 -5581 5336 8143 2978 -1366 493 3543 1231 -3557 -3181 3638
1311 3638 8204 4013 -3520 -5252 -56 4473 2965 -1519 -994 2363 1779 -3443 -6910 -2000 6330
1326 6330 6559 -3105 -11792 -8628 2726 9001 3913 -4748 -7530 -3979 -850 -1224 -605 2665 4621
1341 4621 477 -5864 -6777 684 7882 5312 -2946 -5978 -963 5411 4466 -1277 -2812 1967 4923
1356D923m552n825k27P941N991m127q133l208M149M912O53j862o3Q29k438n159
1372f196p54P278Q949j341j0094p249M439J0216L445m903p493r0M963K456k139
1387A487p40L036K271l602o394j138O119O155j266n898k316L145K136k829l129
1402b963K364O369J293o954q453J528R494O389l942q855l936L750N418J027j936
1417E93n84j93k687l946Q41P886N860k585j0210n613M460Q801K795n230m406J544
1433b674M110j59m230j072M959L885k389p015j975N210N529J90m098k384P88J199
1449a26k277j064M465N651j493q721o761L376J0865N917m976r641l076M405N203
1464A747N77j825P03M01k166l227L14O020N053k946p617l429M224O845J067l882
$$ plain form
1356 4923 371 -5454 -5681 2260 8251 4124 -4009 -7217 -3068 1844 2497 635 572 1401 -1037 -6196
1372 -6196 -6950 328 9277 7936 -2158 -9407 -4968 5248 8693 3790 -3703 -3793 1170 3626 1487
1387 1487 747 3783 6054 2452 -3942 -5080 1039 7194 5928 30 -2286 859 2995 166 -2963
1402 -2963 -599 5770 7063 109 -8344 -6816 2678 9067 5125 -3730 -7666 -3916 1502 2529 593
1417 593 9 -184 -2871 -6817 -5976 1910 7770 5185 -5025 -10638 -6178 2623 5418 188 -4218 -2674
1433 -2674 1436 1277 -2953 -4025 934 4819 2430 -4585 -6560 -1350 4179 4369 271 -2113 -1325 -126
1449 -126 -2403 -3467 998 6649 5156 -3565 -10326 -6950 3915 9832 4856 -4785 -7861 -3456 1747
1464 1747 2324 499 1202 1603 -563 -3790 -3476 2544 7597 4651 -2966 -6395 -2171 4674 5741 1859
1480A859k605K115J983k954m411R28P098M785l725q655l262N005O553J016l790
1495A940k823n73J25j308J054M005M306l087q097m146M996R375L171o644q309
1510f015j260N515M275o17j661N25J317k196m176o20M916M850p62n617k919K610
1526a835L924k25j979K57J972M89m883l602L218P862L777n663q856k302N883P418
1542E455R36m759l812k11K67m29J744M182K388l132p087k916N347P134J195o071
1558B31n158J350M368K281k661j493J853J957j677n245j168N387N414l45n214
1573a20l676R22K608Q72m74J334J970k257n347k558M199P909K406o512p998j064
1589g786O339O141k98m488l245O87J184K20O84K817J446k899n112j968M083N678
$$ plain form
1480 1859 -746 1369 3352 398 -4013 -3085 4013 8798 5073 -3582 -6844 -1839 4714 5730 1940
1495 1940 -883 -1456 -1331 -2639 -1585 2420 6726 3639 -4458 -8604 -3608 5767 8938 2294 -6015
1510 -6015 -7275 -1760 2515 1898 237 762 2079 -117 -4293 -4913 3 4853 4091 -1526 -4445 -1835
1526 -1835 2089 1864 -115 142 2114 2603 -2280 -5882 -2664 5198 8975 3312 -5544 -7846 -1963 5455
1542 5455 6391 1632 -2180 -2391 -2124 -2553 -809 3373 5761 2629 -4458 -7374 -2027 5107 6302 231
1558 231 -4927 -3577 791 3072 411 -1082 771 2728 1051 -4194 -5362 25 5439 5094 -120
1573 -120 -3796 -2874 -266 606 132 1466 3436 1179 -4168 -6726 -2527 5382 7788 1276 -6722 -7786
1589 -7786 -1447 4694 4396 -92 -3337 -2650 -1466 -1246 -562 2255 3701 802 -4310 -6278 -2195 3483
1605C483O29m326k939J665K679p48k936K25M093K466k703n740j473M987O220K50
1621E832n336l618L11K882J642O13J280P78k591m391j367M814O907P44o233o779
1637d512K79O178M043j235l760j034J549L32j756l11K103K317j310m315k130K524
1653a038L920R63k606j585N55K95j974k247K587N079J589m807o151q51N635N722
1669E086j12n617l631O22K558J555L08O39J77k208l469q76L939M546k49m515m343
1686e590J437M337J729j810k379J391J385q83l344j166L210M117N1m416k699L38
1702d292L479K147o52j090m2r89k009j22L250M867O34n579n406Q10O350N015j286
1719E085m887k837J161L022R82p8Q00N47j403k765j000K495L337K74l082j732
$$ plain form
1605 3483 4112 -214 -3153 -1488 1191 443 -2493 -2268 1825 4291 1588 -4152 -5625 -638 5582 5832
1621 5832 496 -3122 -2811 71 1713 2326 3606 4384 1793 -2598 -3965 849 7756 8500 2267 -4512
1637 -4512 -4233 1945 5988 4753 993 -41 1508 1840 84 -227 1876 4193 2883 -1432 -3562 -1038
1653 -1038 2882 3845 1239 -346 209 504 -1470 -3717 -1130 3949 5538 731 -5420 -6271 -636 5086
1669 5086 4974 -643 -4274 -3652 -1094 461 769 1408 1585 -623 -4092 -4968 -1029 3517 3268 -1247 -5590
1686 -5590 -4153 184 1913 103 -2276 -885 500 -383 -3727 -4893 -1683 2434 2485 -1931 -4630 -4292
1702 -4292 -813 1334 682 -408 -450 -1439 -3448 -3570 -320 4547 5181 -398 -5804 -4994 1356 6371 5085
1719 5085 198 -2639 -1478 1544 2526 2448 3248 3795 2392 -373 -1373 1122 4459 4733 1651 -81
1735h1J7K393Jj726M0K116J337l218m062l92M280M967k58n081m289K80L624K750
1753B698N33j370j509j675j435O08L698M126j169n142m468J390N342L445j673
1768C399m443j507J968J470l86r29J004J260q91l124j534J281L487J375j729k193
1784a492o29K0k79o9J723K674o10l828m340J342N185M695j226n390m019J438M075
1801g30K735J30j284j715j063q93J516K983K568p65m411k430J262M140J991j684
1817B350j740Q2P10k72j424m08K593K352j030l631k760J299L566K488q98k971
1833C06j712r56M37J706K633J471j936m577k914K599N347L212k514n022k598K025
1849b493L207K443n59j297j015r56o01J42K457J788j71k805k048J59K153J211
$$ plain form
1735 -81 -64 2329 2330 604 644 2760 4097 879 -3183 -3575 705 5672 5414 333 -3956 -3676 -52 2698
1753 2698 3231 1861 352 -1323 -2758 -2150 1548 5674 4505 -637 -5105 -3715 1627 5072 3399
1768 3399 -1044 -2551 -583 887 501 -428 576 1836 945 -2179 -3713 -2432 1055 2430 701 -1492
1784 -1492 -2121 -2101 -2380 -2449 -726 1948 1338 -2490 -6830 -5488 -303 4392 3166 -2224 -6243 -4805 -730
1801 -730 2005 2135 851 -864 -1927 -2820 -1304 1679 4247 3482 -929 -3359 -2097 2043 4034 2350
1817 2350 610 692 1402 1130 -294 -702 1891 4243 3213 -418 -3178 -1879 1687 4175 3277 306
1833 306 -1406 -2362 -1925 -219 2414 3885 1949 -2628 -5542 -2943 2404 5616 3102 -1920 -4518 -2493
1849 -2493 714 3157 2598 1301 286 -670 -1271 -1129 1328 3116 2945 140 -1908 -1749 404 1615
1865A615K8q47N6o76k099j657J636L674K318j920m937k930K252M074K768j284
1881B071l497k166j28J376K810J977K73k525l579j357K940M346J867k603l809
1896b004q74K205K667jl46n60J72m01j577m22J628K496P11k067k522m53R60Q16
1914D28J354P1l01j758k440j074K492M010J506l056n062j912K824M355J500j529
1930A408l012j568P9K087J953J327m59j930k678l62K405K955Q43j995j533n68
1946a048Q19J204l95J50M51J082j112l016m52J924K835Q74j823l084j091N58J635
1963d89J838O42p32k636k542L46K891L664K54l736l982k42L026L196J163k335
1979C26k201o52O93R99J054Q16J49j336j345k17J024J538P76o22q34k54n14m76
$$ plain form
1865 1615 1643 796 852 176 -1923 -3580 -1944 1730 4048 2128 -2809 -5739 -3487 587 3355 2071
1881 2071 -1426 -3592 -3720 -2344 466 2443 2716 191 -3388 -4745 -1805 2541 4408 1805 -2004
1896 -2004 -2878 -673 1994 1993 1647 1087 1259 858 -719 -1141 487 2983 3694 1627 -895 -1348 -388 428
1914 428 1782 1853 1552 -206 -2646 -3720 -1228 2782 4288 1232 -3830 -5742 -2918 1437 2937 1408
1930 1408 -1604 -3172 -3093 -1006 947 2274 1815 -115 -2793 -3155 -750 2205 3048 1053 -480 -1048
1946 -1048 -229 975 580 730 1181 2263 1151 -1865 -2317 -393 2442 3316 1493 -1591 -2682 -2124 -489
1963 -489 1349 1991 1259 -1377 -3919 -3573 -682 2982 3236 -500 -4482 -4724 -1698 1498 2661 326
1979 326 -1875 -2527 -1834 -835 219 1035 1184 -152 -1497 -1714 -690 848 1624 1002 168 -86 -600 -1076
1997a076k54J258K046J08j745l092l08K466L009Q05k630k723j489J559K282J657
2013A873J46j345k195j781J094K698K357m17k432k390O35K330J456k8j037l99
2029E65q4n3m30L38Q85J314j65j523j325Q7J207Q88N74k66j480j214j292P03K198
2048I27K397p99l451k870J82K777K938j56k838k497n56J932J693J013j27j585
2064a020j266j135O34J883J367k22j506r33N88J222J26k07K90M69L6j476j020
2081b170K90J682J658M39j969k143p60J592J757J456l03j898k241p06J671K819
2097A174J597j438l105k133J026L068K333r13k461j078L85R80J032K59k4k50j379
2114i27l87L72Q93J144l9l60j37l36l74q60Q25J464J172o35j940j991K21L107
$$ plain form
1997 -1076 -1330 -72 1974 2082 337 -2755 -3063 -597 2412 3217 587 -2136 -3625 -2066 216 1873
2013 1873 2019 674 -1521 -3302 -2208 490 2847 2430 -2 -2392 -1757 573 2029 2001 964 565
2029 565 481 428 -2 336 1221 2535 2370 847 -478 -391 816 1704 2278 2012 532 -682 -1974 -1271 927
2048 927 3324 2525 -926 -3796 -3614 -837 2101 1945 -893 -3390 -3946 -2014 -321 692 565 -1020
2064 -1020 -2286 -3421 -2787 -904 463 241 -1265 -2198 -1610 -388 -262 -469 -179 290 326 -1150 -2170
2081 -2170 -1880 -198 1460 1899 -70 -2213 -2973 -1381 376 1832 1529 -369 -2610 -3316 -1645 1174
2097 1174 2771 1333 -1772 -3905 -2879 189 2522 1609 -852 -1930 -1545 -565 467 726 702 452 -927
2114 -927 -1314 -942 -49 1095 1056 696 559 223 -151 -1011 -186 1278 2450 1815 -125 -2116 -1895 1212
2132A212K221n81k674k010p0J410J776J118j077j558k095l37K023K254Q13j768
2148F57k403j387J442K102O83n08j241j18J46n2m1M07L84Q30m89j163m89N19J037
2167C16M93M91o70j323j169k96J819J947R99j643l042j142J360K902J455j294
2183A203k830j373N12J966J565J60p83j402j130k16J227J780M01j325j290n10
2199b045J279Q59J21j44l22O45m57j056o40P47K271O82q67k300j050P45J980J333
2217A781J1j169j890j082M71K007K297m3k312k612o07K203K874M96j903k131n05
2234b114R70J233M67k78j95n84p52k96L48J031R86o04n84l75j86k01jO92J039
2253E96L05j297j949k72J617K689Q21j659k615j151J529K113J419l75j530j707
$$ plain form
2132 1212 3433 2852 178 -1832 -1902 -492 1284 2402 1325 -233 -2328 -2665 -642 1612 2425 657
2148 657 -1746 -3133 -1691 411 1094 586 -655 -773 -627 -679 -720 -313 71 901 412 -751 -1240 -721 316
2167 316 809 1300 630 -693 -1862 -2158 -339 1608 2607 964 -2078 -3220 -1860 1042 2497 1203
2183 1203 -1627 -3000 -2488 -522 1043 1203 420 -982 -2112 -2328 -1101 679 1080 -245 -1535 -2045
2199 -2045 -766 93 214 70 -252 393 -64 -1120 -1760 -1013 1258 1940 1073 -1227 -2277 -1532 448 1781
2217 1781 1792 623 -1267 -2349 -1878 129 2426 2383 71 -2541 -3148 -945 1929 2425 522 -1609 -2114
2234 -2114 -1144 89 556 278 83 -501 -1253 -1549 -1201 -170 816 212 -372 -747 -933 -1134 -1135 -443 596
2253 596 901 -396 -2345 -2617 -1000 1689 2510 851 -1764 -2915 -1386 727 2146 1771 241 -1466
2269a466m32Q45K064J591p16k022j630r1J953J910k06j335j217J69J160N4j69
2286D62k24L44L84q34r41K0Q63J147Qm27r43r13l05O34J349R29K02k324k263J25
2306b707K249K471N1k180k298m41J627K222K21p85j043r53k06J197J120M40k96
2323F89j742o58J12J475N29O5o89n00K85m3o44n15O59J668L13j458j569l23J277
2342a069J579P25j037j509p37R2J183J221R66q84j996j455Q67J996J873m10k284
2359h79j352K88J817J146k89n69n23J93j90k18M99N73K73n29m00j44K44K98J42
2378C80J99L83l02r02j230J21J887K028l61j893k365J74K008J958n0j315j404
2395f84p05O41J358R83k4p84j707n95P87J655P75q82j083l97O65Q35J72n37l84
$$ plain form
2269 -1466 -1898 -1053 1011 2602 1886 -136 -1766 -1857 96 2006 1800 465 -752 -583 577 631 462
2286 462 238 582 966 132 -809 -789 74 1221 1229 802 -141 -1054 -1359 -725 624 1553 1755 -569 -2832 -2707
2306 -2707 -458 2013 2064 -116 -2414 -2855 -1228 994 1215 430 -613 -1566 -1772 -575 545 985 689
2323 689 -1053 -1711 -1599 -124 405 470 -219 -719 -434 -477 -1121 -1636 -977 691 1004 -454 -2023 -2346 -1069
2342 -1069 510 1235 198 -1311 -2048 -1956 -773 448 1414 530 -1466 -2921 -2054 -58 1815 1405 -879
2359 -879 -2231 -1943 -126 1020 731 162 -361 -168 -358 -576 -77 496 769 240 -160 -304 -60 238 380
2378 380 579 962 660 -242 -1472 -1351 536 2564 2203 310 -2055 -1881 127 2085 2035 720 -684
2395 -684 -1389 -748 610 1593 1569 785 -922 -1517 -730 925 1700 818 -265 -662 3 838 1010 473 89
2414H9L00O60q35q71J6Q32J147M16j700r27m80J79Q69J038K02p40j897j163Q99
2433a966J779J524p43k568j264L76K578J227l91j706r07QR39N42P12R2p55n26
2451a049q4J51J272M97k07q32J24L70j41l39k10O83J252l6j360j684M45J816J052
2470A720K21j538j374l73P42J353J308l50j300j410q04J263J703J083j548j871
2486a175n26R82J663M86r45p27m52M07K52j91J44O02J76n81n27k44J91Q66K55
2505F56j16M7n57r11n68P20J454J073q99j904j372N98K290J337p49j753j189p0
2523a913J473J129L64p35j058o99l71J308J164P44j227j018k73P92J091K86o25
2540D32J35N02j01o24o37K34J378R62l46j376r99J73J096N75K87p08j115j101
$$ plain form
2414 89 389 1049 214 -657 -641 191 1338 1754 54 -873 -1353 -1174 -305 733 935 195 -1702 -2865 -1966
2433 -1966 -187 1337 594 -1974 -3238 -2862 -284 943 552 -1154 -2061 -2053 -1114 -572 140 232 -523 -1049
2451 -1049 -1133 -982 290 787 580 -252 -128 242 101 -238 -448 235 1487 1451 91 -1593 -1148 668 1720
2470 1720 1941 403 -971 -1344 -602 751 2059 1709 409 -1001 -1805 -542 1161 2244 696 -1175
2486 -1175 -1701 -719 944 1430 485 -242 -694 -287 -35 -226 -82 520 696 115 -412 -656 -465 401 656
2505 656 540 587 30 -881 -1449 -729 725 1798 899 -1005 -2377 -1779 511 1848 1099 -654 -1843 -1913
2523 -1913 -440 689 1053 318 -740 -1439 -1810 -502 662 1406 179 -839 -1112 -320 771 1057 432
2540 432 567 1069 968 344 -293 -59 1319 2281 1935 559 -440 -267 829 1404 1691 983 -132 -1233
2558a233K48J083J841M60k037j989o28J313J943R03j196j802q20P81J138N25j28
2575D02j07q48k96k5L02R43L30l82m59l1M1m9r9L34O55M24r35r57q70J156J740
2596A269R55r54j772j230P55J437J118O8j255r48q90N32J376J405l32j539j592
2613a597k21J225J993p3j325j047J74K80R65l22Q1K02Rm31l71k49P77P02N3J12
2633I37o27n92k1K0N78J288K30j210j421o05J621J790N53j748k094m74J067J845
2651A137N54l32j510p32l36P38Q28P36j41j155p26J81J083O25m9m60m59P58k77
2670D63j15j89K59R26L68l10j429k35O22J035P53o09q87j179n6P51J056M44m48
2689A220j357j171o1J457J559n4j659j558K42R20J339o0n67j029J65k73M52M77
$$ plain form
2558 -1233 -985 98 1939 2399 362 -1627 -2255 -942 1001 1904 708 -1094 -1914 -1133 5 530 402
2575 402 295 -553 -849 -874 -572 371 701 319 -140 -171 -130 -179 -278 56 711 1135 200 -757 -1627 -471 1269
2596 1269 2224 1270 -502 -1732 -977 460 1578 1646 391 -557 -1447 -915 461 1866 1534 -5 -1597
2613 -1597 -1818 -593 1400 1327 2 -1045 -871 -591 374 52 133 335 344 -87 -458 -707 70 772 825 937
2633 937 310 -282 -303 -283 295 1583 1813 603 -818 -1423 198 1988 2541 793 -1301 -1775 -708 1137
2651 1137 1691 1359 -151 -883 -1219 -481 347 1083 942 -213 -939 -758 325 950 901 441 -18 740 463
2670 463 348 159 418 1344 1712 1402 -27 -262 360 1395 2148 1539 652 -527 -583 168 1224 1668 1220
2689 1220 -137 -1308 -1369 88 1647 1593 -66 -1624 -1382 -462 877 817 250 -779 -614 -887 -435 42
2707D2J6L7m44l32J8J09N05p6K78L35m18o01k00m85Q76J629m0q59j543k41J249
2728a45J383N82p32j722o73P47R45J106m0o15j378o81O53J148Q33n51j275m76
2746h91K32P66Q75p98m03j57L45J69n06O9L27Q04J21m76q06j41M54M95O19J40
2766A238k64j007p65N65J221J242k98j660j557J1J729J240J63r75j657k51O84
2783c41J362L04l13n29r98l09Q99P49K66n51m19k55oN57r7j29r5N94J52l95j087
2804f41j63R71J364k4j067j032k55K46J266P42j93j032r18m01O70J407O03o09
2822I34j422j096Q48J297K96J11o93r94J91N65L54Jk27N4n42l7k75N49o3J84P5
2843A10j5l58j89j60K45K63J144p91n71q17M13J049J233n76r47j446M00R29R77
$$ plain form
2707 42 58 95 -349 -681 -663 -554 -49 -125 153 488 70 -531 -731 -1216 -340 1289 1249 390 -1153 -1394 -145
2728 -145 1238 1820 1088 -634 -1307 -560 385 1491 1451 836 -542 -1223 -570 578 1411 860 -415 -891
2746 -891 -659 107 982 184 -219 -376 -31 138 -368 -299 28 832 953 477 -329 -470 -16 479 1098 1238
2766 1238 974 -33 -798 -233 988 2230 1932 272 -1285 -1274 455 1695 1858 883 -774 -1025 -341
2783 -341 1021 1325 1012 483 -515 -824 75 824 1090 539 120 -135 -141 416 319 190 95 689 841 446 -641
2804 -641 -804 167 1531 1507 440 -592 -847 -601 665 1407 1214 182 -736 -1137 -467 940 1543 934
2822 934 -488 -1584 -736 561 857 968 275 -719 -528 37 391 392 165 219 -323 -360 -635 -86 -149 35 110
2843 110 95 -263 -452 -612 -367 -104 1040 249 -322 -1139 -726 323 1556 980 33 -1413 -1013 -84 893
2862H93L23k19j294o27M6R44J141J70p64j136k19N48O55M51n94m36j82L69k3k23
2882a77K01K39N91k32p10k27l07P11R34M2k73o90r27K69J111O83K59p95j562o62
2902a522J040J319R42p04j280j016O68R59P59k41o43n64m34N87P56L61o0m57n19
2921d9J81l8N51k47K8O8K0O1l72m57K25P91N86l10j160r73Q4R43Q64K85r96j291
2943a206P2M92Q07P96j09j039j354k06J349J192L05q35j238n0N27Q93K6m36O1
2962D7m24K75rN0K82K14J57l25J78p10j51j47O61N24L28p61j266m8P90J172M96
2983A333l90j557p06N52J408M26r6j028r02k4P77O38P49o52p28p24O2J203N5L83
3003G79q15j70k02J34P97m11o5J61K38j08k38l58l14P99M95J76q77m83o0M13Q28
$$ plain form
2862 893 1216 997 -297 -924 -878 66 1207 1377 613 -523 -742 -194 461 912 318 -118 -300 69 46 -177
2882 -177 24 263 854 622 -88 -315 -622 89 1023 1065 792 102 -825 -556 555 1238 1497 702 -860 -1522
2902 -1522 -482 837 1779 1075 -205 -1221 -553 406 1165 924 281 -283 -717 -130 626 987 927 470 -49
2921 -49 132 94 645 398 426 494 514 575 203 -254 -29 762 1348 1038 -122 -1095 -1011 -68 796 1081 85 -1206
2943 -1206 -1134 -642 165 961 852 -187 -1541 -1747 -398 794 1099 264 -974 -1024 -497 396 422 -14 47
2962 47 -377 -102 -111 -61 221 435 592 267 445 -265 -416 -563 98 622 950 189 -1077 -1125 -335 837 1333
2983 1333 943 -614 -1320 -768 640 1066 970 -58 -960 -984 -207 431 1180 528 -200 -924 -862 341 396 779
3003 779 -36 -206 -408 -274 523 112 47 208 446 338 100 -258 -572 227 722 898 21 -462 -522 -109 719
3024G19K88k40j034p51L78P25R77L4q47j273l35Q63J246N14p80r40k45J97P26
3043B22M65l5l08k89j39L04K61r3J68L6J75k67j0m66k50O01M09J15n27p72m81
3064h81M16J057N16p57r29p33M41P00Q57K1j140k78l33K34J235J96lr75q70L45
3084h81N58P73j37l71n98J20L03N7r6K51lj9L33n56j29J2J53N85J44k35p91k33
3106g60J47Q91N76K8r30o78k80J069N82O08p32r35m35L29J000P4k21n49o57K18
3126f55L41O45N14p77n31K3K26L1L07l01R1r7M31k55L47m10m45J005L46m09p79
3147c52j45M8Q11M15J01q19n42n75N85J011K36k90j307l08M98M64O86Q1p33m61
3167e96j65N64L88OJ95o01J30n2K52M14k38j5l70J69K15j99l90Q2O73K12j25o06
$$ plain form
3024 719 1007 767 -267 -1018 -640 85 1062 1096 249 -1024 -1359 -496 750 1264 484 -456 -701 -504 222
3043 222 687 652 344 55 -84 220 481 388 556 592 767 500 490 24 -226 375 784 899 372 -400 -881
3064 -881 -465 592 1108 351 -578 -1311 -870 -170 687 708 -432 -710 -1043 -809 426 622 619 -356 -1226 -881
3084 -881 -323 450 313 -58 -656 -536 -233 -176 -272 -21 -24 -43 290 -266 -395 -383 -230 355 499 264 -527 -760
3106 -760 -613 278 854 882 -48 -726 -1006 63 645 1253 521 -414 -849 -520 480 554 333 -216 -873 -655
3126 -655 -314 331 845 68 -463 -440 -214 -183 124 -177 -86 -183 248 -7 340 -70 -515 490 836 427 -352
3147 -352 -497 -449 362 777 878 59 -483 -1058 -473 538 774 484 -823 -1131 -633 -169 517 598 -135 -596
3167 -596 -761 -197 191 197 392 -209 -79 -131 121 535 297 282 -88 81 296 97 -293 -211 462 674 549 -57
3189e7m57k54P64R14j01n69p42l43K97Q73R11q39m77q83K99P26R24j39p76p48
3209f77m9M81M92L52o32n01K8j50N03J32k35j81R5J20J7np61N27K48N08r7p5p35
3232e95l59R23N30J4m85n24m09M26Q44P66l40j076p00M37R07K63K70n43r10l29
3252h90L23O22R1o9m72l52L25N53q9j74j44j18mL94j10l23J81J9N62L21l22j051
3274g27n5L32O90O52l87n58q81K15O85O71k29l59r75J60K72J231J53o49o40m50
3294h49J67R01M18j99m24o26M40K08L73k34k24K33lk6o8q4Q4j24N54M7n12l53
3316c01k83L08O49J70q0q98k98K09O15J021l52p02o81LM90L93N75k03r55m83Q6
3337g17P85N32j93j71n42Q0J29k1n2k25l0R4o6J07l41K3L46K52O6l6n56m82K82
$$ plain form
3189 -57 -514 -768 -4 910 809 240 -502 -845 -548 325 1236 397 -80 -963 -664 62 986 847 71 -677
3209 -677 -726 -245 247 599 -33 -534 -506 -656 -153 -21 -256 -437 -342 -222 -205 -210 -971 -444 -196 312 215 140 -595
3232 -595 -954 -31 499 513 28 -496 -905 -479 365 1131 791 -285 -985 -548 359 622 892 349 -561 -890
3252 -890 -567 55 146 77 -395 -747 -422 131 42 -132 -276 -394 -398 -4 -114 -437 -256 -237 325 646 324 -727
3274 -727 -782 -450 240 892 505 -53 -934 -719 -34 637 408 49 -926 -766 -494 737 890 241 -399 -849
3294 -849 -682 219 637 438 14 -612 -172 36 409 175 -49 184 181 155 87 3 87 -37 517 564 52 -301
3316 -301 -584 -276 373 543 463 -435 -733 -524 91 1112 760 58 -623 -620 -130 263 838 635 -320 -803 -717
3337 -717 68 600 407 236 -306 -226 -97 -118 -170 -395 -425 -331 -397 -290 -631 -608 -262 -10 56 20 -536 -1018 -736
3360g36P49N41p6o80o87K30O02Q41N3m96p88l04J68O41Q20n40o16m89L05K54J58
3381e0K74m59k73J51K58J13M07o34j34p8L53P9o9k09L05L89J50l62n95nr1R05
3403D25M27l06m10j000R3M86Q80Jk01r80j60M63L38Q50l75n14o50L05L49M40M11
3424H72p16k83m29O19N00k07k34J12j05K88j53j63m75K34M26J14K5k83r71L73
3444d56L20N12L61r52p71J43K61P87P1J15o99o46K21R71O38l36p40l65p0J57Q48
3465C70J65l23o46j14K68O42k61l27j98j9J61M65l64l51Q7O91m9j1L0q45L49m
3487b84N94L19m73n21m73L35P62N63N4j198k03k9P28N38k03n81l49k54L93M73
3507A91L51m74m03k94J26N52m3j1oK7J0P5J11j87n6J20L25J30k97k69k70M80J4
$$ plain form
3360 -736 13 554 478 -202 -889 -659 -57 784 837 341 -447 -751 -583 58 878 338 -278 -767 -462 -208 -50
3381 -50 224 -235 -508 -357 -99 14 421 -213 -347 -425 -72 7 -62 -271 34 423 573 211 -384 -389 -480 425
3403 425 852 546 136 -864 -771 -285 595 596 395 -585 -745 -282 56 906 531 17 -633 -328 21 461 872
3424 872 156 -127 -556 63 563 356 122 234 129 417 264 101 -374 -140 286 400 425 142 -829 -456
3444 -456 -136 376 737 -215 -986 -843 -582 205 276 391 -308 -954 -733 238 876 540 -200 -565 -635 -478 370
3465 370 535 212 -434 -548 -280 362 101 -226 -424 -443 -282 183 -181 -532 -445 246 197 186 216 -629 -280 -284
3487 -284 310 629 156 -365 -838 -503 259 822 876 -322 -525 -554 174 712 509 -72 -421 -675 -282 191
3507 191 542 68 -335 -629 -503 49 6 -5 -11 16 26 101 212 25 -31 89 414 544 247 -22 -292 188 202
3530B02L47k88p25k41L52K06O28J7p22m83j90N52Q71j67m86n97o1M55M17M67j39
3551D15p01K0J65J52M3M09l25m4k18P40m34j47k46J87J17K75k15m22j75L14M82
3572C92J7m9q06l18K06O10P23j48n27p66m3M30N43K25j32q18l09M11O50K2nn99
3594b91k14K18O3L55k0k47m46O91q9N4K16o87K30M45N7j14k85o47M58N95L91j46
3616E87p84l94J91N58M17M70m85j070l25O40M52K67M3o80m18j04O37K38J39o74
3636b95p7l20N90O9o5J04l71O6L00ql3m79M89N56J01k55l22l53N2K65K72J41j12
3659C15q52N7K55O09N35l67q57m37K54N44L85j01q42k16M0O20J004m58m79k12
3679b03m34P04J93j34R1k27k74M68K1P0m17J09O40o13L89m86L9l30P26K48j17
$$ plain form
3530 202 549 261 -464 -705 -353 -147 481 498 -224 -707 -897 -345 526 359 -127 -724 -785 -330 87 554 415
3551 415 -286 -266 -101 51 94 503 178 134 -84 656 222 75 -171 16 133 408 193 -229 -404 -90 392
3572 392 409 360 -446 -764 -558 52 775 627 100 -666 -709 -279 264 489 357 -461 -770 -359 291 313 308 -291
3594 -291 -505 -287 -224 131 111 -136 -582 109 20 74 290 -397 -167 278 335 221 -64 -711 -253 342 733 587
3616 587 -197 -591 -400 158 575 1045 560 -510 -835 -195 257 524 567 -113 -531 -635 2 240 379 -295
3636 -295 -372 -692 -102 -33 -98 6 -365 -299 1 -7 -40 -519 -30 526 627 372 50 -303 -251 14 286 427 315
3659 315 -537 -480 -225 384 919 552 -305 -742 -488 56 441 340 -502 -718 -678 -58 946 488 9 -203
3679 -203 -637 67 260 126 217 -10 -284 184 205 275 -142 -33 607 -6 383 -103 -64 -394 332 580 463
3700D63l07m20p1K59Q24q6l06n77m26K79O97L93k37p17k04j56M52N22N6n55Q9
3721b8n84P2K99L32j64k58R6k78Q4R8K62k64J81N20j59k03k21j86N42J86K91l17
3743C01o48J8L13P85k4l70p11j88o6P88N17r4m74n69k98M94L82L23n00l77l24
3764g22L15L50p2J37j98oJ94Q9J54k38j57J39M17p5l68l16J60J86K99J95j28n08
3786a53m35M47P68K20k11o54m66j57P85J77K21l87n89o8K89N11M0R9p27k28K14
3807c04L64N22l12k54k36q5L40j26n8J55j07K22j1j74n8j38L5L10L22n2o85k81
3829f11K74M34Q50j13o01l71k00J21R02J00m81o46j71P13J52n3J24m08n91K74
3849c02K27L79j4j57o89K10L67K79n64n7J58mK90K3j21k83K19Q7J94k77J96j94
$$ plain form
3700 463 156 -264 -335 -76 748 662 356 -221 -647 -368 329 722 485 -232 -436 -592 -140 382 438 -117 -28
3721 -28 -612 -540 -241 91 -73 -331 -235 -513 -429 -331 -69 -333 -152 368 209 6 -215 -401 141 327 618 301
3743 301 -347 -329 -16 769 745 375 -336 -524 -590 198 715 621 147 -422 -720 -226 156 479 -21 -398 -722
3764 -722 -407 -57 -129 8 -190 -196 -2 87 241 3 -154 -15 402 327 -41 -357 -197 -11 288 483 355 -153
3786 -153 -588 -141 627 847 636 -18 -484 -641 144 321 542 155 -434 -502 -213 298 338 437 -290 -518 -304
3807 -304 60 582 270 16 -220 -305 35 -91 -149 6 -101 121 110 -64 -122 -260 -225 85 407 355 -330 -611
3829 -611 -337 97 947 834 233 -138 -338 -217 685 785 304 -342 -513 200 352 299 423 15 -576 -302
3849 -302 -75 304 290 133 -556 -346 21 300 -264 -321 -163 -167 123 146 25 -258 -39 48 242 -35 161 -33
3871c3j45P6O34j47m79l00J53L27M00k29J10n38m99R9P30O56n57k18m87R4M60
3892A07K11p7l07k44J75R7pJ65l95RJ57j%L5k95p5O87Q6j23q5m58j86M31M78n0
3917C35m18l52QJ96M12K37M1p53l20J68O80N49m86p6o17K29O5N87k45Kq1j47O0
3940G4J37o3j92K09j39M9p7j81R3m16L27L35J49j83l31l6P1N97K30l92n08l48
3962e95M04K55K96J44l52o20K15N44J15K31n22n55P8J94N76k32k7j79j85P7L72
3983B34k19J05m65L0J56K87l22k15R7J30N39k12J67n22n16O50L08J70j86o09k99
4004f92ON45O07J01o08n08P4K37O79O1m40q48M60o2N53J0K5r7l00j06K99K02m35
4027b37N3K61Q0K33j7l94j67o5M71J38j25l93k77K94J22M65n3o39k05J83J93O32
$$ plain form
3871 -33 -178 -102 532 385 -94 -394 -241 86 486 257 367 -171 -670 -571 159 815 258 40 -447 -353 107
3892 107 318 241 -66 -310 -135 -38 -45 120 -275 -266 -109 -110 -110 -75 -370 -445 242 328 205 120 -338 -524 -93 385 335
3917 335 -83 -435 -427 -231 181 418 459 -294 -614 -446 234 783 297 221 -396 -167 -102 485 240 242 161 14 74
3940 74 211 148 -44 165 26 75 -2 -183 -90 -506 -179 156 305 122 -209 -245 -174 423 653 261 -247 -595
3962 -595 -191 64 360 504 152 -468 -253 291 406 637 115 -440 -362 -168 408 176 149 -30 -215 -138 234
3983 234 15 120 -345 -315 -159 128 -194 -409 -312 -182 357 145 312 -210 -726 -76 232 402 216 -393 -692
4004 -692 -686 -141 466 567 -41 -549 -475 -238 441 502 62 -786 -326 -388 165 175 200 103 -197 -303 -4 198 -237
4027 -237 -184 77 157 390 373 -21 -188 -253 218 356 231 -162 -439 -145 -23 442 389 -250 -455 -272 -79 553
4049E53j88m73k04N9N18K6M35j89o72j64L85M61oj81k32k77K63r0L0k2r8j39M65
4072B60r2K6k47P0j70K31J78O9n65p2l2L68M70k55k39n32N8O90K52L5l63l51J16
4095i5l8J87M93l23n39j88K42L36N3j44m68L71k15O49j33k92K9o7oL40Q9k58l16
4118b93K7L2M87j7l27j70M1M00J75j84j05o03M03J65L82j1p82N1qJ20J54L01j92
4141D6l03l01K11L20O36m04l64m4O7P2L7O7p7m2j29K54L96l34l64K62O1J86k7
4164B26m08q8j6J98L33L43l32n52m58P98K35K67j85m31j45j71O61j07L11m52j54
4185a27r6J67K37J59k34l47Q4K22J00J8j41j25J11j58L72k97j19o0J66L33j91
4206G4l3r1k13K06L90J56l13k89j8J58L22J56k95k70m26L77K98M18k74k81n23
$$ plain form
4049 553 365 -108 -312 -253 265 291 726 537 -135 -299 86 547 541 360 128 -149 114 24 54 32 -66 -205 260
4072 260 168 194 -53 17 -153 78 256 325 -240 -312 -344 24 494 239 0 -532 -474 216 468 503 140 -211 -95
4095 -95 -133 54 547 224 -315 -503 -261 75 128 -16 -484 -113 -328 321 188 -104 -75 -142 -148 192 281 23 -293
4118 -293 -266 -234 253 236 -91 -261 -220 180 355 171 66 -537 -134 31 413 402 -380 -329 -337 -217 -63 238 46
4141 46 -257 -558 -347 -27 609 205 -159 -203 -136 -64 -27 40 -37 -79 -208 46 442 108 -256 6 67 253 226
4164 226 -182 -270 -286 -88 245 588 256 -296 -754 44 279 546 361 -70 -215 -386 275 168 479 27 -127
4185 -127 -223 -56 181 340 106 -241 -157 65 165 183 42 -83 28 -130 242 -55 -174 -234 -68 265 74
4206 74 41 -50 -263 -57 333 489 176 -113 -131 27 349 505 210 -60 -486 -109 189 607 333 52 -471
4227d71J80K35R4Q2K30m72k27J87J92n5j08l1O6J31j58K21k01j59K45J91r9K50
4249C23n42J16J28L45k50j07J39m95K18J96K84K95q19l05K69J51M43mm25l61L2
4270c69L41M9J98l38o8o3J34K41j28o2j13J15j1K02j08k32r8K06K29m2Q6j61l21
4293c13L43L71K49J21o44n29L38R3K96l8j88j40l03L55N49q9j14p22r0K35M97
4314B77p9l21O8r1K04k52M12Rm50J5K26m6K86n08J21k8M49o4j64j26k65m8N33
4337A58J31o6J30o80K25J32O46m13P5m04k22N25J45J31n05K30n56K88L75j41r4
4358A10J03k64m36M53L40k24k98j06J25J12J47q4j18K7L2L37j77k0l6j13J05J29
4380A44J72l78j03j55J70K59Q2p3m42k49K17O86L3k37l03k09K37J43M32l53j23
$$ plain form
4227 -471 -291 -56 38 120 350 -122 -349 -162 30 -25 -133 -164 -98 33 -125 96 -105 -264 -19 172 73 323
4249 323 -219 -103 25 370 120 13 152 -343 -125 71 355 650 -169 -474 -205 -54 389 385 -40 -401 -369
4270 -369 -28 21 219 -119 -187 -250 -116 125 -3 -65 -178 -63 -74 128 20 -212 -310 -104 125 83 169 8 -313
4293 -313 30 401 650 771 127 -402 -64 29 325 287 99 -41 -344 11 560 471 357 -365 -455 -220 277
4314 277 198 -123 -55 -146 58 -194 218 227 -223 -208 18 -28 258 -250 -129 -157 292 228 64 -62 -327 -375 158
4337 158 289 223 353 -327 -102 30 676 263 338 -66 -288 237 382 513 8 238 -318 -30 345 204 110
4358 110 213 -51 -487 -34 306 82 -216 -322 -197 -85 62 -22 -140 -113 -81 256 79 59 23 -90 15 144
4380 144 316 -62 -165 -320 -150 109 191 118 -324 -573 -356 330 363 126 -177 -386 -149 -6 426 73 -50
4401e0k16R4L6K05P3m37j16N43j96J20m1k12N5Q7J31p4K0l05j27N66q1J16j10
4424H1n05J64QN17J69k29m18o5N40oj7K46p35j86M07K32L50l47j4j43M0k18R0
4447c9M9k19J80j27N3J13N4J43o31M07M05k13j20j15j08N11k50K58k04m23K41
4468c5K04K74Nl06j43k6j50K57N44k10m98m6j58K93M39j6n31J00k26K82L17o6
4490C04j36m3k56J83J52k62K1j14K00p4L99k07j72m36J7K32K67r2o5j40N0M94
4512C22Q4k36o14lkL13L52o4p4m26R6L7K22L67k41m94o3M58J19l04P3N5k66L04
4536A5k20k06M71m83M33j01L32j75l28P7K37k28K63J54m28J99r9L27J05N0l70
4557B5j93K91J2L17j33l8l26l92M10L02M4k55j28r8L22k45J32k1k30J22L64j31
$$ plain form
4401 -50 -266 -172 -136 69 142 -295 -411 132 -64 56 15 -197 -142 -55 76 2 22 -283 -410 156 75 191 81
4424 81 -424 -260 -252 265 434 205 -213 -278 262 256 239 485 -250 -436 -29 203 553 206 192 49 89 -129 -39
4447 -39 10 -209 -29 -156 -103 10 64 207 -424 -17 388 175 55 -60 -168 343 93 351 147 -276 -35
4468 -35 169 443 448 142 -1 -27 -177 80 624 414 -84 -130 -288 5 444 428 -103 -3 -229 53 370 304
4490 304 168 125 -131 52 204 -58 -37 -151 49 -25 374 167 -5 -441 -424 -192 75 -17 -82 -222 -172 322
4512 322 406 170 -444 -447 -449 -136 216 152 78 -348 -252 -215 7 374 133 -361 -424 34 153 -151 -78 -23 -289 15
4536 15 -205 -411 60 -423 10 -91 241 66 -262 -185 52 -176 87 241 -187 12 -87 240 345 395 25
4557 25 -168 123 135 452 319 281 -45 -437 -27 275 319 64 -64 -162 160 -85 47 26 -204 -82 282 151
4579A51l7K08m89j33L65K11j73j17l12M30j13L55j66l03jq5K35J54L5j07o68M49
4601a11j51O92k79L6k98k08L02P0L84k25j88k30L4M45m04K56l03M7L68l61J99
4622G5m8L07p10O11k75q7l4K0J00J44r7P1k36J24l71N22P3J52k11o68L40J61J69
4645A32kl02j92J34j0M05L02j38m12J8j38M31J72l58j58j24L9L65q7j24K01j62
4667hR7j95J34j4j37P8M1L26L6k13m05O2J13M33j84k38r1l32L50K68L46j90q0
4690A97m51K0L31K17j4l06m8k35J37N95om57m6k5J46J73l8Qk92J79o2L00l70k9
4714g6nMQ9J91R9l05J44o4J17p7M3m77K16P6L06r7n8l32l5r0L26K88l12J98l46
4739a77J61m2J28Ok17L87k27j85N2K79j02J17m41J76J35l64K47o0Mp5j2L38m16
$$ plain form
4579 151 114 322 -167 -300 65 276 103 -14 -326 104 -9 346 180 -123 -124 -209 26 180 215 108 -560 -111
4601 -111 -262 430 151 187 -111 -319 -17 53 437 212 24 -206 -172 273 -131 125 -178 -131 237 -124 75
4622 75 27 334 -376 235 -40 -127 -161 -141 -41 103 6 77 -159 -35 -406 116 189 341 130 -538 -198 -37 132
4645 132 130 -172 -364 -230 -240 165 467 329 -83 -65 -203 228 400 42 -116 -240 -201 164 77 -47 154 -8
4667 -8 89 -106 28 14 -123 -45 -4 322 358 145 -260 -198 -85 348 164 -74 -165 -497 -147 121 467 277 197
4690 197 -254 -234 97 314 300 -6 -54 -289 -152 443 437 -20 -66 -91 55 228 190 198 -94 85 23 323 -47 -76
4714 -76 -81 -77 12 203 302 -3 141 77 194 117 160 -317 -101 -25 281 184 126 -206 -241 -331 -5 283 -29 169 -177
4739 -177 -16 -58 70 76 -141 246 19 -166 -114 165 63 180 -261 -85 50 -314 -67 -127 -123 -198 -210 128 -288
4762b88KK98N04l38k39p9J59j88O0L03n3J58m63J54r5K45K21n50J74j72K10j12
4784h9L5q8j76K29P2J16k80L19R4r4L7j60Q9r5l28L66K21j9j44m65K89P3Q0M06
4808D88m85j17j04l3J52K80k7q8k24l2N9J80j64L18k47M7j60L24J6k1k96PJ80
4831E3R6r1J72o9k83J31j78m4J66k03L85J1M5j56M6m14K87M02j80j2l55J28J19
4854E6Q9O5j48l2j28m5j73N80L1l77o5l21M58J00P7j17K7k95J51q4M69l67L8j65
4878a76k5J92J35k72LJ55N6R8j53K89m92M2r2M14J01j73j57l2P9K83j15j11P0
4901A19l42P4J48L15k71k38ON6K08J90k13r1j17l8N14k40j49k35j0n1L39o7Ok09
4925b96k0L68j7j58J75%j67J11M20k34j00r1J59k8J63K09m50j13k85K21n2M01
$$ plain form
4762 -288 -286 12 516 178 -61 -140 19 -169 -109 194 141 299 -164 -10 -105 140 361 -189 -15 -187 23 -89
4784 -89 -54 -142 -318 -89 -17 99 -181 138 232 138 175 15 104 9 -319 47 268 249 105 -360 -71 2 82 488
4808 488 3 -114 -218 -251 -99 181 154 66 -158 -190 -131 49 -115 203 -44 3 -157 167 183 162 -134 -127 53
4831 53 149 58 230 161 -122 9 -169 -213 -47 -250 135 146 191 35 81 -333 -46 356 176 164 -191 -63 56
4854 56 145 210 62 30 -98 -143 -316 264 295 -82 -147 -468 -10 90 167 50 77 -218 -67 -151 318 -49 -11 -176
4878 -176 -201 -9 126 -146 -143 12 68 166 13 302 -190 -148 -240 174 275 102 -55 -87 -8 275 160 49 119
4901 119 -223 -149 -1 314 43 -195 -189 -133 75 265 52 -39 -156 -194 320 80 -69 -304 -314 -365 -26 -93 -87 -296
4925 -296 -316 52 35 -123 52 52 -115 -4 416 182 82 -9 150 122 285 494 44 -69 -354 -133 -185 216
4947B16l57J6k13L09J73K30k96j50k1Q0oO5K3N8l24J48K14j92l4k21J89J28J03
4970A38M9p2j89m2j9P06m39J47k78k25NM00j2n8k29m6n8N62j61Q7l81J18n1MK38
4995A94J09l49Q0R0L02m88q2J5K38m21K53J59j13K08k22k2O1J45m40RQ9p3M42
5018A84J9Lk29Qj69L10r5J07J23m99P8O6M65k17k22j22L59l8J36q6m2j39l35M12
5042G7l69J59J13q6p0K81M3k62L16m45j25L48J89l44k4j1m4K33MLj45k61O10k70
5066h0k6J68r9k46K3N64n8m9j27k22j72M96R3k62j71K88k82N4J02J62l12L98%
5089B42j64P9j82J8J29O8O0j35k26J85p1J97M50l45k28k27o3J30N6J91K45m25
$$ plain form
4947 216 -141 -125 -338 -29 144 374 78 -72 -93 -13 -19 46 69 127 -197 -49 165 -27 -61 -282 -93 35 138
4970 138 187 115 -74 -116 -135 571 132 279 1 -224 -219 181 169 111 -118 -164 -222 340 179 266 -115 3 -48 -44 194
4995 194 303 -46 34 124 426 -62 -144 -129 109 -312 -59 100 -13 195 -27 -49 12 157 -283 -274 -185 -258 184
5018 184 203 206 -23 -15 -184 126 31 138 261 -238 -160 -94 371 154 -68 -190 169 131 267 181 139 0 -335 77
5042 77 -292 -133 -20 -106 -176 105 148 -114 202 -243 -368 -20 169 -175 -199 -210 -254 -21 -17 -14 -159 -420 190 -80
5066 -80 -106 62 -37 -283 -260 304 246 197 70 -152 -324 172 265 3 -168 120 -162 -108 -6 156 -156 242 242
5089 242 78 157 -25 -7 122 190 250 115 -111 74 3 200 650 305 77 -150 -213 -83 -27 164 409 -16
$$ [...]
8191g3
##END NTUPLES=NMR FID
##END=
