##TITLE=1H_Ser 2310-NEA
 CDCl3
 8 sc, 
 20.2.2024
##JCAMPDX= 6.0         $$ Bruker NMR JCAMP-DX V2.0
##DATA TYPE= NMR FID
##DATA CLASS= NTUPLES
##ORIGIN= UXNMR, Bruker Analytische Messtechnik GmbH
##OWNER= root
$$ XWIN-NMR		Version 3.5
$$ Tue Feb 20 15:57:37 2024 Russian Standard Time (UT+4h)  she@DPX200
##.OBSERVE FREQUENCY= 200.1313
##.OBSERVE NUCLEUS= ^1H
##.DELAY= (6, 6)
##.ACQUISITION MODE= SIMULTANEOUS
##.ACQUISITION SCHEME= undefined
##.AVERAGES= 8
##.DIGITISER RES= 18
##SPECTROMETER/DATA SYSTEM= spect
##.PULSE SEQUENCE= zg30
##.SOLVENT NAME= DMSO
##.SHIFT REFERENCE= (INTERNAL, DMSO, 0, 15.7039)
##AUDIT TRAIL= $$ (NUMBER, WHEN, WHO, WHERE, WHAT)
$$ ##TITLE= Audit trail, XWIN-NMR		Version 3.5
$$ ##JCAMPDX= 5.01
$$ ##ORIGIN= Bruker BioSpin GmbH
$$ ##OWNER= she
$$ F:/spectra/data/she/nmr/H-F/1/audita.txt
$$ ##AUDIT TRAIL=  $$ (NUMBER, WHEN, WHO, WHERE, WHAT)
(   1,<2024-02-20 15:56:03.75 +0400>,<she>,<DPX200>,
      <created by zg, POWCHK disabled, PULCHK disabled
       configuration hash MD5:
       00 E9 B6 7A A2 85 ED C7 34 08 36 98 17 FE 4E 26
       data hash MD5: 16K
       6F FF DC EB D3 58 9E 49 44 DE A8 9D 10 88 A6 DA>)
$$ ##END=
$$ 
$$ hash MD5
$$ F0 DE A5 4E 8D 4D 80 1C FA 09 E1 27 E6 59 13 CE
##$RELAX= 
##$RELAX= 
##$RELAX= 
##$RELAX= 
##$RELAX= 
##$RELAX= 
$$ Bruker specific parameters
$$ --------------------------
##$DU= <F:/spectra>
##$EXPNO= 1
##$NAME= <H-F>
##$PROCNO= 1
##$TYPE= <nmr>
##$USER= <she>
##$AMP= (0..31)
100 100 100 100 100 100 100 100 100 100 100 100 100 100 100 100 100 100 
100 100 100 100 100 100 100 100 100 100 100 100 100 100 
##$AQSEQ= 0
##$AQ_mod= 1
##$AUNM= <au_zg>
##$AUTOPOS= <>
##$BF1= 200.13
##$BF2= 200.13
##$BF3= 200.13
##$BF4= 200.13
##$BF5= 200.13
##$BF6= 200.13
##$BF7= 200.13
##$BF8= 200.13
##$BYTORDA= 1
##$CFDGTYP= 0
##$CFRGTYP= 5
##$CHEMSTR= <none>
##$CNST= (0..31)
1 1 145 1 1 1 1 1 1 1 1 1 1 1 1 1 1 1 1 1 1 1 1 1 1 1 1 1 1 1 1 1 
##$CPDPRG= <>
##$CPDPRG1= <>
##$CPDPRG2= <>
##$CPDPRG3= <>
##$CPDPRG4= <mlev>
##$CPDPRG5= <mlev>
##$CPDPRG6= <mlev>
##$CPDPRG7= <mlev>
##$CPDPRG8= <mlev>
##$CPDPRGB= <>
##$CPDPRGT= <>
##$D= (0..31)
0 1.2 0 0 0 0 0 0 0 0.06 0 0.03 0 0 0 0 0.0002 0 0 0 0 0 0 0 0 0 0 0 0 
0 0 0 
##$DATE= 1708430163
##$DBL= (0..7)
120 120 120 120 120 120 120 120 
##$DBP= (0..7)
150 150 150 150 150 150 150 150 
##$DBP07= 0
##$DBPNAM0= <>
##$DBPNAM1= <>
##$DBPNAM2= <>
##$DBPNAM3= <>
##$DBPNAM4= <>
##$DBPNAM5= <>
##$DBPNAM6= <>
##$DBPNAM7= <>
##$DBPOAL= (0..7)
0.5 0.5 0.5 0.5 0.5 0.5 0.5 0.5 
##$DBPOFFS= (0..7)
0 0 0 0 0 0 0 0 
##$DE= 6
##$DECBNUC= <off>
##$DECIM= 32
##$DECNUC= <off>
##$DECSTAT= 4
##$DIGMOD= 1
##$DIGTYP= 9
##$DL= (0..7)
0 120 120 120 120 120 120 120 
##$DP= (0..7)
150 150 150 150 150 150 150 150 
##$DP07= 0
##$DPNAME0= <>
##$DPNAME1= <>
##$DPNAME2= <>
##$DPNAME3= <>
##$DPNAME4= <>
##$DPNAME5= <>
##$DPNAME6= <>
##$DPNAME7= <>
##$DPOAL= (0..7)
0.5 0.5 0.5 0.5 0.5 0.5 0.5 0.5 
##$DPOFFS= (0..7)
0 0 0 0 0 0 0 0 
##$DQDMODE= 0
##$DR= 18
##$DS= 0
##$DSLIST= <SSSSSSSSSSSSSSS>
$$ [...]
##$SUBNAM2= <"">
##$SUBNAM3= <"">
##$SUBNAM4= <"">
##$SUBNAM5= <"">
##$SUBNAM6= <"">
##$SUBNAM7= <"">
##$SUBNAM8= <"">
##$SUBNAM9= <"">
##$SW= 18.0517328524113
##$SWIBOX= (0..15)
0 0 2 0 0 0 0 0 0 0 0 0 0 0 0 0 
##$SW_h= 3612.71676300578
##$TD= 16384
##$TD0= 1
##$TE= 0
##$TE2= 300
##$TE3= 300
##$TEG= 300
##$TL= (0..7)
0 120 120 120 120 120 120 120 
##$TP= (0..7)
150 150 150 150 150 150 150 150 
##$TP07= 0
##$TPNAME0= <>
##$TPNAME1= <>
##$TPNAME2= <>
##$TPNAME3= <>
##$TPNAME4= <>
##$TPNAME5= <>
##$TPNAME6= <>
##$TPNAME7= <>
##$TPOAL= (0..7)
0.5 0.5 0.5 0.5 0.5 0.5 0.5 0.5 
##$TPOFFS= (0..7)
0 0 0 0 0 0 0 0 
##$TUNHIN= 0
##$TUNHOUT= 0
##$TUNXOUT= 0
##$USERA1= <user>
##$USERA2= <user>
##$USERA3= <user>
##$USERA4= <user>
##$USERA5= <user>
##$V9= 5
##$VALIST= <valist>
##$VCLIST= <CCCCCCCCCCCCCCC>
##$VD= 0
##$VDLIST= <DDDDDDDDDDDDDDD>
##$VPLIST= <PPPPPPPPPPPPPPP>
##$VTLIST= <TTTTTTTTTTTTTTT>
##$WBST= 1024
##$WBSW= 4
##$XGAIN= (0..3)
0 0 0 0 
##$XL= 0
##$YL= 0
##$YMAX_a= 685771
##$YMIN_a= -827794
##$ZGOPTNS= <>
##$ZL1= 120
##$ZL2= 120
##$ZL3= 120
##$ZL4= 120
##$ABSF1= 10
##$ABSF2= 0
##$ABSG= 5
##$ABSL= 3
##$ALPHA= 0
##$AQORDER= 0
##$ASSFAC= 0
##$ASSFACI= 0
##$ASSFACX= 0
##$ASSWID= 0
##$AUNMP= <proc_1d>
##$AZFE= 0.1
##$AZFW= 0.1
##$BCFW= 1
##$BC_mod= 2
##$BYTORDP= 1
##$COROFFS= 0
##$CY= 11.3945322036743
##$DATMOD= 1
##$DC= 2
##$DFILT= <>
##$DTYPP= 0
##$F1P= 15.7292609196834
##$F2P= 12.9074282941183
##$FCOR= 0.5
##$FTSIZE= 0
##$FT_mod= 4
##$GAMMA= 1
##$GB= 0.15
##$INTBC= 1
##$INTSCL= 1
##$ISEN= 128
##$LB= 0.24
##$LEV0= 0
##$LPBIN= 0
##$MAXI= 10000
##$MC2= 0
##$MEAN= 0
##$ME_mod= 0
##$MI= 1.114404
##$NCOEF= 0
##$NC_proc= 0
##$NLEV= 6
##$NOISF1= 3.799351
##$NOISF2= 2.8
##$NSP= 1
##$NTH_PI= 0
##$NZP= 0
##$OFFSET= 15.70392
##$PC= 1
##$PHC0= -24959.1
##$PHC1= 8.25264
##$PH_mod= 1
##$PKNL= yes
##$PPARMOD= 0
##$PSCAL= 0
##$PSIGN= 0
##$REVERSE= no
##$SF= 200.130013532006
##$SI= 16384
##$SIGF1= 3
##$SIGF2= 2
##$SINO= 400
##$SIOLD= 16384
##$SREGLST= <1H.CDCl3>
##$SSB= 0
##$STSI= 0
##$STSR= 0
##$SW_p= 3612.71676300578
##$SYMM= 0
##$S_DEV= 0
##$TDeff= 0
##$TDoff= 0
##$TI= <>
##$TILT= no
##$TM1= 0
##$TM2= 0
##$TOPLEV= 0
##$USERP1= <user>
##$USERP2= <user>
##$USERP3= <user>
##$USERP4= <user>
##$USERP5= <user>
##$WDW= 1
##$XDIM= 8192
##$YMAX_p= 0
##$YMIN_p= 0
$$ End of Bruker specific parameters
$$ ---------------------------------
##NTUPLES= NMR FID
##VAR_NAME=  TIME,          FID/REAL,        FID/IMAG
##SYMBOL=    X,             R,               I
##VAR_TYPE=  INDEPENDENT,   DEPENDENT,       DEPENDENT
##VAR_FORM=  AFFN,          ASDF,            ASDF
##VAR_DIM=   8192,          8192,            8192
##UNITS=     SECONDS,       ARBITRARY UNITS, ARBITRARY UNITS
##FACTOR=    0.0002768,     1,               1
##FIRST=     0,             0,               0
##LAST=      2.2672688,     0,               0
##MIN=       0,             -827794,         0
##MAX=       2.2672688,     685771,          0
$$ Real data points
##PAGE= N=1
##DATA TABLE= (X++(R..R)), XYDATA
$$ [...]
$$ plain form
1905 -2885 -3700 -804 2761 3224 -6 -2999 -2915 390 3494 3106 -420 -3658 -3261 525 3690 2724 -745
1922 -745 -3462 -2440 1266 3467 1947 -1687 -3549 -1634 2228 3684 1535 -2278 -3798 -1551 2186
1937 2186 3561 1262 -2480 -3219 -603 2608 3258 203 -3063 -3189 -7 3422 3198 -383 -3518 -2935
1953 -2935 490 3324 2722 -547 -3058 -1976 1165 3402 2154 -1659 -3537 -1966 1692 3655 1562
1968 1562 -1858 -3669 -1418 1946 3329 1273 -2060 -3103 -595 2564 3106 231 -3012 -3304 -177
1983 -177 2915 3044 64 -3083 -2750 306 3059 2816 -599 -3128 -2322 876 3118 1956 -1285 -3381
1999 -3381 -2118 1406 3776 1946 -1487 -3140 -1540 1817 3304 1197 -1848 -3075 -875 2379 2992
2014 2992 443 -2638 -3098 -408 2714 3052 273 -2816 -2814 70 2800 2514 -260 -2997 -2373 841 2903
$$ packed form
1905b885q15K896L565M63l230k993Q4L305L104l88l526l238L97L786L165r66l469
1922g45k717J022L706K201j520l634j862J915L862J456k149l813j520K247L737
1937B186J375k299l742p39K616L211O50l055l266j26L182L429k24l581l135N83
1953b935L425K834o02l269k511J082L141K237j248l813j878J571L658J963k093
1968A562l420j811K251L364J383k056l333j043K508L159N42k875l243k92L127
1983a77L092J29k980l147L33L056K753k43l415k529Q06L198K242j162l241k096
1999c381J263L524K370j830l433j653J600L357J487k107l045j227K200L254O13
2014B992k549l081m60K690L122L38k779l089KK884K730k86k774k737O24L214K062
$$ plain form
2031 2903 2153 -1182 -3283 -1701 1281 3324 2024 -1466 -3212 -1896 1464 3017 1379 -1864 -2936
2046 -2936 -736 2138 3203 664 -2404 -2978 -507 2801 3003 457 -2593 -2926 -445 2460 2233 -307
2062 -307 -2636 -2281 737 3090 2118 -869 -3083 -1959 1177 3295 2048 -1071 -3147 -1854 1206 2863
2078 2863 1284 -1675 -2762 -797 1776 2982 977 -2308 -3104 -698 2201 2852 449 -2302 -2621 -442
2094 -442 2333 2238 -221 -2488 -2101 342 3013 2151 -779 -3089 -2379 608 3002 1881 -894 -2718
2110 -2718 -1608 1322 2675 1370 -1462 -2710 -985 1745 2600 1038 -1973 -2851 -860 1796 2618 666
2126 666 -1947 -2398 -93 2422 2361 -123 -2594 -2310 316 2681 2209 -550 -2589 -2112 642 2566 1885
2143 1885 -863 -2381 -1521 1313 2639 1300 -1387 -2770 -1461 1648 2771 1106 -1636 -2690 -1024
$$ packed form
2031B903p50l335k101J582K982K043j300l490j746J316L360J553j638l243j072
2046b936K200K874J065k539l068n74K471L308K02k546l050l33K481K905k27k540
2062c07k329L55L018K353r72k987k214J124L136K118j247l119k076J293L060J657
2078B863j579k959j087J965K573J206k005l285p96K406K899O51k403k751l19K179
2094d42K775r5k459k267L87K443K671q62k930k310P10K987K394j121k775j824
2110b718J110K930J353j305k832j248J725K730Q55j562l011q78J991K656Q22j952
2126F66k613m51K305K515o1k484k471K84K626K365m72k759k039M77K754J924o81
2143A885k748j518Q60K834J326j339k687j383J309L109J123j665k742j054J666
$$ plain form
2158 -1024 1790 2387 741 -1837 -2285 -239 2074 2426 130 -2501 -2562 1 2440 2277 -99 -2410
2174 -2410 -2072 627 2400 2063 -460 -2359 -1563 977 2508 1401 -1376 -2759 -1602 1207 2704 1274
2190 1274 -1310 -2393 -1097 1507 2493 658 -1738 -2461 -507 1985 2304 78 -2208 -2405 -14 2338
2206 2338 2310 237 -1990 -2100 286 2161 1923 -544 -2424 -1654 894 2504 1650 -1122 -2415 -1367
2222 -1367 1241 2587 1440 -1241 -2493 -988 1327 2224 668 -1646 -2264 -522 2019 2288 312 -1831
2238 -1831 -2216 -217 2186 2183 163 -2186 -2056 -93 2157 1851 -321 -2158 -1764 728 2544 1620 -726
2255 -726 -2449 -1491 832 2219 1150 -1189 -2286 -964 1043 2015 746 -1392 -2139 -694 1767 2417
2271 2417 596 -1714 -2040 -400 1737 1999 17 -2062 -1938 154 2143 1858 -153 -2227 -1558 517
$$ packed form
2158a024K814N97j646k578m48K046K313L52k296k631o1K563K439j63k376k311
2174b410L38K699J773l37k523j899P96K540J531j107k777j383J157K809J497j430
2190A274k584j083J296K604R86j835k396p23J954K492L19k226k286j97K391K352
2206B338k8k073k227j10K386J875k38k467j880P70K548J610q54k772j293J048
2222a367K608J346j147k681j252J505K315Q97j556k314o18J742K541K69j976k143
2238a831l85J999K403lk020k349J30J963K250l06k172j837L94K492J816r24k346
2255g26j723R58K323J387j069k339j097J322K007R72j269k138p47J445K461O50
2271B417j821k310l26J640K137K62j982k079J24K092J989k85k011k074O69K075
$$ plain form
2287 517 2263 1693 -608 -2313 -1510 733 2155 1185 -932 -2271 -1132 1203 2390 963 -1074 -2289
2303 -2289 -660 1390 2154 660 -1782 -2124 -402 1822 1991 106 -1926 -1947 93 1899 1984 -260 -2092
2320 -2092 -1729 142 1897 1409 -604 -2021 -1405 650 2172 1306 -770 -2064 -1001 1056 1978 1171
2336 1171 -1132 -2125 -1076 1384 1942 601 -1351 -2031 -287 1612 2038 425 -1387 -1855 -166 1823
2352 1823 1816 34 -1856 -1903 14 1838 1616 -317 -1809 -1421 538 1985 1490 -657 -2003 -1126 799
2369 799 2037 985 -1222 -2142 -1134 1033 2143 738 -1281 -1913 -487 1449 1971 296 -1456 -1856
2385 -1856 -411 1526 1804 95 -1593 -1729 65 1858 1665 -216 -1807 -1387 548 1736 1242 -417
2401 -417 -1974 -1320 700 1832 1195 -934 -1747 -996 1001 1753 1088 -1033 -1834 -654 1230 1830 472
$$ packed form
2287E17J746n70k301j705Q03K243J422r70k117j339J139K335J187j427k037j215
2303b289J629K050P64j494k442l42J722K224J69j885k032k1K040J806Q5k244j832
2320b092L63J871J755m88k013j417O16K055J522q66k076j294J063K057R22q07
2336A171k303r93J049K460N58j341j952o80J744J899M26j613j812m68J689J989
2352A823pj782j890m7J917J824k22j933j492L88J959J447m95k147j346Q77J925
2369G99J238j052k207r20J008K167J110j405k019o32J426J936N22j675j752m00
2385a856J445J937K78j709j688j36J794J793j93j881j591M20J935J188m94j659
2401d17j557O54K020J132o37k129q13P51J997P52o65k121q01J180J884O00j358
$$ plain form
2418 472 -1423 -1783 -271 1447 1769 154 -1346 -1458 223 1715 1493 -92 -1591 -1503 151 1806 1310
2435 1310 -487 -1773 -1245 879 1759 1225 -691 -1866 -1042 872 1720 1010 -856 -1909 -796 1033
2451 1033 1703 690 -1346 -1749 -266 1278 1675 179 -1482 -1569 -209 1412 1507 -86 -1677 -1538 -14
2468 -14 1557 1448 -238 -1720 -1082 503 1802 1073 -696 -1616 -1135 589 1643 1154 -832 -1569 -777
2485 -777 1052 1664 485 -929 -1545 -561 1284 1590 175 -1400 -1533 -201 1270 1491 110 -1585 -1405
2502 -1405 110 1366 1235 -314 -1573 -1148 357 1682 1235 -722 -1638 -1224 470 1866 1072 -814
2518 -814 -1534 -765 910 1552 531 -914 -1602 -376 1231 1549 296 -1298 -1668 -208 1122 1508 241
2535 241 -1154 -1310 32 1414 1280 -7 -1664 -1223 320 1353 1364 -422 -1726 -1019 470 1642 956
$$ packed form
2418D72j895l60J512J718L22j615j500j12J681J492k22j585j499Q8J654J655m96
2435A310j797j286N28K124Q80n34j916j175Q24J914Q48p10j866j053J113J829
2451A033O70j013k036m03J483J544L97j496j661q7J360J621R5j593j591J39J524
2468a4J571j09j686j482O38J585J299p29j769r20M81J724J054m89j986p37P92
2485g77J829O12j179j414o16R84J845L06j415j575j33J332J471K21j381j695J80
2502a405J515J256j31j549j259M25J505J325m47j957r16M14J694J396p94j886
2518h14p20P69J675O42j021j445o88J226J607L18j253j594l70J460J330L86j267
2535B41j395j56J342J382j34j287j657M41J543J033J1j786j304P07J489J172o86
$$ plain form
2552 956 -481 -1622 -1012 475 1463 636 -984 -1507 -498 1020 1462 544 -943 -1493 -314 1238 1344
2569 1344 364 -1118 -1394 -223 1180 1256 -22 -1404 -1247 403 1458 1073 -141 -1405 -1117 440 1452
2586 1452 943 -383 -1405 -851 534 1395 687 -759 -1380 -731 865 1418 609 -789 -1566 -501 841
2603 841 1449 275 -1189 -1219 -206 1169 1294 -9 -1355 -1098 80 1316 1279 -163 -1295 -1143 218
2620 218 1264 789 -460 -1378 -915 535 1498 719 -647 -1327 -530 890 1344 553 -821 -1324 -477 979
2638 979 1174 210 -944 -1163 -211 977 1339 156 -1127 -1203 -16 1197 997 -303 -1152 -1160 172 1250
2656 1250 1008 -271 -1173 -687 445 1452 769 -672 -1288 -815 623 1308 694 -652 -1325 -514 731
2673 731 1309 395 -885 -1098 -192 1074 1350 209 -1195 -1484 -214 1110 1136 -17 -1103 -1073 160 1321
$$ packed form
2552I56j437j141O10J487R88q27j620n23J009J518M42r18j487n50J179J552J06
2569A344r80j482k76J171J403P6j278j382J57J650J055l85j214j264K88J557J012
2586A452n09j326j022N54J385Q61p08j446o21O49J596N53q09j398p77J065J342
2603H41O08j174j464l0J013J375J25j303j346K57J178J236l7j442j132J52J361
2620B18J046m75j249r18M63J450R63p79j366o80P97J420M54p91j374n03Q47J456
2638I79J95r64j154k19R52J188L62j183j283p6J187J213k00j300q49qJ332J078
2656A250k42j279r02M86J132J007o83j441o16M73J438O85o14j346o73Q11J245
2673G31N78r14j280k13R06J266K76j141j404k89J270J324K6j153j086L0J233J161
$$ plain form
2691 1321 926 -225 -1206 -1008 267 1221 916 -523 -1343 -775 432 1226 592 -707 -1197 -445 718 1339
2709 1339 529 -802 -1320 -394 990 1227 60 -979 -992 -145 1075 1231 -125 -1050 -977 290 1255 822
2727 822 -260 -1277 -880 276 1031 736 -340 -1044 -522 522 1080 739 -411 -1247 -530 837 1155 659
2745 659 -669 -1233 -458 858 1231 292 -828 -959 -262 952 1119 9 -1072 -1215 -92 803 1056 38
2763 38 -995 -834 312 1092 931 -246 -1085 -756 499 1163 536 -547 -1418 -674 581 1130 557 -523
2781 -523 -1067 -392 861 1229 327 -775 -1118 -146 944 1174 193 -983 -853 -12 878 1125 20 -936
2799 -936 -698 175 889 869 -359 -1062 -848 288 1048 560 -476 -1043 -577 281 1106 667 -531 -1152 -443
2818 -443 797 1082 210 -830 -1180 -163 845 979 143 -943 -911 -65 991 809 71 -930 -800 164
$$ packed form
2691A321l95j151r81J98J275R54l05j439q20N68J207P94o34j299m90P52J163O21
2709A339q10j331n18R26J384K37j167j039j3Q47J220J56j356r25P3J267R65m33
2727H22j082j017L97J156P55k95j076p04N22J044N58l41j150q36P17J367L18m96
2745F59j328n64P75J316L73r39j120j31O97J214J67j110j081j43J123Q95K53j018
2763C8j033J61J146P80j61j177q39L29J255O64o27j083q71P44J255N49n73j080
2781e23n44O75J253L68r02j102l43R72J090K30r81j176J30Q41Q90K47j105r56
2799i36K38Q73P14k0j228p03K14J136P60m88j036n67M66Q58Q25m39j198o21P09
2818d43J240K85q72j040l50J017J008J34q36j086L2Q46J056j82p38j001J30R64
$$ plain form
2836 164 1032 626 -212 -1062 -851 246 1128 691 -408 -844 -653 434 983 553 -423 -1023 -590 622 1095
2855 1095 359 -587 -1044 -345 817 1061 240 -745 -1147 -127 744 804 21 -871 -888 45 892 757 -210 -946
2875 -946 -618 129 1021 861 -200 -1010 -633 456 968 465 -377 -1029 -651 517 924 432 -618 -937 -299
2894 -299 571 903 411 -588 -1058 -195 625 751 116 -768 -714 80 830 911 -35 -1061 -746 73 886 692
2914 692 -154 -885 -737 295 853 452 -470 -958 -373 383 881 512 -478 -1016 -497 471 832 386 -509 -830
2934 -830 -425 719 849 93 -721 -714 45 709 904 80 -806 -869 -86 700 632 -123 -787 -476 156 951 683
2955 683 -273 -1065 -509 421 927 593 -313 -970 -550 394 751 276 -523 -698 -255 590 900 128 -749 -782
2975 -782 -150 602 797 139 -728 -912 41 699 699 75 -780 -448 145 798 634 -413 -947 -766 298 742
$$ packed form
2836A64Q68m06q38q50K11J097Q82m37j099m36J91J087N49m30r76o00M33J212M73
2855A095p36r46m57O99J162K44q21r85m02J020Q71O0p83q92j7R33Q47j35r67p36
2875i46L28P47Q92j60j061q10L77J089N12n03q42o52L78J168M07m92j050l19O38
2894b99Q70L32m92r99m70Q63Q20J26o35q84N4P94P50Q1r46j026L15Q19Q13j94
2914F92q46p31J48J032N58m01r22m88N85P56M98l69r90n38N19R68L61m46q95l21
2934h30M05J144J30p56q14PP59O64J95q24q86o3P83P86o8p55o64L11O32P95k68
2955F83r56p92N56R30N06l34r06o57M20R44L57m75p99j75M43Q45L10p72q77l3
2975g82O32P52J95o58q67j84R53O58%o24q55L32N93O53j64j047n34J81J064M44
$$ plain form
2995 742 596 -318 -879 -491 446 884 381 -390 -754 -259 470 861 102 -652 -867 -107 873 652 135 -747
3015 -747 -641 -177 557 665 20 -794 -596 95 836 648 -427 -921 -467 194 856 543 -229 -740 -386 247
3035 247 719 405 -531 -795 -341 601 786 14 -584 -771 -296 683 710 153 -626 -654 -122 749 578 13 -757
3056 -757 -813 190 843 558 -156 -604 -676 238 803 551 -154 -776 -432 308 782 349 -473 -613 -298 500
3076 500 630 331 -451 -770 -264 540 686 163 -385 -685 -123 533 516 7 -580 -554 114 753 708 -242 -623
3097 -623 -579 77 609 511 -199 -572 -603 61 566 319 -315 -644 -382 418 712 206 -340 -684 -272 315 510
3118 510 197 -513 -688 -102 363 617 134 -577 -616 90 642 712 36 -920 -720 -42 642 430 -103 -613 -494
3139 -494 273 709 551 -91 -709 -448 333 851 316 -273 -737 -285 351 696 262 -209 -545 -50 475 573
$$ packed form
2995G42j46r14n61L88R37M38n03p71l64M95P29L91p59p54k15P60R80k21n17q82
3015g47J06M64P34J08o45q14J98O91P41j88j075m94M54O61O62l13p72n11L54O33
3035B47M72l14r36k64M54R42J85p72n98j87M75R79K7n57p79k8N32Q71j71n65p70
3056g57n6J003O53k85p14m48p2R14N65k52p05o22L44P40M74m33q22j40L15P98
3076E00J30k99p82l19N06Q04J46n23n48l00N62O56j7n09n87K6O68O39m5r50l81
3097f23M4O56N32r8p10l73l1O64N05k47o34l29K62Q00K94n06n46l44M12N87J95
3118E10l13p10j75N86M65K54m83p11l9P06N52P0o76r56K00O78O84k12n33n10J19
3139d94P67M36j58o42o18K61P81N18n35n89m64M52O36L45m34m71l36M95N25R8
$$ plain form
3159 573 60 -618 -647 -76 479 499 155 -505 -504 78 484 475 -55 -569 -410 402 735 440 -347 -742 -377 164
3181 164 585 245 -229 -768 -353 444 639 202 -372 -575 -80 371 595 70 -506 -501 -126 502 505 -75 -539
3202 -539 -494 98 483 415 -23 -587 -432 118 566 300 -266 -647 -362 165 604 366 -230 -575 -276 339 597
3223 597 167 -360 -580 -33 257 597 177 -391 -538 -133 491 434 193 -419 -504 -8 505 430 -10 -716 -470
3244 -470 101 454 352 -210 -687 -427 141 599 269 -192 -524 -275 181 510 354 -367 -520 -174 257 647
3264 647 210 -325 -628 -146 395 549 155 -581 -648 79 569 430 -93 -426 -320 149 536 359 -174 -473
3284 -473 -320 -39 537 277 -168 -574 -409 390 534 101 -389 -476 -246 262 552 288 -246 -459 -131 226
3304 226 416 86 -448 -484 -202 600 729 101 -380 -340 93 383 391 -89 -449 -410 200 426 388 -232 -564 -288
$$ packed form
3159E73n13o78k9N71N55K0l44o60JN82M06rn30n14J59Q12L33k95p87l95L65N41
3181A64M21l40m74n39M15P97J95m37n74k03M95M51K24n25n76NL75O28Ln80m64
3202e39M5N92L85o8m38n64J55N50M48k66n66l81K85N27M39k38n96l45K99O15K58
3223E97m30n27k20N47K90L40m20n68j47M05O24n7k41o12q5M96N13p5m40p06K46
3244d70N71L53j02n62m77K60N68M58l30m61l32K49M56L29j56p21j53L46M31L90
3264F47m37n35l03M82N41J54l94p36o7P27M90j39n23l33J06M69L87j77n33k99
3284d73J53K81N76k60m45m06J65P99J44m33m90q7K30N08K90k64n34k13L28L57
3304B26J90l30n34l6K82Q02J29o28m81M0M33K90Qm80l60L9O10K26l8o20l32K76
$$ plain form
3326 -288 301 533 334 -106 -559 -283 319 448 172 -188 -618 -204 336 496 17 -394 -590 -13 370 433
3346 433 90 -464 -416 -77 370 394 43 -438 -352 129 483 400 -142 -537 -314 94 420 409 -285 -573 -122 231
3368 231 324 145 -171 -495 -124 455 390 176 -437 -759 -266 359 459 68 -289 -452 -200 340 444 -90 -352
3389 -352 -372 197 499 393 -135 -398 -409 184 337 250 -187 -448 -166 142 464 217 -303 -425 -217 345 460
3410 460 184 -157 -460 -203 253 309 61 -344 -412 -30 449 329 -61 -363 -352 150 511 433 -25 -412 -382 108
3432 108 362 310 -57 -346 -264 320 554 350 -237 -418 -288 151 516 149 -236 -365 -313 235 314 102 -382
3453 -382 -434 -151 170 286 17 -462 -350 -6 237 180 21 -306 -290 -20 529 340 -78 -386 -182 149 395
3474 395 278 -289 -548 -130 339 488 140 -196 -491 -261 278 341 187 -259 -177 -2 347 294 115 -183 -307
$$ packed form
3326b88N89K32j99m40m53K76O02J29k76l60m30M14N40J60m79m11j96N77L83O3
3346D33l43n54M8L39M47K4l51m81Q6M81L54q3n42l95K23M08L26j1o94k88M51L53
3368B31R3j79l16l24L71N79o5k14o13l22M93O25J00l91l57j63K52N40J04n34k62
3389c52k0N69L02j06n28k63j1N93J53q7m37k61K82L08L22k47n20j22K08N62J15
3410D60k76l41l03K57M56N6k48m05o8L82M79j20l90l02J1N02L61p8m58l87L0M90
3432A08K54n2l67k89Q2N84K34k04n87j81J30M39L65l67l85j29N2N48P9k12m84
3453c82n2K83L21J16k69m79J12L44K43n7j59l27J6K70N49j89m18l08K04L31K46
3474C95j17n67k59M18M69J49l48l36k95K30N39O3j54m46Q2J75L49n3j79k98j24
$$ plain form
3495 -307 75 294 392 9 -287 -415 -11 375 303 -55 -278 -274 27 361 112 -309 -288 -38 287 586 153 -137
3517 -137 -421 -176 164 401 133 -259 -475 93 417 435 -84 -315 -328 9 508 307 23 -340 -342 178 132 444
3539 444 -55 -339 -240 74 377 304 -54 -315 -332 145 361 401 -125 -154 -144 281 308 42 -289 -399 -10 331
3561 331 369 11 -251 -644 14 475 405 -35 -289 -240 -42 254 252 -150 -284 -314 203 514 290 -73 -113 -300
3583 -300 99 333 248 -165 -256 -54 113 378 177 -189 -319 -54 224 406 4 -302 -263 -122 184 236 -21
3604 -21 -264 -166 90 469 271 -5 -343 -287 59 176 244 -79 -349 -172 -62 316 255 -175 -325 -89 175 461
3626 461 36 -216 -305 -96 217 456 99 -202 -258 -42 301 380 56 -312 -286 -79 293 335 79 -395 -300 -69
3648 -69 326 184 -90 -447 -100 -26 332 65 -215 -231 -86 49 317 125 -174 -357 -196 205 411 232 -179
$$ packed form
3495c07L82K19R8l83k96j28M04L86p2l58k23ML01L34k49m21K1K50L25K99m33k90
3517a37k84K45L40K37k68l92k16N68L24J8n19k31j3L37M99k01k84l63kN20m6L12
3539D44m99k84R9L14L03p3l58k61j7M77K16M0n26k9J0M25K7k66l31j10L89L41
3561C31L8l58k62l93O58M61p0m40k54M9J98K96km02j34l0N17L11k24l63m0j87
3583c00L99K34q5m13r1K02J67K65k01l66j30K65K78J82m02l06L9J41L06N2k57
3604b1k43R8K56L79j98k76l38N6L46J17O8l23k70J77J10L78o1m30j50K36K64K86
3626D61m25k52q9K09L13K39l57l01n6K16L43P9l24l68K6K07L72M2k56m74R5K31
3648f9L95j42k74l57L47P4L58k67k80j6J45J35K68j92k99j83J61M01K06j79m11
$$ plain form
3669 -179 -186 -133 165 171 -35 -239 -205 -28 250 257 -75 -238 -137 7 303 278 77 -330 -191 78 220 175 -52
3692 -52 -254 -343 70 382 187 -151 -200 -242 139 334 23 -124 -346 -143 291 164 198 -168 -323 -36 148 315
3714 315 0 -263 -262 167 64 233 -74 -204 -195 -88 207 144 -94 -277 -48 89 225 115 -161 -99 -213 289
3736 289 299 147 -46 -334 -73 215 232 55 -157 -380 -15 278 363 44 -333 -435 -45 178 85 39 -38 -225
3758 -225 -101 387 276 14 -338 -124 110 321 139 -100 -378 -172 64 299 249 -102 -204 -34 356 158
3778 158 5 -97 -263 -9 216 290 109 -213 -423 -125 198 117 144 -163 -179 76 275 269 91 -315 -345 121
3800 121 168 320 -47 -139 -104 174 271 148 -193 -352 -24 23 385 145 -65 -272 -155 149 230 48 -199 -36
3822 -36 2 25 316 -1 -202 -187 101 173 77 -134 -235 -188 -89 177 102 -194 -321 -123 114 266 96 -163 -359
$$ packed form
3669a79pN3K98Ok06k04L4J77K78Pl32j63J01J44K96k5k01m07J39K69J42m5k27
3692e2k02q9M13L12j95l38m9m2L81J95l11j47k22K03M34j27L4l66j55K87J84J67
3714C15l15k63JM29j03J69l07j30RJ07K95o3k38j83K29J37J36j10k76O2j14N02
3736B89J0j52j93k88K61K88J7j77k12k23L65K93Q5l19l77j02L90K23r3m6p7j87
3758b25J24M88j11k62l52K14K34K11j82k39k78K06K36K35n0l51j02J70L90j98
3778A58j53j02j66K54K25P4j81l22k10K98L23q1K7l07j6K55J99oj78m06l0M66
3800A21M7J52l67r2L5K78R7j23l41j59L28M7L62k40k10k07J17L04Q1j82k47J63
3822c6L8K3K91l17k01J5K88P2r6k11j01M7R9K66p5k96j27J98K37J52j70k59j96
$$ plain form
3845 -359 -281 109 261 202 7 -426 -241 88 225 100 -148 -189 -118 162 160 -30 -199 -261 -85 160 139 17 -194
3868 -194 -202 163 357 377 -187 -249 -156 8 289 173 -131 -71 -157 58 371 -65 -10 -198 -232 82 241 89 -48
3891 -48 16 34 110 255 62 -215 -252 46 194 427 -19 -117 -261 159 261 210 54 -263 -80 14 254 12 -117
3914 -117 -302 -229 -2 346 150 -310 -197 -230 162 186 60 -118 -353 -93 127 223 14 -213 -214 24 389 196
3936 196 142 -398 -306 14 103 132 -90 -215 -83 63 298 212 11 -272 -99 166 15 152 -89 -172 48 -35
3958 -35 218 126 -174 -295 -181 89 52 -25 35 -142 52 122 215 -25 -435 -306 -48 148 180 91 -184 -168 132
3981 132 372 49 -116 -158 -116 -45 217 244 -116 -232 -109 215 218 145 -228 -193 -135 79 222 49 -114 -253 95
4004 95 25 144 -17 -197 -126 14 66 36 32 -140 -245 41 124 168 -29 -205 -26 11 168 47 -235 -120 -275
$$ packed form
3845c59P8L90J52n9j95m33J85L29J37j25k48m1P1K80kj90j69o2J76K45k1j22k11
3868a94qL65J94K0n64o2R3J64K81j16l04O0q6K15L13m36N5j88l4L14J59j52j37
3891d8O4J8P6J45j93k77l7K98J48K33m46r8j44M20J02n1j56l17J83R4K40k42j29
3914a17j85P3K27L48j96m60J13l3L92K4j26j78k35K60K20R6k09k27jK38L65j93
3936A96n4n40R2L20Q9K9k22j25J32J46K35q6k01k83J73K65j51J37k41q3K20q3
3958c5K53r2l00j21J14K70l7p7O0j77J94P0R3k40m10J29K58J96L2q9k75J6L00
3981A32K40l23j65m2M2P1K62K7l60j16J23L24Lp3l73L5N8K14J43j73j63j39L48
4004I5p0J19j61j80P1J40N2l0mj72j05K86Q3M4j97j76J79L7J57j21k82J15j55
$$ plain form
4027 -275 124 223 178 -224 -123 63 -26 193 85 -158 -72 -23 176 83 30 -48 -356 1 317 238 0 -88 -243
4050 -243 -132 189 16 -114 -26 -187 48 260 218 -26 -115 -170 -83 147 150 -123 -67 -10 70 228 89 -83 -318
4073 -318 -83 163 29 113 -88 -62 73 41 217 62 -249 -216 -28 170 193 -35 -180 -213 79 311 194 49
4095 49 -100 -134 197 74 3 -77 -51 35 193 220 197 -151 -199 86 199 190 -8 54 -206 -79 63 238 99 -121
4119 -121 -31 84 257 332 -41 -151 -45 -125 303 242 73 -262 -269 15 285 123 -217 -435 -181 117 388 -9
4141 -9 -82 -212 47 97 262 149 -112 -227 -136 106 324 203 -230 -99 -9 170 162 25 -124 -91 -104 253 51
4164 51 45 -169 -26 44 136 217 -66 -39 -4 137 183 79 -105 -225 -105 57 194 2 -121 7 -65 206 87
4187 87 88 -236 -156 -147 148 76 42 -84 -196 -181 107 244 30 -78 -24 38 100 219 -17 -242 -146 45 119 60 -16
$$ packed form
4027b75L99R9m5m02J01J86q9K19j08k43Q6M9J99r3n3p8l08L57L16p9k38q8j55
4050b43J11L21j73j30Q8j61K35K12m2k44q9n5Q7K30Lk73N6N7Q0J58j39j72k35
4073c18K35K46j34Q4k01K6J35l2J76j55l11L3J88J98K3k28j45l3K92K32j17j45
4095D9j49l4L31j23p1q0K6Q6J58K7k3l48m8K85J13rj98O2k60J27J42J75j39k20
4119a21R0J15J73P5l73j10J06q0M28o1j69l35pK84K70j62l40k18K54K98K71l97
4141ip3j30K59N0J65j13k61j15R1K42K18j21m33J31R0J79qj37j49L3j3L57k02
4164E1ok14J43P0R2Q1k83K7L5J41M6j04j84j20J20J62J37j92j23J28p2K71j19
4187H7Jl24Q0RK95p2l4j26j12J5K88J37k14j08N4O2O2J19k36k25R6J91P4n9p6
$$ plain form
4212 -16 -227 -207 163 215 259 -134 -125 64 223 165 -80 -177 -273 12 150 177 -3 -176 -81 -90 172 38 80 -65 -106
4237 -106 38 28 80 -255 -78 -92 26 208 23 -62 -33 -65 188 145 57 -225 -341 -84 118 49 105 -25 -163
4260 -163 135 127 207 -63 8 -9 -16 158 122 9 -67 -240 0 224 63 -76 -18 -96 15 163 106 58 -161 46
4284 46 -46 240 -3 -14 -193 -64 119 138 47 -71 -359 -143 181 25 -59 -76 -208 2 260 230 104 -159 -144
4307 -144 25 42 168 -125 -138 -91 104 95 -107 -20 -121 -25 67 104 -34 -134 -149 80 66 176 47 -58 -196 -46
4331 -46 -108 81 53 -99 -75 73 57 64 -44 68 -153 2 75 87 61 -171 -90 -21 202 72 13 -58 -78 50 0
4356 0 88 -8 -169 -86 204 252 9 -89 -267 -20 5 33 64 15 -185 17 214 211 -1 -207 -27 -59 104 11 31
4381 31 -208 -147 119 255 58 6 -234 -54 85 68 -16 -12 -76 -110 -3 26 154 -150 -127 38 33 88 -86 -63 -83
$$ packed form
4212a6k11K0L70N2M4l93RJ89J59n8k45r7r6K85J38K7j80j73R5rK62j34M2j45m1
4237a06J44j0N2l35J77j4J18J82j85q5K9l2K53m3q8k82j16K57K02o9N6j30j38
4260a63K98qQ0k70P1j7pJ74l6j13p6j73K40K24j61j39N8p8J11J48n7m8k19K07
4284D6r2K86k43j1j79J29J83J9r1j18k88K16L24j56q4j7j32K10K58l0j26k63J5
4307a44J69J7J26k93j3M7J95rk02Q7j01R6R2L7j38j00j5K29j4J10j29j05j38J50
4331d6o2J89k8j52K4J48j6Pj08J12k21J55P3J2k6k32Q1O9K23j30n9p1k0J28n0
4356@Q8r6j61Q3K90M8k43r8j78K47K5K8L1m9k00K02J97lk12k06J80l2J63r3K0
4381C1k39O1K66J36j97n2k40J80J39j7q4Mo4l4J07K9J28l04K3J65nN5j74K3k0
$$ plain form
4406 -83 -79 90 93 6 -161 -163 44 31 204 -147 -142 -155 107 23 219 -50 -115 -110 8 56 176 59 -18 -101 165 100 34
4433 34 32 63 -109 -16 203 -67 61 -153 -19 108 119 95 -40 -174 53 122 128 6 -55 -72 -124 17 144 65 -81
4458 -81 -194 90 136 192 -30 -48 -65 22 97 34 -39 -37 -65 -50 15 -46 -137 22 -107 -17 93 -50 -91 25 98 -66
4484 -66 -7 25 -77 -46 -103 74 -96 9 -25 -133 2 232 86 -82 -152 74 36 230 153 -78 -113 -64 3 21
4508 21 -88 -32 -37 10 158 189 101 -93 33 45 14 -2 -195 -105 -173 13 74 -137 -113 -127 -46 -13 87 71 -37 22
4534 22 -62 23 64 5 -120 -57 -168 -29 -13 171 -74 -53 -113 139 196 -160 -183 -236 -10 -67 174 -10 13 -29 17
4559 17 184 -40 281 -25 -242 -156 25 22 25 -12 67 20 60 -11 -6 25 25 -80 52 174 -6 -10 -65 117 39 119 -19
4586 -19 -17 -149 26 166 -1 2 -174 -158 61 3 93 -87 129 146 106 -29 20 40 -121 -37 171 49 -116 5
$$ packed form
4406h3MJ69Lq7j67kK07j3J73l51Nj3K62q4J96k69o5NJ18M8J20j17p7q3K66o5o6
4433C4kL1j72R3K19k70J28k14J34J27J1k4j35j34K27O9Oj22o1j7n2J41J27p9j46
4458h1j13K84M6N6k22j8j7Q7P5o3p3Kk8J5O5o1r1J59j29R0J10j43m1J16P3j64
4484f6N9L2j02L1n7J77j70J05l4j08J35K30j46j68p0K26l8J94p7k31l5M9O7J8
4508B1j09N6nM7J48L1q8j94J26J2l1j6j93R0o8J86O1k11K4j4Q1L3J00j6j08N9
4534B2q4Q5M1n9j25O3j11J39J6J84k45K1o0K52N7l56k3n3K26n7K41j84K3m2M6
4559A7J67k24L21l06k17Q6J81lLl7P9m7M0p1NL1%j05J32J22j80mn5J82p8Q0j38
4586a9Kj32J75J40j67Lj76J6K19n8R0j80K16J7m0j35M9K0j61Q4K08j22j65J21
$$ plain form
4610 5 -43 -56 44 127 -61 -168 74 105 -162 -197 -21 -156 -116 90 80 135 -59 -178 -18 22 223 -215 33 92
4634 92 -90 175 -38 58 -279 -23 -64 162 35 16 -57 55 -64 143 -6 -30 -8 -36 -45 110 98 -157 -142 34
4658 34 -41 119 108 -62 -166 -206 45 65 74 -123 -106 157 188 27 -149 2 -108 -107 86 -72 -96 -58 44 -34 -54
4683 -54 104 -3 -315 26 39 -2 -15 -205 -113 35 154 168 64 -8 -42 26 -20 -1 196 0 -40 29 75 -72 114
4708 114 -134 -102 -120 0 209 -6 -12 -28 91 108 34 -7 -85 -200 -104 115 42 -73 -9 -174 -18 137 185 -127
4732 -127 -179 -13 -7 146 107 -139 -160 68 69 -89 -127 53 -69 -177 261 -96 91 -203 -204 125 70 -69 62 -36
4756 -36 -83 94 -20 -24 -126 -119 1 253 -108 -35 11 -49 -23 49 -6 131 52 -33 -6 149 -8 108 -122 -42 -44 -4
4782 -4 173 -17 -80 -115 26 -27 48 -110 68 55 -179 140 79 -62 34 -134 -121 233 64 23 90 111 7 225
$$ packed form
4610Em8j3J00Q3j88j07K42L1k67l5J76j35M0K06j0N5j94j19J60M0K01m38K48N9
4634I2j82K65k13R6l37K56m1K26j27j9p3J12j19K07j49k4K2k8rJ55j2k55J5J76
4658C4p5J60j1j70j04m0K51K0Rj97J7K63L1j61j76J51j10JJ93j58k4L8J02p8k0
4683e4J58j07l12L41J3m1j3j90R2J48J19J4j04p2l4O8m6J9J97j96m0O9M6j47J86
4708A14k48L2j8J20K09k15oj6J19J7p4m1p8j15R6K19p3j15O4j65J56J55M8l12
4732a27n2J66OJ53l9k46k1K28Jj58l8J80j22j08M38l57J87k94jL29n5j39J31r8
4756c6m7J77j14mj02PJ20K52l61P3M6o0K6P2n5J37p9q5K7J55j57J16k30Q0kM0
4782dJ77j90o3l5J41n3P5j58J78j3k34L19o1j41R6j68J3L54j69m1O7K1j04K18
$$ plain form
4806 225 -7 71 -164 -36 50 17 129 -49 5 -28 72 98 111 -61 -65 63 95 57 -165 -75 32 132 173 27
4830 27 -66 -136 56 140 28 224 43 51 95 68 121 -7 16 -63 -84 -75 118 -9 -2 -15 -66 73 -25 120 -83 -49 113
4857 113 -65 140 -42 -74 -75 -68 78 163 -43 -54 -46 148 121 -61 -182 72 0 135 -102 20 -85 40 18 -18
4881 -18 10 79 -122 -154 -21 127 90 73 -9 -77 -111 124 100 -77 1 -165 -56 -14 -83 -11 -23 -29 -44 266 223 -82
4907 -82 32 -81 180 46 144 -131 -148 -102 -189 24 69 39 -141 55 -83 59 -47 -116 -78 -38 110 81 84 -91
4931 -91 -147 130 175 173 96 -68 -95 -47 13 260 -101 53 95 -133 -206 40 -27 -45 63 -48 19 253 -109 -108 -63 7
4957 7 -21 180 -28 -83 7 119 71 -26 -34 -143 -41 211 -63 48 118 -29 187 82 -22 -154 -32 -25 132 -81
4981 -81 160 95 60 -6 55 67 9 -51 -55 -23 -124 89 91 -52 -151 -89 36 -20 26 -23 -11 -100 -115 -59 86 -51 118
$$ packed form
4806B25k32P8k35J28Q6l3J12j78N4l3J00K6J3j72mJ28L2l8k22R0J07J00M1j46
4830B7r3p0J92Q4j12J96j81QM4k7N3j28K3p9k1RJ93j27Pj3n1J39r8J45k03L4J62
4857A13j78K05j82l2jPJ46Q5k06j1QJ94k7j82j21K54p2J35k37J22j05J25k2l6
4881a8K8O9k01l2J33J48l7j7q2o8l4K35k4j77P8j66J09M2o9P2j2oj5L10m3l05
4907h2J14j13K61j34R8k75j7M6q7K13M5l0j80J96j38J42j06o9L8M0J48k9Lj75
4931i1n6K77M5kp7j64k7M8O0K47l61J54M2k28p3K46o7j8J08j11O7K34l62JM5P0
4957Gk8K01k08n5R0J12m8r7qj09J02K52k74J11P0j47K16j05j04j32J22PJ57k13
4981h1K41o5l5o6O1J2n8o0mL2j01K13Kj43r9O2J25n6M6m9J2q9j5N6J45j37J69
$$ plain form
5008 118 4 -80 -89 -61 55 96 40 -29 -8 37 -66 -36 41 -26 116 -103 9 41 -24 42 -132 47 1 -199 180
5033 180 -15 42 30 -74 -7 13 -45 -52 -285 40 -154 6 11 41 0 -128 33 111 213 14 -101 -34 162 69 23
5058 23 -196 -67 47 154 -84 -116 -51 -89 10 -153 154 23 105 -114 35 15 -50 123 -94 -137 70 179 -30
5081 -30 -79 -61 -8 -2 64 -38 9 -129 17 -82 60 119 -36 16 67 114 91 -107 -92 -125 4 52 42 84 -180 -9
5107 -9 -43 69 -46 -90 14 -253 -60 10 21 -34 61 -79 -39 -85 90 -2 -58 59 -57 101 -79 88 -28 15
5131 15 206 62 -61 117 -28 114 135 16 43 -74 -64 -103 141 -56 -41 -51 -58 -63 -37 50 -27 84 -111 -104 -25 34
5157 34 -64 -153 40 -120 -112 45 -84 -8 -80 -35 59 8 6 -107 51 0 -141 -10 -68 -89 -85 38 -39 110 25 -123
5183 -123 77 -56 21 -103 -33 41 -27 -66 -61 73 136 29 -100 26 -89 -136 -233 158 -151 3 61 53 -32 -53 57
$$ packed form
5008A18j14q4rK8J16M1n6o9K1M5j03L0P7o7J42k19J12L2o5O6j74J79m6k00L79
5033A80j95N7j2j04O7K0n8pk33L25j94J60NL0m1j28J61P8J02j99j15O7J96r3m6
5058B3k19J29J14J07k38l2O5l8R9j63L07j31Q2k19J49k0o5J73k17m3K07J09k09
5081c0m9J8N3OO6j02M7j38J46r9J42N9j55N2N1M7k3j98J5l3J29M8j0M2k64J71
5107il4J12j15m4J04k67J93P0J1n5R5j40M0m6J75r2n6J17j16J58j80J67j16M3
5131A5J91j44j23J78j45J42K1j19K7j17J0l9K44j97J5j0pnK6Q7p7J11j95PP9N9
5157C4r8q9J93j60QJ57j29P6p2M5R4n1kj13J58n1j41J31n8k1MJ23p7J49q5j48
5183a23K00j33P7j24P0P4o8l9NJ34O3j07j29J26j15m7r7L91l09J54N8qq5k1J10
$$ plain form
5208 57 74 107 -46 141 -33 -48 156 -6 -99 -18 37 -16 117 165 -145 40 -72 -30 56 -149 -214 -47 71 74 -7
5233 -7 61 40 -114 105 65 79 -132 -130 130 147 104 -123 7 -100 86 89 -23 -3 -73 -4 188 5 -1 161 -22 -50
5259 -50 56 69 35 -28 -38 33 -28 23 143 -166 23 -184 -1 -21 46 -172 -66 8 143 79 -65 -8 -99 -28 71
5284 71 -29 -39 -40 -61 -154 -18 31 61 63 -1 105 124 55 -21 -25 47 77 -60 136 -4 -101 38 -51 100 39 16 172
5311 172 -37 -45 -82 -44 -12 72 15 -9 106 21 15 -40 69 43 3 121 -101 -56 -8 66 75 -234 -5 -55 -155 -157 129
5338 129 -140 8 -10 13 -102 -48 -12 -138 28 212 -44 65 66 -55 -230 -42 63 40 -239 -63 31 -42 160
5361 160 -49 -87 109 4 -119 -6 -14 33 -1 8 -82 144 166 70 44 21 -62 79 -76 -13 -38 -17 64 111 36 30 -142
5388 -142 83 -44 24 57 -21 15 -50 19 66 -57 -60 -18 -57 29 119 -198 -91 87 40 157 -44 -139 39 -128 50
$$ packed form
5208E7J7L3j53J87j74j5K04j62r3Q1N5n3J33M8l10J85j12M2Q6k05o5J67J18Lq1
5233gO8k1j54K19m0J4k11KK60J7m3k27J30j07J86Lj12K0p0O9J92j83oJ62j83k8
5259e0J06J3l4o3j0P1o1N1J20l09J89k07J83k0O7k18J06P4J35o4j44N7r1P1R9
5284G1j00j0jk1r3J36M9L0Ko4J06J9o9p6mP2L0j37J96j40r7J39q9J51o1k3J56
5311A72k09ql7L8L2Q4n7k4J15q5on5J09k6m0J18k22M5M8P4Rl09K29n0j00kK86
5338A29k69J48j8K3j15N4L6j26J66J84k56J09Jj21j75J88J05k3k79J76R4p3K02
5361A60k09l8J96j05j23J13qM7l4Rr0K26K2r6k6k3q3J41j55O3k5K1Q1M7p5oj72
5388a42K25j27O8L3p8L6o5O9M7j23lM2l9Q6R0l17J07J78m7J17k01r5J78j67J78
$$ plain form
5413 50 117 122 -113 -38 -14 -142 64 -134 -80 -3 -19 -16 65 27 55 100 93 -86 134 -31 48 35 163 69 -137 -34 -43
5440 -43 -12 -19 38 93 -45 -20 63 -39 153 -34 0 -121 73 190 71 -67 -23 -93 31 -84 25 113 -154 -3
5464 -3 -29 92 80 59 -137 55 13 33 -51 37 -7 8 71 106 95 -44 45 5 -78 82 71 124 -67 -7 109 -3 -65
5491 -65 90 -188 -249 122 96 118 -148 15 -157 -92 -146 36 74 -22 22 -40 25 33 45 -110 -262 220 136 -76 28
5516 28 80 93 46 -13 29 -113 -106 -45 15 10 126 -32 -22 -98 93 -115 -164 27 55 69 57 51 -55 -55 -165 -5 110
5543 110 19 -30 -40 164 18 -14 -13 35 4 -29 113 56 -16 3 -4 78 236 1 -23 -65 86 -17 53 -109 47 -134
5569 -134 47 144 135 -103 135 -27 -178 52 63 60 15 37 -11 -25 25 37 -16 -95 -31 58 -81 49 -82 -81 -29 -7 24
5596 24 15 44 113 77 -27 -46 -13 66 -88 152 5 -205 31 65 59 72 -110 -92 -133 -47 -76 128 8 -169 -56 33
$$ packed form
5413E0O7Nk35P5K4j28K06j98N4P7j6LQ1l8K8M5pj79K20j65P9j3J28r4k06J03r
5440d3L1pN7N5j38K5Q3j02J92j87L4j21J94J17j19j38M4p0J24j15J09Q8k67J51
5464ck6J21j2k1j96J92m2K0q4Q8m4J5O3L5j1j39Q9m0q3J60j1N3j91O0J16j12o2
5491f5J55k78o1L71k6K2k66J63j72O5n4J82L8r6M4o2O5QJ2j55j52M82q4k12J04
5516B8N2J3m7n9M2j42PO1O0nJ16j58J0p6J91k08m9J91K8J4j2oj06%j10J60J15
5543A10r1m9j0K04j46l2JM8l1l3J42n7p2J9pQ2J58k35k4m2J51j03P0j62J56j81
5569a34J81R7rk38K38j62j51K30J1lm5K2m8j4N0J2n3p9O4Q9j39J30j31JN2K2L1
5596B4rK9O9l6j04j9L3P9j54K40j47k10K36L4oJ3j82J8m1Q6k9K04j20j77J13Q9
$$ plain form
5622 33 70 59 -51 -198 -122 -46 -153 13 31 87 -96 -130 129 75 52 -52 -106 85 120 -84 30 101 -14 120
5646 120 40 75 96 -55 25 -171 78 -112 4 -61 -122 15 48 5 -32 17 -99 -82 47 -31 -36 -143 -30 -80 -146
5671 -146 27 14 -35 100 127 5 21 -160 105 44 -67 75 71 -24 -5 -49 -78 62 -144 -47 -2 -36 44 -92 -84 11
5697 11 55 -73 89 85 -237 -131 -42 -51 183 -21 -21 -136 7 50 -36 3 22 71 -82 171 -65 189 -140 46 -9
5722 -9 86 -82 31 187 51 102 8 18 189 -50 -233 83 -237 -29 -89 -135 -68 34 55 -40 -88 129 32 -177
5746 -177 36 54 -39 19 8 18 -28 47 -66 -68 -134 -9 81 115 -62 -23 -3 0 -15 -1 92 -60 -7 -56 -75 -35 16 -1
5774 -1 11 -164 -130 8 15 32 -155 73 -216 -192 70 1 10 42 -70 -80 85 29 -8 -96 -216 -187 49 11 -7 -31 -8
5801 -8 -140 136 -16 89 -89 5 -16 -60 -26 136 -80 -109 -2 93 152 153 -41 42 68 21 32 43 -119 -66 -131 -58
$$ packed form
5622C3L7j1j10j47P6P6j07J66J8N6j83l4K59n4k3j04n4J91L5k04J14P1j15J34
5646A20q0L5K1j51Q0j96K49j90J16o5o1J37L3m3l7M9j16J7J29p8nj07J13n0o6
5671a46J73j3m9J35K7j22J6j81K65o1j11J42mr5J9m4k9J40k06R7M5l4Q0j36QR5
5697A1M4j28J62ml22J06Q9rK34k04%j15J43M3q6L9J9M9j53K53k36K54l29J86n5
5722iR5j68J13J56j36N1r4J0J71k39j83L16l20K08o0m6O7J02K1r5m8K17r7k09
5746a77K13J8r3N8j1J0m6P5j13ko6J25R0L4j77L9K0Lj5J4R3j52N3m9j9M0N1j7
5774aJ2j75L4J38PJ7j87K28k89K4K62o9RL2j12j0J65n6l7q8j20K9K36l8j8k4K3
5801hj32K76j52J05j78R4k1m4L4J62k16k9J07R5N9Jj94Q3K6m7J1J1j62N3o5P3
$$ plain form
5827 -58 -96 36 85 -28 96 48 158 -37 47 67 133 -92 -21 11 -55 -67 -147 45 16 4 -62 -7 40 148 13 85
5853 85 -71 -100 -34 107 62 -94 -8 41 18 -132 -95 -43 -96 56 -20 230 -68 -103 -59 -82 58 -101 -26 -174 2
5878 2 -64 167 89 -52 78 -28 -70 -1 29 -147 -67 -162 -86 -18 19 -164 53 -41 122 162 -24 129 62 -62 -18
5903 -18 72 -1 150 37 22 17 -9 17 -77 -192 -3 60 -88 38 184 -99 180 -14 -40 35 56 -149 15 149
5927 149 130 5 79 -55 -5 74 -54 80 32 -121 -112 -52 -116 -130 -214 60 -61 -41 -95 -42 -22 98 -67 -101 9
5952 9 13 -60 -158 15 -31 0 -67 174 -102 85 68 -53 18 114 -106 -86 52 -32 114 -46 119 277 -153 -117 -44
5977 -44 31 -74 25 60 -10 53 -18 -67 -4 -136 -171 -219 -111 -31 -21 -34 97 -10 27 -128 11 -64 -55 -49 -52 15 -237 76
6005 76 -3 -53 116 103 -34 -36 0 17 112 118 74 64 -124 2 92 -6 -101 13 -27 15 183 9 -106 140 -32 -158
$$ packed form
5827e8l8J32M9j13J24m8J10j95Q4K0O6k25P1L2o6j2q0J92k9j2o6N5M7J08j35P2
5853H5j56k9O6J41m5j56Q6M9k3j50L7N2n3J52p6K50k98l5M4k3J40j59P5j48J76
5878Bo6K31p8j41J30j06m2O9L0j76Q0r5P6O8L7j83K17r4J63M0j86J53o7j24M4
5903a8R0p3J51j13j5nk6K6r4j15J89O3j48J26J46k83K79j94k6P5K1k05J64J34
5927A49j9j25P4j34N0P9j28J34m8j53RO0o4j4q4K74j21K0n4N3K0J20j65l4J10
5952IMp3r8J73m6L1o7K41k76J87j7j21P1R6k20K0J38q4J46j60J65J58m30L6P3
5977d4P5j05R9L5p0O3p1m9O3j32l5m8J08Q0J0j3J31j07L7j55J39p5ROlO7k52L13
6005G6p9n0J69j3j37kL6J7R5Om4j0j88J26R0r8r5J14m0M2J68j74j15K46j72j26
$$ plain form
6031 -158 125 139 -61 -31 1 -38 94 11 -53 55 -1 162 120 -22 108 42 17 -142 54 -102 -97 -34 -104 84 238
6056 238 69 -46 2 -87 108 80 10 67 110 62 -76 40 -27 -38 6 27 54 -149 -92 -4 -42 29 120 -24 42 -230
6082 -230 13 -134 62 30 -11 -66 0 121 -97 54 55 -145 58 -1 -32 273 -8 -27 130 -129 59 29 11 44
6106 44 -112 17 30 -120 -221 120 -113 -23 178 -36 -6 118 53 -21 -234 41 -39 -82 -68 -24 -58 38 -99 83
6130 83 33 108 -141 6 -26 -12 -1 34 -172 -99 -7 -12 -146 -77 -104 26 97 -53 66 -118 30 -133 -117 20 46
6155 46 -55 -70 -131 -8 127 13 119 39 -57 -31 -73 131 -32 -70 -5 17 -95 14 51 -80 -40 58 0 -32 -89
6180 -89 125 -27 -27 92 -39 -59 40 2 -59 66 -20 30 -49 -52 -69 -87 48 89 -40 -22 -29 -25 -30 -25 22 -67 -62 8 -26 96
6210 96 -28 126 3 84 49 -16 -30 22 -2 53 -11 141 60 57 87 -57 -95 -69 198 -110 98 24 -77 -90 -200 -29
$$ packed form
6031a58K83J4k00L0L2l9J32q3o4J08n6J63m2j42J30o6k5j59J96j56NO3p0J88J54
6056B38j69j15M8q9J95k8p0N7M3m8j38J16o7j1M4K1K7k03N7Q8l8P1R1j44O6k72
6082b30K43j47J96l2m1n5O6J21k18J51Jk00K03n9l1L05k81j9J57k59J88l0j8L3
6106D4j56J29J3j50j01L41k33R0K01k14L0J24o5p4k13K75q0m3J4M4l4R6j37J82
6130H3n0P5k49J47l2J4J1L5k06P3R2nj34O9k7J30P1j50J19j84J48j63J6J37K6
6155D6j01j5o1J23J35j14J06q0r6K6m2K04j63l8O5K2j12J09L7j31M0R8n8l2n7
6180h9K14j52%J19j31k0R9l8o1J25q6N0p9lj7j8J35M1j29J8pMnNM7q9NP0l4J22
6210I6j24J54j23Q1l5o5j4N2k4N5o4J52q1lL0j44l8K6K67l08K08p4j01j3j10J71
$$ plain form
6236 -29 75 73 19 -62 -52 -141 85 -38 53 -104 34 -83 157 16 -75 151 -51 90 -40 99 68 27 -36 66
6260 66 0 35 106 -86 107 15 97 34 6 210 -31 31 -5 71 146 -30 -12 98 112 -132 56 -46 -75 185 4
6285 4 203 22 58 7 89 50 229 1 -17 10 -4 -200 -46 37 -28 4 41 57 92 11 -20 -218 107 61 -55 -45
6311 -45 -77 132 -53 -136 -117 -44 227 96 -44 -8 -19 16 5 30 -3 -3 -41 -16 -198 27 -77 -24 93 141 58 -84
6337 -84 84 -79 79 -98 205 31 -88 -122 -3 -61 -61 183 -125 87 -63 93 33 -14 171 -96 -34 120 -75
6360 -75 38 0 5 -13 85 -113 -141 -149 -206 -1 149 98 -123 -166 -111 9 -68 -71 30 -138 -104 33 80 78 54 -154 187
6387 187 173 88 -42 8 -93 -174 30 61 122 -137 -51 135 -86 64 -176 16 -22 0 183 74 26 -181 -95 25
6411 25 -172 -44 40 110 75 -25 13 -43 -3 0 22 59 -104 95 111 -84 199 47 119 -15 -145 -49 15 59 97 89
$$ packed form
6236b9J04kn4q1J0q9K26j23R1j57J38j17K40j41r1K26k02J41j30J39l1m1o3J02
6260F6o6L5P1j92J93r2Q2o3k8K04k41O2l6P6P5j76J8J10J4k44J88j02k9K60j81
6285DJ99j81L6n1Q2l9J79k28j8K7j4j96J54Q3o5L2L7J6L5q1l1j98L25m6j16J0
6311d5l2K09j85q3J9P3K71j31j40L6j1L5j1K5l3%l8K5j82K25j04N3J17M8q3j42
6337h4J68j63J58j77L03j74j19l4J19n8%K44l08K12j50J56o0m7J85k67O2J54j95
6360g5J13l8Nj8R8j98k8qn7K05J50n1k21m3N5J20p7lJ01j68L4J37M7kk4k08L41
6387A87j4q5j30N0j01q1K04L1O1k59Q6J86k21J50k40J92l8K2J83j09m8k07Q6J20
6411B5j97J28Q4P0l5j00L8n6M0LK2L7j63J99J6j95K83j52P2j34j30R6O4M4L8q
$$ plain form
6437 89 130 -93 78 130 70 -54 -102 47 -33 -128 182 120 -131 -190 76 21 25 8 17 233 -38 1 -120 -54 66 22
6463 22 28 -43 3 10 153 139 -10 75 70 34 -131 -69 -29 215 136 165 -17 -10 -137 94 -39 -72 91 34 -82 -23 -32 -117
6491 -117 57 -23 87 -93 -29 -30 97 89 20 -41 -74 -5 122 133 -180 -10 28 -88 -23 -27 -133 -44 -33 132 66 -62
6517 -62 -54 48 -53 -36 56 21 114 8 -54 -194 21 -24 -41 52 38 -112 -71 51 90 46 53 -1 -99 -23 -173 -1 43
6544 43 105 62 26 -101 31 -79 150 117 -10 93 16 -94 148 30 -116 -83 1 -70 8 -23 64 121 -59 -91 45
6569 45 -79 -94 11 56 -129 -95 9 -75 -153 53 -75 -129 -17 -83 43 123 -129 -6 39 -27 -98 -6 57 38 134
6594 134 118 106 237 69 -36 -5 44 53 19 16 61 145 -129 46 -118 12 46 -37 96 64 -11 -104 0 34 195 -28
6620 -28 74 33 -80 -113 246 96 -67 6 -65 -17 -149 -59 -35 134 183 53 -129 -9 78 -114 -32 -25 -48 95 -127
$$ packed form
6437H9M1k23J71N2o0j24m8J49q0r5L10o2k51n9K66n5Mj7RK16k71L9j21O6J20m4
6463B2Op1M6PJ43j4j49Q5nl6j65O2M0K44p9K9j82Pj27K31j33l3J63n7j16N9rq5
6491a17J74q0J10j80O4jJ27qo9o1l3O9J27J1l13J70L8j16O5mj06Q9J1J65o6j28
6517f2QJ02j01J7R2l5R3j06o2j40K15m5j7R3j4j50M1J22L9m4Pn4r8P6j50J72M4
6544D3O2m3l6j27J32j10K29l3j27J03p7j10K42j18j46L3Q4p1P8l1Q7N7j80l2J36
6569D5j24j5J05M5j85L4J04q4p8K06j28n4J12o6J26Q0k52J23M5o6p1R2O3j9R6
6594A34j6j2J31j68j05L1M9Rl4lM5Q4k74J75j64J30L4q3J33l2p5r3J04L4J61k23
6620b8J02m1j13l3L59j50j63P3p1M8j32R0K4J69M9j30j82J20Q7j92Q2Pk3J43k22
$$ plain form
6645 -127 90 80 2 -59 -26 70 18 -26 114 48 -156 9 185 119 90 -19 -106 56 -34 32 12 -81 -10 -109 74 -58
6671 -58 100 -50 -120 15 6 109 54 -228 18 -28 -7 -86 178 -53 93 -144 10 -66 -84 -26 -14 32 -136 52
6695 52 -181 81 -85 -40 -18 -59 29 52 -44 -5 94 -54 -23 114 -2 -59 -77 49 104 9 -69 -6 167 -51 -53 7
6721 7 62 23 34 80 -99 -13 121 -47 -82 224 -64 13 119 -63 -119 81 24 89 7 25 -138 149 -21 73 70 185
6747 185 11 -114 18 -14 16 0 -40 46 37 14 -121 35 -5 77 160 3 -87 9 -5 -20 90 -26 37 12 106 0
6773 0 87 -77 -23 17 13 -54 56 -5 -34 -86 15 -92 39 -142 -106 -109 -41 46 -178 -11 62 76 -122 -116 -125 260 -20
6800 -20 -66 -32 164 44 -33 -158 -59 -37 -23 20 76 -14 -97 67 67 9 178 143 43 -1 6 70 -65 -28 -43 -180 -35
6827 -35 -125 88 31 2 104 33 -50 -24 -11 -30 63 96 -3 134 103 -99 35 77 78 17 72 1 48 -127 24 83 -11
$$ packed form
6645a27K17j0p8o1L3R6n2m4J40o6k04J65J76o6k9j09q7J62r0O6k0r3P1r9J83j32
6671e8J58j50p0J35rJ03n5k82K46m6K1p9K64k31J46k37J54p6j8N8J2M6j68J88
6695E2k33K62j66M5K2m1Q8K3r6L9R9j48L1J37j16n7j8J26N5r5p8O3J73k18kO0
6721GN5l9J1M6j79Q6J34j68l5L06k88P7J06j82n6K00n7O5q2J8j63K87j70R4lJ15
6747A85j74j25J32l2L0j6m0Q6rk3j35J56m0Q2Q3j57r0R6j4j5J10j16O3k5R4j06
6773@Q7j64N4M0mo7J10o1k9n2J01j07J31j81L6lO8Q7k24J67P3J4j98OrL85k80
6800b0m6L4J96j20p7j25R9K2J4M3N6r0q3J64%n8J69l5j00m4PO4j35L7j5j37J45
6827c5r0K13n7k9J02p1q3K6J3j9R3L3r9J37l1k02J34M2Jo1N5p1M7j75J51N9r4
$$ plain form
6854 -11 142 -14 4 -77 -99 -93 124 -46 -9 58 21 -4 15 -12 -44 -82 -219 -92 77 -116 1 -44 -15 28 10 -101
6880 -101 10 74 66 49 50 0 30 -30 68 170 28 -80 223 -57 -146 -31 -52 -88 -29 -5 47 -7 0 -29 -6 93 32 -24
6908 -24 -55 33 -27 -57 41 -179 141 146 19 6 -46 20 187 -162 -50 -54 -98 -127 -130 -143 28 -138 -80 -61 110 15 -14
6935 -14 -126 -38 109 93 52 11 -28 99 108 -18 60 -12 -63 33 -8 -15 -61 45 9 26 -10 9 34 -108 53 -62 -127
6962 -127 -35 -155 -100 259 91 59 -76 -44 -56 -75 -3 -285 -70 25 -47 -105 19 45 12 -206 -64 39 -48 34 -105
6987 -105 -123 77 -82 59 76 -86 40 -103 37 -4 -24 9 -89 117 -104 -164 37 -19 -76 62 48 23 -114 -71
7011 -71 34 -7 -97 135 35 -48 44 -12 -94 -106 51 43 -139 -15 -23 45 8 -3 -94 49 1 125 139 111 16 -66 9
7038 9 93 18 -156 -91 -13 -95 215 25 43 24 -1 -42 -48 -45 -133 -198 165 175 33 1 61 83 -97 51 45 -7 -32 -40 -83
$$ packed form
6854a1J53j56J8q1k2OK17j70L7O7l7k5J9k7l2l8j37J27J69j93J17m5K9M3j8j11
6880a01J11O4qj7Jn0L0o0R8J02j42j08L03k80q9J15k1l6N9K4N2n4Pk9K3R9o1n6
6908b4l1Q8o0l0R8k20L20Nj27j3n2O6J67l49J12mm4k9lj3J71j66N8J9J71r5k9
6935a4j12Q8J47j6m1m1l9J27Rj26P8p2n1R6m1pm6J06l6J7l6J9K5j42J61j15o5
6962a27R2j20N5L59j68l2j35L2j2j9P2k82K15R5p2n8J24K6l3k18J42J03q7Q2j39
6987a05j8K00j59J41J7j62J26j43J40m1k0L3r8K06k21o0K01n6n7J38j4k5j37M3
7011g1J05m1r0K32j00q3R2n6q2j2J57qj82J24qO8l7j1r1J43m8J24J4k8r5q2P5
7038IQ4p5j74O5P8q2L10j90J8j9k5m1oLq8o5L63J0j42l2O0K2j80J48on2k5qm3
$$ plain form
7067 -83 -111 41 -51 24 -57 -38 -28 45 -35 73 25 -102 -140 -197 -63 -108 -54 104 -78 156 164 -130 128 -83 63
7092 63 -46 26 -57 -144 172 29 -7 29 -24 132 -18 -34 -84 134 12 60 116 -48 34 50 -86 -43 -26 104 98 -69
7118 -69 -52 -8 -12 101 60 134 76 117 -97 -82 4 -14 3 81 -12 10 -76 -113 -152 -45 10 54 51 -37 -88 -63 -66 142 -62
7147 -62 -27 126 -202 -23 -101 -40 56 -103 63 1 -50 -64 -24 117 17 31 83 -95 79 144 -148 -37 34 161
7171 161 52 -2 85 -35 16 4 -54 92 65 -17 -12 137 -141 66 16 48 -81 2 57 70 -23 -155 -5 -25 56 -29
7197 -29 -107 -53 51 -46 58 30 -16 -30 -177 -2 96 0 -130 -28 -40 52 64 37 -73 28 -9 7 -136 -49 -78 47
7223 47 85 156 62 152 -74 -30 -64 -69 97 -88 -44 33 -113 27 -27 -103 15 26 7 -81 -17 -58 -158 46 21 -54 -103
7250 -103 -65 9 -30 120 -14 55 103 19 -33 73 -61 -73 105 -12 174 61 26 -142 -207 23 66 -149 -27 -13
$$ packed form
7067h3k8J52r2P5q1J9J0P3q0J08m8j27l8n7J34m5N4J58j82K34Qk94K58k11J46
7092F3j09P2q3q7L16j43l6L6n3J56j50j6n0K18j22M8N6j64Q2J6j36M3J7J30oj67
7118f9J7M4mJ13m1P4n8M1k14J5Q6j8J7P8r3K2q6l7l9J07N5M4lq8n1K5lK08k04
7147f2L5J53l28J79p8O1R6j59J66o2n1j4M0J41j00J4N2j78J74O5k92J11P1J27
7171A61j09n4Q7j20N1j2n8J46k7q2NJ49k78K07n0L2j29Q3N5J3r3j32J50k0Q1q5
7197b9p8N4J04r7J04k8m6j4j47J75R8r6j30J02j2R2J2k7j10J01l7J6j43Q7k9J25
7223D7L8P1r4R0k26M4l4nJ66j85M4P7j46J40n4p6J18J1j9q8O4m1j00K04k5p5m9
7250a03L8P4l9J50j34O9M8q4n2J06j34j2J78j17J86j13l5j68o5K30M3k15J22J4
$$ plain form
7274 -13 -9 60 -82 86 -40 67 113 141 55 159 -48 -169 -16 -68 -85 41 55 -21 2 -89 -52 -37 -167 145 -154
7299 -154 -176 56 -123 -9 -185 183 -2 -104 -9 79 -289 145 -15 -40 -39 -142 -46 -21 55 -75 78 -15 -29 -55
7323 -55 -140 180 66 -36 -66 -21 100 69 -94 202 137 45 38 -23 140 -2 32 -78 -78 -180 -30 54 -146 1 68
7348 68 -151 121 -67 -83 106 -156 -14 -12 -55 -105 -54 -21 -24 180 10 -8 45 25 8 67 58 245 1 123 13 42
7374 42 -40 8 137 79 -116 150 58 30 -114 44 -32 -15 -59 -18 -50 -46 52 104 54 80 -53 96 139 -100 48 -72
7400 -72 -31 -43 122 -126 -72 21 -3 84 -5 26 -133 -173 18 -9 -24 60 104 -24 104 193 7 152 107 62 103 -103
7426 -103 -103 29 38 89 -108 -86 31 68 -76 -194 -12 10 -42 -138 -44 20 -15 -56 13 27 -104 171 144 -96 -108 -57
7452 -57 44 -19 60 -207 97 185 18 32 -67 218 -47 -29 -35 52 -9 176 8 -89 -32 17 119 -49 -12 -64 38
$$ packed form
7274a3MO9j42J68j26J07M6K8q6J04k07j21J53n2j7J26J4p6K3r1L7J5j30L12k99
7299a54k2K32j79J14j76L68j85j02R5Q8l68M34j60k5Jj03R6K5P6j30J53r3j4k6
7323e5q5L20j14j02l0M5J21l1j63K96o5r2po1J63j42L4j10%j02J50Q4k00J47O7
7348F8k19K72j88j6J89k62J42Km3n0N1L3lK04j70j8N3k0j7N9rJ87k44J22j10K9
7374D2q2M8J29n8j95K66r2k8j44J58p6J7m4M1l2MR8N2n0K6j33J49M3k39J48j20
7400g2M1j2J65k48N4R3k4Q7q9L1j59m0J91k7j5Q4M4j28J28Q9j86J45m5m5M1k06
7426a03%J32RN1j97K2J17L7j44j18J82K2n2r6R4O4l5m1O9J4j31K75k7k40j2N1
7452e7J01o3P9k67L04Q8j67J4r9K85k65J8oQ7o1J85j68r7N7M9J02j68L7n2J02
$$ plain form
7477 38 87 60 37 18 -18 -1 -78 -139 -50 -106 -220 -106 -73 -83 44 -22 231 -73 -94 -55 112 -64 -88 -112 -69 -107 -17
7504 -17 144 147 2 -101 -40 -36 -69 156 17 113 50 -92 -159 53 62 3 -40 -95 -80 136 207 60 86 -79 -239 -2
7530 -2 38 -18 -102 56 -95 -46 -97 119 -17 -133 186 1 44 -166 32 -196 -15 -155 192 108 114 81 -17 14 22
7555 22 114 -51 -93 -45 -40 22 75 34 -245 28 76 -119 73 4 -150 9 156 -108 54 -47 36 0 6 72 -143
7580 -143 7 -14 44 80 58 60 -95 43 113 -48 -34 -173 38 134 82 15 15 -125 113 -141 72 67 32 14 -157 62
7606 62 -79 -28 23 -232 57 75 -91 -43 -30 43 -71 14 94 3 91 -40 1 -92 91 -24 -3 -37 17 3 -225 -50
7632 -50 68 -38 -64 -65 31 -70 -18 -115 100 91 -21 -189 -48 -13 6 -216 -34 -8 74 87 -197 32 25 40 128 60
7658 60 -178 34 -31 24 117 -132 34 98 -30 -5 -13 -66 -89 -74 -46 46 -33 7 15 75 65 -65 49 86 -79 59 -148
$$ packed form
7477C8M9k7k3j9l6J7p7o1Q9n6j14J14L3j0J27o6K53l04k1L9J67j76k4k4M3l8R0
7504a7J61Lj45j03O1Ml3K25j39R6o3j42o7K12Rn9m3n5J5K16P1j47K6j65j60K37
7530bM0n6q4J58j51M9n1K16j36j16L19j85M3k10J98k28J81j40L47q4Ol3r8L1Q
7555B2R2j65m2M8NO2N3m1k79K73M8j95J92o9j54J59J47k64J62j01Q3l6OO6k15
7580a43J50k1N8L6k2Kj55J38P0j61J4j39K11R6n2o7%j40K38k54K13nl5j8j71K19
7606F2j41N1N1k55K89J8j66M8J3P3j14Q5Q0r1Q8j31M1r3J83j15K1l4N4j4k28J75
7632e0J18j06k6jR6j01N2r7K15rj12j68J41L5J9k22J82K6Q2J3k84K29pJ5Q8o8
7658F0k38K12o5N5R3k49J66O4j28K5qn3k3J5K8R2p9M0QO0j0j30J14L7j65J38k07
$$ plain form
7685 -148 -29 -19 -56 79 71 -26 -137 -35 -60 -122 55 35 68 -18 0 -4 -10 37 40 104 -10 86 21 43 84 85 -54 37 -50
7714 -50 -152 44 -125 -13 134 -185 -23 55 144 28 -46 -149 85 -114 26 24 -45 48 -28 -21 -7 -1 59 55 -98 86
7740 86 129 -38 95 -197 -145 -23 185 -78 -59 -145 -191 2 -84 -14 52 -119 -5 -79 -30 -43 59 10 142 -13
7764 -13 -9 33 -32 8 -67 -49 -110 56 76 -56 20 47 37 -69 35 50 61 69 186 -129 -57 -96 70 144 -118 -82 39
7791 39 6 -24 54 13 -149 90 12 -62 82 -81 42 16 -119 110 134 -42 -15 8 -106 -71 -1 16 -206 -144 -32
7816 -32 -151 72 24 -102 -141 -14 54 28 118 -112 -84 45 -169 -101 71 -81 173 56 -17 -64 133 -51 37 98
7840 98 -47 143 -38 28 65 4 113 -35 6 -47 -67 35 -27 -106 -100 62 3 95 -80 52 15 -55 107 -55 13
7865 13 -94 57 87 -12 24 20 92 42 163 22 -2 -74 -191 -179 87 125 -100 150 -19 -66 50 -27 14 -11 -107 -108
$$ packed form
7685a48J19J0l7J35qr7j11J02k5o2J77k0L3q6J8moM7LO4j14R6o5K2M1Jj39R1q7
7714e0j02J96j69J12J47l19J62P8Q9j16p4j03K34j99J40ko9R3p6PJ4OO0mj53J84
7740H6M3j67J33k92N2J22K08k63J9q6m6J93q6P0O6j71J14p4M9j3J02m9J32j55
7764a3MM2o5M0p5J8o1J66K0j32P6K7j0j06J04J5J1QJ17l15P2l9J66P4k62L6J21
7791C9l3l0P8m1j62K39p8p4J44j63J23k6j35K29K4j76K7K3j14L5P0J7k22O2J12
7816c2j19K23m8j26l9J27O8k6R0k30K8J29k14O8J72j52K54j17p3m7J97j84Q8O1
7840I8j45J90j81O6L7o1J09j48M1n3k0J02o2p9OJ62n9R2j75J32l7p0J62j62O8
7865A3j07J51L0r9L6mP2n0J21j41k4p2j17J2K66L8k25K50j69m7J16p7M1k5r6j
$$ plain form
7891 -108 -212 -62 49 5 44 77 -282 -19 96 -39 97 -69 66 -154 50 138 -59 103 -5 -41 -35 311
7913 311 -163 -100 15 55 -90 23 -274 58 67 -78 120 -90 -6 34 -147 -81 87 -127 28 -140 -28 -112 100
7936 100 33 -115 -128 -63 -52 62 19 80 -13 -99 -66 75 33 -214 159 -131 -29 -69 92 164 117 -146 -25 -102 67
7961 67 58 -145 86 35 -37 45 157 35 56 49 30 122 47 -88 46 -11 123 45 130 -68 -188 6 33 61 98 16
7987 16 -15 -60 77 91 -149 -2 80 -26 -3 100 -88 -103 -35 170 52 -66 78 109 -30 24 -5 35 16 -9 -19
8012 -19 91 -71 -13 71 87 -59 -80 -14 95 73 74 -175 16 51 -204 157 -162 114 81 -47 83 150 128 96 15
8037 15 71 26 52 74 11 47 -64 73 75 19 -87 -49 -93 66 -61 -38 36 16 -87 9 -114 47 64 -44 23 133
8063 133 62 -89 37 -12 -62 113 33 15 220 48 -8 -121 -5 -132 195 -4 117 -97 -86 -54 11 -87 63
$$ packed form
7891a08j04J50J11m4L9L3l59K63J15j35J36j66J35k20K04Q8j97J62j08l6OL46
7913C11m74O3J15M0j45J13k97L32Rj45J98k10Q4M0j81O6J68k14J55j68J12q4K12
7936A00o7j48j3O5J1J14m3O1r3q6L3J41m2k47L73k90J02m0J61P2m7k63J21p7J69
7961F7rk03K31n1p2Q2J12j22K1pj9R2p5j35J34n7J34p8Q5j98j20J94K7K8L7q2
7987A6l1m5J37J4k40J47Q2j06K3J03j88j5O8K05j18j18J44L1j39N4k9M0j9k5j0
8012a9J10j62N8Q4J6j46k1O6J09k2Jk49J91L5k55L61l19K76l3j28J30O7k2l2q1
8037A5N6m5K6K2o3L6j11J37Kn6j06L8m4J59j27K3P4k0j03R6j23J61J7j08O7J10
8063A33p1j51J26m9n0J75q0j8K05j72n6j13J16j27L27j99J21k14J1L2O5r8J50
$$ plain form
8086 63 17 -43 17 -142 62 86 148 -153 7 135 -122 85 47 -73 180 -41 29 -137 -92 12 160 -38 -10
8109 -10 80 -18 -68 -192 -123 -36 -75 190 97 105 166 3 -143 144 -63 -33 90 17 17 -52 124 115 69 -79 -12 -1 57
8136 57 11 74 -200 -47 -41 43 56 -21 -16 67 30 -128 102 97 85 -79 -11 -37 18 2 90 -103 -128 96 -2 103 -36
8163 -36 134 42 -295 55 56 -4 -18 54 -59 8 111 99 94 53 -17 -44 -94 -56 139 108 -93 -18 39 -39 21 25 23 -44
$$ packed form
8086F3m6o0O0j59K04K4O2l01J60J28k57K07l8j20K53k21P0j66M5J04J48j98K8
8109a0R0r8n0j24O9Q7l9K65r3QO1j63j46K87k07L0J23p3%o9J76rm6j48O7J1N8
8136E7m6O3k74J53OQ4J3p7NQ3l7j58K30nj2j64O8k6N5j6Q8j93k5K24r8J05j39
8163c6J70r2l37L50Jo0j4P2j13O7J03j2nm1p0k7n0L8J95l1k01P5N7p8O0Mko7
8191d4
$$ Imaginary data points
##PAGE= N=2
##DATA TABLE= (X++(I..I)), XYDATA
$$ plain form
0 0 0 0 0 0 0 0 0 0 0 -8 8 -8 16 -16 24 -24 36 -45 51 -64 77 -92 112 -128 152 -176 205 -240 273 -315 360
31 360 -410 468 -527 597 -672 753 -845 943 -1052 1173 -1301 1446 -1602 1770 -1957 2158
47 2158 -2380 2623 -2891 3185 -3507 3869 -4267 4714 -5221 5796 -6457 7224 -8131 9218
61 9218 -10558 12242 -14445 17460 -21866 28934 -42164 75638 -351773 -459563 321113 651265
73 651265 685771 327272 -2227 -278160 -378085 -430491 -349203 -140668 253133 588208 654071
84 654071 297168 -255281 -657392 -623765 -245427 216654 446212 393198 188133 19322
94 19322 -91074 -198334 -328232 -339983 -140323 209738 483337 473588 152957 -258142 -483969
105 -483969 -375331 -56353 209560 268039 177471 81557 44362 -9364 -133102 -264435 -275102
$$ packed form
0@%%%%%%%%%qJ6j6K4l2M0m8O0q1R6j15J41j69K04k40K80l28L81m45N13n88O75
31C60p70Q78r95J124j269J425j598J788j995K225k474K747l048L372l727M115
47B158m538N003n514O076o692P376q136Q981r935J1017j2253J3681j5355J7349
61I218j9776K2800k6687L1905l9326N0800p1098J17802m27411j07790P80676L30152
73F51265L4506l58499l29499k75933r9925n2406Q1288K08535L93801L35075O5863
84F54071l56903n52449m02111L3627L78338M62081K29558n3014k05065j68811
94A9322j10396j07260j29898j1751J99660L50061K73599r749l20631m11099k25827
105d83969J08638L18978K65913N8479r0568r5914l7195n3726j23738j31333j0667
$$ plain form
116 -275102 -87981 211133 396532 311625 12278 -268506 -326598 -168097 42146 150293
126 150293 123231 59104 51045 76623 45890 -87951 -232122 -222106 -24758 209263 287167
137 287167 147327 -81290 -215646 -175169 -22499 91927 79117 4259 -15826 49589 108497
148 108497 53748 -90837 -190030 -139621 36672 189311 182561 28273 -132333 -156583 -40063
159 -40063 76554 80669 -2864 -65727 -32776 56844 97424 32454 -90868 -145035 -54713 99937
171 99937 168760 83874 -72315 -145578 -78950 43865 103135 48629 -51265 -84128 -17732 73249
183 73249 80057 -16105 -107389 -89794 25261 130905 120981 -401 -119725 -127757 -18873 95484
195 95484 99570 5849 -74593 -58226 28071 76490 28980 -63611 -107032 -44184 76594 136197
$$ packed form
116b75102J87121K99114J85399q4907k99347k80784n8092J58501K10243J08147
126A50293k7062o4127q059K5578l0733j33841j44171J0016J97348K34021P7904
137B87167j39840k28617j34356M0477J52670J14426j2810p4858k0085O5415N8908
148A08497n4749j44585r9193N0409J76293J52639o750j54288j60606k4250J16520
159d0063J16617M115q3533o2863L2951Q9620M0580o4970j23322n4167R0322J54650
171I9937O8823q4886j56189p3263O6628J22815N9270n4506r9894l2863O6396R0981
183G3249O808r6162r1284J7595J15055J05644r924j21382j19324q032J08884J14357
195I5484M086r3721q0442J6367Q6297M8419m7510r2591m3421O2848J20778N9603
$$ plain form
207 136197 70772 -62451 -134684 -76300 42027 101461 58323 -31290 -67409 -14547 59896
218 59896 66308 -16011 -105167 -96230 11990 115279 115152 11136 -94189 -107171 -28495 64023
230 64023 79278 8154 -60586 -44940 38493 91491 41678 -62754 -114809 -61992 50358 117143
242 117143 75666 -29165 -98832 -69395 22519 71449 30343 -45128 -66010 -2762 78277 89056
254 89056 11986 -85986 -107880 -25113 77330 98323 24473 -63172 -73341 -6955 57368 53420
266 53420 -15229 -75754 -57725 26549 95072 71848 -27068 -98305 -71035 20064 83073 58819
278 58819 -20163 -67981 -37749 38621 76689 27318 -57787 -88378 -31873 56742 86154 29786
290 29786 -51024 -79684 -27698 51797 73189 14768 -59447 -65965 6538 75403 66102 -8858
$$ packed form
207A36197o5425j33223p2233N8384J18327N9434m3138q9613l6119N2862P4443
218E9896O412q2319q9156Q937J08220J03289j27j04016j05325j2982P8676R2518
230F4023J5255p1124o8740J5646Q3433N2998m9813j04432n2055N2817J12350O6785
242A17143m1477j04831o9667K9437R1914M8930m1106p5471k0882O3248Q1039J0779
254H9056p7070r7972k1894Q2767J02443K0993p3850q7645j0169O6386O4323l948
266E3420o8649o0525J8029Q4274O8523k3224r8916p1237K7270R1099O3009k4254
278E8819p8982m7818L0232P6370L8068m9371q5105l0591N6505Q8615K9412n6368
290B9786q0810k8660N1986P9495K1392n8421p4215o518P2503O8865r301p4960
$$ plain form
302 -8858 -76286 -70125 2507 67770 63897 -5618 -67991 -52829 20236 69910 41710 -35767 -77969
315 -77969 -39625 38959 83321 47839 -34625 -78008 -40286 35698 68347 23420 -44371 -59981
327 -59981 -10227 54519 65478 6114 -64996 -77025 -13779 64165 74762 11011 -55334 -58310
339 -58310 838 54212 44826 -13525 -60248 -42573 28111 76522 49318 -29083 -81193 -54889
351 -54889 19374 65781 44988 -18880 -58083 -30567 31373 59122 19410 -48121 -65233 -10650
363 -10650 58183 73012 18433 -51893 -70567 -24641 40898 60271 13173 -44488 -48177 3816
375 3816 54333 44145 -17163 -64557 -50043 15716 69504 56340 -10018 -63433 -50582 13313
387 13313 56711 35803 -19833 -51149 -24972 31508 56906 22276 -41939 -70297 -27650 42387
$$ packed form
302h858o7428O161P2632O5263l873o9515o2373J5162P3065M9674k8200p7477m2202
315g7969L8344P8584M4362l5482q2464m3383L7722P5984L2649m4927o7791j5610
327e9981M9754O4746J0959n9364p1110j2029O3246P7944J0597o3751o6345k976
339e8310N9148N3374r386n8351m6723J7675P0684M8411k7204p8401n2110K6304
351e4889P4263M6407k0793o3868l9203K7516O1940K7749l9712o7531j7112N4583
363a0650O8833J4829n4579p0326j8674M5926O5539J9373m7098n7661l689N1993
375C816N0517j0188o1308m7394J4514O5759N3788j3164o6358n3415J2851O3895
387A3313M3398k0908n5636l1316K6177N6480K5398l4630o4215k8358M2647P0037
$$ plain form
399 42387 67769 25825 -38309 -57341 -15884 37932 50633 10046 -42250 -47552 1037 52717
411 52717 50687 -7267 -59630 -52148 3956 53991 48523 -6035 -51752 -42361 11994 54168 35967
424 35967 -21234 -54026 -28390 28850 56748 26437 -29770 -57483 -28068 31839 57989 23300
436 23300 -34941 -55716 -16960 37151 48771 9452 -40130 -48434 -4773 44438 48161 1051
448 1051 -48981 -46210 6167 52014 45613 -5254 -48643 -41589 5415 45167 36312 -14507 -50153
461 -50153 -30989 22035 52037 25600 -28505 -52414 -23935 29679 56187 27700 -26254 -51772
473 -51772 -23843 28033 45897 11697 -33497 -41798 -4276 39885 42502 171 -46755 -49956 -1350
486 -1350 48431 48789 3042 -41691 -39841 2468 36856 30142 -9673 -40310 -25097 21873 50719
$$ packed form
399D2387K5382m1944o4134j9032M1457N3816J2701m0587n2296n302M8589N1680
411E2717k030n7954n2363P482N6104N0035n468n4558m5717R391N4355M2174j8201
424C5967n7201l2792K5636N7240K7898l0311n6207k7713K9415N9907K6150l4689
436B3300n8241k0775L8756N4111J1620l9319m9582q304M3661M9211L723m7110
448A051n0032K771N2377M5847o401n0867m3389P054M7004L9752q855n0819l5646
461e0153J9164N3024L0002k6437n4105k3909K8479N3614K6508k8487n3954k5518
473e1772K7929N1876J7864l4200m5194q301L7522M4161K617m2331m6926l201M8606
486a350M9781L58m5747m4733J850M2309L4388o714l9815l0637J5213M6970K8846
$$ plain form
499 50719 27734 -27749 -57461 -30983 22009 50764 29741 -17963 -42434 -21867 20248 37738
511 37738 9283 -32323 -37487 229 44212 46984 3523 -43228 -50502 -11742 36048 44762 7615
524 7615 -32953 -34675 2675 33863 23543 -14642 -40531 -24557 21287 51371 33697 -16776
536 -16776 -52263 -35967 12657 42293 26928 -13470 -34164 -14490 21025 34173 8381 -32960
548 -32960 -43391 -8061 37824 48061 11113 -34989 -44459 -12853 27540 37572 8591 -25718
560 -25718 -28274 3660 35111 27482 -13860 -43852 -31724 11485 43612 33043 -8079 -39900
572 -39900 -31804 7996 36442 23898 -12582 -32787 -14010 22541 35845 11748 -26888 -41790
584 -41790 -14724 27458 42123 14903 -27139 -39087 -10445 24591 31244 4578 -26701 -28385
$$ packed form
499E0719k2985n5483k9712K6478N2992K8755k1023m7704k4471K0567M2115J7490
511C7738k8455m1606n164L7716M3983K772m3461m6751p274L8760M7790Q714l7147
524G615m0568j722L7350L1188j0320l8185k5889J5974M5844L0084j7674n0473
536a6776l5487J6296M8624K9636j5365m0398k0694J9674L5515J3148k5792m1341
548c2960j0431L5330M5885J0237l6948m6102r470L1606M0393J0032k8981l4309
560b5718k556L1934L1451p629m1342k9992J2128M3209L2127j0569m1122l1821
572c9900Q096L9800K8446j2544l6480k0205J8777L6551J3304k4097l8636j4902
584d1790K7066M2182J4665k7220m2042j1948K8642L5036O653k6666l1279j684
$$ plain form
596 -28385 1549 32714 31103 -5161 -37470 -30712 7035 37827 29944 -7468 -34568 -26794 6966
609 6966 32868 22522 -12556 -33882 -18295 18357 35546 13796 -22195 -36226 -14396 23305
621 23305 37687 15134 -21783 -35643 -10846 24813 32240 5367 -26542 -30195 -1666 27276
633 27276 27461 -1920 -32354 -30140 4141 35074 30938 -3852 -32218 -25303 6324 29959 22141
646 22141 -9901 -31352 -19472 13445 33420 16990 -18889 -34699 -15289 19608 34709 14711
658 14711 -18559 -32553 -14365 18797 30089 7991 -22088 -27645 -1811 27371 28517 1008
670 1008 -27939 -29879 -1615 27788 28193 -452 -28735 -25960 3808 26562 19877 -7668 -27085
683 -27085 -16818 12665 31386 19165 -14203 -33231 -17844 14462 30911 15034 -15300 -27179
$$ packed form
596b8385K9934L1165j611l6264l2309O758L7747L0792p883l7412k7100P774L3760
609F966K5902j0346l5078k1326J5587L6652J7189k1750l5991j4031K1830L7701
621B3305J4382k2553l6917j3860K4797L5659P427k6873l1909l653K8529K8942
633B7276J85k9381l0434K214L4281L0933m136l4790k8366O915L1627K3635p818
646B2141l2042k1451J1880L2917J9975j6430l5879j5810J9410L4897J5101j9998
658A4711l3270j3994J8188L3162J1292k2098l0079n557K5834K9182J146k7509
670A008k8947j940K8264K9403M05k8645k8283K775K9768K2754o685k7545j9417
683b7085J0267K9483J8721j2221l3368j9028J5387L2306J6449j5877l0334j1879
$$ plain form
695 -27179 -11150 15830 25757 6734 -21274 -27620 -4346 25313 29433 2802 -25069 -26952 -2754
708 -2754 23961 25131 953 -23385 -22535 3514 25734 19156 -8748 -28433 -18868 10890 29463
721 29463 18699 -9930 -29223 -18599 10954 27254 14350 -13783 -26130 -9030 17611 26313
733 26313 8672 -18920 -27321 -7419 19966 27641 5436 -22519 -26391 -3872 20996 23154 449
746 449 -21464 -20460 2433 25460 22562 -4163 -26212 -20922 5856 25356 17191 -8232 -24843
759 -24843 -16539 9668 25791 14771 -11398 -26402 -12909 14567 25563 10178 -15243 -24747
771 -24747 -8307 15930 23703 7043 -17926 -23702 -2926 21070 23395 1565 -21967 -22422 -1391
784 -1391 19642 20241 -1219 -21386 -18276 4366 23196 16893 -7995 -23589 -14654 9440 24955
$$ packed form
695b7179J6029K6980R927j9023k8008o346K3274K9659M120k6631k7871j883K4198
708b754K6715J170k4178k4338Q50K6049K2220o578k7904j9685R565K9758J8573
721B9463j0764k8629j9293J0624K9553J6300j2904k8133j2347J7100K6641Q702
733B6313j7641k7592q401J9902K7385P675k2205k7955l872K2519K4868K158k2705
746D49k1913J004K2893K3027k898k6725k2049N290K6778J9500q165k5423j6611
759b4843Q304K6207J6123j1020k6169j5004J3493K7476J0996j5385k5421r504
771b4747J6440K4237P773j6660k4969n776K0776K3996K325k1830k3532m55K1031
784a391K1033N99k1460k0167L110K2642J8830o303k4888j5594Q935K4094J5515
$$ plain form
797 24955 15111 -9301 -24083 -14785 9895 23121 10499 -12793 -21966 -7415 15461 21440 5005
810 5005 -17150 -23093 -4710 19143 23792 4887 -18236 -21415 -1777 17809 17611 -892 -19225
823 -19225 -16793 3778 21105 16958 -5887 -23500 -16369 6998 22698 15430 -7287 -21294 -13220
836 -13220 7710 20850 11317 -11132 -20816 -7851 14571 22503 6705 -15141 -21816 -7447 14165
849 14165 20435 4789 -15670 -20220 -2780 17849 18844 658 -17278 -16910 2021 19067 16386
862 16386 -2674 -20219 -17297 4032 19691 14535 -6077 -20378 -12369 7944 19801 11959 -8858
875 -8858 -20370 -10410 10279 20106 8426 -12773 -19693 -6056 13862 19790 5332 -14209 -19114
888 -19114 -4636 15219 18868 1901 -16324 -17168 -476 16462 15042 -2224 -16870 -14627 4077
$$ packed form
797B4955r844k4412j4782R298K4680J3226j2622k3292r173J4551K2876N979j6435
810E005k2155n943J8383K3853M649j8905k3123l179J9638J9586j98j8503j8333
823a9225K432K0571J7327m147k2845j7613P131K3367J5700p268k2717j4007Q074
836a3220K0930J3140r533k2449r684J2965K2422P932j5798k1846o675J4369K1612
849A4165O270j5646k0459m550J7440K0629R95j8186j7936L68J8931J7046k681
862A6386j9060j7545K922K1329J5659n156k0612j4301Q009K0313J1857p842k0817
875h858j1512R960K0689R827j1680k1199o920J3637J9918N928j4458j9541m905
888a9114J4478J9855L649j6967j8225q44J6692J6938j420j7266j4646K243J8704
$$ plain form
901 4077 19573 15131 -4486 -19469 -14382 5978 18486 11685 -6251 -17667 -10038 8246 17454
914 17454 8002 -11468 -19594 -6516 13128 19850 6811 -12503 -18240 -5550 11892 17022 4137
927 4137 -13386 -15881 -862 15283 15014 -2364 -17351 -14708 2262 17849 15664 -1968 -16789
940 -16789 -14561 2865 16103 10975 -6107 -16155 -8563 8950 17670 8611 -9217 -18770 -9039
953 -9039 10181 18557 7942 -10330 -17354 -5997 10053 14211 3081 -12177 -14542 -361 15411
966 15411 16445 872 -16204 -15955 -53 14590 14315 -714 -14273 -12491 1975 14717 10846
979 10846 -5838 -16006 -9219 8071 17611 9280 -8036 -17231 -10062 7119 16352 8231 -8021
992 -8021 -14885 -5192 10880 14420 2427 -11933 -15063 -2220 13245 15328 2131 -13742 -15949
$$ packed form
901D077J5496m442j9617j4983N087K0360J2508o801j7936j1416P629J8284R208
914A7454r452j9470q126J3078J9644O722j3039j9314n737J2690J7442N130j2885
927D137j7523k495J5019J6145k69j7378j4987K643J6970J5587k185j7632j4821
940a6789K228J7426J3238n128j7082j0048P592J7513Q720r059j7828r553R731
953i039J9220Q376j0615j8272p024J1357J6050M158j1130j5258k365J4181J5772
966A5411J034j5573j7076K49J5902J4643k75j5029j3559J782J4466J2742l871
979A0846j6684j0168O787J7290R540q331j7316r195P169J7181R233q121j6252
992h021o864R693J6072L540j1993j4360l130J2843J5465K083j3197j5873k207
$$ plain form
1005 -15949 -1298 13094 13315 -249 -12901 -10895 2621 13724 10804 -4173 -15527 -10214 5603
1018 5603 16135 10034 -6910 -16004 -9030 6104 14453 7623 -7067 -13681 -5518 9292 14630 4107
1032 4107 -11067 -14328 -3097 11761 14241 2270 -11683 -14350 -2358 12114 13239 752 -11782
1045 -11782 -11274 1986 12764 9796 -3285 -14066 -10754 4121 14637 10551 -4537 -14774 -9080
1058 -9080 5799 13957 8125 -5880 -13089 -6137 7000 12953 4409 -10135 -14261 -3740 10716
1071 10716 14433 3467 -10316 -12965 -2920 10303 12701 1289 -10767 -11181 572 12239 10061
1084 10061 -3062 -13295 -10184 3281 13847 10538 -2682 -13293 -10007 4033 12524 7431 -5423
1097 -5423 -12490 -5514 7338 12513 5004 -8523 -13923 -4908 8876 13865 4748 -9114 -12644 -3007
$$ packed form
1005a5949J4651J4392K21j3564j2652K006J3516J1103k920j4977j1354N313J5817
1018E603J0532o101j6944r094O974J5134Q349o830j4690o614Q163J4810N338j0523
1032D107j5174l261J1231J4858K480j1971j3953k667J1992J4472J125j2487j2534
1045a1782N08J3260J0778k968j3081j0781L312J4875J0516m086j5088j0237N694
1058i080J4879Q158n832j4005p209O952J3137N953q544j4544m126J0521J4456
1071A0716L717j0966j3783k649J0045J3223K398j1412j2056m14J1753J1667k178
1084A0061j3123j0233L111J3465J0566l309j3220j0611L286J4040Q491n093j2854
1097e423p067O976J2852N175p509j3527n400R015J3784M989r117j3862l530R637
$$ plain form
1111 -3007 8662 10844 1365 -10311 -10735 222 11587 11328 -1430 -12277 -10343 2060 12473
1124 12473 10027 -2205 -11413 -8920 2873 11435 6842 -5398 -12352 -6438 6839 12876 5918 -6486
1138 -6486 -12380 -5373 7317 12242 4753 -7871 -11954 -2792 8660 10728 1360 -9753 -10617 -394
1152 -394 10301 11069 659 -10814 -10602 687 10424 9039 -2329 -11004 -8056 2865 11172 7989
1166 7989 -3936 -11397 -7066 5048 12082 6100 -5907 -11625 -5595 5866 11000 4210 -6964 -10895
1180 -10895 -3486 8296 11262 2585 -8392 -10670 -1286 9061 9768 673 -9358 -10027 143 9936
1194 9936 9075 -1161 -10629 -8365 2611 10393 7834 -2865 -10628 -7014 3815 10807 6464 -5175
1208 -5175 -11347 -5541 5495 10932 4883 -6210 -10286 -4078 6491 10521 2878 -7622 -10227 -1993
$$ packed form
1111c007J1669K182r479j1676m24J0957J1365k59j2758j0847J934J2403J0413
1124A2473k446j2232r208K493J1793Q562m593j2240o954N914J3277O037o958j2404
1138f486n894P007J2690M925p489j2624m083R162J1452K068r368j1113q64J0223
1152c94J0695P68j0410j1473K12J1289R737j385j1368q675K948J0921Q307l183
1166G989j1925p461M331J2114P034n982j2007n718O030J1461N134o790j1174l931
1180a0895P409J1782K966q677j0977k278R384J0347P07r095j0031o69J0170R793
1194I936q61j0236r468K264J0976P782k559j0699p763L614J0829O992m343j1639
1208e175o172N806J1036N437o049j1093m076O208J0569M030p643j0500k605Q234
$$ plain form
1222 -1993 8484 9633 706 -8746 -9641 -570 9279 9548 297 -8873 -8671 1341 9370 7159 -2714
1237 -2714 -9980 -7022 3167 9949 6623 -4023 -10892 -6241 4596 10638 5599 -5021 -9633 -3786
1251 -3786 5380 9042 2765 -6982 -9543 -2277 7776 10121 1628 -8162 -9267 -1239 8086 8832 350
1266 350 -8074 -8163 341 8609 7121 -2189 -9200 -6701 3194 10109 6671 -3176 -9686 -6478 3682
1281 3682 9377 5096 -4479 -9755 -4234 5400 8830 3262 -5944 -9067 -2454 7009 9405 2467 -7571
1296 -7571 -8984 -1399 7300 8270 453 -8092 -7807 67 7799 7492 -1223 -8373 -6652 2113 9031 6286
1312 6286 -2992 -9024 -5952 3270 9247 5485 -3782 -9224 -5103 4489 9178 3822 -4947 -8331 -2810
1327 -2810 6075 8201 2048 -6691 -9167 -1991 7081 8675 1526 -7275 -7935 -507 7035 7419 90
$$ packed form
1222a993J0477J149q927r452q95R071R849K69r251r170K02J0012Q029k211r873
1237b714p266K958J0189O782l326j0646o869M651J0837O042n039j0620m612N847
1251c786R166L662o277r747k561P266J0053K345q493r790j105Q028R325P46q482
1266C50q424q9Q504Q268j488r310p011K499R895O915l438r847o510L208J0160
1281C682N695m281r575n276N521R634L430n568r206l123O613R463K396o938j0038
1296g571j413P585Q699R70p817q545K85P874P732l07q715p150J721Q765O918k745
1312F286r278o032L072R222N977l762r267n442M121R592M689n356q769l384N521
1327b810Q885K126o153q739k476P176R072J594p149q801o60P428P542L84p329
$$ plain form
1342 90 -7264 -6342 1404 7916 6079 -2954 -9254 -6108 2858 9113 6392 -2669 -8038 -5354 2817 8236
1358 8236 4077 -4291 -7547 -2777 5381 7879 1849 -6251 -8873 -2318 6666 8762 2383 -6090 -7825
1373 -7825 -1372 6028 6086 -312 -6776 -6019 1523 7779 6096 -1909 -8645 -6277 2199 8461 6285 -1856
1389 -1856 -7579 -5092 2188 6814 3639 -4145 -7449 -2960 5214 8418 2756 -5831 -8117 -2907 5401
1404 5401 8190 2606 -5036 -7173 -1647 5468 6412 -136 -6627 -6337 941 7629 6480 -1048 -7609
1419 -7609 -6594 1264 7363 5831 -1583 -7279 -4899 2520 6863 3893 -3512 -7477 -3415 4259 7899
1434 7899 3955 -4472 -7986 -3026 4295 7082 2164 -5094 -6805 -1356 5636 6867 667 -6165 -6453
1449 -6453 101 6961 6596 -420 -6536 -6215 404 6370 5020 -1623 -6752 -4892 2458 7283 4439
$$ packed form
1342I0p354R22P746O512j837r033o300L146Q966O255k721r061n369K684Q171N419
1358H236m159q368l256M770Q158K498o030q100k622O555Q984K096o379q473j735
1373g825O453P400N8o398o464P57P542O256j683q005o736K368Q476O262k176q141
1389a856n723K487P280M626l175p784l304M489Q174L204n662q587k286N210Q308
1404E401K789n584p642k137N526P115R44o548o491K90P278O688j149p528o561
1419g609J015P858O099j532p414n696K380P419M343k970p405l965M062P674L640
1434G899l944q427l514M960P321K787m918p258j711N449O992J231o200o832k88
1449f453O554O860l65p016o116L21O619N966j350o643n129J860P350M825k844
$$ plain form
1464 4439 -2593 -7205 -4116 3382 7049 3677 -3593 -7366 -3205 3948 6623 2138 -5016 -6502 -1216
1479 -1216 5320 6750 1240 -5709 -6782 -787 5754 6304 3 -6139 -5473 689 6130 5409 -1293 -6238
1495 -6238 -4914 1915 6980 4567 -2554 -6962 -4287 2668 6684 3603 -3147 -6488 -3122 3812 6670
1510 6670 2598 -4149 -6182 -1659 4987 6433 1100 -5134 -6428 -1176 5225 6078 766 -5590 -5421
1525 -5421 395 5616 5149 -744 -5856 -4504 1640 6078 4748 -2163 -6882 -4229 2343 6528 4051
1540 4051 -2358 -5889 -3233 2867 5934 2401 -3825 -6239 -2001 4575 6229 1385 -4825 -6431 -1339
1555 -1339 4867 5989 1394 -4409 -5292 -191 4904 4556 -784 -5846 -4760 1406 5868 4614 -1328
1570 -1328 -6239 -4574 1669 6218 4383 -1850 -5692 -3221 2648 5309 2131 -3672 -6043 -2160 4015
$$ packed form
1464D439p032m612L089P498L667l372p270l773M161P153K675m485p154j486N286
1479a216O536J430n510o949j073N995O541N50o301o142O66O162N441p21o702m945
1495f238J324O829N065k413p121m408K675O955M016l081o750l341L366O934K858
1510F670m072o747k033M523O646J446n333o234j294N252O401Q53n312o356J69
1525e421N816N221m67n893n112J352O144M438j330o911m719K653O572M185k477
1540D051o409l531K656O100L067l533o226k414M238O576J654m844o210j606N092
1555a339O206J122m595n803q83N101N095l48n340n062J086O166M462j254n942
1570a328m911J665O243M549j835o233l842K471N869K661l178n803k371L883O175
$$ plain form
1585 4015 6615 2290 -4039 -6177 -1977 3951 5492 1161 -4218 -5131 -491 4736 4710 -576 -5484 -4954
1601 -4954 883 6085 5019 -739 -5374 -4777 743 5068 3489 -1636 -5556 -3128 2652 5523 2632
1616 2632 -3122 -6024 -2543 3424 6202 2753 -3131 -5603 -2090 3487 5031 801 -4324 -4962 -584
1631 -584 4582 4962 -40 -4947 -4968 -59 5215 4926 -361 -4791 -4049 830 4880 3300 -1596 -5112
1647 -5112 -3333 2342 5828 3398 -2502 -5665 -3150 2571 5128 2306 -2844 -5062 -2024 3384 5017
1662 5017 1143 -3867 -5077 -558 4391 5075 791 -4556 -4796 -673 4019 4476 -348 -4716 -4088 781
1678 781 4966 3801 -1317 -4954 -3427 1405 5138 3544 -1794 -4970 -3182 1918 4945 2307 -2623
1693 -2623 -4840 -2022 3299 5103 1620 -3486 -5195 -1404 3817 4809 1051 -3787 -4681 -462 3942
$$ packed form
1585D015K600m325o329k138M200N928J541m331n379r13M640N227k6n286m908N30
1601d954N837N202j066n758m635N97N520M325j579n125l920K428N780K871k891
1616B632n754k902L481N967K778l449n884k472L513N577J544m230n125o38M378
1631e84N166L80n002m907k1M909N274k89n287m430P42M879M050j580m896l516
1647e112J779N675L486k430n900l163K515N721K557k822n150k218L038N408J633
1662E017l874n010j210M519M949O84m284n347k40M123M692M57m824m368O28M869
1678G81M185j165n118l637J527M832L733j594n338l176J788N100L027k638m930
1693b623k217K818N321J804l483n106j709L791N221R92l758m838q94M219M404
$$ plain form
1708 3942 4340 215 -4262 -3941 465 4558 4009 -890 -4918 -3722 1074 4657 3216 -1799 -4871 -2931
1724 -2931 1829 4911 2603 -2186 -4461 -1912 2802 4940 1824 -3221 -4850 -1811 3168 4548 954
1739 954 -3708 -4722 -725 3883 4108 308 -3903 -3853 360 4224 3707 -749 -4540 -3764 1157 4456
1755 4456 3423 -1154 -4477 -2922 1844 4557 2561 -2001 -4564 -2122 2390 4233 1726 -2845 -4493
1770 -4493 -1584 2829 4734 1564 -2925 -4262 -826 3565 4162 227 -3801 -4057 -186 3944 3624 -443
1786 -443 -4075 -3557 770 4334 3495 -932 -4063 -2908 1471 4204 2695 -2039 -4475 -2453 2181 4453
1802 4453 2048 -2373 -4564 -1630 2814 4199 1385 -2994 -3984 -965 3039 3828 699 -3479 -3736 -344
1818 -344 3623 3934 -8 -3655 -3286 454 3882 3249 -865 -3911 -3026 1263 3865 2441 -1607 -3988
$$ packed form
1708C942L98m125m477L21M406M093n49m899m028J196M796L583j441n015l072J940
1724b931M760L082k308m789k275K549M714K138l116n045j629L039M979J380l594
1739I54m662j014L997M608K25l800m211N0M213L864n17m456l791P76M921L299
1755D456j033m577l323J555M766K713j996m562k563K442M512J843k507m571j648
1770d493K909M413J905l170m489j337L436M391N97l935m028k56L871M130l20m067
1786d43l632N18M327L564q39m427l131J155M379K733j509m734k436K022M634K272
1802D453k405m421k191K934M444J385k814m379r90L019M004P89l129m178k57L392
1818c44L967L11l942l647L69L740L428o33m114l046Q85M289K602j424m048k381
$$ plain form
1834 -3988 -2465 1904 4482 2444 -1898 -4043 -1828 2349 3813 1168 -2757 -4120 -1088 3031 3807
1849 3807 752 -3242 -3992 -264 3585 3758 366 -3348 -3387 95 3414 3162 -930 -3780 -2828 1206
1865 1206 3967 2614 -1489 -3832 -2461 1558 3891 2178 -1829 -3735 -1990 2024 3748 1345 -2476
1880 -2476 -3885 -1200 2914 4091 956 -2906 -3693 -915 2790 3227 279 -3103 -3389 100 3256 3017
1896 3017 -443 -3590 -3036 867 3948 3138 -870 -3745 -2582 1021 3619 2127 -1561 -3549 -1775
1911 -1775 1956 3847 1561 -2261 -3885 -1440 2474 4004 1206 -2545 -3683 -968 2658 3304 340
1926 340 -2923 -3155 55 3331 3073 -322 -3469 -3146 432 3513 2820 -290 -3304 -2624 952 3445
1942 3445 2051 -1372 -3583 -1674 1968 3777 1772 -2004 -3780 -1540 1886 3410 1270 -2293 -3410
$$ packed form
1834c988J523M369K578k038m342k145K215M177J464k645l925j363L032M119P76
1849C807l055l994p50L728L849J73l392l714l9L482L319k52m092k850R52M034
1865A206K761j353m103k343J371M019K333j713m007j906J745M014J724k403l821
1880b476j409K685M114J177l135l862p87K778L705M37k948l382k86L489L156k39
1896C017l460l147N54L903L081q10m008k875J163L603K598j492l688j988J774
1911a775L731J891k286l822j624K445L914J530k798l751j138K715L626O46k964
1926C40l263k32L210L276k58l395l147L23L578L081o93l110l014O80L576K493
1942C445j394l423k211J909L642J809k005l776j776K240L426J524k140l563j117
$$ plain form
1957 -3410 -1077 2390 3280 557 -2716 -2928 -33 3260 3174 -112 -3419 -3150 38 3074 2706 -632
1973 -632 -3107 -2316 815 3242 2105 -1073 -3274 -2082 1469 3465 1788 -1888 -3679 -1838 1899
1988 1899 3324 1440 -1877 -3024 -726 2375 3048 700 -2796 -3048 -462 2672 3217 179 -3064 -3119
2004 -3119 -226 2971 2842 -203 -2816 -2195 665 2985 2100 -1161 -3129 -2120 1275 3339 1817 -1597
2020 -1597 -3370 -2030 1532 3357 1487 -1535 -2979 -976 2043 2784 414 -2419 -2997 -424 2682
2035 2682 2943 392 -2630 -2781 -111 2607 2670 163 -2718 -2333 398 2711 2292 -1001 -3301 -2086
2051 -2086 1264 3343 2147 -1204 -3058 -1679 1422 3117 1416 -1609 -2755 -1190 1856 2901 664
2066 664 -2329 -2995 -694 2649 3155 749 -2348 -2756 -392 2357 2506 -85 -2566 -2434 475 2493
$$ packed form
1957c410K333L467Q90k723l273k12K895L293q6l286l307K69L188L036l68l338
1973f32k475P91L131K427j137l178k201J192L551J996j677l676j791J841L737
1988A899J425j884l317j147K298L101O73k348l496k52K586L134N45l038l243n5
2004c119K893L197j29l045k613O21K860K320q85l261j968J009L395K064j522l414
2020a597j773J340L562J825j870l022j444K003L019P41k370k833n78K573L106
2035B682K61k551l022j51K670K718O3k507k881L85K731K313m19l293k300J215
2051b086L350K079j196l351j854J379L101J695j701l025j146J565L046J045k237
2066F64k993o66K301L343N06k406l097m08K364K749J49k591k481J32K909K018
$$ plain form
2082 2493 2146 -794 -2947 -2093 869 2970 2287 -888 -3048 -1949 887 2623 1470 -1369 -2692 -1012
2098 -1012 1725 2831 1024 -1933 -2947 -894 1860 3035 747 -2182 -2696 -552 2139 2327 -126
2113 -126 -2441 -2255 317 2795 2242 -379 -2647 -2315 705 2786 2038 -728 -2712 -1737 971 2685
2129 2685 1485 -1296 -2808 -1274 1626 2908 1186 -1681 -2852 -1011 1591 2689 717 -1940 -2516
2144 -2516 -378 2129 2420 126 -2389 -2241 209 2591 2651 -230 -2495 -2225 304 2474 1989 -626
2160 -626 -2257 -1714 1129 2679 1629 -1057 -2699 -1379 1312 2688 1252 -1447 -2834 -1201 1292
2175 1292 2394 770 -1668 -2325 -528 1972 2482 389 -2169 -2431 -9 2246 2323 57 -2407 -2172
2191 -2172 -12 2306 1912 -385 -2331 -1556 958 2584 1591 -1160 -2536 -1309 1088 2450 1182 -1070
$$ packed form
2082B493l47k940k153Q54K962K101o83l175k160J099K836J736j153k839j323J680
2098a012K737J106j807k957j014K053K754J175k288k929n14K144K691J88k453
2113a26k315J86K572K478n53k621k268L32L020K081p48k766j984R75K708J714
2129B685j200k781j512J534K900J282j722k867j171J841K602J098j972k657n76
2144b516K138K507K91k294k515J48K450K382O0k881k265K70K529K170m85k615
2160f26j631N43K843J550j050k686j642J320K691J376j436k699j387J633K493
2175A292J102j624k438o57J797K500N10k093k558k62K422K255P7k266k464K35
2191b172K160K318l94k297j946P75K514J626r93k751j376J227K397J362j268k252
$$ plain form
2207 -1070 -2489 -1042 1496 2391 867 -1445 -2395 -652 1919 2259 317 -2142 -2312 -361 2082 2197
2223 2197 115 -2074 -2050 149 2198 1942 -219 -2222 -1644 589 2357 1423 -1147 -2528 -1456 965
2239 965 2470 1386 -1100 -2440 -1061 1108 2523 1041 -1426 -2251 -736 1642 2231 499 -2046 -2378
2255 -2378 -354 1976 2211 221 -2037 -2156 -3 1837 1654 -280 -2119 -1810 463 2239 1510 -654
2271 -654 -2181 -1501 915 2393 1491 -923 -2333 -1091 966 2016 1106 -1405 -2426 -815 1421 2252
2287 2252 792 -1554 -1997 -351 1797 2122 409 -1843 -2094 -84 1834 1766 -359 -1979 -1677 350
2303 350 2084 1770 -302 -2073 -1614 772 1990 1338 -725 -2116 -1219 1004 2091 1005 -1252 -2258
2319 -2258 -769 1554 2133 780 -1561 -2141 -657 1425 1788 462 -1834 -2001 -23 1911 1945 111
$$ packed form
2207a070j419J447K538Q95j524k312r50J743K571L40j942k459j70J951K443J15
2223B197k082k189K4K199K049k56k161k003N78K233J768r34k570j381J072K421
2239I65J505j084k486j340J379K169J415j482k467q25J515K378N89j732k545l32
2255b378K024K330K35j990k258j19K153J840j83j934j839L09K273J776p29k164
2271f54j527O80K416J478r02k414j410J242K057J050r10k511j021J611K236Q31
2287B252j460k346m43J646K148L25j713k252k51K010J918o8k125j620L02K027
2303C50J734l14k072j771M59K386J218o52k063j391Q97K223J087j086k257j006
2319b258J489K323N79j353k341n80J484K082L63j326k296j67J978J934L4j834
$$ plain form
2335 111 -1825 -1632 273 1973 1553 -209 -1888 -1723 401 2014 1217 -814 -1925 -1200 978 2168
2351 2168 1239 -1135 -2016 -1006 1111 1945 746 -1341 -2086 -600 1423 2089 400 -1469 -1976 -117
2367 -117 1587 1816 107 -1902 -1748 64 1607 1513 -428 -1882 -1438 356 1788 1537 -545 -1856 -1244
2384 -1244 803 1787 1141 -909 -2025 -961 979 1865 733 -978 -2004 -729 1290 1816 583 -1333
2400 -1333 -1800 -283 1517 1818 174 -1612 -1825 -132 1565 1556 -86 -1702 -1491 301 1785 1477 -257
2417 -257 -1908 -1252 381 1734 1183 -876 -1826 -992 911 1790 1092 -974 -1696 -717 1007 1831 619
2434 619 -1260 -1797 -500 1380 1611 194 -1405 -1645 -84 1654 1672 147 -1564 -1489 100 1672 1369
2451 1369 -307 -1743 -1425 548 1697 970 -601 -1807 -896 806 1815 1063 -773 -1756 -661 955
$$ packed form
2335A11j936J93J905J700m20j762j679J65K124J613p97k031j111P25K178J190
2351B168r29k374q81J010K117Q34j199k087p45J486K023O66j689j869n07J859
2367a17J704K29j709k009J54J812J543r4j941j454M44J794J432k51k082j311O12
2384a244K047R84o46k050j116J064J940Q86j132j711j026J275K019N26j233j916
2400a333m67J517J800L01j644j786k13J693J697rj642j616K11J792J484l08j734
2417b57j651O56J633J353n51k059r50Q34J903Q79o98k066p22R79J724Q24j212
2434F19j879n37J297J880K31j417j599k40J561J738J8j525j711P5J589J572l03
2451A369j676j436L18J973J149p27j571j206R11J702J009p52j836r83J095J616
$$ plain form
2467 955 1564 473 -1167 -1751 -497 1175 1600 493 -1400 -1533 -118 1482 1560 42 -1360 -1549 -218
2484 -218 1523 1452 -228 -1409 -1155 587 1702 1246 -602 -1584 -1232 630 1662 823 -573 -1739 -1001
2501 -1001 841 1601 671 -802 -1803 -645 1098 1427 467 -1254 -1710 -282 1297 1479 130 -1327
2517 -1327 -1400 -20 1381 1327 -67 -1393 -1118 368 1631 1136 -561 -1756 -1204 451 1536 1044 -582
2534 -582 -1496 -860 760 1741 806 -893 -1686 -630 1017 1633 362 -1057 -1473 -355 1238 1546 223
2551 223 -1255 -1234 -26 1267 1366 12 -1430 -1315 66 1365 1281 -464 -1563 -1338 317 1530 1131
2568 1131 -429 -1414 -895 488 1599 677 -876 -1329 -775 886 1531 508 -929 -1585 -449 1050 1494
2585 1494 394 -1043 -1334 -233 1282 1123 -41 -1381 -1624 -9 1324 1246 -93 -1477 -1013 319
$$ packed form
2467I55O09j091j640n84J254J672M25j107j893j33J415J600P8j518j402j89J331
2484b18J741p1j680j181K54J742J115m56j848r82L52J862J032q39j396j166P38
2501a001J842P60r30j473j001J158J743L29r60j721m56J428J579J82j349j457
2517a327p3J380J401n4j394j326K75J486J263m95j697j195N52J655J085m92j626
2534e82r14O36J620R81r35j699p93J056J647O16j271j419m16J118J593L08j323
2551B23j478K1J208J293R9j354j442J15J381J299q4j745j099K25J655J213l99
2568A131j560r85N19J383J111r22j553m53N54J661O45j023j437o56J136J499M44
2585A494j100j437k91J101J515j59j164j340k43J615J333p8j339j384M64J332
$$ plain form
2601 319 1455 1232 -332 -1311 -799 499 1613 831 -822 -1581 -641 808 1470 776 -853 -1509 -389
2618 -389 902 1324 371 -988 -1281 -382 1118 1326 6 -1137 -1105 49 1485 1169 27 -1481 -1198
2635 -1198 148 1305 955 -375 -1187 -948 309 1288 690 -527 -1554 -659 812 1437 829 -816 -1320
2652 -1320 -640 732 1005 403 -981 -1250 -307 898 1197 56 -1073 -1205 -33 1090 1423 46 -1028
2669 -1028 -1217 16 1189 966 -166 -1241 -926 470 1403 990 -411 -1363 -738 463 1291 750 -643
2686 -643 -1326 -575 932 1302 496 -752 -1295 -228 910 1225 368 -990 -1183 -389 1003 1177 128 -1135
2704 -1135 -918 135 1116 1014 -323 -1177 -914 245 1254 905 -494 -1391 -882 500 1116 535 -562
2721 -562 -1540 -686 668 1115 668 -723 -1257 -568 801 1091 310 -903 -1267 -135 872 1103 155 -1041
$$ packed form
2601C19J136k23j564r79N12J298J114p82j653p59R40J449O62o94j629o56J120
2618c89J291M22r53j359k93Q99J500K08j320j143L2J154J436l16j142j508K83
2635a198J346J157l50j330q12K39J257R79n98j217j027Q95J471O25o08j645n04
2652a320O80J372K73o02j384k69R43J205K99j141j129j32J172J123L33j377j074
2669a028j89J233J173k23j132j075L15J396R33m13j401r52O25J201Q28n41j393
2686f43o83P51J507L70q06j248n43J067J138L15q57j358j93P94J392J74j049j263
2704a135K17J053R81j02j337q54K63J159J009l49j399q97N09J382O16n81j097
2721e62r78Q54J354M47m47j391n34O89J369K90p81j213l64J132J007K31r48j196
$$ plain form
2739 -1041 -1038 203 1112 1321 185 -1045 -908 143 931 960 -332 -1054 -695 415 1236 720 -531 -1170
2757 -1170 -534 664 1251 600 -651 -1278 -544 498 1039 169 -693 -1042 -195 988 1038 102 -1087 -1269
2775 -1269 -319 932 994 -58 -1158 -1022 202 1108 756 -285 -931 -631 398 1219 655 -501 -1091 -704
2793 -704 484 1131 650 -758 -1157 -442 816 1081 269 -710 -1116 -291 924 1144 485 -966 -966 -268 895
2812 895 865 179 -912 -957 189 1155 823 -241 -1034 -822 244 1028 694 -411 -1028 -797 421 1028 554
2831 554 -572 -1012 -524 589 1039 456 -545 -1038 -301 707 1050 290 -786 -1078 -168 687 654 60 -764
2850 -764 -854 101 955 907 -6 -936 -744 41 955 763 -376 -989 -484 265 1150 684 -348 -923 -495 485
2870 485 895 453 -541 -1010 -287 692 844 373 -598 -1004 -207 663 1105 61 -650 -840 -92 726 752 -139
$$ packed form
2739a041LJ241R09K09j136j230J37J051P88K9j292p22L59J110Q21n16j251o39
2757a170O36J198N87o51j251o27P34J042N41q70q62l49Q47J183N0r36j189j82
2775a269R50J251O2j052j100J36J224R06l52j041o46L00J029Q21n64j156n90L87
2793g04J188O47m81j408l99P15J258K65q12r79m06Q25J215K20o59j451%O98J163
2812H95l0o86j091m5J146R66l32j064p93K12J066P84l34j105o17K31J218O07m74
2831E54j126m40M88J113M50n83j001m93P37J008L43p60j076k92R10Q55l3n94q24
2850g64r0R55Q54m8r13r30J92P85R14j92j139o13N05P49Q85m66j032n75M28R80
2870D85M10m42r94m69P23R79J52m71r71m06P97Q70M42j044p11j90P48Q18K6q91
$$ plain form
2890 -139 -1001 -885 244 923 994 -54 -990 -753 253 915 648 -300 -848 -454 421 1001 351 -582 -922
2909 -922 -435 685 968 357 -526 -901 -335 570 920 208 -569 -913 -114 882 880 89 -967 -978 25 912
2929 912 891 -25 -764 -788 106 952 630 -384 -904 -475 443 974 487 -325 -985 -476 489 935 446 -412
2949 -412 -796 -385 443 881 91 -636 -828 -64 737 913 226 -684 -807 -111 783 768 112 -671 -756 61 785
2970 785 429 -76 -813 -405 279 952 591 -194 -952 -611 425 726 240 -441 -731 -214 461 917 278 -576
2990 -576 -754 28 781 858 155 -636 -764 -246 562 673 -93 -654 -703 158 772 576 -61 -746 -663 276 849
3011 849 550 -227 -979 -660 357 907 347 -380 -624 -415 318 806 252 -355 -1011 -259 545 737 33 -684
3031 -684 -622 -198 716 687 181 -561 -524 278 737 661 -211 -723 -498 48 756 621 -205 -695 -457 425 812
$$ packed form
2890a39q62J16J129O79P1j048r36K37J006O62k67r48n48L94Q75N80o50r33l40
2909i22M87J120K83o11q83l75N66R05L50p12p77l44P99R96kp91j056j1J003Q87
2929I12k1r16p39k4Q94Q46l22j014n20M29R18N31m87q12o60N09R65M46m89q58
2949d12l84M11Q28M38p90p27j92P64Q01J76o87r10j23O96Q94j5o56p83q5Q17P24
2970G85l56n05p37M08O84O73l61p85p58L41J036L01m86o81k90N17O75M56o39q54
2990e76j78P82P53P7p03p91j28N18Q08J11p66n61m9Q61O14j96o37o85Q3R39N73
3011H49k99p77p52L19J017N50n60p27k44K09P33M88n54o07o56P52Q04J92p04p17
3031f84O2M24R14k9n06p42L7Q02M59p6q72n12K25N46P08j35q26m90K38Q82L87
$$ plain form
3052 812 461 -146 -724 -382 442 714 313 -556 -807 -314 611 654 47 -541 -683 76 599 668 -18 -562 -669
3073 -669 151 627 477 -169 -791 -329 272 596 498 -209 -667 -527 322 702 435 -201 -738 -410 276 660
3093 660 269 -370 -678 -408 588 833 242 -377 -772 -136 533 424 7 -622 -660 -71 532 639 -60 -520
3113 -520 -500 101 719 539 -35 -564 -433 156 735 488 -209 -725 -494 322 811 357 -363 -683 -398 600
3133 600 599 289 -392 -654 -139 337 505 6 -447 -284 57 711 494 -28 -527 -587 -165 497 636 -37 -614
3154 -614 -416 255 627 448 -215 -666 -576 224 820 481 -129 -616 -359 290 557 38 -382 -646 -201 567
3174 567 714 161 -596 -654 -65 464 690 42 -692 -733 33 523 456 -150 -443 -417 287 598 356 -107 -626
3195 -626 -530 157 638 344 -390 -702 -306 143 693 382 -345 -547 -77 429 858 276 -485 -607 -197 559
$$ packed form
3052H12l51o07n78L42Q24K72m01q69k51M93R25M3o07n88j42P59N23O9o86n44j07
3073f69Q20M76j50o46o22M62O01L24r8p07m58J40Q49L80k67o36n37L28O86L84
3093F60l91o39l08K70R96K45n91o19l95O36O69j09m17o29l8N89O03J07o99m60
3113e20K0O01O18j80n74n29J31N89N79k47o97n16K31Q16M89m54p20l20K85R98
3133F00jl10o81k62N15M76J68m99m53J63L41O54k17n22m99o0M22O62J39o73n77
3154f14J98O71L72j79o63m51R0Q00N96l39o10m87K57O49K67n19m20k64M45P68
3174E67J47n53p57n8N89N29K26o48p34m1P66M90o7o06k93K6P04L11k42m63n19
3195f26R6O87M81k94p34l12L96M49N50l11p27k02M70N06M29n82p61j22M10P56
$$ plain form
3215 559 569 -30 -584 -474 232 513 539 2 -362 -428 38 609 503 -49 -581 -294 218 504 493 -257 -494
3236 -494 -465 267 631 247 -309 -542 -148 422 542 97 -516 -564 -107 453 636 155 -467 -520 32 519 555
3257 555 -11 -411 -487 -26 296 395 -248 -486 -497 38 728 373 -46 -575 -252 132 505 308 -278 -675 -332
3278 -332 160 447 184 -415 -552 -163 486 408 71 -380 -378 -145 631 431 -45 -458 -478 -22 322 465 91
3299 91 -389 -501 388 426 435 -6 -530 -497 222 505 443 -294 -614 -182 305 507 212 -324 -423 -225 302 509
3321 509 -119 -260 -550 -58 311 482 31 -469 -506 23 461 514 64 -325 -372 -92 398 265 -128 -652 -232
3342 -232 341 447 314 -127 -525 -253 289 566 199 -240 -332 -188 199 371 168 -434 -436 -118 467 434 68
3363 68 -418 -592 -92 393 563 167 -378 -275 98 441 331 -70 -368 -409 40 441 469 -205 -489 -370 70
$$ packed form
3215E59J0n99n54J10P06K81K6n37l64o6M66N71j06n52n32K87N12K86j1p50k37
3236d94K9P32L64l84n56k33L94N70J20m45o13m8M57N60J83m81o22n3N52M87L6
3257E55n66m00p6M61L22R9o43k38j1N35O90l55m19n29L23L84L73j97n86l97L43
3278c32M92K87k63n99j37L89O49p8l37m51KK33P76k00m76m13k0M56L44J43l74
3299I1m80j12Q89L8Rm41n24L3P19K83o2p37l20M32M87K02k95n36r9J98N27K07
3321E09o28j41k90M92L69J71m51n00l7N29M38N3m50l89m7K80M90j33l93n24M20
3342b32N73J06j33m41l98K72N42K77l67m39r2J44L87J72k03o02kL18N85l3l66
3363F8m86j74N00M85J70l96n45J03L73L43j10m01k98m1M49M01K8o74k84J19M40
$$ plain form
3384 70 342 283 -407 -315 -230 246 479 204 -301 -603 -32 332 459 258 -362 -468 -79 321 319 -146 -464 -394
3406 -394 232 222 310 67 -527 -179 214 611 336 -211 -427 -320 175 482 323 -209 -434 -154 241 533 148
3427 148 -184 -401 -164 264 471 264 -383 -504 -55 365 383 -115 -485 -431 1 370 310 -180 -487 -359 61
3448 61 380 326 -80 -517 -276 160 361 246 -89 -366 -265 198 480 274 -213 -477 -269 192 454 143 -258
3469 -258 -332 -149 374 482 111 -281 -301 -14 340 283 25 -489 -373 5 371 359 10 -262 -202 176 342 236
3491 236 -229 -587 -229 44 397 84 -437 -507 -165 6 337 321 -109 -364 -13 378 397 160 -408 -186 -110
3512 -110 253 523 -26 -199 -376 -33 249 330 -50 -354 -409 -9 308 236 -215 -420 -213 101 384 271 -147
3533 -147 -321 -200 137 399 155 -248 -316 -217 212 282 144 -467 -453 -73 291 439 159 -261 -259 -166 410 517
$$ packed form
3384G0K72n9o90R2Q5M76K33k75n05l02N71L64J27k01o20j06L89M00km65l18P0
3406c94O26j0Q8k43n94L48L93L97k75n47k16J07M95L07j59n32k25K80L95K92l85
3427A48l32k17K37M28K07k07o47j21M49M20J8m98l70N4M32L69o0m90l07J28M20
3448F1L19n4m06m37K41M36K01j15l35k77J01M63K82k06m87k64K08M61K62l11m01
3469b58p4J83N23J08l71l92k0K87L54n7k58n14J16L78L66j2l49k72O0L78J66j06
3491B36m65l58L58K73L53l13n21p0L42J71L31j6m30k55L51L91J9k37n68K22P6
3512a10L63K70n49j73j77L43K82Q1l80l04n5M00L17p2m51k05K07L14K83j13m18
3533a47j74J21L37K62k44m03o8R9M29P0j38o11J4L80L64J48k80m20KR3N76J07
$$ plain form
3555 517 -93 -428 -92 125 402 199 -130 -312 -236 94 317 162 -129 -343 -32 82 247 19 -299 -415
3575 -415 -194 214 159 24 -420 -315 -72 276 321 164 -376 -337 -12 305 383 -165 -376 -295 88 298 444 -104
3597 -104 -300 -156 118 167 137 -37 -372 -186 131 350 21 -187 -337 -156 360 418 129 -241 -352 -91 284
3618 284 236 -75 -323 -278 -168 414 353 -156 -177 -250 207 437 238 -18 -88 -58 10 205 208 -186 -365 9 268
3641 268 385 160 -160 -369 -166 195 407 56 -132 -230 -20 189 198 83 -109 -347 -33 308 227 97 -281
3662 -281 -246 -68 326 57 -10 -239 -199 -100 198 109 -137 -179 -108 179 449 228 -221 -422 -200 190 256 5 -63
3685 -63 -139 -39 213 277 -12 -307 -281 -99 460 233 -116 -286 -372 23 333 204 -28 -244 -153 265 470 269
3707 269 12 -234 -98 173 423 90 -63 -465 -217 107 376 251 -61 -301 -117 318 252 61 -327 -276 -13
$$ packed form
3555E17o10l35L36K17K77k03l29j82P6L30K23j55k91k14L11J14J65k28l18j16
3575d15K21M08n5j35m44J05K43L48M5j57n40L9L25L17P8n48k11Q1L83K10J46n48
3597a04j96J44K74M9l0j74l35J86L17K19l29k08j50J81N16N8k89l70j11K61L75
3618B84m8l11k48M5J10N82o1n09k1p3M57K30j99k56p0L0O8J95Ll94j79L74K59
3641B68J17k25l20k09K03L61K12l51j88r8K10K09Rj15j92k38L14L41q1j30l78
3662b81L5J78L94k69o7k29M0R9K98q9k46m2P1K87K70k21m49k01K22L90O6k51o8
3685f3p6J00K52O4k89k95K6J82N59k27l49j70q6L95L10j29k32k16R1M18K05k01
3707B69k57k46J36K71K50l33j53m02K48L24K69j25l12k40J84M35o6j91l88N1K63
$$ plain form
3728 -13 310 256 -152 -280 -364 27 250 412 -106 -449 -116 6 263 55 -39 -172 -287 93 420 334 -99 -205
3750 -205 -418 7 355 138 -72 -195 -166 133 324 -91 -159 -380 -107 312 497 -19 -317 -188 -135 284 94
3771 94 -94 -122 -212 15 104 119 50 -161 -231 154 217 370 11 -59 -189 231 379 139 -130 -330 -177 52 247
3794 247 228 -81 -256 -179 187 225 141 -169 -264 -85 39 310 81 -296 -450 -32 211 60 -165 -126 -242 61
3816 61 333 170 -20 -186 60 127 247 30 -233 -80 -26 201 253 98 -80 -272 -74 149 205 -21 -256 -267
3838 -267 -204 313 141 -64 -207 -246 -43 332 129 -104 -246 -195 -70 203 236 -204 -157 -118 -10 268 130 -85
3860 -85 -344 -115 226 253 144 -159 -130 -254 186 176 138 84 -376 25 256 361 34 -199 -215 -12 236 220 -134
3883 -134 -260 -249 89 228 46 77 -339 -268 -82 201 91 -82 -191 -49 -44 246 156 -268 -216 -161 260 145 113
$$ packed form
3728a3L23n4m08j28q4L91K23J62n18l43L33J22K57k08r4j33j15L80L27q6m33j06
3750b05k13M25L48k17k10j23K9K99J91m15o8k21K73M19J85n16k98J29N3M19j90
3771I4j88k8r0K27Q9J5o9k11p0L85O3J53l59p0j30M20J48k40k69k00J53K29J95
3794B47j9l09j75P7L66L8q4l10r5J79J24K71k29l77j54M18K43j51k25L9j16L03
3816F1K72j63j90j66K46O7J20k17k63J53N4K27N2j55j78j92J98K23N6k26k35j1
3838b67O3N17j72k05j43l9K03L75k03k33j42N1J25K73L3m40M7L9J08K78j38k15
3860h5k59K29L41K7j09l03K9j24M40j0l8n4m60M01K31J05l27k33j6K03K48j6l54
3883a34j26J1L38J39j82L1m16P1J86K83j10j73j09J42NK90r0m24N2N5M21j15l2
$$ plain form
3906 113 -48 -181 -57 -6 235 83 -128 -232 -156 239 135 -180 -117 -256 47 179 351 -54 -102 -56 -120 72
3928 72 132 5 -276 -126 63 237 75 -102 -183 -365 -17 297 179 -188 -232 -151 96 115 -33 -301 -113 26
3950 26 208 232 55 -124 -364 -78 139 146 -128 -261 -213 48 265 218 -109 -244 -221 98 269 234 -113 -29 -29 5
3974 5 301 212 -139 -331 -37 91 161 -50 -98 -159 -63 313 188 177 -137 -177 144 297 58 68 -262 -121 60
3997 60 209 152 49 -129 -62 185 289 117 -44 -208 -26 46 232 174 -180 -213 -179 55 217 251 3 -163 40
4020 40 187 275 44 -150 -134 -195 243 274 -110 -115 -143 72 211 229 123 -132 -254 10 196 35 -144 -201 -161 251
4044 251 265 92 -138 -51 -107 69 79 185 -123 -82 -57 -24 27 83 -222 -84 144 254 231 -44 -67 -94 -85 66 136
4069 136 -52 -208 -264 -33 84 190 -84 -96 0 30 51 13 97 -134 25 124 87 139 -137 -42 -94 225 281 78
$$ packed form
3906A13j61j33J24N1K41j52k11j04P6L95j04l15O3j39L03J32J72m05m8M6o4J92
3928G2O0j27k81J50J89J74j62j77q1j82L48L14j18l67m4Q1K47J9j48k68J88J39
3950B6J82K4j77j79k40K86K17Pk74j33M8K61K17m7l27j35K3L19J71l5l47Q4%L4
3974EK96q9l51j92K94J28P0k11m8o1R6L76j25j1l14m0L21J53k39J0l30J41J81
3997F0J49n7j03j78O7K47J04j72j61j64J82P2J86n8l54l3L4K34J62L4k48j66K03
4020D0J47Q8k31j94J6o1M38L1l84nk8K15J39J8j06k55j22K64J86j61j79n7M0M12
4044B51J4j73k30Q7n6J76J0J06l08M1K5L3N1N6l05J38K28J10k3k75k3k7RJ51P0
4069A36j88j56n6K31J17J06k74j2R6L0K1l8Q4k31J59R9l7N2k76R5n2L19N6k03
$$ plain form
4093 78 -59 -197 -36 109 189 115 -132 -50 -19 12 87 47 -185 -126 -62 208 92 11 -297 -200 132 233 73 -59
4117 -59 -221 -129 63 177 -152 26 -263 -184 199 236 97 8 1 -154 176 182 80 -93 -160 -141 104 194 -67 -46
4141 -46 -216 -75 212 -27 50 -176 -99 -6 187 30 -48 -268 -118 67 101 90 129 -12 1 181 165 18 -39 -163
4165 -163 -181 71 322 32 -143 -179 -146 151 172 5 55 -173 110 306 102 -108 -218 -44 -10 259 91 -40
4187 -40 -86 -44 37 9 252 -59 11 63 91 71 98 -192 -274 -12 232 277 14 -191 -106 121 226 122 68 -160 -47
4212 -47 130 37 103 -39 -175 -48 -12 35 179 107 -98 -87 -34 33 76 -166 -157 -159 153 60 130 -50 -23 -57 -67 171
4238 171 174 -111 -76 -157 -22 96 -11 41 -134 -5 188 31 -162 -169 -11 104 168 108 53 -217 -186 11 143 -57
4262 -57 -7 -82 -46 150 220 -7 -20 -118 38 99 103 27 40 -77 37 44 67 92 -10 -64 -61 152 237 -181 -297 -264 39
$$ packed form
4093G8j37j38J61J45Q0p4k47Q2L1L1P5m0k32N9O4K70j16q1l08R7L32J01j60j32
4117e9j62R2J92J14l29J78k89P9L83L7j39q9pj55L30Oj02j73o7J9K45R0k61K1
4141d6j70J41K87k39P7k26P7R3J93j57p8k20J50J85L4j1L9j41J3J80j6j47n7j24
4165a63j8K52K51k90j75l6L3K97K1j67N0k28K83J96k04k10j10J74L4K69j68j31
4187d0m6M2Q1k8K43l11P0N2K8k0K7k90q2K62K44M5k63k05Q5K27J05j04n4k28J13
4212d7J77r3O6j42j36J27L6M7J44p2k05J1N3O7M3k42RkL12r3P0j80K7l4j0K38
4238A71Lk85L5q1J35J18j07N2j75J29J93j57j93pJ58J15O4o0n5k70L1J97J32k00
4262e7N0p5L6J96P0k27j3r8J56O1Mp6J3j17J14PK3K5j02n4LK13Q5m18j16L3L03
$$ plain form
4289 39 35 85 109 -186 -215 -120 98 109 6 -199 90 57 56 -8 -49 -29 -81 4 97 -147 72 -34 69 77 337 -80
4315 -80 30 -59 -31 106 209 66 -117 -64 -121 35 85 -70 -187 -113 92 127 144 -159 20 -132 42 105 -12
4338 -12 49 -18 -81 157 173 -157 -147 -38 24 56 178 25 -116 23 -167 -24 229 29 36 5 108 127 42 -25 -150
4363 -150 -156 -128 79 51 -152 -84 -175 -11 56 253 -102 -222 -80 136 151 205 72 -34 15 211 243 64 -30 -97
4387 -97 -130 -73 229 117 -23 55 69 39 137 -89 -62 39 73 173 197 -8 -248 -121 -11 145 -95 -82 16 -201
4411 -201 81 -47 79 -26 -75 -56 4 180 125 -73 -202 -50 35 97 -5 161 -88 40 190 145 -52 14 -163
4434 -163 -123 82 56 60 -70 -155 11 200 247 -9 -24 -207 -44 86 103 -98 -192 -90 54 277 21 -169 17
4457 17 -103 -88 148 -59 -105 -217 119 227 96 -28 -102 -157 154 51 60 -91 -59 -81 -29 132 42 97 -264 -74
$$ packed form
4289C9mN0K4k95k9R5K18J1j03k05K89l3jo4m1K0n2Q5R3k44K19j06J03QK60m17
4315h0J10q9K8J37J03j43j83N3n7J56N0j55j17P4K05L5J7l03J79j52J74O3j17
4338a2O1o7o3K38J6l30J0J09O2L2J22j53j41J39j90J43K53k00Pl1J03J9q5o7j25
4363a50oK8K07k8k03O8r1J64O7J97l55j20J42K16J5N4j33j06M9J96L2j79r4o7
4387i7l3N7L02j12j40P8J4l0R8k26K7J01L4J00K4k05k40J27J10J56k40J3R8k17
4411b01K82j28J26j05m9J9O0J76n5j98j29J52Q5O2j02J66k49J28J50m5j97O6j77
4434a63M0K05k6Mj30q5J66J89M7k56j5j83J63J30J7k01r4J02J44K23k56j90J86
4457A7j20J5K36k07m6j12L36J08j31j24p4n5L11j03Rj51L2k2N2J61r0N5l61J90
$$ plain form
4481 -74 32 -59 -15 -116 -10 -83 196 142 -138 -7 -117 20 61 75 -148 -165 -67 132 92 103 3 -101 -68 59
4505 59 145 -71 0 -294 -55 -33 152 187 187 -122 -77 -154 201 144 104 124 -63 -37 177 23 -13 -124 -62 81 44
4530 44 -83 -240 -90 -211 140 -99 50 -107 -52 -4 121 -177 -46 -68 -83 -79 51 -27 -133 -119 -221 5 -23
4553 -23 -28 -200 -187 -93 87 130 130 48 -43 -175 3 91 184 28 -40 -100 130 113 -36 45 -209 -67 187 118 145 -176
4579 -176 -47 149 147 4 -115 83 -101 -9 17 -59 -69 -80 22 123 147 123 -24 -90 113 22 81 38 -41 -226 -81
4604 -81 103 135 -79 -98 -173 68 59 151 -77 11 -74 38 191 122 -19 -81 -297 57 118 6 -38 -146 22 -42 45
4629 45 136 79 151 41 25 309 45 66 -1 -95 250 253 -72 42 -124 -102 75 10 -86 -147 -80 141 45 106 48 44 53
4656 53 -33 40 80 191 -90 -39 -128 34 -57 -140 -194 -85 19 58 82 24 -116 22 36 97 177 -136 98 -126 160
$$ packed form
4481g4J06r1M4j01J06p3K79n4k80J31j10J37M1J4k23j7R8J99m0J1j00j04L3J27
4505E9Q6k16P1k94K39K2J85L5%l09M5p7L55n7m0K0j87K6K14j54l6j11O2J43l7
4530D4j27j57J50j21L51k39J49j57N5M8J25k98J31k2j5MJ30p8j06J4j02K26k8
4553b3nj72J3R4J80M3%q2r1j32J78Q8R3j56o8o0K30j7j49Q1k54J42K54o9K7l21
4579a76J29J96kj43j19J98j84R2K6p6j0j1J02J01K4k4j47o6K03r1N9m3p9j85J45
4604h1J84L2k14j9p5K41rR2k28Q8q5J12J53o9j41o2k16L54O1j12m4j08J68o4Q7
4629D5R1n7P2j10j6K84k64K1o7r4L45Ll25J14j66K2J77o5r6o1O7K21r6O1n8mR
4656E3q6P3M0J11k81N1q9J62r1q3n4J09J04L9K4n8j40J38J4O1Q0l13K34k24K86
$$ plain form
4681 160 -46 -55 -39 -167 -81 165 36 34 -38 -112 6 213 39 -109 -92 -154 100 141 -20 -138 -74 -92 63 144 96
4706 96 -104 34 44 183 -18 -94 -65 -132 73 231 -34 85 -32 -108 36 162 -41 -98 -101 -112 39 119 75 -207
4730 -207 -150 4 5 116 154 -128 -93 80 -23 159 -18 46 -230 -142 -63 105 12 150 95 47 110 13 51 -123 -107
4755 -107 -109 105 -36 -285 -50 -236 -127 157 145 55 -172 -17 -30 -23 6 -82 -31 23 98 276 164 172 -158 -192 70
4780 70 32 134 56 -49 16 23 131 -30 0 43 135 -19 -29 82 36 -21 7 276 93 -7 -80 -46 -233 187 18
4805 18 -63 -76 -43 0 -138 71 -32 -108 -59 -62 5 48 -83 108 153 120 62 101 13 -163 57 123 42 77 -41 -89 -10
4832 -10 15 32 44 -134 79 -44 -3 65 19 -109 -20 35 -29 -81 66 -55 -32 -179 -42 41 17 44 -135 145 71
4857 71 150 84 -75 -146 -40 202 10 -210 -9 80 33 -12 -15 -124 -5 172 68 -96 -125 50 -116 -10 24 20
$$ packed form
4681A60k06rJ6j28Q6K46j29kp2p4J18K07j74j48J7o2K54M1j61j18O4j8J55Q1m8
4706I6k00J38J0J39k01p6K9o7K05J58k65J19j17p6J44J26k03n7lj1J51Q0m4k82
4730b07N7J54JJ11L8k82L5J73j03J82j77O4k76Q8P9J68r3J38n5m8O3r7L8j74J6
4755a07kK14j41k49K35j86J09K84j2r0k27J55j3PK9q8N1N4P5J78j12Ql30l4K62
4780G0l8J02p8j05O5PJ08j61L0M3R2j54j0J11m6n7K8K69j83j00p3L4j87M20j69
4805A8q1j3L3M3j38K09j03p6M9lO7M3j31J91M5l3n8L9q8j76K20O6q1L5j18m8P9
4832a0K5J7J2j78K13j23M1O8m6j28Q9N5o4n2J47j21K3j47J37Q3k4K7j79K80p4
4857G1P9o6j59p1J06K42j92k20K01Q9m7m5lj09J19J77j04j64k9J75j66J06L4m
$$ plain form
4881 20 -141 -91 -16 -75 81 80 -100 -11 -97 159 43 -59 -32 -21 36 33 4 -166 -21 15 -73 21 106 12 -10 -100 -38
4908 -38 59 7 124 100 -101 75 -61 72 -151 29 -221 -151 20 18 84 -129 -128 -142 226 141 -82 -42 -63 76 61
4933 61 7 -57 -97 35 -80 48 1 88 -26 65 87 -139 36 -89 -94 -151 128 182 -10 -210 -112 55 -114 -180 58
$$ packed form
4881B0j61N0P5n9J56jj80Q9q6K56j16j02K7J1N7lk9j70J45L6q8R4Q5r4k2r0O2
4908c8R7n2J17k4k01J76j36J33k23J80k50P0J71kO6k13Jj4L68q5k23M0k1J39j5
4933F1n4o4m0J32j15J28m7Q7j14R1K2k26J75j25nn7K79N4j92k00R8J67j69o6K38
$$ [...]
8191A51
##END NTUPLES=NMR FID
##END=
