##TITLE=1H_Ser 2188-ox
 CDCl3
 8 sc, 
 4.7.2024
##JCAMPDX= 6.0         $$ Bruker NMR JCAMP-DX V2.0
##DATA TYPE= NMR FID
##DATA CLASS= NTUPLES
##ORIGIN= UXNMR, Bruker Analytische Messtechnik GmbH
##OWNER= root
$$ XWIN-NMR		Version 3.5
$$ Thu Jul  4 14:53:48 2024 Russian Standard Time (UT+4h)  she@DPX200
##.OBSERVE FREQUENCY= 200.1314
##.OBSERVE NUCLEUS= ^1H
##.DELAY= (6, 6)
##.ACQUISITION MODE= SIMULTANEOUS
##.ACQUISITION SCHEME= undefined
##.AVERAGES= 8
##.DIGITISER RES= 18
##SPECTROMETER/DATA SYSTEM= spect
##.PULSE SEQUENCE= zg30
##.SOLVENT NAME= DMSO
##.SHIFT REFERENCE= (INTERNAL, DMSO, 0, 15.7039)
##AUDIT TRAIL= $$ (NUMBER, WHEN, WHO, WHERE, WHAT)
$$ ##TITLE= Audit trail, XWIN-NMR		Version 3.5
$$ ##JCAMPDX= 5.01
$$ ##ORIGIN= Bruker BioSpin GmbH
$$ ##OWNER= she
$$ F:/spectra/data/she/nmr/H-F/1/audita.txt
$$ ##AUDIT TRAIL=  $$ (NUMBER, WHEN, WHO, WHERE, WHAT)
(   1,<2024-07-04 14:52:43.98 +0400>,<she>,<DPX200>,
      <created by zg, POWCHK disabled, PULCHK disabled
       configuration hash MD5:
       00 E9 B6 7A A2 85 ED C7 34 08 36 98 17 FE 4E 26
       data hash MD5: 16K
       6C 4D 4F 17 C5 D2 30 77 D7 C3 85 6B 77 8F D0 CD>)
$$ ##END=
$$ 
$$ hash MD5
$$ 0B 0B 68 E6 35 C5 F3 18 6B B1 88 8D 45 02 F6 56
##$RELAX= 
##$RELAX= 
##$RELAX= 
##$RELAX= 
##$RELAX= 
##$RELAX= 
$$ Bruker specific parameters
$$ --------------------------
##$DU= <F:/spectra>
##$EXPNO= 1
##$NAME= <H-F>
##$PROCNO= 1
##$TYPE= <nmr>
##$USER= <she>
##$AMP= (0..31)
100 100 100 100 100 100 100 100 100 100 100 100 100 100 100 100 100 100 
100 100 100 100 100 100 100 100 100 100 100 100 100 100 
##$AQSEQ= 0
##$AQ_mod= 1
##$AUNM= <au_zg>
##$AUTOPOS= <>
##$BF1= 200.13
##$BF2= 200.13
##$BF3= 200.13
##$BF4= 200.13
##$BF5= 200.13
##$BF6= 200.13
##$BF7= 200.13
##$BF8= 200.13
##$BYTORDA= 1
##$CFDGTYP= 0
##$CFRGTYP= 5
##$CHEMSTR= <none>
##$CNST= (0..31)
1 1 145 1 1 1 1 1 1 1 1 1 1 1 1 1 1 1 1 1 1 1 1 1 1 1 1 1 1 1 1 1 
##$CPDPRG= <>
##$CPDPRG1= <>
##$CPDPRG2= <>
##$CPDPRG3= <>
##$CPDPRG4= <mlev>
##$CPDPRG5= <mlev>
##$CPDPRG6= <mlev>
##$CPDPRG7= <mlev>
##$CPDPRG8= <mlev>
##$CPDPRGB= <>
##$CPDPRGT= <>
##$D= (0..31)
0 1.2 0 0 0 0 0 0 0 0.06 0 0.03 0 0 0 0 0.0002 0 0 0 0 0 0 0 0 0 0 0 0 
0 0 0 
##$DATE= 1720090363
##$DBL= (0..7)
120 120 120 120 120 120 120 120 
##$DBP= (0..7)
150 150 150 150 150 150 150 150 
##$DBP07= 0
##$DBPNAM0= <>
##$DBPNAM1= <>
##$DBPNAM2= <>
##$DBPNAM3= <>
##$DBPNAM4= <>
##$DBPNAM5= <>
##$DBPNAM6= <>
##$DBPNAM7= <>
##$DBPOAL= (0..7)
0.5 0.5 0.5 0.5 0.5 0.5 0.5 0.5 
##$DBPOFFS= (0..7)
0 0 0 0 0 0 0 0 
##$DE= 6
##$DECBNUC= <off>
##$DECIM= 24
##$DECNUC= <off>
##$DECSTAT= 4
##$DIGMOD= 1
##$DIGTYP= 9
##$DL= (0..7)
0 120 120 120 120 120 120 120 
##$DP= (0..7)
150 150 150 150 150 150 150 150 
##$DP07= 0
##$DPNAME0= <>
##$DPNAME1= <>
##$DPNAME2= <>
##$DPNAME3= <>
##$DPNAME4= <>
##$DPNAME5= <>
##$DPNAME6= <>
##$DPNAME7= <>
##$DPOAL= (0..7)
0.5 0.5 0.5 0.5 0.5 0.5 0.5 0.5 
##$DPOFFS= (0..7)
0 0 0 0 0 0 0 0 
##$DQDMODE= 0
##$DR= 18
##$DS= 0
##$DSLIST= <SSSSSSSSSSSSSSS>
$$ [...]
##$SUBNAM2= <"">
##$SUBNAM3= <"">
##$SUBNAM4= <"">
##$SUBNAM5= <"">
##$SUBNAM6= <"">
##$SUBNAM7= <"">
##$SUBNAM8= <"">
##$SUBNAM9= <"">
##$SW= 24.0689651099613
##$SWIBOX= (0..15)
0 0 2 0 0 0 0 0 0 0 0 0 0 0 0 0 
##$SW_h= 4816.95568400771
##$TD= 16384
##$TD0= 1
##$TE= 0
##$TE2= 300
##$TE3= 300
##$TEG= 300
##$TL= (0..7)
0 120 120 120 120 120 120 120 
##$TP= (0..7)
150 150 150 150 150 150 150 150 
##$TP07= 0
##$TPNAME0= <>
##$TPNAME1= <>
##$TPNAME2= <>
##$TPNAME3= <>
##$TPNAME4= <>
##$TPNAME5= <>
##$TPNAME6= <>
##$TPNAME7= <>
##$TPOAL= (0..7)
0.5 0.5 0.5 0.5 0.5 0.5 0.5 0.5 
##$TPOFFS= (0..7)
0 0 0 0 0 0 0 0 
##$TUNHIN= 0
##$TUNHOUT= 0
##$TUNXOUT= 0
##$USERA1= <user>
##$USERA2= <user>
##$USERA3= <user>
##$USERA4= <user>
##$USERA5= <user>
##$V9= 5
##$VALIST= <valist>
##$VCLIST= <CCCCCCCCCCCCCCC>
##$VD= 0
##$VDLIST= <DDDDDDDDDDDDDDD>
##$VPLIST= <PPPPPPPPPPPPPPP>
##$VTLIST= <TTTTTTTTTTTTTTT>
##$WBST= 1024
##$WBSW= 4
##$XGAIN= (0..3)
0 0 0 0 
##$XL= 0
##$YL= 0
##$YMAX_a= 125754
##$YMIN_a= -140962
##$ZGOPTNS= <>
##$ZL1= 120
##$ZL2= 120
##$ZL3= 120
##$ZL4= 120
##$ABSF1= 10
##$ABSF2= 0
##$ABSG= 5
##$ABSL= 3
##$ALPHA= 0
##$AQORDER= 0
##$ASSFAC= 0
##$ASSFACI= 0
##$ASSFACX= 0
##$ASSWID= 0
##$AUNMP= <proc_1d>
##$AZFE= 0.1
##$AZFW= 0.1
##$BCFW= 1
##$BC_mod= 2
##$BYTORDP= 1
##$COROFFS= 0
##$CY= 11.3945322036743
##$DATMOD= 1
##$DC= 2
##$DFILT= <>
##$DTYPP= 0
##$F1P= 15.6554695791079
##$F2P= 12.8336369535428
##$FCOR= 0.5
##$FTSIZE= 0
##$FT_mod= 4
##$GAMMA= 1
##$GB= 0.15
##$INTBC= 1
##$INTSCL= 1
##$ISEN= 128
##$LB= 0.24
##$LEV0= 0
##$LPBIN= 0
##$MAXI= 10000
##$MC2= 0
##$MEAN= 0
##$ME_mod= 0
##$MI= 1.114404
##$NCOEF= 0
##$NC_proc= 0
##$NLEV= 6
##$NOISF1= 3.799351
##$NOISF2= 2.8
##$NSP= 1
##$NTH_PI= 0
##$NZP= 0
##$OFFSET= 15.70392
##$PC= 1
##$PHC0= -25502.22
##$PHC1= 8.787479
##$PH_mod= 1
##$PKNL= yes
##$PPARMOD= 0
##$PSCAL= 0
##$PSIGN= 0
##$REVERSE= no
##$SF= 200.130013532006
##$SI= 16384
##$SIGF1= 3
##$SIGF2= 2
##$SINO= 400
##$SIOLD= 16384
##$SREGLST= <1H.CDCl3>
##$SSB= 0
##$STSI= 0
##$STSR= 0
##$SW_p= 3612.71676300578
##$SYMM= 0
##$S_DEV= 0
##$TDeff= 0
##$TDoff= 0
##$TI= <>
##$TILT= no
##$TM1= 0
##$TM2= 0
##$TOPLEV= 0
##$USERP1= <user>
##$USERP2= <user>
##$USERP3= <user>
##$USERP4= <user>
##$USERP5= <user>
##$WDW= 1
##$XDIM= 8192
##$YMAX_p= 0
##$YMIN_p= 0
$$ End of Bruker specific parameters
$$ ---------------------------------
##NTUPLES= NMR FID
##VAR_NAME=  TIME,          FID/REAL,        FID/IMAG
##SYMBOL=    X,             R,               I
##VAR_TYPE=  INDEPENDENT,   DEPENDENT,       DEPENDENT
##VAR_FORM=  AFFN,          ASDF,            ASDF
##VAR_DIM=   8192,          8192,            8192
##UNITS=     SECONDS,       ARBITRARY UNITS, ARBITRARY UNITS
##FACTOR=    0.0002076,     1,               1
##FIRST=     0,             0,               0
##LAST=      1.7004516,     0,               0
##MIN=       0,             -140962,         0
##MAX=       1.7004516,     125754,          0
$$ Real data points
##PAGE= N=1
##DATA TABLE= (X++(R..R)), XYDATA
0 0 0 0 0 0 0 0 0 0 0 0 -8 8 -8 8 -8 11 -16 16 -21 24 -26 32 -37 42 -48 56 -61 69 -82 91 -101 113 -128 144
34 144 -160 176 -197 220 -242 268 -297 328 -364 402 -447 495 -553 616 -689 776 -879 1004 -1157
53 -1157 1357 -1621 1991 -2549 3480 -5312 10294 -55233 -140962 -28713 -24000 -87096 -30759 45556
67 45556 28411 52273 62473 -23347 -49438 11924 -47516 -133482 -45139 53734 6732 1260
79 1260 81557 78752 27652 25761 -13286 -63208 -15866 11120 -52562 -22973 92437 80459 120
92 120 27335 57330 -10607 -51115 -36814 -52475 -40182 18001 3414 -29990 42817 76517 -24238
105 -24238 -59936 9854 -8650 -73991 -38968 1590 -9336 24927 46506 -6593 4031 65330
117 65330 4303 -71278 -1827 46716 -22074 -25979 41769 32927 10386 34948 6126 -28306
129 -28306 25431 25882 -57717 -32287 52213 7619 -51236 3193 27819 -18646 -15616 -1716 -28533
142 -28533 -7227 28160 -22259 -47716 25248 32824 -44899 -32267 34711 14392 -18702 13190
154 13190 19958 4140 26594 14729 -35060 -4983 43120 -10113 -42717 29186 53753 -4844
166 -4844 -5852 28101 2056 -16555 -4135 -33178 -40596 18763 17780 -39094 -216 60892 5263
179 5263 -42858 -1158 1197 -38962 -22530 -7480 -22286 17571 51698 -232 -11532 50382
191 50382 27370 -49435 -27099 18317 -11273 -18415 20541 19362 18595 47995 17469 -31246 3607
204 3607 22069 -44757 -55037 13774 19314 -15564 7800 29686 7080 4781 939 -39729 -36005
217 -36005 8928 -12143 -47476 7666 53277 9019 -10016 25569 15087 -17426 -9585 -14411
229 -14411 -27867 10909 29854 -11168 279 57629 29643 -28947 -4335 18593 -20361 -26835
241 -26835 -277 -8412 100 32267 6173 -22812 21338 27234 -39529 -39888 13663 -2733 -31109
254 -31109 552 14106 -352 17346 15392 -22581 -5800 27643 -14180 -42373 12953 31855
266 31855 -11154 -5571 27863 12835 1167 11860 -8751 -18103 17512 9936 -33326 -5907 38814
279 38814 3601 -26702 8376 18029 -13149 -10993 -2412 -16971 -2915 15824 -16139 -23911 24769
292 24769 21786 -29435 -13372 26905 1238 -20236 3707 4654 -5358 14766 8142 -19536 9318
305 9318 34951 -10974 -26821 22452 21628 -21112 -8200 15664 -1569 -2377 10410 -11853 -11103
318 -11103 23876 3473 -35346 -794 27832 -14178 -27360 10089 9146 -11291 1308 1294 -12525
331 -12525 9378 16469 -21579 -16322 27997 10462 -27238 736 27046 -384 -8404 9353 923
344 923 -1744 15072 -3747 -21437 13413 25615 -18931 -19219 24141 11412 -21531 -4619 8474
357 8474 -8477 -1819 4563 -17629 -6086 24987 -2572 -30808 9124 25417 -17060 -19282 14071
370 14071 4863 -9162 7274 627 -9252 17542 15168 -22648 -6565 30542 862 -26444 7118
383 7118 19818 -6942 -4041 8727 -5002 1001 14685 -12075 -21409 16158 13829 -26558 -11958
396 -11958 22092 2719 -16201 2755 4937 -6761 4813 -57 -19505 874 22043 -9204
408 -9204 -20940 18368 21980 -13242 -7242 14261 644 -6550 4241 -6432 -7479 18689 9805
421 9805 -20226 3810 29686 -4965 -24186 5695 8047 -15473 -5682 3443 -7419 6793 17860
434 17860 -11542 -13879 20430 5349 -31950 -9886 16938 -5343 -11652 11351 8326 2006 15841
447 15841 1441 -19836 4395 14588 -21687 -19864 20952 15651 -9665 6473 18582 512
459 512 -1508 391 -18829 -13020 11675 -4011 -20900 13035 29425 -3828 -10791 11698 1303
472 1303 -17572 -9301 -8742 -13495 8415 15054 -7715 2617 30618 6810 -23650 -3502 8077
485 8077 -15491 -14663 5151 2878 7260 22157 5704 -8453 14018 10439 -27860 -21636 11414
498 11414 -430 -15643 7989 17416 4573 9352 6089 -16475 -8460 7572 -17229 -27279 10580
511 10580 20083 -6891 554 21057 6057 -6777 -1113 -11313 -16209 5725 3379 -15877 6221
524 6221 31073 5731 -12136 10040 9342 -14351 -11267 -1892 -8468 1723 13667 -2470 -4250
537 -4250 20987 11145 -21557 -9577 11165 -8160 -17428 2981 5461 -808 9925 5211 -10095
550 -10095 4304 13536 -14610 -19343 12297 10087 -13949 -1080 15115 1472 -1291 6010 -6157
563 -6157 -6349 12750 513 -18522 5357 20328 -7777 -13465 10572 6010 -10092 -294 2289
576 2289 -5913 5866 8954 -12863 -7539 16023 -200 -21952 48 14554 -4346 -5892 9295
589 9295 2941 -949 7191 -5090 -15160 5574 9837 -14709 -6993 20813 10659 -8498 3863
602 3863 8681 -6173 -5622 -2609 -12877 -3512 14766 659 -9662 14867 18821 -10694 -12812 4704
616 4704 -5215 -14940 -2272 -321 -2155 14420 13673 -7480 488 15922 -8229 -24815 -2168 5853
630 5853 -9070 -1309 13122 7135 8075 13856 -4860 -13780 4838 -1014 -23802 -7818 16815 5143
644 5143 -3453 12849 11859 -1992 281 -5597 -19032 -6454 6413 -9944 -9593 19377 18237 -5446
658 -5446 -112 10265 -5499 -12811 -4801 -9636 -7142 11589 7533 -5912 10914 21466 -4201
671 -4201 -15313 3218 472 -14895 -5581 4186 -137 8254 14188 -2691 -3439 13139 -306 -22014
685 -22014 -5973 8693 -6563 -7626 8798 7412 1243 7922 129 -11202 2061 5248 -15363
698 -15363 -11530 13564 6637 -8787 4284 12200 -924 -1807 1669 -7659 -4657 8407 -2945 -12467
712 -12467 8581 14893 -7016 -6625 10447 2877 -8218 -598 132 -5437 3760 4185 -10021 -1979
726 -1979 14808 -212 -14068 4419 10861 -7089 -6364 4447 -1437 -2653 4934 -3374 -7144 10074
740 10074 8991 -11231 -3314 14289 588 -12511 925 4797 -5554 263 3553 -4229 3118
753 3118 12953 -4228 -11085 7869 6335 -13908 -7341 8165 -317 -3817 5201 2142 -1182 7827
767 7827 1526 -13240 -1861 9120 -7244 -12098 8183 9984 -3272 1406 6958 -1855 -654 2296
781 2296 -9548 -8247 8543 3337 -10278 3532 15905 264 -7052 3364 517 -7305 -1412
794 -1412 -2272 -7428 4616 10962 -4647 -4396 12920 4849 -12901 -4270 4434 -4953 -5220 3473 -587
809 -587 1020 10965 1673 -9403 3912 8463 -10778 -10953 6954 3883 -5601 3081 6385 -962 3855
824 3855 4339 -9221 -4977 8511 -2262 -13122 4256 11685 -3052 -3296 6378 683 -3462 1373
838 1373 -3959 -7954 4949 6011 -8955 -2247 13136 2381 -9153 1857 4861 -4886 -2141 1287
852 1287 -4005 854 9112 -2315 -7634 8055 7356 -9755 -5677 7541 -34 -6095 2050 1704 -2343
867 -2343 5570 2511 -8846 -299 9671 -4641 -11065 5544 6712 -6165 -2208 5586 -1026 -692
881 -692 3738 -4112 -4842 7817 2968 -10571 -139 11002 -1584 -7558 4540 3421 -3914 804
895 804 1160 -5006 2430 7488 -5900 -5883 9105 4017 -9939 -1663 6940 -2019 -4422 2666 -752
910 -752 -2019 5607 -22 -8625 3101 8191 -6557 -7578 6843 4073 -6215 4 3844 -2070
924 -2070 914 3265 -5406 -2491 8512 104 -9891 2640 9062 -4274 -5339 5219 1456 -3664
938 -3664 1613 -667 -5401 4144 5410 -8183 -3135 10066 1313 -9209 1236 5847 -3492 -2181
952 -2181 2374 -2863 -394 6315 -2424 -7288 5560 6673 -8045 -4620 7727 910 -5761 2006
966 2006 2352 -2121 3034 2223 -6816 -322 8103 -2975 -8207 5030 6354 -5378 -2694 4721 -298
981 -298 -1966 2612 -2754 -4271 5880 3032 -7840 -377 9489 -1313 -7179 2917 3553 -3977 -365
996 -365 1522 -2959 1933 6062 -3946 -4993 6994 3739 -8967 -2443 6519 -1073 -3995 2889 1504
1011 1504 -1280 4399 242 -7361 1041 6046 -6130 -7032 6817 5130 -4798 281 4899 -1196 -957
1026 -957 1462 -5385 -3626 5897 466 -7153 3836 9895 -2179 -4990 3885 490 -5519 -608 -925
1041 -925 -4022 3812 6376 -3876 -1248 8926 1564 -9466 -1494 3242 -4398 -3510 3285 605 1650
1056 1650 7159 294 -5741 2943 3286 -9412 -6713 5391 896 -3543 3801 5452 126 2404 1500
1071 1500 -6715 -3235 3632 -3914 -7972 5190 8102 -1994 -254 6510 567 -3911 -781 -4498
1085 -4498 -5857 2722 3098 -4975 2221 10543 1284 -5682 1798 1718 -6360 -3669 -353 -2420 1310 6766
1101 6766 -401 -2194 7012 3397 -8633 -4082 3602 -2988 -5310 2359 3047 711 5036 2469 -4584
1116 -4584 590 4204 -6236 -8004 3940 3782 -3957 965 6281 687 -217 1814 -3890 -4414 3383
1131 3383 -591 -7399 2122 7774 -1174 -3212 4442 2321 -3515 -769 -704 -3986 1099 3617 -3689
1146 -3689 -1825 7481 2029 -6263 628 4755 -2936 -3918 1840 -591 -759 3432 -400 -4192 3596
1161 3596 4575 -5341 -3621 5676 1691 -5383 48 2796 -1700 9 1823 -3385 -809 5389 -872
1176 -872 -5774 3602 5323 -4747 -3981 3568 111 -2744 1657 357 -1619 3800 2922 -4895 -1195
1191 -1195 5454 -1902 -6936 1781 3986 -2176 -39 3793 -32 145 2943 -3243 -5133 3107 1843
1206 1843 -6228 -885 6685 1377 -2357 2458 2003 -2839 -400 -895 -5327 -149 5039 -1638 -3043
1221 -3043 6182 4924 -4246 -1876 2684 -2313 -3414 611 -1467 -1281 5635 2886 -3561 1852 5688
1236 5688 -3547 -6540 1191 663 -3898 196 2835 23 3051 4335 -3036 -3232 3702 -409 -7657
1251 -7657 -488 4584 -1229 -1318 3982 1923 -753 2153 -1226 -5542 998 2497 -4838 -3062 6051
1266 6051 2745 -3418 1116 3432 -1898 -1566 39 -3398 -1841 4096 -231 -4064 3897 5468 -2927
1281 -2927 -3082 2988 101 -3524 80 361 -1537 2483 2645 -3447 -489 5702 -424 -5552 1419 3232
1297 3232 -2821 -1982 2265 -103 -361 2823 -888 -2582 3491 2558 -5211 -1554 4738 -259 -4007 1318
1313 1318 2091 -1321 499 1255 -2516 408 4059 -2404 -4465 3532 3110 -4263 -1626 3789 28 -1645
1329 -1645 1677 -6 -1691 2691 361 -4882 8 4569 -1886 -3934 3306 2981 -2352 -346 1792
1344 1792 -1921 -581 1594 -2900 -2649 4242 1724 -4359 756 4872 -1429 -3581 1132 -49 -2346
1359 -2346 1087 58 -2282 2526 4106 -2716 -2226 4345 1201 -4976 -1065 2318 -1253 -1008 1945
1374 1945 -588 -220 3855 -211 -4525 1123 3122 -3402 -3097 3450 1496 -1678 1003 1406 -1195 916
1390 916 1059 -3854 -1631 3722 -489 -4474 1969 4302 -1648 -1803 2309 -202 -1712 1025 -1091 -3023
1406 -3023 2383 2770 -3610 -835 5092 442 -3966 490 1560 -2257 -401 872 -1495 417 3785
1421 3785 -820 -3397 3085 2408 -4285 -1976 2980 -421 -1939 1695 1020 -666 2493 900 -3659
1436 -3659 -293 3222 -2045 -4325 2305 2789 -2033 24 2710 -463 -389 1331 -2525 -2944 3023 1256
1452 1256 -3928 653 5166 -479 -2365 1784 543 -2429 -119 -249 -2317 913 3331 -1578 -1715
1467 -1715 4259 1859 -4079 -1013 1951 -2313 -1905 1354 -361 299 3482 847 -2963 1376 2661
1482 2661 -3646 -3938 2337 909 -2493 754 2541 -12 1171 2041 -2524 -2040 2207 -1087 -4646 870
1498 870 3978 -618 -515 2978 921 -1373 411 -1533 -3545 716 1622 -2742 -498 5235 1504 -2601
1514 -2601 922 1906 -2215 -1678 76 -2184 -365 3219 405 -1418 3824 3234 -3342 -2359 1711 -1265
1530 -1265 -3055 680 981 -273 2542 2425 -1985 -142 2936 -2364 -4518 950 1853 -2235 -25 3398
1546 3398 913 428 1825 -1588 -2584 1556 157 -3989 -464 3864 97 -1864 2294 1926 -1760 -414
1562 -414 83 -2573 131 2161 -1825 -1845 3807 2407 -2805 -539 2502 -1050 -2080 711 -342 -1039
1578 -1039 2130 666 -2382 1091 2927 -1877 -3107 2192 1254 -2650 -20 1972 -609 -17 1436
1593 1436 -1486 -1532 2629 6 -3377 1079 3517 -1300 -1947 1611 234 -1615 601 -121 -1528 1533
1609 1533 2258 -1827 -1134 3603 75 -3430 -376 1375 -1161 -1072 1801 311 516 2259 -95 -2708
1625 -2708 865 1293 -3582 -2171 2586 926 -1598 1912 2319 -650 233 228 -3290 -1616 1957 -1263
1641 -1263 -2587 2646 3738 -899 11 2214 -946 -2018 -382 -2048 -2028 1977 2034 -1077 927 4492
1657 4492 40 -3188 42 -113 -2768 -1189 508 -433 1647 3508 559 -1057 2004 395 -4215
1672 -4215 -2236 1061 -795 -1616 1986 1873 835 2170 576 -2760 -1015 1023 -2980 -2973 1951 2126
1688 2126 -850 1515 2631 155 -410 81 -1970 -2334 1254 -30 -2440 1459 4043 22 -1297 1915
1704 1915 299 -2347 -811 -579 -1707 600 2184 -871 -57 3570 643 -2848 -174 1349 -2050
1719 -2050 -1692 804 241 -196 1982 573 -1744 1364 1744 -2502 -2440 1508 -121 -2472 873 1269 -270
1736 -270 423 1582 -1239 -602 1885 -853 -2483 907 1918 -1809 -1052 2064 623 -1045 1038 161
1752 161 -1242 1070 903 -2482 -628 2586 -331 -2090 1266 1810 -964 51 1073 -554 -407 1054
1768 1054 -1085 -1905 1778 1623 -1948 22 2824 131 -1700 536 -8 -1766 220 99 -1584 540
1784 540 2490 -584 -1562 2062 849 -2638 -902 652 -1170 -814 788 -151 -453 2743 1175 -2403
1800 -2403 79 1612 -1792 -2624 975 396 -1073 1078 1616 -175 708 1118 -1809 -2235 881 -98 -2753
1817 -2753 115 2613 131 -423 1430 177 -1197 429 -927 -2389 444 1867 -1469 -803 2895
1832 2895 1366 -1573 318 543 -1767 -1167 106 -1175 -588 2503 758 -1510 1324 2339 -1651 -1824
1848 -1824 941 -371 -1385 224 890 -54 1668 1694 -1595 -631 1820 -708 -2750 620 1264 -905
1864 -905 -281 1321 87 171 1352 -913 -2219 941 1149 -2128 -754 2390 495 -1139 868 936 -929
1881 -929 69 46 -1767 -282 1879 -435 -1448 1858 1568 -1771 -527 1309 -773 -1088 336 -109 -616
1898 -616 1181 747 -1568 229 2148 -982 -1921 1350 952 -1349 180 1163 26 130 1392 -922
1914 -922 -1205 1546 410 -2775 -6 2108 -310 -1125 1125 464 -815 602 434 -1502 320 1625
1930 1625 -1167 -1098 1842 532 -1683 63 1076 -574 -706 729 -756 -399 1470 234 -1734 823
1946 823 1828 -1403 -1324 1320 385 -1083 495 248 -574 478 1080 -1268 -630 1418 76 -1891 261
1963 261 1702 -1189 -874 890 -67 -453 1246 86 -1408 724 1043 -1818 -806 1718 289 -1359
1979 -1359 737 1085 -791 -184 497 -1137 -413 1504 -306 -1602 1409 1385 -1364 -686 1126 -348 -872
1996 -872 623 30 -875 683 336 -1365 -289 1443 -607 -1928 827 673 -1093 -14 1114 -237
2012 -237 99 755 -835 -1136 1406 546 -1458 -195 2289 -93 -1113 736 627 -870 119 70 -1222
2029 -1222 254 1307 -539 -633 1773 585 -1651 -384 1064 -773 -795 667 200 -197 1691 571
2045 571 -1298 502 1307 -1287 -1551 1039 310 -755 443 986 21 419 835 -1060 -1364 729 -294
2062 -294 -1767 356 1976 -195 -258 1616 288 -466 38 -824 -1977 135 790 -833 69 2365 546
2079 546 -1128 248 305 -1204 -969 -115 -931 -348 1850 232 -479 1559 1111 -1535 -1103 222 -715 -1566
2097 -1566 568 350 46 1622 1075 -441 -431 965 -1207 -2050 359 1138 -616 621 1719 431 -55
2114 -55 762 -623 -1722 10 -3 -1639 -110 1958 315 -43 1036 627 -944 -605 -375 -1703 -423
2131 -423 1236 -65 -413 2068 1333 -768 -442 585 -904 -1333 -221 -517 -369 1275 817 -458 314
2148 314 1282 -900 -1658 549 150 -1114 -100 600 -131 494 1105 103 -484 1160 -180 -2041 -264
2165 -264 1124 -430 -226 901 349 -357 534 -38 -932 -9 541 -1209 -604 1103 441 -1267 764 882
2183 882 -200 -700 660 -133 -497 797 -138 -1168 657 815 -944 -606 1192 246 -781 417 139
2200 139 -936 -153 573 -955 -131 1133 -27 -718 971 958 -825 -930 633 -94 -1014 491 -297 -670
2218 -670 552 1061 -770 -23 1266 -470 -1323 -224 221 -729 -124 695 -96 306 1216 -512 -1128 294
2236 294 251 -1642 -724 1013 -96 110 1170 555 -343 415 -184 -1427 -526 373 -830 -883 1264 1084
2254 1084 -158 582 842 -461 -567 96 -853 -1084 745 469 -931 654 1800 -186 -638 444 -257
2271 -257 -1088 -50 196 -786 726 1476 -88 -349 728 17 -1698 -269 243 -458 -386 672 361 150
2289 150 1241 26 -936 -71 889 -826 -1302 945 234 -387 410 876 -176 -137 149 -972 -620 503
2307 503 -248 -1004 509 908 -368 -309 849 63 -338 237 -46 -774 544 441 -827 -266 1208 -75
2325 -75 -576 282 686 -515 -356 110 -393 -185 777 -114 -1000 797 566 -1151 -479 900 51 -463 230
2344 230 137 -525 152 655 -729 -112 1143 -259 -773 641 559 -860 -501 411 -405 -409 570 201 -325 679
2364 679 563 -986 -189 598 -659 -1119 364 503 -16 826 900 -177 56 676 -962 -871 642 314 -782
2383 -782 495 1070 135 43 399 -171 -768 -76 -654 -794 87 967 -294 -151 757 632 -628 -114 -203 -693
2403 -693 59 131 -356 210 985 527 -825 141 618 -880 -742 448 -299 -633 385 524 6 578 764
2422 764 -721 -674 612 -366 -955 107 796 -93 259 775 -142 -253 466 -451 -995 -35 245 -711 -373
2441 -373 907 516 -428 419 558 -841 -226 279 -718 -372 943 -11 -364 807 689 -497 -259 164
2459 164 -313 -217 503 105 -325 563 364 -572 50 761 -283 -935 439 184 -325 -22 521 -16 179 445
2479 445 -270 -439 266 -44 -842 -2 875 51 -238 430 193 -388 133 56 -644 56 583 -452 -393 979
2499 979 591 -641 96 323 -324 -332 241 171 -266 391 92 -823 319 720 -330 -820 205 -164 -585 219
2519 219 228 -457 131 451 -433 -193 747 208 -564 5 439 -370 -355 512 -16 -289 381 -154 -828 150 230
2540 230 -725 -369 557 -17 -426 349 323 -380 -173 336 -476 -384 672 -17 -542 773 751 -505 -256 436
2560 436 118 -242 -12 32 -375 316 545 -396 63 991 -363 -925 367 271 -490 -171 41 -127 123 691
2580 691 268 -436 273 459 -916 193 919 -223 -472 462 286 -263 188 282 -427 -307 552 -333 -483
2599 -483 593 460 -192 -99 291 -270 -352 581 -86 -92 278 163 -453 74 609 -260 -425 198 472 -405 -70
2620 -70 253 -162 76 506 -52 -163 409 107 -730 212 336 -183 -232 274 280 -454 47 43 -345 53 564 -394
2642 -394 -290 418 412 -455 82 261 -404 -48 449 -320 -351 494 27 -632 305 672 -360 -651 591 -329
2662 -329 -237 242 153 -201 17 271 -535 -344 332 -191 -661 -62 321 -165 94 522 81 -329 255 -510 -600
2683 -600 53 -55 -733 -14 544 118 0 349 340 -609 -83 -170 -191 -36 620 -158 -399 396 395 -522 -307 301
2705 301 -391 -617 -10 107 -219 686 229 -329 124 480 -198 -516 393 131 -582 -29 460 -51 104 303
2725 303 -347 -389 303 -125 -684 110 232 9 -205 395 242 12 95 5 -508 -5 172 -456 -121 620 318
2746 318 -452 165 421 -147 -211 478 -245 -159 123 -94 -162 222 274 -466 6 297 -228 -638 265 -120 -234
2767 -234 265 308 -249 127 700 -106 -202 116 299 -405 -217 -163 -544 62 329 -11 -10 310 474 -344 -461 633
2789 633 56 -914 101 -126 -227 45 201 -126 181 326 -425 -440 256 173 -264 -154 552 149 311 337 -55
2810 -55 -281 -150 -102 -422 -30 371 4 -395 730 600 4 -389 -66 -444 -375 -68 -501 -333 565 252 -259
2831 -259 29 490 -111 -284 -81 17 -567 224 355 -82 390 634 -328 -129 130 -317 -585 -162 196 -124
2851 -124 92 372 208 41 162 4 -466 157 307 -423 -241 463 430 -96 200 272 -334 43 91 -329 49
2872 49 235 21 -221 217 488 -1 -232 135 -187 -253 -92 -189 -406 241 660 -25 162 698 120 -379 208
2893 208 31 -401 -127 297 101 65 368 -120 60 246 34 -253 12 224 -269 -91 245 116 -13 515
2913 515 98 -193 -127 396 -55 -324 33 271 -564 -177 -63 -161 -199 19 -329 -306 352 144 -175 -291 61
2934 61 -155 -325 230 131 -367 103 195 -195 -129 539 -187 -557 159 34 -345 -377 537 45 -121 359 -154 -221
2956 -221 322 -248 -240 211 411 -189 -333 382 246 -350 -21 115 -160 -59 217 -195 -185 382 -2 -167 91
2977 91 107 -422 -463 211 -64 -228 342 94 -199 289 192 -243 -414 213 -55 -430 137 285 -204 232 318 13
2999 13 44 378 -288 -590 99 16 -217 -341 309 100 -15 185 -22 -90 -133 173 -133 -275 438 80 -63 171
3021 171 24 -563 135 269 -355 -206 -8 -202 -86 36 184 -2 268 673 -290 -175 6 -77 -269 -40
3041 -40 664 93 32 289 -261 -54 219 364 -382 -42 219 -424 120 150 52 39 309 -96 -286 88 417 -244
3063 -244 -378 321 345 -69 183 145 -278 -120 81 -170 88 561 220 -156 -176 423 -20 -248 105 340 -123
3084 -123 -229 -56 -156 14 140 -36 -33 261 52 -248 -111 106 -509 22 197 32 41 119 126 -206 198 349
3106 349 -248 -232 634 -245 -250 147 180 86 18 140 -373 -7 93 -510 -332 -3 293 -216 -50 311 18 -141
3128 -141 10 -144 -280 136 239 39 65 62 -2 -180 80 -31 -438 16 14 -173 61 226 15 -157 4 141
3150 141 -634 -127 186 -150 -96 268 213 -200 -30 176 -143 -320 -3 -333 -106 333 266 -58 172 -107 -257
3171 -257 -54 188 -238 -106 135 27 -276 438 257 -133 -43 180 3 -282 240 -144 -347 -83 191 -29
3191 -29 -149 324 317 -209 228 156 -271 -90 406 132 -221 38 233 -73 155 187 -193 -13 362 -165 -302 405
3213 405 16 -45 -121 320 -241 -300 178 331 87 69 168 164 39 178 216 -149 191 143 -190 9 26 -75 -5 105
3237 105 250 -417 145 39 -39 151 -73 86 -178 62 -47 122 -18 -190 -38 -159 228 -150 -168 -37 -229
3258 -229 -206 174 214 149 124 235 -22 -38 63 143 19 -58 -32 -24 -94 140 22 146 241 -94 -208 -22 -151 -211
3282 -211 -198 498 -26 324 -110 245 -119 -42 63 -59 -203 94 -180 -158 27 475 -137 46 297 -101 30
3303 30 199 77 -12 211 -5 48 -310 235 131 -199 10 86 -421 -156 -414 -158 -16 7 69 -583 -92 -212
3325 -212 -286 116 179 116 -89 138 95 155 200 164 -54 -44 53 -203 -254 167 367 -402 197 291 250 -46 316 -94
3349 -94 -213 -16 39 -557 76 594 -96 -177 297 159 -133 -17 -108 -84 126 106 234 -449 195 9 -289 101
3371 101 235 157 -159 258 -393 -86 -174 124 -75 -17 288 -437 -168 422 192 -84 -238 -28 -117 91 521
3392 521 -78 -262 24 160 -351 225 -191 -116 -170 114 78 -130 59 181 -44 325 140 -80 -95 87 -129
3413 -129 -141 373 98 92 85 273 325 -147 1 168 -294 78 208 192 312 318 119 -29 -85 -87 -91 -350 147 -12 -227
3438 -227 71 -5 8 210 249 161 -20 162 5 -25 -22 -117 -222 87 -163 204 87 65 -81 -540 41 225 -221
3461 -221 288 516 183 94 97 59 -236 150 193 -283 112 58 85 -101 10 -101 -253 160 207 -111 -142 349 49
3484 49 5 116 271 -104 -174 -147 -227 -303 -12 53 -35 -14 -154 125 -341 -1 -191 180 -102 131 -36 71 -68
3507 -68 4 200 16 -214 -225 102 124 -70 -200 151 -45 107 165 269 -22 36 192 -289 78 330 -105 -289
3529 -289 57 163 -142 151 128 -19 -263 56 -148 -329 379 -42 -227 306 217 -51 -73 211 -488 -126 -45
3550 -45 -99 -205 -283 155 -584 -182 -243 80 -118 110 214 -373 141 194 -108 -350 -47 -148 -116 32 72 -115
3572 -115 313 -49 344 -232 43 300 -174 364 -165 -45 -42 199 -10 -260 529 -5 174 -33 53 217 -86
3593 -86 -125 119 -274 180 26 -157 50 98 -56 122 205 -23 -267 -145 131 -200 -171 -141 -72 27 110 70 -125
3616 -125 -115 50 -73 -31 -88 258 -60 206 88 -41 133 157 -257 18 -54 -85 57 89 -1 -101 326 314 -134
3639 -134 15 318 215 -143 207 143 60 -175 116 176 -62 86 -45 -86 205 244 147 -97 21 -288 -205 -220 7
3662 7 -219 95 143 15 362 -183 145 -68 48 34 -10 -113 187 -11 42 -234 -13 211 196 -134 -67 -145 31
3685 31 117 22 50 -83 -87 -197 369 -211 -66 125 169 -503 69 143 -162 -83 -32 -17 16 253 -372 6 76 525
3709 525 272 132 -195 -81 -92 36 185 101 58 82 -5 -29 -11 56 -171 -102 101 -207 -70 112 13 119 64 149
3733 149 -93 111 -10 -195 -87 -135 -1 -176 -56 106 -50 247 122 154 106 170 125 -38 -59 -195 1 225
3755 225 306 140 -134 -44 271 -75 -38 -57 13 110 168 18 -98 -45 110 -271 105 88 -41 35 -21 -68 15 -243
3779 -243 -14 -229 155 279 57 -112 268 -11 -268 230 -138 -4 -282 237 399 -37 -13 102 -221 261
3799 261 14 148 188 -41 322 289 -148 -116 -48 -97 -4 228 -33 202 -15 -128 118 63 248 40 133 117 -160
3822 -160 -155 18 -143 -217 91 190 143 16 70 30 -71 66 140 -141 187 183 -89 289 -131 -101 97 -91 -262 8
3846 8 -153 -197 -88 -58 183 24 105 233 -386 -255 -426 -173 22 -399 35 -4 3 183 -166 -172 175 -107 124
3869 124 365 148 -115 239 282 -149 -57 -153 -115 -485 40 186 -20 -346 242 -49 242 -159 -253 115 -57 -453
3891 -453 -338 66 226 38 24 156 -153 127 -6 37 54 -340 -205 -76 167 98 -20 -186 -4 38 -13 42
3913 42 181 -118 -98 13 -119 -69 148 274 -213 30 123 92 83 166 -21 -155 68 335 -129 -104 118 -138 -224
3936 -224 78 105 107 114 124 -26 96 -49 -212 226 -95 10 -263 145 71 49 107 362 -24 0 148 167 -176 -224
3960 -224 176 115 -1 206 8 -219 42 205 370 -374 44 -13 -344 70 18 -88 -45 -102 -20 76 179 32
3982 32 -113 10 -86 140 -149 12 -20 -160 221 -56 2 59 -66 297 -83 44 40 238 159 27 -108 408 279
4005 279 -155 -365 -190 -49 -163 9 49 -74 -171 -128 -191 20 -160 -408 14 291 -255 313 -61 184 90 -184
4027 -184 338 -145 46 -223 -74 -28 -241 225 -122 -21 -48 -13 187 89 -271 193 16 171 54 -57 57
4048 57 -14 -232 -81 -32 142 175 5 -77 69 -143 57 -251 230 -199 175 51 100 -5 158 -270 107 41
4070 41 -219 -44 202 -27 97 8 76 -33 -312 192 -73 44 125 95 109 110 -111 -249 -140 288 -86 -182 86
4093 86 -101 -75 -259 -131 -277 267 429 88 -202 346 256 -227 152 11 -91 -78 70 -43 55 73 82 -242 -116
4116 -116 58 -194 -57 -58 29 -149 86 -10 -171 153 83 -159 -108 -66 182 -96 150 387 143 -66 -42 -203 -8
4139 -8 -218 89 51 -156 -151 225 -95 -139 -72 -17 -81 -80 -136 -93 -228 204 223 -338 101 80 121 22 46 105 170 -41 -94
4166 -94 -43 -55 -169 42 46 -10 -109 -152 -57 119 -36 -77 -313 -36 -166 -76 -76 42 193 264 -221 139 -41 -24 61
4191 61 275 32 -43 130 -3 156 271 -72 -99 135 96 263 -52 205 -249 128 -269 56 -7 12 57 208
4213 208 23 130 27 -161 -76 -2 56 -40 49 -128 -84 88 -367 41 -85 -223 28 -108 358 46 47 -72 -1
4236 -1 -26 39 1 -254 -17 287 -67 93 -34 38 143 -105 71 138 151 -222 -308 249 293 -233 0 -24 -112 3
4260 3 184 71 -27 2 68 -220 30 106 124 -96 113 294 96 -345 -124 -57 73 -3 -30 46 63 159 45 297
4284 297 52 49 -413 -127 114 -345 -226 -35 82 -42 201 70 16 -123 -188 39 383 -34 -49 -79 -97 242
4306 242 43 -117 125 -111 -2 72 134 -34 -199 -136 -46 -202 88 55 14 244 -34 117 -43 44 -76 -116 81
4329 81 55 -122 94 231 -94 -198 354 -155 -109 80 -117 -33 -112 -158 266 -160 94 -117 68 59 2 -371 132
4352 132 109 -36 -65 -34 -218 -234 72 -5 39 -109 -9 18 77 -325 -115 -15 32 -16 -10 -70 64 66 -13 -175 95
4377 95 -88 19 -31 -148 -165 7 -449 117 128 145 9 -73 -79 36 -25 195 -47 -154 124 -130 -102 -266 249
4400 249 13 -77 254 116 20 1 -113 119 173 -239 14 223 -140 181 -184 -231 81 182 7 -228 63 54
4422 54 55 47 -167 33 -191 -101 -19 -167 -80 27 253 -126 -29 -5 -209 241 51 364 112 17 -29 -66 -261 217
4446 217 -103 137 -80 9 -199 13 -17 268 -172 -142 254 -201 -19 128 144 -36 62 -149 110 -201 237 176
4468 176 -63 -169 69 98 -28 104 141 19 -111 162 -111 -24 -83 5 181 187 -17 53 -114 -34 147 17 -78
4491 -78 303 46 -165 -20 -80 -59 -81 -247 136 41 10 -47 -123 -311 -94 88 104 -132 -149 91 -225 -23 17 174
4515 174 124 281 154 206 -23 80 -103 110 205 286 -174 152 -134 -9 287 -5 -124 181 -212 179 -237
4536 -237 88 370 -15 65 -297 -128 89 -24 212 240 -196 -43 120 190 -18 110 -154 -8 -19 -19 -61 -193
4558 -193 -57 -285 200 55 301 105 -35 111 -115 -155 141 146 -28 -201 14 235 238 -361 -155 -10 74 -119
4580 -119 -9 -116 -152 -198 83 -180 146 -67 -70 -160 84 183 4 179 128 19 11 -12 0 -176 91 -6 -110 37
4604 37 -73 -21 -86 3 -160 77 -80 6 86 333 -151 25 287 -84 71 -99 166 -164 109 -426 -112 -248
4626 -248 -137 -103 -139 167 -152 281 -22 5 259 -91 32 7 -219 55 17 54 102 68 33 -44 241 102 221
4649 221 -272 -88 -49 289 -288 241 63 27 -126 140 -26 94 27 50 72 -7 28 -374 -49 -179 -72 -12 -86
4672 -86 -115 -156 -42 211 87 143 93 144 -138 -183 -64 -35 -97 96 -84 107 102 109 -268 51 48 289 -121 51 -181
4697 -181 43 -104 -157 3 34 -134 68 180 -131 -243 -4 -144 -20 -210 234 468 -96 247 63 -140 120
4718 120 -228 -230 -27 168 267 -295 -73 78 105 -189 89 75 63 -203 -193 39 157 -199 -53 -8 -214 -33 24
4741 24 5 226 311 -147 41 338 41 181 77 -15 424 110 -42 -171 -23 21 -7 76 -14 149 -121 36 -205
4764 -205 -304 -74 109 122 -113 146 -208 -117 141 0 -7 118 124 91 -276 -64 -62 322 -25 -132 165 -209 -11
4787 -11 -166 52 -97 -213 27 15 -42 -42 -110 -280 11 -260 56 75 -99 196 -99 -180 124 99 -49 67 -232
4810 -232 -159 -171 31 0 139 50 158 -452 324 10 -145 -101 89 119 -74 94 -20 137 17 58 -122 -83 38
4833 38 22 -35 -216 -190 -141 -247 -83 -44 -34 -163 -119 -182 261 -278 113 86 -192 245 -229 159 124 194 -134 -140 -36
4858 -36 19 -14 -373 19 65 226 -189 -273 -115 145 97 -137 -147 89 -62 188 167 58 -68 -66 129 -217 -144 16
4882 16 341 -22 -21 -40 86 -10 88 -161 -166 -122 -100 -36 -88 -95 440 2 -38 -100 -137 29 -52 279 121 96 16 -5 -28
4909 -28 168 253 -14 -187 137 -41 54 -42 -71 143 -34 70 -53 -116 -268 -116 -83 -19 -34 -46 -90 -50 205 189
4933 189 -50 149 112 -163 -98 122 -138 -4 60 -112 -7 -151 281 40 -138 -126 6 -273 21 229 -63
4954 -63 -162 357 -142 -159 -36 -127 47 36 -67 -4 85 -162 -119 -245 -326 78 -39 -139 109 -56 -63 -171 -64 -60
4978 -60 -301 86 207 8 383 -297 -159 57 149 301 59 356 -11 70 48 -181 -94 17 -294 337 -178 -39
5000 -39 -71 -89 21 -153 -117 202 -107 -74 1 70 -183 -161 -37 -199 98 -238 -136 117 -15 381 30 29 -219
5023 -219 30 -31 337 226 -6 -56 -84 -116 -60 -68 13 -191 103 -28 63 114 59 104 81 -248 325 -28 -10 18 -148
5048 -148 184 -118 35 53 119 -101 -73 -81 -239 -18 120 -201 153 -52 357 109 166 -83 -177 -40 25 -43 19
5071 19 27 86 -192 248 -57 -128 -182 41 -172 -297 315 -38 24 84 146 -44 237 -114 50 148 120 -353 -41 111
5095 111 -109 30 52 41 -239 -9 96 -11 299 29 -75 104 -161 30 198 51 -103 78 74 155 125 70
5117 70 -174 -20 189 -58 85 100 156 -1 95 72 -92 -27 -7 -79 -281 -11 15 33 -262 -168 253 -36 -308 -159
5141 -159 -68 108 -7 76 -30 -94 -304 -82 63 5 119 -48 -76 124 31 338 -310 25 -124 23 226 -279
5163 -279 -155 -213 31 215 74 -60 211 -43 163 -158 -66 -303 -78 179 130 -261 -138 -18 -85 167 399
5184 399 -111 203 -131 -170 -370 62 36 -252 240 153 117 -13 -108 107 -147 -268 -8 -58 240 170 -341 -270 229
5207 229 -244 311 -98 -58 207 62 243 -213 -73 -35 -257 59 11 35 300 402 -133 167 155 137 170 148 -116
5230 -116 -26 -91 -14 -82 52 19 49 286 221 100 -183 -106 153 -15 -45 71 6 180 -433 135 117 -114 334 -143
5254 -143 -97 2 175 -142 171 -55 -77 217 145 -42 9 -157 146 91 -77 41 -265 -130 -32 7 -4 -36 117
5277 117 -447 119 -139 151 -23 -94 159 -248 -257 179 -39 -250 187 167 -101 -50 154 -268 -78 263 157 89
5299 89 188 -68 123 -314 159 -62 298 -161 -9 -159 111 -62 18 136 -327 -119 252 -35 -212 122 245
5320 245 -282 404 305 -55 2 -390 224 255 152 -7 -14 78 -5 166 175 16 -160 159 42 75 -14 -25 83 18
5344 18 127 204 281 106 -196 -210 -152 -91 228 147 237 -67 169 182 -208 -196 -22 110 182 -4 44 -184 -88 28
5368 28 99 178 104 -92 -47 49 -151 160 87 -86 33 -180 97 264 126 -27 125 98 -93 -82 37 29 80 -58
5392 -58 -55 -270 29 -171 -66 252 227 63 12 -305 -82 -258 97 -92 -37 183 47 319 -262 13 -195 -235
5414 -235 -294 33 -91 99 -177 15 -104 63 -44 -121 78 85 292 166 88 75 -222 183 102 138 -5 9 61
5437 61 80 21 -78 -103 -11 53 -50 135 -260 -4 -56 266 -84 0 -40 -219 170 13 71 81 32 68 170 175 106 -74
5463 -74 175 -177 190 18 -183 -120 117 -20 42 -57 -72 108 -86 174 -197 7 -109 34 203 100 -402 -84
5485 -84 194 117 46 265 21 114 -335 31 -139 -71 -234 -63 323 156 -28 282 -76 -75 -143 -428 150 -47 3
5508 3 -125 20 -34 104 11 -121 -56 254 -411 -12 -94 73 -27 -100 153 -153 -19 125 -151 97 -18 -42 54
5531 54 -41 -21 86 252 28 86 33 154 139 -72 296 164 -94 -92 82 99 8 256 131 -205 56 -94 36
5554 36 249 -59 10 162 34 -29 -221 -246 20 -25 -59 131 83 -47 -146 44 -179 -191 29 -93 -326 255 137
5577 137 -264 151 -150 -141 32 -446 -3 -110 -77 -149 -175 -78 178 62 303 5 69 272 -104 234 -147 -159 -84
5600 -84 8 215 -168 214 24 143 -130 -455 -54 -134 -102 -116 34 -8 -59 -14 -91 113 -24 26 -35 -39 -137 -211 -136
5625 -136 122 217 23 -123 205 41 -14 4 167 -44 -215 229 289 53 24 -97 -313 -50 159 -129 -105 -42
5647 -42 -113 72 -142 -235 -522 -146 -333 -4 238 -68 188 -63 -2 -182 -19 192 -149 -197 2 -293 59 -18
5669 -18 -8 -112 -245 118 -222 -9 -146 73 -46 119 88 -33 -101 233 -70 -10 -129 -36 87 120 -17 -300
5691 -300 -89 -3 197 -31 -67 -313 -12 -212 -261 -71 -94 102 138 346 58 94 178 -221 -205 -94 11 107 -3
5714 -3 317 -189 262 -139 21 -35 -174 -102 105 189 -148 -68 -88 -123 88 458 -300 140 -75 190 -150 21 15
5737 15 -61 139 -88 181 95 20 -106 -276 84 5 -289 13 -22 -179 -207 -51 -233 -142 44 -179 -74 60 -143
5760 -143 26 -224 -76 280 47 215 -65 -87 333 -3 -111 32 153 -6 175 -122 232 46 -243 -330 223
5781 223 136 -307 -49 63 2 256 162 6 -152 172 -32 -93 102 172 158 221 -92 -12 14 -31 17 -41 53 149 -38
5806 -38 -208 181 7 -46 -308 -51 -24 -101 71 438 11 -215 -165 393 57 -106 61 -70 -99 -42 2 5 -111
5829 -111 42 -77 -5 -277 -185 186 20 151 102 11 31 -16 238 -148 -46 -375 95 -158 108 257 24 -152
5851 -152 -14 75 -100 -129 -42 -29 -92 -86 -89 142 163 -81 61 147 26 49 108 -25 -1 151 -116 35 -290 313 -199
5876 -199 -282 -11 -256 75 -55 -314 156 -226 7 -85 -95 -251 115 -7 32 -234 -77 -109 70 161 108 249
5898 249 -13 -242 76 47 354 121 160 40 -20 155 135 -39 286 -69 10 96 -164 -65 -118 -89 203 124 120 41
5922 41 -27 342 -169 454 -147 137 -11 102 -87 -13 -12 -119 -49 -61 120 33 15 177 -24 -136 298 26 259
5945 259 -15 -200 88 -81 122 -88 -230 162 121 192 -120 -29 424 216 -3 -302 -64 -52 107 -41 -154
5966 -154 -271 7 -51 -10 124 244 435 -23 15 268 -118 -172 -125 -16 -92 42 113 91 3 -65 164 306 -104
5989 -104 340 83 -210 -33 178 203 -142 56 178 89 -62 197 -140 342 202 86 -214 93 161 -6 313
6010 313 -195 147 -151 134 59 -8 -170 -94 120 -15 51 155 -79 306 132 -128 17 -226 249 -186 87
6031 87 -261 137 -75 -69 236 -96 221 172 61 -114 35 1 -434 -27 254 92 85 -78 363 114 -432 112
6053 112 -191 272 41 88 54 -119 19 -35 -124 29 118 -89 -159 -103 424 -52 -261 -195 275 121 122 -21 10 117
6077 117 -108 96 -66 173 -291 105 -72 -110 -207 -125 60 75 69 29 223 68 185 -98 113 40 112 -169 -136
6100 -136 267 -86 101 3 -88 -214 105 49 106 264 165 53 -80 82 82 47 138 166 54 138 220 225 115 1 22
6125 22 62 -46 156 158 145 87 7 -75 202 -130 250 188 -158 -31 102 108 -257 -90 -223 -129 -181 -120 -233 -41 -274
6150 -274 315 -190 -227 126 120 28 -60 297 86 -200 -280 -100 -198 43 -174 361 -202 24 118 -36 176 99 -262
6173 -262 -74 73 -71 -262 -61 247 118 111 -107 -100 -107 -211 169 26 -123 -55 -27 38 80 -99 -65 -37 -113 15
6197 15 103 -4 137 -92 -63 -70 173 19 133 135 38 121 85 17 5 311 -37 260 111 58 -51 -207 47 81 -166
6222 -166 21 20 58 -58 -43 139 -164 121 69 26 64 -220 -31 -98 269 6 263 -122 -140 -46 87 -28 -52 -55
6246 -55 38 -119 47 200 -51 -41 63 -44 -54 -32 57 56 100 -28 -286 100 -41 101 1 71 -161 74 -95
6269 -95 -185 -118 -215 121 -106 -414 -109 -43 69 212 -60 -116 76 -106 29 -35 -33 -171 -184 -252 -60 -127 -163 -104 54
6294 54 -129 -118 63 -97 -125 -102 26 58 144 -169 264 -5 -23 69 74 51 149 -198 59 -173 205 -93 -118 84
6318 84 -59 28 -154 -31 127 147 -162 -246 -33 36 -54 71 -226 206 -81 200 126 -146 -124 8 -1 -119 104
6341 104 -204 282 132 61 11 137 284 138 38 -23 102 151 11 -87 125 -268 104 -104 -171 -169 -219 80 -53
6364 -53 155 136 510 -10 -120 -47 -216 -43 82 -109 244 -271 -151 30 49 4 7 -350 -50 199 58 -88
6386 -88 -167 -193 -70 -61 -51 -134 -12 -112 -177 -273 -118 -36 4 230 264 60 90 204 75 40 -90 -374 120 74 140
6411 140 8 -17 43 221 201 -38 115 21 213 63 224 -52 286 -108 -93 110 679 196 174 120 372 0
6433 0 -10 211 -350 162 75 -206 -132 -212 57 -156 -15 156 -24 -113 109 41 -93 -58 13 268 312 -88 -12 -100
6457 -100 -71 257 98 -188 94 84 -87 -38 -187 -111 290 80 -18 -291 70 62 63 28 170 19 37 -200 -188 291
6481 291 -303 -72 -23 -195 -137 -117 -27 175 82 -235 63 230 -46 27 -192 27 42 -397 42 212 142 -233 3
6504 3 -53 -565 100 117 83 26 328 -54 52 -53 164 187 -191 -61 -216 89 -21 -201 97 -369 -177 -265 117
6527 117 -130 44 -228 60 163 18 336 20 -110 4 -36 -62 -222 -95 31 15 99 -5 177 89 -93 -80
6549 -80 -13 131 -151 -136 165 -64 137 -196 -27 325 -29 121 -14 67 3 -41 -117 79 -14 129 -104 97 -1
6572 -1 124 327 45 -162 -4 -64 -189 53 -59 140 -171 273 -179 -97 314 56 247 -63 -108 534 -171 -164
6594 -164 91 260 61 -126 29 331 -154 -316 71 123 -20 -32 -184 471 439 250 39 62 -130 -118 -173 64
6616 64 -163 59 -249 198 123 -26 -135 171 136 -135 45 -196 94 -47 -26 -181 -103 28 66 18 197 110 -136
6639 -136 24 -240 -57 -140 -3 84 192 100 -193 322 27 213 7 -102 -11 -96 -127 -93 125 -266 48 352
6661 352 -91 184 132 -152 -63 108 99 -141 106 -249 -46 130 63 42 -2 -54 99 -311 -157 136 293 71 91
6684 91 173 204 5 -268 -15 -28 -26 399 27 78 -4 -184 -7 -245 -14 -237 -60 143 -296 -52 -200 -78 26
6707 26 81 28 -137 194 199 72 193 323 -55 97 -88 143 -201 111 61 -175 -93 112 -161 -84 309 -61 159
6730 159 -239 289 -19 269 -126 -5 -9 -82 -33 25 17 61 177 91 -80 -131 124 15 80 -176 93 -119 -55 -72
6754 -72 -318 134 176 -56 -71 -28 93 177 159 70 -215 11 -188 -28 54 348 110 -63 -37 -52 -3 158 278 -93
6778 -93 -62 201 -72 121 290 -1 183 121 -78 251 -33 122 21 89 -59 -99 -12 81 81 59 -175 241 -9
6801 -9 70 381 -176 84 -277 -160 8 -129 -26 -91 -16 33 -4 100 141 164 -18 64 11 -201 162 58 -160 2
6825 2 1 292 -103 -258 -296 90 -240 86 85 -86 -114 -157 -33 211 193 30 -279 -173 77 -281 -81 147 -149
6848 -149 261 -49 -203 152 87 -79 -94 -17 -178 112 181 -112 -56 244 -27 -211 -118 -117 -220 316 -26 192 -94
6871 -94 78 48 24 -17 162 221 98 88 -230 4 56 -52 85 146 192 -11 50 -234 105 -211 -29 38 21 33
6895 33 -22 205 355 139 -240 -226 55 -38 -195 -302 159 -138 297 195 -47 65 75 -235 -23 -66 364 125
6917 125 -187 -129 -14 -25 8 -45 39 29 -69 -337 137 329 -127 104 5 23 135 165 -203 -141 -258 -86 -53 526
6941 526 -60 48 -55 -117 -172 20 250 193 112 -147 -172 177 -112 -250 26 -211 -136 134 -167 58 -90 -214
6963 -214 -46 176 -308 -5 -19 -57 -126 186 181 -19 -317 49 -25 9 -170 -479 25 142 162 79 -94 -98 -65 251
6987 251 83 147 127 -121 329 -56 -284 -146 -196 -70 -49 80 12 -278 111 -417 -187 64 -230 -307 -210 -259 4
7010 4 -170 296 -17 -79 -33 -223 -44 319 287 -67 33 -188 99 -19 13 -4 126 33 3 257 -159 -36 -13
7033 -13 12 -51 -197 -35 -49 -18 -71 166 -269 -144 215 277 -143 -467 -35 66 -79 -244 -9 -37 297 -14 -23
7056 -23 72 45 -18 -71 10 59 96 16 113 240 -146 122 15 6 -24 48 210 -61 61 -44 -8 -290 283 3 143
7081 143 81 -52 -22 -31 -19 -84 -74 87 -293 6 125 -190 -28 91 177 84 -217 -114 65 -106 228 223 54 -109
7105 -109 246 -127 -60 -1 21 -71 82 -304 -121 -274 -56 62 -226 -215 -6 50 87 100 109 54 -68 504 139 -6
7129 -6 82 105 383 -13 -154 -12 234 86 -116 112 -97 -64 -69 -162 88 -381 79 127 -116 218 76 162 -235
7152 -235 -125 -19 94 312 -11 336 -143 -19 -31 -56 -170 -162 -195 13 106 125 152 4 -43 -206 -134 193 -255
7175 -255 68 -5 296 64 33 -58 65 371 -4 23 -182 133 140 97 146 285 -109 -194 67 23 -62 -168 276 -320
7199 -320 -139 590 12 281 124 -4 -49 216 -144 -49 116 -2 -123 138 -89 241 77 29 -95 -169 91
7220 91 185 -31 60 -105 -38 287 -111 -1 104 -155 1 136 133 -238 27 -161 -27 -34 167 17 -162 -119 -14
7243 -14 60 17 -46 77 330 238 -19 -49 -243 -241 114 -172 152 89 86 -54 78 -22 170 -102 99 -29 -51 -151
7267 -151 390 133 256 180 51 -114 -346 -73 -190 -103 -131 193 -166 -89 36 -297 -71 108 -39 -65 11 -6
7289 -6 248 92 62 -197 208 -82 -335 -2 145 -164 17 -36 37 -154 -45 -173 -159 69 70 -3 -88 -110 287 -272
7313 -272 79 99 34 -85 -123 -146 -39 136 196 -197 -146 189 15 -91 -18 8 -115 132 -227 -150 -45 0 -44 -186
7337 -186 -111 -194 -69 -81 -22 151 98 52 -61 -109 211 343 37 -46 195 243 -44 23 -147 204 -242 -49 -198
7360 -198 138 123 -253 -4 -32 -228 -52 -349 77 146 -70 89 -437 83 177 3 -81 -172 10 -261 -182 -87 31
7383 31 -216 -70 81 16 12 77 252 -192 21 87 220 42 -179 85 84 163 80 -50 -84 113 94 -164 220 -85
7407 -85 -50 -160 -56 1 253 -112 -375 219 -287 -202 -77 45 39 -219 97 208 14 264 158 -125 194 156
7429 156 -54 -188 268 -144 -159 -36 55 134 73 72 86 87 -145 31 180 336 -189 -70 -26 2 71 -106 183 -20
7453 -20 36 57 -165 81 -260 57 -86 -118 305 -346 -185 111 84 -57 -93 -48 83 88 180 -103 -80 33 -194 159
7477 159 36 65 264 81 -224 -88 -159 83 -148 188 -345 21 161 80 214 0 270 -149 19 305 5
7498 5 117 -199 -203 36 22 -160 -69 66 171 30 95 109 66 333 262 -113 -154 -153 70 3 -73 -135 56 -139 5
7523 5 44 162 19 131 -7 -136 -108 305 103 -50 -141 -230 57 -168 114 5 288 -76 235 1 70 34 221
7546 221 95 -209 141 119 -58 -18 68 -80 154 14 -20 83 -176 171 151 -321 -33 88 434 -128 -22 -359
7568 -359 13 -83 -51 150 205 161 -131 254 66 -142 103 89 96 198 172 291 -41 -183 256 218 -27 77 -5
7591 -5 -23 -64 211 72 40 -102 -89 -43 -98 10 45 -4 184 -84 -90 101 -197 -126 9 110 218 -111 259 138
7615 138 -199 203 -111 -72 -199 -134 40 271 -22 -263 -120 197 -116 21 134 -142 465 11 -129 -344 266
7636 266 158 -24 4 -159 123 107 64 14 -131 109 345 -120 -46 166 174 281 290 -17 70 -9 32 -95 25 129
7660 129 163 -58 -53 -299 -194 -30 -51 95 -169 120 72 -58 -79 34 -160 -82 110 -171 329 233 35 143 -58
7683 -58 -197 -417 118 170 -85 -243 9 -42 139 -75 -55 242 -170 -32 -67 -44 157 33 -214 76 77 -12 -165
7706 -165 -42 201 106 -104 7 -198 98 -175 37 119 -80 121 161 -68 22 83 -81 318 71 -37 12 -177
7728 -177 -144 184 -105 17 -311 -129 386 25 268 13 -56 -117 351 -84 -235 41 -13 35 73 228 71 150
7750 150 -61 193 5 -213 -154 -331 -181 133 -8 -116 -303 -187 148 -193 50 -9 109 -93 -71 -152 -169 -25
7772 -25 79 68 -251 104 88 -262 177 118 -139 19 225 -91 189 168 69 -183 125 59 58 83 77 174 -51 -189
7796 -189 -154 12 275 24 353 -51 99 -20 -376 2 57 92 -79 -84 -90 57 -154 -307 -76 -216 69 25 -160
7819 -160 25 64 116 84 0 272 121 -129 0 130 -237 -132 315 131 -113 -116 16 -100 179 -36 -367 -279
7841 -279 -338 -17 -196 184 -157 280 37 -8 -105 106 72 233 -61 -158 -18 -92 7 -91 204 15 -66 126 46
7864 46 172 313 100 216 -108 44 -14 -182 6 -25 -22 -58 89 -239 -8 -77 222 -58 -95 115 -13 -259 9
7887 9 86 -95 -409 -140 141 106 72 23 65 -13 -17 -158 -271 -127 -118 -25 -95 -341 -68 111 175 11 13 15 -39 -81 91
7914 91 -5 120 -98 -105 24 -110 280 14 47 -509 18 204 -29 194 -34 -63 121 -35 177 75 122 126 133 -140
7938 -140 116 -91 -93 168 77 1 -116 182 41 103 229 -90 -207 75 27 -232 36 -178 360 -157 -211 247
7960 247 -415 15 -99 29 -27 163 94 50 357 34 -144 -54 55 -252 206 -26 -238 -123 -91 56 -90 53
7982 53 12 -397 -195 100 74 -149 116 110 -229 143 -115 346 -16 337 -204 35 -253 34 -7 187 -142 144
8004 144 73 -1 346 -86 -241 104 335 -180 117 -134 104 34 95 -1 -97 164 -8 41 -211 11 -39 -145 64
8027 64 91 236 63 -2 -4 -193 48 30 27 239 268 -46 63 -116 -16 174 -239 -136 47 43 -42 431 -170 -443
8051 -443 -209 -7 168 30 247 310 -48 -92 -57 -297 32 -143 -318 58 18 20 -50 176 -72 -20 15 -71 46
8074 46 -41 -236 142 44 166 -130 295 170 -67 -74 215 165 91 -136 -382 -100 -139 -327 65 53 203 168 -370
8097 -370 306 -294 99 75 -9 55 16 53 77 95 73 290 274 -7 -30 114 32 41 56 -62 -243 -110 135 107 62
8122 62 29 -247 143 206 167 -232 -59 112 -2 153 167 -58 103 -146 -239 -151 48 -121 -73 63 202 -224 158
8145 158 83 11 249 169 6 -92 42 -163 460 -83 362 -193 101 51 384 64 82 -112 -69 2 77 -32 -83
8168 -83 282 210 246 -4 96 174 149 145 229 -86 -88 329 145 122 39 -158 61 -186 54 -99 213 -17 84
8191H4
$$ Imaginary data points
##PAGE= N=2
##DATA TABLE= (X++(I..I)), XYDATA
0 0 0 0 0 0 0 0 0 0 -8 8 -8 8 -16 16 -16 24 -29 32 -40 48 -56 64 -72 87 -98 112 -129 146 -165 187 -211
31 -211 237 -266 298 -332 371 -413 457 -509 562 -625 690 -765 848 -940 1042 -1157 1287 -1438
49 -1438 1612 -1816 2062 -2361 2740 -3227 3888 -4844 6348 -9095 15761 -69492 -33229 55855
63 55855 -31667 21652 91081 55841 13782 21920 -52453 -76673 -3649 -9805 -75002 19239 125754
76 125754 64740 8932 68421 53464 -28370 -39477 -38922 -65532 -12755 38042 -7805 -988 92589
89 92589 65304 -45795 -38620 7381 -49833 -85675 -38318 -15986 -6884 42226 34155 -13474 26411
102 26411 54490 -42182 -83340 4077 16186 -45998 -8519 54751 34996 33136 48801 -2451
114 -2451 -16000 37849 -2162 -73866 -5318 62992 -4929 -29416 41473 35906 -15472 -1814
126 -1814 -9304 -44790 -3174 16428 -53383 -37850 51004 16187 -56759 -5405 36164 -16236
138 -16236 -25941 6657 -8376 -3014 31278 -4435 -35620 27996 46395 -30268 -26146 49710 32982
151 32982 -18385 8960 26593 -1682 3926 4786 -34423 -13105 39145 -1388 -41795 23215 51233
164 51233 -19358 -35666 7938 -8946 -37481 -14928 -16758 -23258 27312 34848 -24252 -4857 53015
177 53015 74 -59746 -10292 16597 -22733 -8719 25911 13219 27727 52740 1146 -28541
189 -28541 24958 15145 -58238 -33136 33558 10795 -12086 26423 28095 3144 13899 -7111
201 -7111 -52956 -22255 13631 -35710 -45073 30745 42635 -9049 -119 24941 -4019 -20154 -12375
214 -12375 -32264 -25900 23930 17441 -19046 23092 64482 10636 -26722 9471 9664 -27857 -16784
227 -16784 429 -7104 19370 39051 -2363 -8955 37713 12438 -52012 -27423 13730 -17320
239 -17320 -28794 9649 10969 2709 23993 4631 -30854 1939 18748 -38741 -40772 24520 19554
252 19554 -19103 9066 31107 5678 6263 10953 -20422 -12678 25260 -3788 -34515 18129 43715
265 43715 -7082 -14309 23736 9638 -15930 -3828 -9472 -20510 9465 12408 -27182 -8850 36588
278 36588 3898 -35561 -619 18791 -15708 -18532 3229 -4982 -766 18495 -4208 -18081 23206
291 23206 26008 -25819 -16468 30141 8730 -22443 4050 15733 -2608 7964 10345 -15896 1380
304 1380 28607 -10464 -32691 15454 22726 -24890 -17128 17275 975 -11327 5240 -6679 -13754
317 -13754 16356 5586 -32860 -4318 31079 -7724 -28032 13527 19986 -9951 -1757 8752
329 8752 -5662 5500 16633 -14176 -15154 27458 15507 -26210 -2521 29864 289 -17732 5478
342 5478 3989 -7406 5931 -1379 -20616 6895 23018 -17918 -24558 20171 13698 -25741 -10115
355 -10115 13633 -4135 -6306 6508 -7946 -5553 22866 2910 -27962 7183 29706 -12379
367 -12379 -21424 18251 14151 -9914 3854 7190 -7094 9781 13833 -20477 -11862 26819 3340
380 3340 -30025 2569 23289 -8215 -12679 7215 -2802 -6227 8276 -8491 -21006 12759 17154
393 17154 -22441 -12948 25489 7623 -19033 1098 11150 -5220 202 4403 -11411 2160 23253
406 23253 -2633 -19491 16348 23554 -15578 -14863 14204 3202 -11814 1901 145 -6022 13851
419 13851 10221 -19881 -4549 23344 -7358 -31094 2783 14083 -12875 -6978 11114 572
431 572 2704 14289 -9266 -18070 14530 8393 -28364 -8044 27083 5157 -11248 12941 13609
444 13609 -3514 3955 -1405 -20722 -1214 16152 -13052 -15885 24935 21452 -13473 -3321 13444
457 13444 -6870 -14990 -4628 -13229 -9696 15513 6587 -13772 11799 28031 -8025 -22502 4571
470 4571 1552 -18920 -7020 5047 399 13727 20599 -3435 -3825 20367 206 -31685 -8994
483 -8994 13892 -7223 -9506 14835 14184 5662 12851 -287 -18687 -567 4394 -26792 -19940 19742
497 19742 12472 -10470 8605 19898 -1670 -5427 -2720 -18315 -12707 9151 -5047 -16145 18228
510 18228 29854 -4358 -6427 15586 1395 -18039 -6592 -4799 -9127 10083 13900 -6417 5713
523 5713 27613 802 -23778 -962 6661 -16804 -13405 6141 2399 3444 14665 194 -8622
536 -8622 11125 5544 -25206 -14095 14067 -475 -14137 7838 14880 511 4043 4392 -11052
549 -11052 -2450 11217 -10614 -17299 14785 17060 -11232 -3111 16789 2097 -8812 2077 -3330
562 -3330 -7605 8791 3132 -16018 2608 20297 -7190 -17985 8998 9307 -11697 -3918 6420
575 6420 -2991 1841 7757 -10145 -9397 14172 3390 -19650 963 20347 -821 -8953 7932
588 7932 5092 -5799 995 -3397 -12288 5100 13995 -8155 -6153 20542 10419 -15197 -4810
601 -4810 6339 -8637 -10228 911 -3930 356 16559 5211 -11287 7344 13291 -15859 -20072
614 -20072 4877 1858 -10808 3644 10800 3726 10698 10659 -11246 -8447 9145 -7649 -23842 2228
628 2228 17558 -143 765 15658 6664 -2340 2086 -10008 -18641 894 4245 -15313 -1636 24751
642 24751 10421 -7586 5282 6761 -11140 -10507 -5945 -13091 -1705 14614 1656 -4091 18966
655 18966 16977 -12280 -11142 5167 -6686 -14775 -815 2569 1630 15048 12083 -5785 3028 13350
669 13350 -10430 -22240 882 5677 -9786 -1720 12291 5888 4893 9298 -5987 -11510 4790
682 4790 -1680 -21112 -4421 16280 1324 -5818 10857 9388 -3245 21 -2565 -12090 -1122
695 -1122 7539 -9007 -7317 16940 11750 -9221 68 11018 -3262 -8506 -151 -4294 -4290 8234
709 8234 1553 -9719 7252 14592 -7641 -11413 8173 3964 -11075 -2870 3605 -2652 2320 5820
723 5820 -6329 -2970 13169 970 -14672 2142 12276 -6109 -8987 5970 2597 -3601 4190
736 4190 830 -5592 7349 8768 -10969 -6100 12682 1220 -14795 81 8773 -3120 -1746
749 -1746 5644 -1714 -144 8665 -4418 -13312 4971 7802 -12580 -6919 11938 4601 -4738 4199
763 4199 3793 -3572 1986 201 -11919 -2956 11300 -2451 -9481 9877 13265 -4627 -3933 5110
777 5110 -2775 -5997 783 -5030 -5928 10211 7431 -8170 1414 14251 -1670 -12915 23 1723
791 1723 -7124 -1888 3262 -2193 4921 11287 -3542 -7663 8395 3730 -15172 -5676 8311 -387
805 -387 -3963 6105 4217 105 6623 79 -11672 -293 8104 -8675 -10345 9433 8891 -5527
819 -5527 1312 6876 -2409 -2228 1151 -8549 -5941 8170 1682 -10594 4225 13743 -2941 -7380
833 -7380 4498 999 -6223 -450 -751 -4826 5155 8298 -6101 -3194 11835 2445 -11839 -856
847 -856 6533 -4055 -3616 3875 -415 269 7447 -1000 -8750 4997 6923 -9681 -7191 8436 2571
862 2571 -7038 1457 4365 -2059 1822 2521 -7438 -2048 9443 -2230 -10759 5551 9505 -6121
876 -6121 -4103 6189 783 -3343 2530 -1924 -4746 6153 4485 -9399 -1653 11311 -686 -9724
890 -9724 2985 5573 -4487 -1163 2675 -3048 852 6374 -4357 -6861 7476 5119 -9857 -2964
904 -2964 8506 -259 -5591 2584 2111 -1980 3798 1058 -7390 1182 8591 -4695 -8145 7241 6255
919 6255 -6683 -1802 5642 -1171 -1679 2905 -3243 -3292 7030 1511 -9433 1031 10057 -3433 -7438
934 -7438 4641 3245 -4434 -1 1546 -3729 2546 5508 -6107 -4433 9224 2199 -9851 47
948 47 7613 -2703 -3891 3403 -191 -1489 5013 -582 -6891 3982 7223 -7113 -5826 8156 2459
963 2459 -6754 355 4415 -2481 237 2258 -5356 -1384 7330 -1761 -8647 4114 7658 -5621 -4781
978 -4781 5420 1102 -3527 1379 -117 -3608 4527 3712 -6923 -1669 9123 -441 -8766 2427
992 2427 5434 -3319 -1666 3077 -1167 426 4970 -2916 -6139 5375 4161 -8682 -3186 8341
1006 8341 912 -5121 2453 3032 -2311 1302 369 -6705 51 6690 -3409 -6485 7125 6762 -5285
1021 -5285 -1849 5102 -1540 -3739 764 -2653 -2691 6308 3132 -5843 2156 9004 -3075 -8003 2291
1036 2291 2078 -5741 -799 2685 -943 3427 6319 -3664 -4012 6041 298 -10445 -2335 6154 -1452
1051 -1452 -2925 5216 3311 -65 3956 -818 -7523 269 3669 -7121 -5061 8230 5426 -3368
1065 -3368 2615 5638 -1914 -2428 -607 -5965 -3602 5142 235 -5102 5734 9534 -2586 -4297 3373
1080 3373 -859 -6778 -1698 -993 -2356 4634 5893 -2413 661 8378 -814 -9597 -985 2458 -5186
1095 -5186 -2926 3581 1859 2216 6261 -101 -4533 2955 1552 -9474 -4891 5763 1001 -4043 4197
1110 4197 5708 -224 1267 516 -6099 -2315 3325 -4346 -6355 5984 6982 -3309 -664 6282 -22
1125 -22 -4015 -175 -2843 -4357 2974 2224 -4579 2308 8812 -1072 -5551 2896 2305 -5389 -2154 1444
1141 1444 -1726 1301 4446 -1902 -2311 6145 2196 -7616 -982 5478 -2259 -4590 2634 1560 -1041
1156 -1041 2656 799 -4015 1762 4678 -4859 -4595 5509 2913 -5511 -515 4164 -1171 -1600 2032
1171 2032 -1353 -1308 4638 -169 -5992 1938 5607 -4254 -4653 4040 2016 -2938 1331 2146 -1668 1694
1187 1694 2143 -4823 -2718 4920 -697 -6507 2204 6124 -1238 -1831 3131 -198 -2241 1164 -2186
1202 -2186 -4627 2983 4152 -4455 -861 7619 1788 -4908 505 1742 -3493 -1723 531 -2808 872
1217 872 6131 182 -3498 4451 3900 -6051 -4504 2611 -925 -3271 1970 1701 11 4631 2582 -4558
1233 -4558 -747 4203 -3696 -7122 1928 3786 -2103 439 4222 720 38 2053 -3413 -4665 2655
1248 2655 713 -5896 344 6941 722 -2546 3015 1896 -2766 -725 -1047 -4649 568 4375 -2503
1263 -2503 -2373 6423 3671 -4735 -816 2879 -2490 -3152 603 -1064 -930 4491 1049 -3617 2462 5184
1279 5184 -3860 -4987 2802 1195 -4086 94 2060 -1148 1619 2856 -2891 -2143 4435 -412 -6103
1294 -6103 864 4724 -2100 -2571 2996 1348 -1119 1679 -448 -3205 2191 2736 -4600 -2265 5219
1309 5219 839 -4539 773 3238 -1426 -940 1615 -1793 -678 3204 -1437 -4489 2838 3807 -4144
1324 -4144 -1948 4499 1065 -2798 920 421 -1837 1174 917 -4015 -450 5078 -1020 -4407 2816
1339 2816 3775 -3197 -1938 1871 -1095 -1569 1846 -1285 -1920 4016 2496 -4023 -261 4929 -1570 -4631
1355 -4631 1384 1574 -1790 548 1793 -1356 1521 3481 -2342 -3518 3429 1477 -5100 -1318 3981
1370 3981 -345 -1237 2245 429 -941 2075 -369 -4662 485 3572 -2556 -3173 3956 2757 -2594
1385 -2594 -100 1652 -1790 -581 925 -2869 -1565 3873 1006 -4092 1500 4943 -1975 -3388 1740
1400 1740 322 -2029 552 202 -1940 2438 3297 -2913 -1698 4320 -63 -4637 -117 2642 -1571
1415 -1571 -740 2092 35 -115 3240 -931 -3933 1875 2690 -4123 -2828 3733 1249 -2321 1094 1591
1431 1591 -1343 679 854 -3379 -1195 3434 -1040 -3777 2498 4027 -1740 -1035 2509 -652 -1889
1446 -1889 555 -1190 -2200 2620 2497 -2912 49 4864 -104 -3989 1057 1199 -2622 -619 1106
1461 1106 -1005 1003 3733 -985 -2477 3081 1323 -4690 -2042 2547 -653 -2097 2011 1597 86
1476 86 2307 744 -3465 -89 2521 -3126 -3998 2922 2791 -1927 720 3027 -271 -1078 1015 -2773
1492 -2773 -2817 2315 169 -3432 1647 5312 -380 -2018 2125 289 -3039 -819 -563 -2794 1148 3178
1508 3178 -1185 -876 4619 1214 -4319 -1022 1418 -2612 -2561 1331 -65 153 3337 1001 -2025 1491
1524 1491 2230 -4121 -3420 2042 219 -2135 1170 2880 -17 1000 1249 -2264 -1614 1894 -1572 -4238
1540 -4238 1591 3684 -1095 -641 3233 762 -1531 27 -1390 -2795 685 1355 -3024 212 4922
1555 4922 560 -2843 1173 1548 -2282 -1426 558 -1488 -94 2921 -482 -1700 3021 2448 -3637 -1723
1571 -1723 2095 -1050 -2461 1162 1048 -482 1857 1242 -2382 58 2636 -1753 -3229 2117 2238 -2298
1587 -2298 -263 2407 -136 -904 1139 -1130 -1709 2211 827 -2930 603 3704 -1008 -2546 1573
1602 1573 1089 -1801 -93 1211 -1038 913 2463 -1778 -1690 2711 203 -4156 -622 2736 -477 -711
1618 -711 2160 379 -534 1357 -917 -2956 470 1859 -2186 -1574 3339 2027 -1482 956 1450 -1581
1634 -1581 -1304 -175 -2419 -1021 2758 647 -1939 2394 3602 -1854 -2429 879 -1245 -2747 203
1649 203 509 -480 2427 2949 -1212 -293 2947 -1024 -4807 -388 681 -1661 -489 2547 993 937 2561
1666 2561 -849 -2822 430 90 -4331 -1696 3088 1256 -301 2523 2423 -707 -162 -644 -3104 -1582
1682 -1582 1245 -1082 -1972 3337 3480 -742 -153 1957 -1256 -2315 -632 -1499 -1675 1729 1698 -1199 1400
1699 1400 3615 -439 -2783 394 121 -2568 -762 1154 -437 801 2799 -293 -851 2072 258
1714 258 -3746 -1387 1755 -1148 -1727 1714 1145 -51 1467 732 -2105 227 1449 -2510 -2052 2260
1730 2260 1187 -1791 473 1715 -400 -324 1037 -1168 -1204 1222 -169 -2237 1124 2576 -1532 -1280
1746 -1280 1927 804 -1609 100 49 -1300 921 1587 -1823 -1190 2618 197 -2562 733 2178 -1244
1762 -1244 -816 880 -495 -1155 1096 -701 -1347 1521 2355 -1740 -724 2518 -1 -2599 135 399
1778 399 -1496 -28 667 -855 550 2716 -352 -2231 1163 1162 -2458 -1563 1396 76 -495 1432 880
1795 880 -401 1516 629 -2434 -1006 1668 -1504 -2603 1431 2233 -460 455 1634 -890 -422 357
1811 357 -1898 -2223 1523 1007 -1701 753 3408 -3 -1379 749 -141 -2027 -399 -170 -1605 924
1827 924 2518 -301 -1037 2445 976 -2713 -1019 996 -995 -940 943 139 -49 2402 765 -1810
1843 -1810 560 1647 -2227 -2345 1069 945 -1055 1025 1649 -243 597 922 -1940 -1259 1214 -459
1859 -459 -2402 612 2535 -435 -495 1383 220 -1174 323 -794 -1931 769 1478 -1436 -605 2440
1875 2440 736 -1698 230 953 -1338 -561 562 -713 -341 1632 45 -1435 1484 1760 -1777 -1409
1891 -1409 1151 -212 -1274 961 599 -521 1009 677 -1333 -737 1871 -466 -2017 960 1708 -1182
1907 -1182 -618 1431 278 -136 900 -870 -1246 1031 922 -1868 -470 2155 -153 -1513 689 611
1923 611 -1036 216 614 -944 89 1765 -895 -1288 1607 1442 -2034 -732 1399 -362 -1043 640
1939 640 -335 -895 1238 160 -1576 175 1951 -1234 -1815 1364 867 -1330 234 970 -23 95 1225
1956 1225 -1084 -646 1498 137 -2155 160 2092 -478 -795 930 327 -746 651 12 -1215 690
1972 690 1245 -1566 -759 1870 500 -1775 261 1068 -728 -434 653 -634 -402 1334 -267 -1135 942
1989 942 1703 -1443 -1101 1176 326 -995 296 494 -486 418 866 -1187 -419 1626 -473 -1781 631
2006 631 1359 -943 -482 1080 -144 -523 598 -557 -1059 825 1113 -1602 86 1780 -297 -1606
2022 -1606 360 791 -1080 -84 347 -561 377 1550 -341 -1330 1150 678 -1751 -681 1036 -90 -1007
2039 -1007 724 528 -197 903 157 -1669 -285 869 -942 -1935 1280 980 -877 131 1437 -129
2055 -129 -295 96 -934 -1253 831 745 -1256 410 2179 -68 -1023 970 11 -1454 -332 54 -885
2072 -885 756 1620 -72 -287 1942 380 -1803 -596 407 -998 -709 394 251 229 1599 800 -1121
2089 -1121 384 471 -1834 -1809 766 163 -799 968 1476 84 205 370 -1180 -1673 456 -537 -2008 651
2107 651 1794 201 -9 1452 362 -994 -459 -777 -1627 181 1042 -508 260 2398 794 -1025 275
2124 275 158 -1592 -805 269 -429 -24 1364 659 -237 1227 998 -1602 -1263 505 -725 -1213 551
2141 551 519 335 1110 1035 -792 -97 808 -1379 -1636 476 861 -734 436 1772 204 31 633 -626
2159 -626 -1333 305 -166 -1206 207 1733 -120 -351 993 610 -884 100 -65 -919 -118 1016 -430
2176 -430 -898 1250 812 -1000 211 877 -398 -889 485 -85 -652 443 227 -994 366 1214 -680
2193 -680 -672 773 714 -1038 59 508 -567 -286 733 -641 -660 1310 177 -915 440 971 -692 -933
2211 -933 488 -245 -850 463 309 -196 657 871 -817 -567 621 -502 -1821 144 547 -285 113 828
2229 828 174 297 759 -365 -1462 31 220 -1225 -377 1563 614 -347 828 382 -1032 -191 -161 -1231
2247 -1231 -420 1130 272 -502 1270 925 -451 -205 373 -754 -1008 50 -102 -174 1246 1108 -458 602
2265 602 1194 -675 -1610 -46 43 -626 -95 819 -55 345 1252 -31 -904 444 -378 -1699 -554 1064
2283 1064 -433 -501 1004 487 -132 592 -66 -1313 -132 819 -756 -701 1300 942 -402 332 919 -499
2301 -499 -769 193 -596 -688 647 230 -663 388 1203 -128 -569 517 106 -856 120 -150 -848 40 660
2320 660 -600 -183 822 199 -1118 308 797 -606 -347 282 140 -477 534 47 -818 587 768 -764
2338 -764 -589 999 87 -698 -156 294 -302 -118 286 -448 45 918 -390 -1037 390 931 -721 -470 818
2357 818 -154 -233 309 155 -575 422 320 -969 -486 631 -308 -761 815 754 -362 42 542 -549 -405
2376 -405 332 -764 -941 701 595 -375 193 1280 24 -662 207 -302 -1037 -217 135 -547 467 1186
2394 1186 -61 -522 853 472 -1211 -598 58 -363 -348 659 301 -281 897 365 -976 118 573 -761
2412 -761 -1006 165 624 -142 614 801 -259 210 389 -650 -706 656 -40 -891 226 1060 32 -158
2430 -158 724 -198 -509 178 -219 -641 67 829 -55 -93 1095 546 -722 -19 527 -575 -461 -152 -205 137
2450 137 830 260 -753 413 352 -651 -312 624 175 -429 646 365 -251 535 694 -691 -289 448 -341
2469 -341 -972 509 562 -313 173 765 23 -214 550 -474 -801 372 451 -657 120 999 66 -264 110
2488 110 245 -400 -234 148 -463 -220 733 68 -759 688 471 -476 -165 413 -290 -617 71 -113 -386 575
2508 575 409 -419 48 548 -755 -564 370 460 -552 392 528 -266 169 538 -509 -256 338 -203 -555
2527 -555 -21 776 46 -233 499 257 -564 -186 -46 -660 -173 358 -621 -268 667 228 -486 314 362 -153
2547 -153 -249 452 -250 -319 439 163 -861 195 840 -553 -578 233 53 -425 112 267 -383 194 428 -377
2567 -377 -425 483 -354 -760 170 427 -643 -272 456 221 -131 431 59 -381 355 276 -820 -125 827 -3
2587 -3 -256 597 173 -367 187 253 -331 -140 588 -214 -521 397 401 -479 -437 463 -239 -57 191 173 -307 250
2609 250 602 -474 2 399 -371 -693 455 261 -589 183 409 -262 31 611 -118 -349 242 253 -709 117
2629 117 378 -414 -192 281 358 -288 -298 241 -611 269 652 -317 -489 575 227 -663 -206 493 -301 -14
2649 -14 208 -227 -90 391 131 -552 -27 328 -631 -653 526 -218 -367 470 154 -247 163 288 -267 -502
2669 -502 320 -100 -873 153 454 -204 -270 667 -144 -444 261 53 -602 18 326 -395 -1 832 325 -722
2689 -722 -280 312 -730 -412 220 -206 185 445 24 -422 326 541 -592 -468 551 -135 -550 400 372
2708 372 -9 394 357 -243 -304 183 -523 -634 290 519 -137 -175 506 21 -212 145 -94 -549 353 -70 -452
2729 -452 37 624 280 -70 191 158 -416 -175 58 -263 54 345 -56 -165 392 493 -509 -74 257 -206
2749 -206 -415 239 -53 -356 573 317 -427 83 354 -267 -401 516 -130 -282 26 276 -142 136 262 -436
2769 -436 -444 378 67 -442 -248 401 -239 -437 -204 371 -152 317 237 -116 91 81 -452 -388 500 -243 -550 245
2791 245 315 -269 -64 634 143 -275 356 8 -417 -11 594 -216 -109 514 196 -143 98 16 -196 -169 32
2812 32 -333 84 511 -52 -220 288 466 -368 -275 73 -381 -230 221 89 -229 574 600 -295 -255 309 -194
2833 -194 -871 -67 -82 -210 114 480 -210 418 442 -260 -332 109 -116 -558 136 391 169 0 584 108 -409
2854 -409 -153 -311 -714 -435 215 -236 -436 457 510 -132 -86 194 -444 -211 183 -240 17 309 2 -252 420
2875 420 581 -137 -324 38 -140 -189 -45 221 -272 519 463 -23 -76 162 -27 -662 97 373 63 -221 490
2896 490 -192 -97 94 -290 -391 142 339 -614 -190 324 409 -7 37 604 -443 -27 155 -67 -312 316 -62
2917 -62 -112 79 377 -91 -313 261 -68 -285 224 157 -326 84 350 -266 -104 533 -25 -219 113 108 -205 58
2939 58 361 -101 -270 265 -118 -278 307 162 -542 279 545 -295 -349 339 126 -95 52 55 -113 74 306
2960 306 -114 -66 609 258 -504 42 97 -139 -81 411 16 15 481 -134 -129 59 44 19 -392 253 19 -215 72
2983 72 95 -484 -134 191 -190 -287 486 160 -114 -22 346 -232 -74 101 -276 -169 27 -90 -183 311 509 -265
3005 -265 -91 217 -76 -393 -62 -45 -208 24 -28 -148 -281 245 35 -114 80 145 -438 -327 224 -39 -491
3026 -491 375 403 -118 417 53 -273 -109 294 -229 -267 119 112 -115 -56 119 -246 -28 336 -71 -385 251 223
3048 223 -293 59 233 113 -183 298 -123 -595 -21 -26 -345 123 296 9 -72 78 274 -286 -307 192 -162
3069 -162 -367 0 142 55 95 303 -64 242 -53 -328 -185 239 7 -421 -125 184 -53 36 162 -350 -223
3090 -223 -233 71 -370 16 462 113 96 88 99 -288 68 -212 -374 31 -28 -21 -100 300 243 -404 297 234 -267 5
3114 5 231 -450 -3 168 307 -29 351 442 -284 -260 2 -252 -275 -147 33 -489 152 323 -37 -404 241 -152
3136 -152 -288 -16 287 -153 -281 266 -79 62 77 -188 -206 193 -3 -344 -37 348 173 88 445 114 -418
3157 -418 -68 207 -153 -89 187 -78 -184 657 288 -74 9 -214 -200 -330 -30 -243 -307 158 104 -310 117 286
3179 286 70 -26 -121 276 -233 16 82 -54 218 296 -5 -328 65 280 -206 -83 310 -340 133 688 113
3200 113 -362 156 87 -91 -199 1 -211 -189 343 57 -326 114 87 47 69 117 -214 -110 9 -11 -79 10 233
3223 233 -310 -7 -78 57 -185 242 176 -205 -181 208 -85 139 341 -67 -333 128 119 -194 153 29 49 -277
3245 -277 100 88 19 272 335 -119 -93 -80 -403 -223 -210 51 -148 -128 152 -182 -171 146 -252 -61 -43 285 -234
3268 -234 -39 -49 -58 -116 122 -78 -433 324 60 -440 -66 234 -326 -42 193 -104 -174 -156 146 1 -202 305
3290 305 -138 -225 3 228 -288 -56 333 26 -221 -26 25 -47 -340 108 -1 -42 263 -19 -90 195 4 -1
3312 -1 -66 -84 -167 235 73 156 162 -52 276 -376 170 -105 -84 -84 64 84 93 336 -177 -287 -287 97 77 -206 47 -11
3338 -11 -209 149 263 64 -34 100 267 -17 224 43 -116 96 151 -436 -122 -28 50 -122 316 -37 -243 127
3360 127 230 -3 -113 268 176 -302 76 38 39 85 38 198 -470 -14 455 -281 172 133 -60 24 366 85 -145
3383 -145 88 325 -223 120 163 -165 -98 64 10 -79 93 183 -86 142 48 112 -18 63 149 -86 -29 296 40
3406 40 127 -234 -145 47 -196 -57 -430 321 150 -24 74 192 -121 -241 58 -297 -184 -183 -36 -20 -74 253 134
3429 134 43 187 -283 -305 -319 230 -77 152 175 182 -160 112 110 -138 -165 245 -235 -127 30 131 219 372 176
3452 176 -16 -62 90 114 -324 -11 -128 -187 -14 242 177 -89 -52 -183 -49 29 34 198 91 148 38 -134 87
3475 87 75 33 -44 -332 -56 -280 199 -260 -74 321 164 -253 -21 152 -103 66 -86 -168 -376 232 -148 99
3497 99 155 76 -204 -41 158 111 119 213 244 40 -13 11 65 -376 113 154 -443 -128 -161 -72 -91 -27 -102 -280 73 -186
3523 -186 -451 -120 99 -239 170 235 205 24 -60 143 -92 -246 -15 102 -316 86 -63 -171 -140 37 -78
3544 -78 -27 167 -123 -222 16 26 -72 -20 81 281 -431 -98 35 27 195 -86 -24 213 375 33 -176 -67 -49
3567 -49 -10 -37 -55 -234 -94 134 -92 -123 410 135 -349 212 -2 110 -75 168 5 41 -88 467 244 -185
3589 -185 5 -81 227 208 -60 -492 -26 71 -405 -134 132 -3 -32 72 155 -156 -194 -152 299 -90 -69 88 -31
3612 -31 -70 -241 -296 -13 17 -6 -53 173 -23 -22 115 -26 -47 140 294 -93 -174 72 -66 215 37 103 37 24
3636 24 117 -54 -275 4 172 -170 -61 186 -305 -123 107 -6 -95 94 -8 166 -35 112 -65 -134 -63 141
3658 141 -260 189 -77 193 -45 -38 314 -154 89 107 -492 53 55 -167 -7 -188 134 12 -1 -60 -28 -243 72
3681 72 262 115 228 -99 -54 -83 63 -178 97 58 28 -63 268 -73 -180 -25 4 -148 13 74 7 -132 -337
3704 -337 -47 79 155 189 -101 -15 -140 8 243 -81 -12 -36 -39 145 -112 -126 110 -281 -191 -407 -26 190 169
3727 169 123 78 -78 -197 150 -22 247 -140 -233 -171 232 -81 84 161 120 8 -99 276 -65 70 -16 -52 -173
3750 -173 164 129 62 192 117 240 -231 254 26 -255 -62 398 25 -281 403 253 -138 251 31 -439 154
3771 154 -52 53 -9 197 -25 59 273 356 80 251 161 13 259 237 -171 -75 21 273 8 -190 -43 -209
3793 -209 -114 -56 65 18 351 -55 -180 103 135 -151 -63 114 13 -223 -1 14 -176 59 40 149 -91 93
3815 93 208 -188 -183 -98 -158 -308 41 55 457 -20 5 33 4 44 -173 -417 179 172 -190 -8 159 -213 -133 -62 -46
3840 -46 -12 13 149 -26 -77 133 143 -63 11 74 153 -183 -332 -240 -97 74 -163 -8 -31 23 -48 -25 -204 -147 -249
3865 -249 31 -114 148 378 -3 31 102 602 6 6 189 -129 -181 -133 135 -89 41 222 131 -136 305 324 15
3888 15 36 194 -27 -80 -58 232 -111 -183 140 31 166 -62 -199 -150 161 -67 -235 119 322 -45 -37 35 -95
3911 -95 19 -63 -114 258 226 205 -160 -60 -134 80 0 40 35 -226 -167 266 -75 -74 321 90 16 -44 -102 -122 -71 209
3937 209 -74 162 327 130 -86 -9 148 -313 -11 186 -179 -74 -87 303 -69 -10 102 82 -12 97 137 198
3959 198 124 41 -218 -50 -36 128 -169 -150 -23 -27 -102 -207 -202 46 -66 -269 -64 -188 225 244 -110 -107 -37 -256
3983 -256 102 -147 -42 -118 146 -81 78 1 12 95 422 107 8 -49 205 -91 -44 298 -75 86 112 190 -45
4006 -45 59 59 175 -85 -44 248 -6 105 -153 -122 36 -74 101 -220 -59 9 101 -163 -154 -75 -95 -130 90 74
4030 74 295 157 -60 151 -102 71 -369 113 84 -14 39 -124 92 87 -217 155 -150 -149 500 -465 -54 -114 -106 51
4054 51 -55 26 2 253 2 170 183 -345 39 293 -64 5 -216 118 92 -280 78 84 -2 68 161 107 -22 -53
4078 -53 -257 -278 -273 182 -163 106 65 -361 308 73 38 -101 107 -61 -28 74 -91 -179 -118 -37 -164 32 167
4101 167 -134 -45 -27 -59 229 -145 -180 -52 -35 109 -31 16 2 196 -24 -182 -52 184 -66 -50 95 -121 -270
4124 -270 31 191 -254 -205 -86 -4 -31 254 -178 24 -141 -209 47 -176 -98 -101 -236 48 291 194 -294 -128 -40
4147 -40 154 -124 -34 23 27 320 -121 133 -302 -200 -133 115 196 218 -172 76 -26 -126 72 32 -83 279 116
4170 116 228 280 -31 -152 38 55 -97 184 -25 140 -159 -52 -173 -36 -3 -87 -140 93 -88 135 -55 144
4192 144 -154 -49 8 -111 -6 -48 214 296 -393 169 -146 73 132 -31 297 -8 -3 -168 -124 -178 68 -235 -43
4215 -43 25 28 20 51 -120 -187 -216 -86 -24 -36 -247 -2 -84 105 -31 127 -77 112 -190 -64 -123 151 -266 -23
4239 -23 209 -331 -27 -29 -154 49 290 -78 -75 31 -57 -40 87 -107 174 5 196 -38 -29 -69 -282 268 -263
4262 -263 26 -11 32 -168 114 -338 345 78 138 87 -51 -38 -166 153 114 108 190 80 86 185 77 -25 -326 -158
4286 -158 69 133 43 -102 176 -37 -71 -150 -124 134 96 -2 -213 246 90 -43 -93 37 115 -128 -9 84 97 2
4310 2 -122 -47 -68 133 -174 -99 109 216 126 -126 -11 -16 -363 80 -179 -42 192 -118 81 -115 29 -201 29
4333 29 85 -58 102 62 -187 -128 214 136 83 -141 -51 -245 94 -173 66 211 370 -199 395 -119 20 17 -255
4356 -255 262 37 119 -369 -125 139 -97 64 25 -102 286 111 -115 -19 -164 162 199 -179 49 43 -240 -146
4378 -146 31 -101 89 203 89 71 133 -17 -167 193 214 40 -95 381 55 -305 -14 -14 -60 168 -123 -32
4400 -32 -12 30 -76 0 -63 157 -238 -90 -165 298 -302 18 -24 162 201 -31 -187 -64 390 100 -72 140 98
4423 98 17 304 232 -127 -13 -77 -130 235 53 -249 -15 -131 127 -209 -25 -128 -45 -88 100 333 98 -102
4445 -102 5 123 249 233 -122 -77 254 -3 202 477 39 258 130 204 -113 86 169 12 -150 12 106 176
4467 176 -71 136 -62 -103 -138 94 -8 321 -240 131 181 -182 112 4 46 135 -89 -84 -118 -332 -241 14 292
4490 292 -134 -198 185 459 -64 -132 -182 161 -40 11 67 -316 -199 -370 -17 274 12 -39 177 148 312 -94
4512 -94 2 110 -97 183 200 33 112 -42 -78 -12 -44 -218 107 -94 -32 -37 111 1 -172 51 -180 -22 -49 155
4536 155 106 240 195 321 -74 -28 74 -126 -74 432 83 -72 -65 -267 279 241 210 104 585 -56 25 -4 15 144
4560 144 109 96 -202 144 -355 0 33 278 29 142 -91 -39 -267 165 -334 202 -68 -36 131 17 -227 16
4582 16 225 118 -335 -105 -1 231 317 -170 133 219 -8 28 287 -12 96 20 -177 0 315 86 152 216
4604 216 -113 -3 -113 24 339 -413 223 88 38 225 -82 -219 56 91 -173 308 242 -239 121 -130 63
4625 63 209 -46 188 220 -111 -298 217 -117 -103 -48 177 85 26 187 49 180 -139 -256 -76 -18 18 76 -210
4648 -210 121 99 38 61 -91 207 136 97 -161 115 80 22 227 -181 42 68 124 -48 176 -77 -155 -213 -107 115
4672 115 7 -238 175 -135 -175 -25 -331 -117 -449 54 140 -159 -13 228 12 -341 136 -292 -77 -26 -283
4693 -283 223 -85 -305 -108 147 84 107 50 86 -209 -331 -214 -81 -17 -126 38 304 -91 -28 -36 -168 130 147
4716 147 1 261 -140 139 -116 -49 -244 147 -66 -72 -159 232 25 350 30 18 157 -88 58 29 -197 -166
4738 -166 419 19 -55 -129 -138 -84 164 78 -176 -108 -86 106 -32 -79 177 -56 -29 119 75 -38 99 -90 115 148
4762 148 225 -100 124 -115 75 -39 95 -84 -12 141 -174 -127 299 -127 -262 -141 -50 -117 203 161 -328 -40
4784 -40 -174 246 -83 -98 -15 145 -178 108 124 226 -97 -51 31 104 154 22 -21 -3 147 182 -81 75 -80 174
4808 174 224 105 -129 40 -211 19 147 -158 266 146 -58 249 34 -128 -30 -14 51 85 138 290 -209 75
4830 75 156 -96 -63 -187 -91 62 164 -112 68 80 -76 367 2 472 116 215 -80 -24 -31 -225 50 -95 -84
4853 -84 61 -56 -167 81 -266 -8 -81 -39 -99 -46 -334 -345 -45 -296 -70 26 -48 327 22 32 -153 -12 -152
4876 -152 123 -72 -271 128 -53 115 295 226 94 -166 60 -44 50 -165 -241 38 325 -235 173 -318 -11
4897 -11 2 -68 146 -318 192 80 -167 -34 -60 256 -12 -203 -312 -150 19 -45 -102 179 301 131 148 157 -217
4920 -217 -105 -265 104 -204 215 -250 -128 40 56 -244 36 -234 -94 -102 178 314 51 -40 -190 -113 24 59
4942 59 264 -101 -286 -88 105 -63 -86 -40 -34 232 74 387 -48 -193 76 -31 -145 -34 -124 76 -77 65
4964 65 23 138 -242 142 -274 -147 85 -398 226 29 -54 10 111 -224 -57 193 -5 165 -68 -241 -209 147
4986 147 -484 -218 -259 -204 -237 -270 -171 74 220 -305 -182 84 57 121 -78 -125 39 408 65 -122 -131 -240 -22
5009 -22 151 68 24 126 64 -38 -258 162 -95 -98 -70 -33 274 24 55 -9 95 -31 172 173 31 -24 11 137 22
5034 22 -237 -89 133 -20 19 -288 -291 -78 40 42 -63 128 -220 49 -12 12 -121 -190 301 -94 -133 -175 367 161
5058 161 34 45 96 140 -140 15 -103 33 175 27 -151 -47 -75 37 243 50 -162 214 -51 -100 93 -93
5080 -93 74 -173 117 91 -133 65 -293 77 -167 -111 -131 167 25 62 -108 155 24 -154 182 160 5 -33
5102 -33 153 17 37 -267 -131 -27 262 26 80 -91 207 24 54 -114 -135 174 267 -88 -191 -49 -219 -34
5124 -34 -60 -75 -59 32 -96 79 269 -50 242 427 27 -241 -15 29 -3 158 119 -89 -69 -193 -154 -176 -29 69
5148 69 -112 -118 -78 15 -44 163 291 310 214 -142 218 24 -53 -67 -60 147 247 -161 120 -105 -191 128 -51 139
5172 139 -4 373 34 99 -260 219 -173 122 75 -89 75 -114 199 -39 -109 176 -33 31 18 106 58 -61
5194 -61 -39 2 -76 33 -202 -344 318 -240 -108 -218 68 178 319 -50 -64 -22 24 46 131 264 101 74 127 30
5218 30 -133 -77 -115 117 -59 23 130 -5 -25 81 126 -15 -33 136 -305 174 336 -50 -48 -158 63 325 -10
5241 -10 -99 205 -64 -15 7 234 112 -232 301 -42 10 -141 -98 220 25 16 114 194 -201 -5 -62 -70 211 38
5265 38 136 1 117 -80 -72 53 -70 -59 -285 72 -193 132 -161 98 -196 250 446 58 -145 92 -197 93
5287 93 -105 -96 -75 -130 -40 8 -83 -57 207 -263 137 304 -294 61 127 -146 88 150 -88 -235 49 218 153 357
5311 357 220 -69 90 205 362 21 -110 -137 101 -9 11 -21 114 -150 27 24 -233 -259 -314 -8 -23 41 -175
5334 -175 2 231 -47 410 48 -213 -12 -220 59 47 -194 -8 -91 -309 -79 -265 216 16 88 34 40 -79
5356 -79 -91 -76 -102 215 44 -26 178 -75 256 44 -94 -90 -59 -102 92 27 -203 -73 108 93 -223 -148 -188 135
5380 135 -120 -248 126 53 213 148 -120 48 103 154 -17 175 263 -43 29 46 34 -243 -141 -10 -127 66 -161
5403 -161 -112 -84 -73 220 76 -123 -25 172 268 -434 -83 201 141 262 214 65 -186 -127 -303 -50 49 135 173 351
5427 351 -34 -137 -59 209 -185 -91 -197 -91 304 -183 -125 97 -189 329 294 -83 143 -20 16 32 -80 8
5449 8 10 -31 -153 -291 166 -98 -40 -184 95 -117 102 167 -204 95 26 115 160 134 -1 73 -101 48 98 116 -8
5474 -8 163 -168 -217 -81 -63 -163 -117 152 -373 -158 -57 121 144 159 -24 333 343 -45 -259 -92 -198 52 -17
5497 -17 -103 -116 237 -23 192 22 -157 -300 173 -216 204 169 123 360 -121 -150 287 -106 48 -125 43 166
5519 166 83 223 30 -107 -22 276 -239 -144 -108 45 -11 309 174 -65 36 177 -73 -90 413 -15 72 -200
5541 -200 -285 59 -81 -271 -53 -114 -184 -97 -29 4 135 13 54 35 59 -101 98 -246 -24 103 -125 257 204
5564 204 57 -65 41 0 -27 55 -206 58 -85 -137 -168 -100 145 64 -279 362 -91 6 -323 -21 -83 258 -20
5587 -20 133 83 -263 278 -60 53 113 176 93 6 -157 -41 -182 -177 -135 179 -325 -243 -56 -91 78 303 -288 12
5611 12 -100 -24 289 89 115 1 128 -72 110 447 -194 -17 82 -127 176 89 -220 286 -219 74 -102 160
5633 160 85 -105 -112 224 -3 53 -93 145 224 -292 144 26 -179 -401 22 48 -286 -268 5 9 34 25 101 -184
5657 -184 250 160 80 104 126 -144 -225 204 147 -51 235 -306 87 -183 -156 -8 -61 -50 -84 -138 17 -67 -162 -6
5681 -6 -16 9 174 22 -153 -4 -135 -79 180 88 278 42 74 -41 120 307 -113 -180 -199 106 -61 -146 100
5704 100 134 -218 -352 264 -106 60 52 -67 84 -121 75 46 209 -35 66 235 3 -88 -101 252 -204 -256
5726 -256 -39 27 -4 -192 -41 -63 -114 163 -152 -169 45 -198 -118 130 141 -61 175 -15 74 220 366 -227 270
5749 270 -98 -20 136 43 -183 -130 -20 -34 44 214 184 321 117 16 -22 169 30 -71 56 5 -110 -44 -102
5772 -102 -80 -20 23 347 -104 -419 -266 -165 -86 5 -173 -231 72 -209 -16 114 -52 -93 -59 -49 48 -144 14
5795 14 -14 -242 -35 -173 -16 271 -239 -138 59 -32 -99 83 -248 -199 -103 38 22 68 -21 137 -283 -141 -87
5818 -87 46 78 -188 150 7 -186 200 142 223 -167 15 -60 132 -141 -74 60 -11 -198 193 -192 113 62 -142
5841 -142 75 -14 -274 88 -194 -271 185 -449 -16 -11 74 -178 172 -100 70 187 -59 22 -185 -67 -86 350
5863 350 -176 -72 107 118 56 373 22 -124 15 247 -52 -82 340 113 -264 -36 -223 -92 143 20 -30
5884 -30 -39 -20 365 -14 34 212 196 171 -114 -521 250 -57 -76 127 -88 107 136 15 -268 -7 105 137 182 -15
5908 -15 230 244 -386 -96 274 97 182 -127 -396 272 -189 19 213 196 -31 -62 163 -19 251 -20 2 80
5930 80 -52 -327 49 32 -178 -30 -68 41 -113 -149 -233 -299 129 -21 -68 216 -78 154 367 -161 -75 -70 136
5953 136 -209 224 -40 -126 -258 75 -19 -148 -106 -197 -11 18 205 -351 -3 -65 203 65 83 -67 107 295
5975 295 21 -356 -89 159 308 -84 346 -123 115 227 37 194 -104 -73 77 168 62 -268 -96 507 90
5996 90 -139 72 -19 92 141 91 24 -165 46 116 195 4 -350 -8 -21 -83 123 152 327 -264 -475 -23 128
6019 128 154 47 50 -147 105 -1 -52 -37 3 -4 115 -325 -100 35 -52 -150 -13 3 -173 -119 67 300 -175 -137
6043 -137 -143 -12 -190 -202 -48 183 99 -80 -89 131 72 -155 -192 -153 62 -117 -19 159 121 -168 -50 41 133 142 287
6068 287 25 -146 -151 -44 -38 31 -193 89 49 -146 82 26 -331 -259 -171 -120 -134 93 270 -88 -92 30 -121 64
6092 64 -22 319 -230 72 -78 -121 -12 -135 76 161 -41 -307 -242 -30 96 -32 52 -60 -84 205 -124 -137 -115
6115 -115 334 -90 56 -140 -1 -70 164 -60 -42 -141 -71 -260 25 -229 129 135 107 -81 -82 -165 -23 -405 -5
6138 -5 -154 131 165 -87 109 -134 -95 -180 -277 267 -24 -10 153 -179 87 58 -25 -75 -138 255 429 43 119 -101
6162 -101 -23 155 -47 18 138 -212 -38 184 40 201 141 21 364 -91 -48 -324 33 -222 43 -147 -12
6183 -12 134 33 -3 53 -261 73 34 -3 31 195 13 49 -39 -136 178 118 -73 44 -4 129 94 -265 15 159
6207 159 74 -136 -324 127 65 63 266 -11 87 205 -3 -452 81 -365 305 20 -135 -54 12 187 -268 20
6229 20 58 5 55 -144 -39 -174 189 44 66 294 228 -53 302 -47 -20 2 83 -147 30 62 -357 -89 -90 175
6253 175 181 -325 -216 94 -119 -66 -39 32 -263 -89 153 -236 -3 -216 9 353 238 65 -264 252 115 130
6275 130 51 -256 74 172 -273 -17 112 -21 -159 6 64 -190 8 -30 57 -55 -194 19 190 -138 271 36
6297 36 143 -191 78 196 -135 7 -189 -135 -80 149 -182 -103 342 -307 108 165 -113 102 -75 78 104 -122
6319 -122 -6 -80 125 -171 -155 6 -135 222 35 -196 -104 34 149 -69 -137 96 -37 -61 142 215 -107 35
6341 35 -296 -96 22 -241 -87 51 -195 42 -14 112 -128 -345 -353 -161 146 90 115 -91 238 60 -174 -59
6363 -59 -51 73 159 82 -147 100 -154 178 56 64 51 59 -309 -190 67 -111 -208 -67 175 197 -206 133 31 205
6387 205 -57 -2 243 -116 -21 52 -24 -111 107 -178 219 -158 -60 -43 225 -179 -86 143 149 62 -76 -106 9 -47
6411 -47 0 -284 -9 85 -79 -262 -8 160 107 -78 77 14 78 86 -202 157 -1 156 8 148 -49 112 -74
6434 -74 -13 7 -101 15 109 75 40 414 523 -43 -108 -133 -45 73 216 77 -81 -51 295 -5 74 134 183 180 135
6459 135 15 144 61 205 268 -27 -233 128 151 62 -189 160 63 -24 -103 112 -64 11 -321 143 -415 -154 249
6482 249 -160 -97 116 -257 134 282 -158 -133 -64 284 -91 -78 92 95 23 198 -86 -304 266 55 274 -124
6504 -124 -102 269 101 96 84 -66 -110 181 -90 -20 171 144 -110 18 82 123 74 -208 -90 -162 -124 -101 -171 -314 -228
6529 -228 -30 200 9 -108 -214 232 362 -45 228 -98 237 -513 -172 264 217 115 -127 13 -190 223
6549 223 72 -231 175 144 -119 -383 -165 -304 -52 -71 -115 -179 148 -10 160 -18 -198 104 24 -10 -256 -113
6571 -113 -102 -171 36 14 -52 -146 -173 -131 154 -207 140 58 111 -175 166 122 -85 103 -180 -1 210 -247 127
6594 127 -146 1 68 57 -132 97 -33 -109 -50 -11 -47 106 329 -23 -115 3 -2 -86 50 -57 125 -39 -125 -112
6618 -112 120 53 201 -124 -223 -19 193 148 34 -295 49 -169 128 -24 -75 88 1 -197 -225 -21 167 38
6640 38 129 -130 -96 -79 -131 11 479 -69 -133 -25 157 -167 85 76 554 34 -164 41 -113 -66 235 45 21
6663 21 -106 134 203 -293 -26 -57 248 101 -169 118 -209 59 269 -198 12 -273 -183 -22 348 -147 111
6684 111 17 92 -5 170 128 -333 517 -47 161 -45 217 -42 -107 -154 -251 -40 287 -237 85 297 -175 -141 37
6707 37 23 19 -78 -269 169 174 117 25 199 14 -138 -24 63 79 11 95 207 -141 48 31 104 120 -136 31 47 -71
6733 -71 -12 -35 -38 -177 -62 163 33 115 -110 -49 -43 -96 -19 -98 233 40 -169 33 15 -418 339 -195 -48 -234
6757 -234 164 -141 -225 76 175 -188 -105 -18 -189 8 10 -78 -76 -192 104 141 114 5 90 118 15 165 128 47 53 182
6783 182 121 -55 -351 -117 144 -31 32 118 -66 -436 -202 56 -201 10 166 8 -130 19 84 229 -24
6804 -24 -122 -22 134 73 36 -301 -118 69 210 93 353 121 -161 389 108 -88 -306 27 71 4 319 -44
6826 -44 24 16 56 -80 -82 -362 51 -17 -59 178 -161 208 -112 34 38 -43 114 -225 190 -10 254 61 295 66
6850 66 -23 -186 -61 -233 -141 71 -136 106 178 343 -465 -98 146 109 -104 87 192 44 69 -46 -210 -82
6872 -82 14 -297 -42 -5 -111 176 -148 28 -20 -258 6 -75 -91 -54 -103 371 -51 -1 -259 -68 -166 -328 -22
6895 -22 -97 -153 -246 82 -64 -104 -324 245 -259 -56 283 83 -45 -296 176 -65 223 30 -222 196 -45 -115
6917 -115 -42 -241 -2 58 179 43 14 55 -14 231 34 174 -179 -82 44 -112 -299 58 40 -51 -82 -47 9 97
6941 97 -166 -236 83 -214 26 19 -72 101 -12 57 13 38 346 -72 -97 68 -78 86 18 -256 -48 42 -33 -75
6965 -75 196 107 67 36 61 -167 -107 -182 -22 95 54 -174 -12 290 68 13 27 35 81 -169 152 242 -30 127 -53
6990 -53 -144 -284 28 266 -234 -180 312 105 -78 147 57 346 -205 33 -275 389 4 61 -47 -72 -29 55 119
7013 119 -7 -81 139 -19 -130 -168 -45 59 58 38 -184 -47 127 292 201 293 49 -170 -173 150 20 148 320
7036 320 105 -245 7 51 323 37 198 -19 -173 104 -135 -62 -45 144 -85 -61 308 -159 64 -90 65
7057 65 -28 24 -153 44 -155 -129 360 -122 91 124 -152 158 -191 115 46 -91 -63 160 126 58 -124 169 9
7080 9 21 266 -203 -278 7 -266 294 78 -108 29 19 -193 -357 -165 129 -265 -41 -29 -58 -38 121 97 101 122
7104 122 -73 16 -97 55 -90 -195 -58 120 -323 99 -246 243 -45 34 71 57 -135 66 155 -240 103 -35
7126 -35 -193 287 98 -299 104 256 96 155 217 -165 234 -228 122 -148 -53 -191 -47 -37 158 -39 123 14
7148 14 379 40 -128 59 211 2 -42 75 132 31 91 -72 164 -286 173 -91 -132 -89 189 -57 -233 -239 88
7171 88 261 -72 -170 122 99 211 -1 99 279 -173 127 -14 -107 54 66 -198 37 -140 -279 141 -262 -114
7193 -114 -288 15 -48 -64 138 79 148 -244 -110 -153 207 81 -24 -52 -3 234 -208 264 50 -131 -350 -141
7215 -141 276 -40 85 -38 -179 -161 205 5 -154 324 224 68 239 -187 -206 -41 101 -362 -28 5 -230
7236 -230 -53 -140 191 -39 -308 186 -298 243 57 -80 -190 125 -8 -104 -91 -127 167 116 53 8 -3 64 -78
7259 -78 48 5 -155 188 -140 -558 -158 -255 115 -125 -65 -14 270 -122 -65 187 158 223 -66 6 170 76 -129
7282 -129 -33 19 16 211 -105 -17 -57 -95 182 -165 14 -184 181 126 -51 -64 -53 -35 43 -146 307 2 191 -195
7306 -195 185 97 -200 206 -216 295 95 -111 31 -14 262 97 -221 -138 -54 -82 -27 60 122 77 25 64 -282 -188
7330 -188 36 97 293 38 14 228 266 -267 -135 111 65 59 19 -7 -11 113 -332 -241 3 130 170 -84 106 215
7354 215 32 -116 170 -244 -120 41 148 -100 80 -77 47 -28 -1 -118 -45 91 384 4 -71 -252 92
7375 92 138 -23 -303 -86 -97 -138 174 -138 350 -20 -214 -81 -110 141 52 279 88 -165 -114 -156 238 -93 214
7398 214 -17 -25 104 -111 250 126 -160 -22 2 38 -69 208 -24 156 73 -72 110 -248 14 48 169 -101
7420 -101 306 11 94 354 -93 136 38 129 56 33 127 -14 -24 -116 119 25 155 66 195 187 -192 96 -89 -14
7444 -14 -45 -36 107 142 334 88 43 256 -154 64 -35 122 203 205 330 -24 -17 67 -94 -58 65 199 53 79 146
7469 146 32 20 -89 -351 229 4 -316 -87 -168 191 -234 -154 -73 231 211 317 -76 192 -40 152 14 389
7491 389 170 107 4 -65 32 84 87 -71 4 74 -114 -150 181 88 135 -35 -25 23 -120 -32 -69 252 -328 81 265
7516 265 245 -203 -132 -273 106 207 -27 24 94 53 -24 -65 114 -47 -267 -206 -215 -286 81 -211 96 19 -266 -134
7540 -134 -32 -27 320 53 57 -281 105 -244 -106 -102 -95 289 -195 77 303 -13 254 86 59 127 88 295 -248 141
7564 141 -158 -27 -241 -27 257 -4 -73 -140 136 283 -50 198 23 -273 85 290 184 -44 -57 -150 134
7585 134 -71 84 12 39 -185 -122 170 244 82 109 66 158 -197 -201 114 -71 219 112 175 66 -6 71 -357 36
7609 36 -13 -57 -278 -112 91 -2 198 -29 -232 -4 -23 159 -1 -54 -218 -68 -60 116 -100 -3 -168 -213 30
7632 30 -198 65 198 -59 -77 73 -11 270 61 40 -162 27 77 -73 148 2 71 74 -199 -171 -135 172 83 -236
7656 -236 65 56 159 169 253 43 113 0 -34 43 -120 -185 -110 -54 284 56 104 -12 135 337 -61 173 -9 223
7680 223 63 -79 -73 110 139 12 3 -16 -29 93 64 -32 -56 -163 238 -230 0 16 -179 -146 151 198 -116 19
7704 19 43 28 81 161 20 206 6 123 71 283 40 -63 77 3 -98 74 -230 -85 72 -82 -121 131 246
7727 246 88 -441 -9 -31 -22 209 239 389 157 162 -113 90 241 8 -168 -75 2 -4 -373 -57 -329 276 -50
7750 -50 196 -148 -32 208 171 -9 122 112 -111 35 58 -2 -41 52 31 46 218 31 -374 250 69 -116 -274
7773 -274 109 -503 31 259 -26 -309 125 69 106 -103 -247 67 -75 157 35 159 190 -33 205 -39 103
7794 103 -155 183 -18 187 -178 16 155 33 222 113 102 -235 102 176 -271 132 -32 163 -71 -285 -42
7815 -42 -26 114 -352 161 -105 -45 -11 -154 -256 20 205 370 9 30 -184 -3 -37 -125 125 32 119 144 201 -161
7839 -161 134 179 -55 272 -17 -168 -73 140 137 76 141 -35 -185 -66 80 -71 -332 -264 -246 91 -9 165 74
7862 74 -320 38 -124 -132 -208 -33 45 14 -167 -157 -206 -53 204 -77 163 187 -166 221 -143 187 232 -119 86
7885 86 76 -113 -13 145 72 246 23 -126 -267 301 -18 77 222 -109 256 148 -94 70 -51 -132 15 -40
7907 -40 -124 -193 173 24 -219 -163 77 150 -168 -96 137 63 -197 360 162 -14 127 -30 25 -174 -353 -18 86
7930 86 45 -104 -209 45 -99 -146 -95 58 206 -94 -19 -45 127 122 -383 15 41 393 -153 -168 219 73 233
7953 233 95 -39 -25 -48 -11 70 -162 33 -129 228 -188 388 -209 360 -133 36 45 -373 214 102 -145 -196
7975 -196 -161 133 123 -87 94 16 -74 -141 -53 -304 -164 49 25 88 100 -346 -247 54 19 -77 18 -65 64 -218 -16
8000 -16 64 107 -47 89 22 136 291 22 60 -29 -7 26 94 -129 46 -111 25 -138 -252 -189 232 -39 -13 -65
8024 -65 -65 -38 160 153 145 -209 -123 132 -13 71 335 281 188 -150 -253 -54 -100 22 30 -104 77 176 -15 -81 35 -58
8050 -58 107 37 129 -163 -76 75 18 -128 -201 95 108 -33 290 209 -22 124 95 -125 314 114 51 -46 -224 -159
8074 -159 -171 82 -10 -230 147 46 -71 58 -115 -118 -149 144 -13 -191 -2 -45 -15 -97 -54 124 -337 178 -41
8097 -41 87 176 -87 -63 97 -7 -326 -203 70 -71 -202 -150 279 3 -18 66 -156 127 106 -186 113 -156
8119 -156 -90 -314 173 28 243 3 -89 228 164 164 157 -222 256 81 83 31 -379 -51 -160 -162 -33 278 8 137
8143 137 -179 4 -297 -24 90 -125 -15 -32 -287 -159 61 -93 59 244 104 -270 -170 -37 305 45
8163 45 -179 -227 -69 111 156 -109 33 -81 153 -115 1 -92 107 -73 -115 48 -112 134 -49 -165 61 -178
8185 -178 178 69 -192 58 154 45
8191D5
##END NTUPLES=NMR FID
##END=
