##TITLE=1H_Ser 2188-ox
 CDCl3
 8 sc, 
 4.7.2024
##JCAMPDX= 6.0         $$ Bruker NMR JCAMP-DX V2.0
##DATA TYPE= NMR FID
##DATA CLASS= NTUPLES
##ORIGIN= UXNMR, Bruker Analytische Messtechnik GmbH
##OWNER= root
$$ XWIN-NMR		Version 3.5
$$ Thu Jul  4 14:28:05 2024 Russian Standard Time (UT+4h)  she@DPX200
##.OBSERVE FREQUENCY= 200.1314
##.OBSERVE NUCLEUS= ^1H
##.DELAY= (6, 6)
##.ACQUISITION MODE= SIMULTANEOUS
##.ACQUISITION SCHEME= undefined
##.AVERAGES= 8
##.DIGITISER RES= 18
##SPECTROMETER/DATA SYSTEM= spect
##.PULSE SEQUENCE= zg30
##.SOLVENT NAME= DMSO
##.SHIFT REFERENCE= (INTERNAL, DMSO, 0, 15.7039)
##AUDIT TRAIL= $$ (NUMBER, WHEN, WHO, WHERE, WHAT)
$$ ##TITLE= Audit trail, XWIN-NMR		Version 3.5
$$ ##JCAMPDX= 5.01
$$ ##ORIGIN= Bruker BioSpin GmbH
$$ ##OWNER= she
$$ F:/spectra/data/she/nmr/H-F/1/audita.txt
$$ ##AUDIT TRAIL=  $$ (NUMBER, WHEN, WHO, WHERE, WHAT)
(   1,<2024-07-04 14:26:36.73 +0400>,<she>,<DPX200>,
      <created by zg, POWCHK disabled, PULCHK disabled
       configuration hash MD5:
       00 E9 B6 7A A2 85 ED C7 34 08 36 98 17 FE 4E 26
       data hash MD5: 16K
       A0 46 5C CE 13 67 0E 5A 7B 7D 92 39 30 6B F6 AD>)
$$ ##END=
$$ 
$$ hash MD5
$$ F7 B4 B8 FD DE 41 19 45 8D A7 5A 16 30 BF 56 A3
##$RELAX= 
##$RELAX= 
##$RELAX= 
##$RELAX= 
##$RELAX= 
##$RELAX= 
$$ Bruker specific parameters
$$ --------------------------
##$DU= <F:/spectra>
##$EXPNO= 1
##$NAME= <H-F>
##$PROCNO= 1
##$TYPE= <nmr>
##$USER= <she>
##$AMP= (0..31)
100 100 100 100 100 100 100 100 100 100 100 100 100 100 100 100 100 100 
100 100 100 100 100 100 100 100 100 100 100 100 100 100 
##$AQSEQ= 0
##$AQ_mod= 1
##$AUNM= <au_zg>
##$AUTOPOS= <>
##$BF1= 200.13
##$BF2= 200.13
##$BF3= 200.13
##$BF4= 200.13
##$BF5= 200.13
##$BF6= 200.13
##$BF7= 200.13
##$BF8= 200.13
##$BYTORDA= 1
##$CFDGTYP= 0
##$CFRGTYP= 5
##$CHEMSTR= <none>
##$CNST= (0..31)
1 1 145 1 1 1 1 1 1 1 1 1 1 1 1 1 1 1 1 1 1 1 1 1 1 1 1 1 1 1 1 1 
##$CPDPRG= <>
##$CPDPRG1= <>
##$CPDPRG2= <>
##$CPDPRG3= <>
##$CPDPRG4= <mlev>
##$CPDPRG5= <mlev>
##$CPDPRG6= <mlev>
##$CPDPRG7= <mlev>
##$CPDPRG8= <mlev>
##$CPDPRGB= <>
##$CPDPRGT= <>
##$D= (0..31)
0 1.2 0 0 0 0 0 0 0 0.06 0 0.03 0 0 0 0 0.0002 0 0 0 0 0 0 0 0 0 0 0 0 
0 0 0 
##$DATE= 1720088796
##$DBL= (0..7)
120 120 120 120 120 120 120 120 
##$DBP= (0..7)
150 150 150 150 150 150 150 150 
##$DBP07= 0
##$DBPNAM0= <>
##$DBPNAM1= <>
##$DBPNAM2= <>
##$DBPNAM3= <>
##$DBPNAM4= <>
##$DBPNAM5= <>
##$DBPNAM6= <>
##$DBPNAM7= <>
##$DBPOAL= (0..7)
0.5 0.5 0.5 0.5 0.5 0.5 0.5 0.5 
##$DBPOFFS= (0..7)
0 0 0 0 0 0 0 0 
##$DE= 6
##$DECBNUC= <off>
##$DECIM= 24
##$DECNUC= <off>
##$DECSTAT= 4
##$DIGMOD= 1
##$DIGTYP= 9
##$DL= (0..7)
0 120 120 120 120 120 120 120 
##$DP= (0..7)
150 150 150 150 150 150 150 150 
##$DP07= 0
##$DPNAME0= <>
##$DPNAME1= <>
##$DPNAME2= <>
##$DPNAME3= <>
##$DPNAME4= <>
##$DPNAME5= <>
##$DPNAME6= <>
##$DPNAME7= <>
##$DPOAL= (0..7)
0.5 0.5 0.5 0.5 0.5 0.5 0.5 0.5 
##$DPOFFS= (0..7)
0 0 0 0 0 0 0 0 
##$DQDMODE= 0
##$DR= 18
##$DS= 0
##$DSLIST= <SSSSSSSSSSSSSSS>
$$ [...]
##$SUBNAM2= <"">
##$SUBNAM3= <"">
##$SUBNAM4= <"">
##$SUBNAM5= <"">
##$SUBNAM6= <"">
##$SUBNAM7= <"">
##$SUBNAM8= <"">
##$SUBNAM9= <"">
##$SW= 24.0689651099613
##$SWIBOX= (0..15)
0 0 2 0 0 0 0 0 0 0 0 0 0 0 0 0 
##$SW_h= 4816.95568400771
##$TD= 16384
##$TD0= 1
##$TE= 0
##$TE2= 300
##$TE3= 300
##$TEG= 300
##$TL= (0..7)
0 120 120 120 120 120 120 120 
##$TP= (0..7)
150 150 150 150 150 150 150 150 
##$TP07= 0
##$TPNAME0= <>
##$TPNAME1= <>
##$TPNAME2= <>
##$TPNAME3= <>
##$TPNAME4= <>
##$TPNAME5= <>
##$TPNAME6= <>
##$TPNAME7= <>
##$TPOAL= (0..7)
0.5 0.5 0.5 0.5 0.5 0.5 0.5 0.5 
##$TPOFFS= (0..7)
0 0 0 0 0 0 0 0 
##$TUNHIN= 0
##$TUNHOUT= 0
##$TUNXOUT= 0
##$USERA1= <user>
##$USERA2= <user>
##$USERA3= <user>
##$USERA4= <user>
##$USERA5= <user>
##$V9= 5
##$VALIST= <valist>
##$VCLIST= <CCCCCCCCCCCCCCC>
##$VD= 0
##$VDLIST= <DDDDDDDDDDDDDDD>
##$VPLIST= <PPPPPPPPPPPPPPP>
##$VTLIST= <TTTTTTTTTTTTTTT>
##$WBST= 1024
##$WBSW= 4
##$XGAIN= (0..3)
0 0 0 0 
##$XL= 0
##$YL= 0
##$YMAX_a= 71360
##$YMIN_a= -99907
##$ZGOPTNS= <>
##$ZL1= 120
##$ZL2= 120
##$ZL3= 120
##$ZL4= 120
##$ABSF1= 10
##$ABSF2= 0
##$ABSG= 5
##$ABSL= 3
##$ALPHA= 0
##$AQORDER= 0
##$ASSFAC= 0
##$ASSFACI= 0
##$ASSFACX= 0
##$ASSWID= 0
##$AUNMP= <proc_1d>
##$AZFE= 0.1
##$AZFW= 0.1
##$BCFW= 1
##$BC_mod= 2
##$BYTORDP= 1
##$COROFFS= 0
##$CY= 11.3945322036743
##$DATMOD= 1
##$DC= 2
##$DFILT= <>
##$DTYPP= 0
##$F1P= 15.6554695791079
##$F2P= 12.8336369535428
##$FCOR= 0.5
##$FTSIZE= 0
##$FT_mod= 4
##$GAMMA= 1
##$GB= 0.15
##$INTBC= 1
##$INTSCL= 1
##$ISEN= 128
##$LB= 0.24
##$LEV0= 0
##$LPBIN= 0
##$MAXI= 10000
##$MC2= 0
##$MEAN= 0
##$ME_mod= 0
##$MI= 1.114404
##$NCOEF= 0
##$NC_proc= 0
##$NLEV= 6
##$NOISF1= 3.799351
##$NOISF2= 2.8
##$NSP= 1
##$NTH_PI= 0
##$NZP= 0
##$OFFSET= 15.70392
##$PC= 1
##$PHC0= -25503.03
##$PHC1= 10.38748
##$PH_mod= 1
##$PKNL= yes
##$PPARMOD= 0
##$PSCAL= 0
##$PSIGN= 0
##$REVERSE= no
##$SF= 200.130013532006
##$SI= 16384
##$SIGF1= 3
##$SIGF2= 2
##$SINO= 400
##$SIOLD= 16384
##$SREGLST= <1H.CDCl3>
##$SSB= 0
##$STSI= 0
##$STSR= 0
##$SW_p= 3612.71676300578
##$SYMM= 0
##$S_DEV= 0
##$TDeff= 0
##$TDoff= 0
##$TI= <>
##$TILT= no
##$TM1= 0
##$TM2= 0
##$TOPLEV= 0
##$USERP1= <user>
##$USERP2= <user>
##$USERP3= <user>
##$USERP4= <user>
##$USERP5= <user>
##$WDW= 1
##$XDIM= 8192
##$YMAX_p= 0
##$YMIN_p= 0
$$ End of Bruker specific parameters
$$ ---------------------------------
##NTUPLES= NMR FID
##VAR_NAME=  TIME,          FID/REAL,        FID/IMAG
##SYMBOL=    X,             R,               I
##VAR_TYPE=  INDEPENDENT,   DEPENDENT,       DEPENDENT
##VAR_FORM=  AFFN,          ASDF,            ASDF
##VAR_DIM=   8192,          8192,            8192
##UNITS=     SECONDS,       ARBITRARY UNITS, ARBITRARY UNITS
##FACTOR=    0.0002076,     1,               1
##FIRST=     0,             0,               0
##LAST=      1.7004516,     0,               0
##MIN=       0,             -99907,          0
##MAX=       1.7004516,     71360,           0
$$ Real data points
##PAGE= N=1
##DATA TABLE= (X++(R..R)), XYDATA
0 0 0 0 0 0 0 0 0 0 0 0 0 7 -7 7 -7 7 -12 14 -14 19 -21 22 -28 33 -34 41 -47 54 -61 68 -76 84 -95 106 -118
35 -118 131 -145 164 -179 200 -221 245 -272 300 -333 369 -410 459 -513 577 -655 747 -863 1008
54 1008 -1207 1483 -1896 2591 -3951 7634 -40591 -99907 -16027 -19535 -59815 -8315 42907 12814
68 12814 20775 49548 2565 -41249 -9565 -25871 -76038 -37135 29920 13400 323 47981
80 47981 46580 -2883 1766 -1064 -44988 -35784 2564 -13161 -15614 43280 54679 3913 4775 26810
94 26810 -8797 -33605 -14261 -14852 -22725 8635 27242 2992 12843 39253 1841 -32270 -4284
107 -4284 3758 -26877 -19817 9672 3211 3557 24093 7364 -10257 9800 5573 -25533 -17515 13697
121 13697 2834 -17800 4360 16659 44 2177 6747 -8443 -5521 11005 -3069 -17330 7385
134 7385 14606 -14171 -11190 11905 6518 -4808 1275 3391 -2430 5911 5342 -14496 -8140 10049
148 10049 -3366 -14451 5036 16759 1801 -2813 5997 346 -2807 63 -12205 -12649 5826
161 5826 7557 -5702 1783 18343 7543 -7790 -2162 -1249 -6692 -5177 -6562 -7601 5912 16002
175 16002 2411 -4206 11553 7758 -12130 -10028 -1833 -4912 -4370 1308 804 4736 16159 6405
189 6405 -10717 -81 8144 -9913 -16068 492 4779 -2878 4443 8394 421 7571 7963 -12788
203 -12788 -11617 7408 11 -16431 -1384 13961 1899 -757 9225 1288 -3486 3464 -4701 -15096
217 -15096 459 11782 -8033 -9267 16289 11549 -7705 22 5831 -6893 -5587 3348 -7674
230 -7674 -6590 13665 5093 -12234 5045 16239 -5264 -13206 4014 2247 -9373 880 4699
243 4699 -6370 3718 12564 -6029 -8834 12059 5143 -17308 -3898 12405 -2945 -5935 5683
256 5683 660 -3445 7005 3338 -10898 368 11841 -7484 -11745 10366 8234 -9169 -3630
269 -3630 7055 -1351 -1884 6487 -3976 -6453 9177 3492 -12552 -442 12050 -3171 -11169 5727
283 5727 7429 -3353 975 1466 -5580 432 6494 -5225 -8996 7454 6494 -10094 -1295 12066
297 12066 1344 -6506 6 -322 -3224 2847 1720 -8404 1085 11252 -1585 -7158 5836 6171
311 6171 -7076 -6612 3057 682 -1394 2922 -2459 -2173 7488 4540 -7228 -3678 6958 -2139 -9325
326 -9325 1786 5961 -816 -241 504 -1159 2808 4878 -4445 -8030 3939 4251 -6338 -1602 6908
341 6908 2516 -2959 -437 1224 77 2680 -2059 -8160 1405 7699 -1843 -4865 4209 4918 -3723
356 -3723 -2957 2379 -1057 86 440 -5596 -601 8317 2755 -7428 -206 7277 -2074 -5954 1802
371 1802 537 -2258 970 -188 -1988 4809 6660 -6222 -6471 7205 2627 -8109 -1432 4565 -631
386 -631 -1533 3435 102 -910 5408 -1822 -10205 2227 7466 -4973 -6830 5702 5813 -2970 1301
401 1301 3344 -3793 -733 1794 -6974 -3929 8585 3471 -8271 1661 11589 -1338 -5940 2366
415 2366 -1628 -5907 319 652 -4794 4295 10341 -3524 -5299 9151 3739 -10820 -5026 3185 -2798
430 -2798 -3008 5638 1762 -398 8631 2614 -9404 -1355 5493 -7076 -11357 4635 7212 -2273 3650
445 3650 6666 -322 -82 1828 -7189 -9508 2655 2684 -7915 1410 13793 4073 -3408 2389 1386
460 1386 -6570 -4711 -1979 -6951 -527 9499 1976 -1983 9577 7785 -7267 -7958 1035 -3431 -7571
475 -7571 143 2565 1349 8266 7495 -2731 -2310 4360 -4295 -13564 -1826 5165 -2470 -494 7537
490 7537 5445 1457 3170 -2130 -9161 -1432 1661 -7907 -4090 9087 6322 -2195 2037 7043 -1575
505 -1575 -4965 -1701 -5379 -3785 4409 1055 -4020 3841 7976 -1862 -5115 3323 1316 -6568 -3256
520 -3256 601 -488 2202 3679 -1697 -1457 6435 2148 -6946 -1554 4362 -2094 -5009 1025 2581
535 2581 -757 1358 458 -2508 3417 4603 -3681 -4950 2907 1604 -5326 -2182 3269 798 53 2413
551 2413 563 1728 3246 -1912 -7281 -1048 3693 -2920 -3978 4108 4065 650 1473 1161 -906 -336
567 -336 -1783 -6783 -3362 5520 2141 -3206 2196 6477 1223 -2066 -683 -2005 -3239 -1013 -2160
582 -2160 -2493 5301 5604 -1576 -893 4501 2815 -5646 -3247 -1069 -2448 -143 1033 22 3735 5537
598 5537 -165 -4263 792 3454 -4660 -5619 695 1108 950 2379 1614 461 2521 1511 -5311 -2366
614 -2366 4265 -1654 -6151 370 4369 1639 -257 1964 51 -181 1169 -2588 -4299 1067 2343
629 2343 -3329 -2633 5859 4239 -2737 -545 729 -904 -334 -602 -3924 -869 4582 890 -4325 2516
645 2516 6346 -2211 -4506 766 889 -1566 -389 -81 -1996 2363 3661 -2296 -894 4698 -204 -5801
661 -5801 -415 4648 -253 -2927 908 346 -166 2693 -49 -3398 1100 3656 -3519 -3965 5188 2747
677 2747 -4639 -1428 1635 -884 56 1787 -1424 -910 5345 1447 -5848 -142 3196 -3799 -4897 2728
693 2728 2918 -569 1858 2197 -1530 1939 2275 -6192 -5207 2613 935 -4238 1765 7423 1512 -1045
709 -1045 1804 -1256 -2539 -25 -2438 -5348 1138 5762 -829 -1007 6005 2116 -4113 -2060 -1748 -4132
725 -4132 -1153 1257 -1739 1729 9405 3512 -3815 1154 2817 -4654 -6110 -282 63 -647 4155 3136
741 3136 530 5124 3973 -5474 -5632 1670 -1045 -6044 829 5464 1304 2532 4564 -69 -1251
756 -1251 1034 -3540 -6786 1025 4970 -2202 -9 8236 4370 -1384 403 -222 -3989 -1920 -96
771 -96 -4772 -1329 6794 1760 -3144 2769 4099 -3545 -5211 106 -1866 -3376 2024 929 -854 5638
787 5638 5605 -2665 -2059 4484 -465 -7105 -630 2714 -1205 345 3105 -289 280 4318 62 -5815
803 -5815 949 4155 -4836 -3118 5205 3170 -1737 1487 1931 -2824 132 2273 -4184 -2912 5248
818 5248 1332 -4781 2523 6554 -2233 -3958 2633 -275 -3489 1565 268 -4028 1716 5162 -2658
833 -2658 -3801 5214 1512 -6237 -326 4090 -1613 -1886 1833 -672 -2019 4070 2179 -4970 1071
848 1071 5346 -3219 -4874 3365 1904 -4478 -188 3111 -1514 313 3314 -3207 -3848 3644 1714
863 1714 -5014 269 5899 -2044 -4205 2628 1145 -2215 1212 1042 -3840 309 4084 -3296 -4218 4725
879 4725 2990 -4313 -12 3787 -1443 -2479 1775 -350 -2143 3247 813 -5464 972 5424 -1213
894 -1213 -3351 3092 1545 -4692 -167 2325 -1630 383 2080 -2998 -2099 4645 2535 -4589 -569
909 -569 3417 -2251 -2611 2428 696 -1408 1315 365 -2699 1637 3995 -4064 -4161 3192 1441 -2818
925 -2818 546 2819 -960 -734 1855 -1291 -1091 2556 -1251 -4242 1826 4573 -1004 -2673 2096 1141
941 1141 -2373 555 396 -2674 966 1852 -2730 -1086 4607 337 -4302 1020 3487 -1808 -1596 1008
957 1008 -935 -842 2099 282 -2456 2976 3965 -3492 -2851 2782 213 -3165 635 1748 -985 565
973 565 2683 -1588 -1240 3044 -1238 -4258 1362 3746 -2557 -2266 3465 1841 -1233 1344 -71 -2785
989 -2785 887 1603 -4003 -2163 4960 1625 -3670 1529 3084 -1929 -1595 930 -1782 -2474 2210 517
1005 517 -3242 1933 4253 -2812 -1714 3420 232 -4693 -531 2315 -1954 142 2902 -1174 -901
1020 -901 3586 -226 -4437 850 3898 -3156 -3610 3312 1735 -2182 1698 1219 -1906 362 2416 -3592
1036 -3592 -2794 4739 1079 -4410 829 3777 -1081 -1385 1984 -513 -1616 2211 -335 -3904 1902
1051 1902 4180 -2114 -2889 3777 1586 -3720 39 1863 -1934 -171 1701 -2287 -795 3868 390
1066 390 -4450 726 3990 -2241 -2344 2027 736 -1509 955 432 -1943 1099 2261 -3532 -2167 4462
1082 4462 1053 -3344 449 2414 -1298 -1218 1105 -886 -1316 2198 -723 -2097 2622 3054 -2224 -2636
1098 -2636 2191 806 -2862 -321 548 -1253 708 1724 -790 179 2851 -1276 -4220 322 2006
1113 2006 -2092 -1171 1944 627 897 2407 481 -1662 463 476 -3941 -1932 3067 560 -1238 2357
1129 2357 2784 -197 -63 -20 -3579 -2514 800 -1747 -2371 3341 3864 -685 -94 2645 -288 -2913 -864
1146 -864 -1547 -1866 1620 2373 -320 1388 4998 66 -4079 332 474 -3870 -2555 644 239 591 3512
1163 3512 1319 -1357 1500 544 -4621 -2049 2070 -976 -2487 2395 3676 254 1485 2272 -2960
1178 -2960 -2417 1424 -2089 -4254 1217 3428 -983 -441 4357 1131 -2327 -244 -1014 -2980 492 1595
1194 1595 -2445 -404 5196 1303 -3158 1859 2660 -3697 -2835 866 -902 -2043 2414 1091 -2050
1209 -2050 1926 3295 -2405 -2167 2478 -289 -3410 602 2600 -1138 65 2505 -1082 -625 2721
1224 2721 -558 -4261 607 3096 -2823 -2319 3259 1019 -2091 531 1610 -1338 -153 1763 -2245
1239 -2245 -2557 2911 745 -2859 899 3091 -1093 -1452 1755 -20 -1892 990 -76 -2961 1493
1254 1493 2932 -2043 -1808 3043 1365 -3200 114 2278 -1510 -1243 1230 -215 -1159 2281 1336 -2136
1270 -2136 335 2623 -1213 -2366 896 428 -1796 271 969 -92 620 1412 -919 -1135 1659 -56
1286 -56 -2712 -548 1691 -242 -1161 1303 1449 -292 1176 -85 -1550 15 938 -1449 -1924 1295
1302 1295 1712 -874 103 1036 199 -262 -741 -856 -665 497 147 -820 1130 1802 -577 -914 427 227
1320 227 -1054 -521 -274 -96 965 1254 -896 40 1759 -352 -2133 -474 991 -520 -691 623 508
1337 508 689 1513 -309 -1236 754 675 -1882 -1441 1707 533 -918 279 980 59 -7 -588 -1185 -588
1355 -588 1028 73 -1212 1076 1607 -513 -1036 630 199 -913 -284 -385 -577 1507 1140 -1693 -428
1372 -428 1791 -188 -2120 319 1525 -1062 -653 838 -152 395 1427 -918 -2084 719 1625 -1740
1388 -1740 -1344 2289 335 -1576 749 1187 -564 159 564 -1452 -976 2161 -51 -2044 929 2033
1404 2033 -1148 -978 1360 151 -1282 373 110 -1564 823 1362 -1613 -866 2058 375 -2021 278
1420 278 1261 -1514 -768 1164 -430 57 1267 341 -1925 920 1750 -1802 -1264 1690 599 -1480 644
1437 644 1687 -633 11 1328 -1285 -805 1641 -52 -1977 193 2290 -465 -1162 1408 800 -1378
1453 -1378 111 358 -1254 50 1137 -597 -984 2166 1059 -1931 -451 1515 -432 -941 339 73
1469 73 -236 341 321 -634 418 1584 -930 -1745 460 1295 -938 -596 879 -21 -497 533 -293 -579
1487 -579 818 -66 -1648 -317 1756 90 -881 521 1060 -699 -378 191 -930 -91 705 -544 -649
1504 -649 2092 1350 -1330 -302 876 -423 -1547 -72 -8 -258 860 791 -449 810 1215 -990 -2204
1521 -2204 -1 666 -1328 -734 1341 500 672 1594 -326 -662 382 -134 -2087 -759 1633 -47 -426
1538 -426 1739 1197 144 424 -522 -1438 -881 122 -791 -1071 1949 1769 -485 441 1409 -468 -1366 -1099
1556 -1099 -1019 -1046 1007 759 -318 1111 2405 30 -1399 255 -257 -1876 -694 483 -6 846 1780
1573 1780 126 -331 1296 276 -2608 -642 1065 -790 -642 1412 829 191 762 165 -1294 -361 687
1590 687 -1856 -1477 1389 865 -786 679 1695 -285 -971 557 -696 -1254 687 85 -1366 758
1606 758 2184 -485 -1087 1028 452 -1641 -129 510 -617 35 821 -168 -680 1573 662 -2184 71
1623 71 1904 -911 -1334 1013 -186 -1079 328 700 -1064 467 1631 -571 -1005 1341 930 -2028 -946
1640 -946 925 -464 -943 1474 560 -528 1561 942 -1400 -510 1147 -1433 -2623 840 1534 -457
1656 -457 535 1484 272 -483 594 -931 -2039 -232 526 -1608 -110 2904 1174 -719 1124 813
1672 813 -1567 -1063 -165 -1636 -1131 1579 812 -256 1862 1962 -1178 -1326 232 -1051 -2039 154 397
1689 397 -145 1342 2049 -78 -467 1296 -720 -2810 -206 639 -1071 -18 1535 1097 203 1242 130
1706 130 -1816 -206 184 -1477 -879 1707 912 -586 853 1195 -579 -138 -81 -1503 -1020 599 28
1723 28 -794 1530 1850 -581 -233 586 -751 -1040 -255 -355 -346 810 1037 23 310 1430 -360 -1485
1741 -1485 323 240 -529 24 572 87 446 889 -573 -955 697 118 -1354 -201 1020 57 -438 857
1759 857 122 -741 325 -179 -1309 233 946 -761 -638 1315 750 -506 50 770 -578 -422 249 -102
1777 -102 -190 1130 838 -1420 260 1035 -1208 -1158 366 262 -817 724 1015 212 251 532 -1310 -1295 761
1796 761 302 -1241 165 1554 60 -304 1092 -65 -825 -61 -243 -1612 -46 1438 -372 -548 2005
1813 2005 870 -1222 -203 212 -1097 -932 350 -303 -503 1527 1125 -1064 266 1198 -1128 -1666 186
1830 186 204 -932 399 1584 -309 604 1291 -782 -1436 763 266 -1955 -363 1484 81 -238 1435
1847 1435 545 -809 -24 210 -1492 -516 1109 -690 -1168 1726 1614 -583 189 1001 -655 -999 438
1864 438 -619 -1245 894 1073 -816 341 1662 -483 -1719 615 318 -1189 -52 573 -846 -24
1880 -24 1622 -72 -922 1025 756 -1802 -746 1366 -600 -734 859 264 -212 1064 915 -1318 -373
1897 -373 1118 -1023 -1073 1044 508 -1030 271 1144 -179 -467 675 -802 -1389 941 525 -1391 242
1914 242 1844 -315 -767 879 339 -1115 244 110 -1111 70 1242 -659 -574 1642 923 -1275 3
1931 3 1160 -868 -902 320 -102 -301 760 660 -983 64 1440 -719 -1464 446 212 -1006 143
1948 143 1011 -230 44 1121 -448 -959 892 349 -1363 -343 1052 -286 -539 1493 412 -741
1964 -741 257 281 -1095 -259 939 -716 -1243 1059 1139 -772 173 1063 -440 -1045 50 229 -929 446
1982 446 794 -730 280 1449 -186 -878 365 223 -1134 -479 834 -446 -167 704 129 -873 692
1999 692 684 -1143 -212 1189 -249 -883 704 540 -632 674 635 -871 -322 958 -477 -1401 827 781
2017 781 -1304 -95 902 -189 -615 706 48 -775 629 599 -1008 152 1087 -5 -982 603 881
2034 881 -424 -456 664 -807 -613 451 -75 -619 662 944 -597 -350 970 -494 -1006 -121 -94 -393
2052 -393 -37 504 -575 -89 1299 -100 -662 440 571 -1078 -472 768 -25 67 514 469 -180 578 142
2071 142 -1024 -633 172 -602 -928 808 976 -118 347 707 -504 -434 267 -963 -1266 308 771 -211
2089 -211 601 1552 -64 -473 185 -386 -984 -372 -83 -526 334 1306 241 -332 956 134 -1110 -496 -178
2108 -178 -858 -114 586 375 86 1014 361 -448 -77 430 -576 -719 387 377 -59 545 1069 -36 274
2127 274 366 -793 -866 291 -238 -829 313 912 -18 191 728 -126 -741 93 -101 -837 279 866 -439
2146 -439 -272 609 549 -297 -154 50 -660 -510 444 -48 128 716 256 -518 67 673 -425 -859 267 48
2166 48 -671 263 506 -291 140 686 -392 -675 449 128 -869 49 862 -324 -257 428 -132 -878 443
2185 443 395 -734 269 978 -99 -526 335 472 -824 -293 374 -369 190 594 200 -262 424 525 -1026
2204 -1026 -455 368 -725 -917 661 732 -138 495 622 -490 -402 325 -353 -890 370 622 -202 176 911
2223 911 383 -583 273 -226 -921 -6 41 -553 459 716 84 -441 794 364 -1257 -514 350 -444 32
2242 32 357 224 154 899 582 -652 -109 499 -547 -787 340 188 -123 382 811 187 26 157 -640 -778
2262 -778 370 -121 -654 -166 878 159 -122 537 -149 -409 136 -312 -633 -141 858 221 -211 1165 775
2281 775 -643 -204 4 -496 11 60 -251 -431 421 455 -57 314 386 -255 -410 184 -10 -504 149 183 -224
2302 -224 221 668 -386 -355 190 -134 -495 61 8 -204 -298 142 -14 -2 274 252 -349 -90 291 -772 -626
2323 -626 75 204 -424 212 601 219 24 544 -206 -568 219 -141 -374 92 658 8 106 135 420 -468 -138
2344 -138 23 -734 -364 555 123 -371 732 1058 -443 -357 405 -582 -161 260 -179 -16 166 461 -131 -18
2364 -18 914 -81 -1028 319 222 -839 -166 455 159 235 645 -20 -411 409 153 -1266 -345 -51 -138 -697
2384 -697 352 707 -284 359 231 -535 -657 199 -499 -676 627 782 -187 434 822 -65 -370 45 -8 -757
2404 -757 -69 621 -69 298 1043 81 -436 178 170 -604 -568 192 -189 -45 1026 -134 43 512 427 -658
2424 -658 -280 392 -394 -537 374 593 -18 273 325 -77 -96 199 -261 -936 335 355 -358 -28 570 477 -176
2445 -176 0 83 -153 69 36 -838 -227 727 441 -561 87 419 -216 -783 63 76 -287 261 66 -257 647
2466 647 111 -63 -97 399 142 -394 20 435 150 112 286 157 -104 65 -359 -420 338 369 -207 -147 445 -65
2488 -65 -427 -164 129 -59 79 -25 -160 92 570 189 -276 -210 313 -479 -435 461 -66 15 237 -192 -72
2509 -72 636 646 -379 -343 -30 -260 -445 373 195 -320 51 -108 -106 12 525 -105 -480 335 518 -325 -188
2530 -188 630 106 -216 312 -147 -398 273 -168 -630 251 632 37 -523 158 420 -169 148 284 -281 -172
2550 -172 306 -30 -316 337 562 -350 -139 528 143 -552 143 -18 -326 66 144 -293 -4 351 -227 -526
2570 -526 172 331 -431 -349 471 19 -36 226 38 -219 77 453 -395 -13 305 -258 -540 496 674 -438
2590 -438 12 157 -552 -374 402 -50 -189 276 546 -376 -189 534 -174 -520 126 290 -227 -125 523 -275
2610 -275 79 619 -129 -715 186 139 -480 -530 387 -212 -415 528 31 -332 129 135 -509 -552 127 59 -607 495
2632 495 447 -290 -152 412 -78 -449 -29 7 -504 217 598 -373 -131 482 359 -421 -16 -25 -408 -43 365
2653 365 -352 -234 504 68 -396 23 436 -363 -221 349 386 -374 -93 425 -37 115 548 -468 -505 481
2673 481 -43 -265 137 573 -129 -185 239 42 -114 250 -119 -377 115 380 -270 -247 524 222 -304 240 181
2694 181 -364 -135 347 -131 -80 591 -165 -593 165 465 -419 36 466 -125 -480 129 -222 -524 -43 654
2714 654 -499 -317 808 -96 -460 95 -94 -452 -85 519 -259 -349 449 47 -332 147 344 -587 -175 474
2734 474 211 -337 148 381 -476 484 531 -343 -382 360 -602 -761 55 580 -498 -128 752 -154 -5 248
2754 248 -77 -518 71 95 -700 -33 694 388 -195 431 433 -189 -282 394 -515 -500 411 -64 -91 425 420 -83 -368
2777 -368 396 -556 -969 130 23 -408 266 720 -103 -357 652 -183 -854 -4 302 -662 -153 567 215
2796 215 45 592 291 -295 -65 154 -881 -260 371 -37 -219 134 477 -16 -153 396 -588 -719 -15 -48
2816 -48 -293 389 646 -189 33 294 -164 -584 323 60 -285 88 417 42 27 702 350 -470 42 -202 -281
2837 -281 -574 123 309 8 441 454 -250 -27 174 -669 -609 216 -234 -347 229 358 -80 -157 238 -528 -396
2858 -396 263 -46 -526 230 418 -191 186 176 15 -550 -66 260 -273 33 242 25 83 253 153 -414 60
2879 60 -72 -312 -259 122 217 -347 63 123 -358 -5 27 -443 -90 573 235 -514 256 282 -120 -136 248 -270
2901 -270 -408 113 61 -297 204 480 -360 16 341 -281 -404 288 -67 -324 304 376 -289 133 199 -168 -437
2922 -437 199 263 -521 -91 277 -135 8 336 -199 -254 235 -170 -394 135 276 0 -57 32 85 5 46 103 -308
2945 -308 108 112 -320 -473 116 365 -116 -112 299 -53 -158 185 134 -634 281 501 -518 172 603 -373 -408 52
2967 52 184 -295 156 174 -425 -278 300 92 -228 493 415 -278 -49 788 -183 -635 -63 -59 -120 151 356 -91
2989 -91 87 449 95 -694 289 207 -226 -181 140 -102 0 271 -41 -440 54 79 -495 -377 388 12 -330
3010 -330 -107 303 5 101 252 -275 -269 169 -4 -439 159 578 -196 -102 568 79 -8 257 35 -378 -27 260
3032 260 -131 145 713 -27 -76 242 307 -472 -106 295 -56 -226 373 -241 -373 304 75 -218 -140 249 49
3053 49 -644 -173 310 -380 -48 627 -19 -148 460 -78 -324 -117 457 -379 132 304 7 115 145 425 -279
3074 -279 -143 338 -509 -249 349 112 -238 590 309 -215 -112 -71 -58 -812 318 -61 -469 296 191 164 63
3095 63 244 119 -501 -5 -116 -494 -82 484 14 -246 326 -6 -247 -21 162 -483 -80 137 181 13 288
3116 288 311 -289 -29 223 -304 -61 320 58 -329 20 626 -266 86 40 -235 -313 105 -225 -18 -104 457
3137 457 60 -94 387 67 -136 -65 96 -271 -265 17 97 165 27 412 -350 86 312 -483 -24 345 71 -31
3159 -31 -61 349 194 -87 407 -513 -493 -111 -131 -74 58 358 -62 60 457 239 -129 -169 -146 -210 -263 593 166
3182 166 19 156 303 295 122 -187 -346 -256 -12 -474 -279 200 273 -155 193 195 -153 -220 75 -268 -395 -31
3204 -31 79 -61 61 320 -28 -12 -18 -212 -389 -182 109 -134 28 321 154 122 166 178 -248 57 259 -187
3226 -187 -241 423 -141 90 154 242 51 -59 126 -292 -295 -128 245 -152 276 9 168 -105 59 -157 -151 81
3248 81 184 -252 164 385 -7 36 177 189 -412 69 334 -338 -50 56 292 76 118 106 -125 6 160 -414
3270 -414 -147 -84 36 -177 -74 456 -112 14 42 -3 2 26 -270 -160 263 190 -193 -30 93 -314 -258 152 -93
3293 -93 39 48 266 128 -322 37 0 -57 91 155 -316 -109 -49 -229 208 -23 59 -548 217 191 -173 176 392
3316 392 153 -166 193 -344 22 -164 203 -305 140 274 238 -166 99 33 31 -116 211 -136 -295 -138 437
3337 437 -45 -217 186 125 29 261 13 -204 10 -20 60 -118 298 16 -280 318 -38 -248 -115 254 -205
3358 -205 -394 33 14 -65 -41 439 -418 191 96 -43 -373 189 303 -258 -76 163 87 -282 233 214 -213 16
3380 16 242 -426 -59 228 -211 -272 132 682 -235 -79 126 -104 -441 205 -177 -144 485 306 -99 -133 384
3401 384 -63 -352 144 -255 -403 311 174 104 127 13 427 -145 219 150 -524 -124 -19 -319 -3 156 263
3422 263 -93 128 625 -161 -297 103 -275 -198 44 20 53 128 347 313 -335 -35 -107 -300 -10 -38 -357 -106
3444 -106 265 99 -150 208 -47 -48 -59 -35 5 89 187 393 296 238 226 -257 532 181 -200 -122 -103 34 -166 128
3468 128 357 -112 152 276 24 41 110 -175 -590 40 79 -184 105 128 -224 -254 -325 -5 170 -174 403 51
3490 51 -107 224 78 114 -106 -310 100 -325 157 -236 -114 501 172 -82 -101 127 -218 -40 -441 -202 -206 138
3512 138 123 -1 79 350 -9 -101 -133 -82 -331 -376 85 -2 -107 -85 170 46 10 -3 -550 -50 43 -325 -264 314
3536 314 115 17 140 100 -91 -138 165 -108 -222 -136 -164 -61 -26 342 324 23 324 -97 -153 160 -209 -362 76
3559 76 227 165 180 103 49 -12 41 337 -235 -274 116 305 -323 -142 354 -213 -106 50 -126 -185 -30 54 -27 168
3583 168 203 148 -33 257 21 -52 403 106 -171 -136 67 -64 -128 447 160 9 166 -73 -319 33 287 -90
3605 -90 -38 204 -276 -121 101 -78 -314 89 174 455 -187 251 127 44 30 296 27 -240 -219 -41 -135 75
3627 75 374 -43 -83 -55 -118 -119 102 209 -234 -174 307 187 -42 191 88 205 -140 177 -105 -103 229 -100 26
3650 26 -18 -103 -185 -64 22 120 -177 -210 -181 -207 58 450 83 503 -54 -199 64 41 -203 -316 23 142 84 39
3674 39 219 306 -15 -46 -108 -119 -183 12 105 149 2 -100 -55 -18 -107 -226 54 231 -82 -296 35 -98 -59 -41
3698 -41 345 -5 -81 112 -13 -252 249 117 -115 96 126 15 64 437 15 -329 187 211 -111 22 112 -181
3720 -181 -42 278 285 -305 -144 58 43 -27 236 -133 -62 167 208 -265 -80 392 15 -27 525 -44 -253 53
3742 53 116 -376 155 181 -159 55 310 210 -330 412 170 -203 -94 95 196 -281 177 198 -132 129 363
3763 363 -55 134 166 -52 -463 57 172 18 -97 108 202 121 218 36 -354 122 134 105 -81 150 -94 -298
3785 -298 -194 105 77 -198 204 12 -57 32 -137 -270 -26 163 -39 -13 237 -95 -496 254 183 270 -72 153
3807 153 -66 -87 536 137 -218 241 120 69 13 -217 100 -79 -11 48 -186 -6 35 -68 46 -209 -207 -694 -181
3830 -181 154 -32 -125 408 101 -280 -98 118 -83 125 -65 -28 -291 167 137 -319 10 -81 -24 -106 -67 86
3852 86 -391 -33 23 -107 -134 129 -167 -46 -85 -251 -201 -111 45 224 235 152 30 -139 -94 126 -264 -222 -247 201
3876 201 295 -132 89 -216 198 390 -410 101 -32 -355 11 32 403 30 -28 223 114 -53 234 -69 -415
3897 -415 39 -332 -169 -200 -112 129 -181 70 28 -427 198 -68 -93 -270 444 -109 -71 -104 -67 -115 -13 6 -346
3920 -346 170 -47 -107 -18 136 -23 -213 -177 117 -333 -497 32 -254 94 204 213 -255 239 -70 -158 -171 -185 -310
3943 -310 -15 -22 83 -109 -75 430 48 -72 27 -69 -412 42 183 -175 -94 235 -157 -12 74 242 1 -159
3965 -159 86 6 -119 94 70 -233 106 163 14 6 69 13 159 28 71 -3 134 257 325 -141 -132 -101 -179 99 222
3990 222 -86 43 323 49 -22 2 -78 99 134 -88 -31 -110 10 399 -88 29 25 76 -52 -310 -18 -149 -48
4013 -48 -318 105 242 68 99 -260 -74 -82 -238 133 63 40 -146 87 213 -416 -71 -81 -133 -342 -141 -43 19
4036 19 206 63 -214 302 -47 -110 -150 -41 183 -198 -93 -83 -34 -52 366 202 15 69 -374 -190 -26 -3 -270
4059 -270 326 229 244 -204 284 71 -217 -55 77 -330 137 171 253 120 -163 -30 -108 102 -25 -158 -61 -20
4081 -20 83 -73 -109 -29 -25 137 -17 -73 -121 57 192 153 35 141 -103 85 227 -43 -178 -23 -33 -217 -68
4104 -68 171 76 -41 -25 -23 -64 214 -104 -47 -15 -102 221 -5 -47 -97 -28 73 183 46 65 129 16 -5 149 87
4129 87 -14 591 -14 21 -175 344 57 74 -33 167 160 -6 -112 -116 -172 197 -13 124 -148 326 -103 -111 222
4152 222 -31 -93 -25 322 210 -52 -169 -162 -69 302 159 -131 -208 326 126 -121 98 -155 -32 288 268 -426
4174 -426 -101 163 340 -126 86 159 -217 -180 137 -123 -296 240 -93 -129 -110 347 309 3 -68 229 -324 -250
4196 -250 457 -181 -199 19 -62 -165 182 59 -289 88 121 96 -281 118 -94 -317 298 -9 -315 -175 290
4217 290 109 -139 -318 -31 -76 73 66 14 60 32 -292 -319 96 245 -105 126 142 -157 79 227 89 -227 -22
4240 -22 -2 29 225 214 51 247 266 246 -144 115 150 -258 113 106 173 22 102 -96 116 -201 -302 -296 -248 40 96
4265 96 -14 196 195 130 -36 -147 56 -368 -277 -264 -65 282 214 -143 220 36 -226 -77 -373 -173 10 -32 -113
4288 -113 -109 96 33 -113 80 76 -192 142 -22 315 12 18 234 42 89 209 124 108 73 -55 -230 -5 269 -40
4312 -40 24 -174 227 303 -147 36 -16 -221 189 -154 -237 -160 216 129 -48 231 -79 -262 123 170 83 -199 -120
4335 -120 160 -32 -96 176 191 -299 401 -166 94 76 30 122 15 168 151 85 12 235 -254 -123 -73 -99 -12 72
4359 72 158 -337 123 136 -94 275 226 223 12 264 140 219 65 58 -135 -5 -89 -344 89 34 67 -224 207 148
4383 148 -56 385 -167 -19 -373 -58 -55 -38 -82 -363 -78 289 114 82 -217 195 196 -170 174 -147 -37 -184
4405 -184 91 -88 -215 -75 378 -216 89 136 109 58 191 309 8 -430 3 66 164 271 -164 74 189 -87
4427 -87 -319 -177 -43 -99 -8 93 155 -226 22 -130 -287 -163 16 -92 -232 68 237 -98 -239 138 -204
4448 -204 -29 -163 -55 -62 88 23 80 -187 -183 7 137 -154 163 86 163 -230 212 99 332 251 -50 -92 -164 21
4472 21 109 132 272 -171 139 -107 -37 286 -383 19 -101 183 -18 -463 -3 117 -157 33 -48 -366 -190 42
4494 42 174 -14 69 378 -109 -96 -1 -182 -65 -112 39 -217 -25 121 -34 -52 -56 -284 -357 85 -96 -113 181
4517 181 289 -312 131 258 364 107 152 2 -228 -48 43 -195 74 93 108 -113 169 54 25 -95 -152 107
4539 107 -69 -128 268 -28 60 397 -156 201 -241 -198 -16 231 284 66 229 283 -325 -117 -279 -52 -103 -91
4561 -91 64 33 73 42 -177 -15 -19 -180 -31 -263 -49 36 -220 370 9 280 -133 143 78 -233 -71 224 -257
4584 -257 183 17 75 219 191 -78 -57 -207 -20 65 -412 -57 61 131 277 107 -135 -130 -2 51 111 -207 -91
4607 -91 -113 523 -42 184 196 52 -24 1 -13 -242 -281 -91 283 -41 199 -174 -67 -149 -6 194 197 -418 -51
4630 -51 261 218 -10 -304 -94 120 20 157 111 -159 -67 36 -123 68 -205 -84 -199 -157 113 -146 -351 -40
4652 -40 193 310 26 202 -18 81 34 53 129 -135 -228 115 -16 38 44 23 -286 142 18 -106 -101 -139 -119 -81 77
4677 77 215 -5 420 160 -195 22 175 95 -16 26 9 34 72 144 -35 -282 -114 -264 -77 109 384 179
4699 179 -196 288 -35 64 115 -209 77 186 -133 -47 -200 10 -28 -181 210 -209 -36 54 56 -226 264 50
4721 50 37 -184 32 -62 -121 163 -47 -47 39 510 -151 22 -38 106 1 -21 317 132 64 98 10 35 -69 219
4745 219 -149 5 -77 10 17 157 81 -28 182 -37 -131 -180 231 132 247 -303 10 171 -199 93 -176 70 371
4768 371 -164 133 297 -49 -33 91 79 -461 -155 -71 -105 -176 141 -34 167 -13 -153 224 -61 -197 -104 100
4790 100 -172 31 43 49 66 38 -122 -40 18 -409 -10 -216 -159 -149 102 407 86 -343 -140 160 138 -229 34
4813 34 -54 -106 -4 -1 -36 19 38 3 -99 -22 -136 135 274 -92 149 -105 1 -103 147 67 -93 -225 -269 -37
4837 -37 -163 178 -172 -41 172 16 68 54 83 -182 -179 187 33 -297 105 -257 -279 -84 14 36 -415 -53 215
4860 215 -105 271 17 -4 201 44 -11 -7 -278 -45 140 -273 371 37 54 -28 -109 176 142 46 -24 -311 18
4883 18 175 241 44 -115 299 -166 -89 -55 -203 -53 291 265 6 -96 -175 -92 182 70 -75 -263 -145 10
4905 10 -75 104 57 27 -113 77 -89 -80 -291 34 -136 181 196 -161 220 -93 -95 32 -24 -18 -244 192 -57 110
4929 110 384 69 81 -347 84 -124 -90 -407 -117 2 48 28 73 124 -65 88 -126 150 -152 148 -27 -55
4951 -55 -243 26 152 -72 195 -153 -188 -150 -79 405 -4 18 67 61 5 -276 159 -385 59 -145 -206 -198 358 106
4975 106 -20 -301 227 83 -161 141 -199 90 199 112 34 7 21 270 -84 -67 422 139 -247 -130 -123 -373
4997 -373 -40 208 279 -242 61 -183 -179 -91 487 -33 -86 -35 50 41 -76 40 -238 -100 113 99 3 -74 25 -309
5021 -309 -144 175 117 -38 -29 -6 291 -30 13 -136 -100 232 -7 218 -271 -67 127 45 262 -92 -64 6 20
5044 20 59 132 122 -38 105 45 -75 -163 88 21 -69 -105 1 267 35 -105 77 -237 260 -126 33 -16 44 46
5068 46 -59 -48 133 8 -119 5 -224 179 83 71 -166 -12 -112 122 -7 132 -299 224 -151 -375 -92
5089 -92 -22 60 114 271 104 -107 -285 213 -91 156 84 192 -1 112 159 -95 -99 364 -92 204 39 112 32
5112 32 61 56 49 -100 -54 208 44 47 94 -272 -235 198 -31 91 237 -245 237 -36 48 210 76 -55 17 -34 88
5137 88 111 -218 99 8 -9 213 104 -175 46 149 194 -339 -261 -1 -130 105 -110 35 -15 -217 -109 178
5159 178 293 45 -143 -271 -306 187 40 242 -111 -144 -58 -57 -60 269 -104 75 287 -75 -19 308 18 170 158
5182 158 57 264 169 -25 127 -225 -194 -324 51 378 -84 -29 34 131 -189 117 -412 53 -7 92 77 -81 132
5205 132 -14 229 -251 -257 158 -119 164 127 -38 177 -72 63 -128 39 -46 71 -114 159 -252 -23 204
5226 204 -31 -52 53 -44 -281 119 257 28 -227 95 48 170 -231 79 110 -103 -1 -204 57 -92 -17 -104
5248 -104 310 -96 301 177 132 -110 217 48 516 -102 -351 -178 13 -104 -62 -341 63 117 -317 -87 -46
5269 -46 -42 -36 51 41 103 36 -74 -203 108 -36 22 -215 -120 -91 199 45 55 93 -237 14 12 98 -183 282 -95 -197
5295 -197 110 -19 -211 24 139 253 6 20 -42 122 79 -204 -69 -7 233 -22 -205 -201 148 269 78 -449
5317 -449 -114 2 -66 -251 1 -110 158 75 -126 178 31 -250 -6 -52 -96 38 88 35 -17 -290 350 -58
5339 -58 -119 -22 49 -234 84 -95 -67 -122 15 89 122 -63 382 54 -208 -182 -123 262 -12 -147 151 36 89 10
5363 10 -22 226 -232 154 134 84 134 344 -129 -101 113 140 88 148 -53 -185 -122 -86 167 444 -93 194 84 -72
5387 -72 9 -123 48 131 -223 -238 -67 -214 13 -175 8 -32 -259 -184 196 -137 222 147 31 238 -44 -67 -35
5410 -35 60 132 117 49 37 85 -205 377 109 -83 -58 -183 -86 -212 0 66 -1 6 -128 -215 100 43 5 -6 86 93 -143
5437 -143 -24 -37 -7 -154 260 -96 69 -117 -16 -32 -301 -177 -190 -194 -132 20 65 -90 7 135 -90 159 -115
5460 -115 50 124 114 74 2 -120 -68 132 -29 -190 -227 -100 139 153 -160 -37 -237 -343 110 50 -127 -125 129
5483 129 -8 -155 -289 114 -42 143 294 -121 -320 -82 -266 -40 86 94 13 40 -220 101 114 -175 -241 -227
5505 -227 15 -48 -133 55 0 -125 190 217 -73 51 -13 -73 -275 -56 94 -115 24 221 153 -201 180 -110
5527 -110 -235 -110 182 71 163 -180 256 -259 -145 157 -37 -164 -56 221 -194 -54 19 209 -26 -25 -160
5548 -160 -124 40 67 -64 -12 -111 -234 -145 242 272 -32 38 -37 -11 91 -193 263 -152 56 252 61 -98 240
5571 240 -113 91 17 129 -233 -274 -82 -11 2 -129 24 122 130 254 -186 -118 -103 264 75 32 159 -165 67
5594 67 -113 -153 -134 -88 -21 43 70 113 220 -44 246 -334 93 -23 -250 -59 -185 101 -149 445 -230 91 82
5617 82 -109 -168 144 -107 16 -239 24 0 -154 50 46 200 43 358 56 2 243 -1 -61 305 -60 199
5639 199 -192 79 -38 182 29 -123 130 210 261 -24 -59 -297 -49 98 128 97 29 152 78 -100 -71 15 304
5662 304 -130 11 113 -9 175 -15 -109 179 297 269 -449 12 -107 -7 -90 496 208 -101 -140 49 -134
5683 -134 207 29 -92 -42 87 -238 -301 461 84 -320 -136 236 -122 -212 -380 159 -38 17 -53 164 -449 -92
5705 -92 257 39 509 2 -48 -233 -55 -326 -177 -191 -214 -83 -25 122 -134 -122 265 254 -456 -188 102 310
5727 310 -176 -90 467 -29 -212 -89 -265 244 84 -87 441 -123 65 -276 -150 -168 79 -250 -40 -9 136
5748 136 -93 160 -196 -118 356 19 -190 -108 -230 -80 -382 -211 268 78 -6 122 135 237 201 39 -74 -225
5770 -225 -42 141 161 141 -52 -260 71 -36 63 123 60 -161 320 -204 263 -14 208 215 -62 -178 -473 -374 132
5793 132 -105 366 28 -100 -219 -201 4 97 182 -171 -239 -219 -110 -146 35 -130 274 -124 162 277 -38 306
5815 306 16 67 -86 63 -34 -85 51 80 300 -77 -67 23 -305 63 164 108 0 -51 -131 -143 -50 -21 -66 -378
5839 -378 403 324 -132 48 119 372 1 -125 -12 20 -69 249 -205 -187 -63 361 -153 -16 8 -354 -29 40
5861 40 -95 -18 167 -188 -147 204 -311 -58 -278 301 289 -113 147 78 -119 12 309 -13 -47 -301 343 255
5883 255 13 154 208 62 0 -179 -370 165 4 207 -10 -70 -22 67 84 -6 251 -2 170 87 81 -101 -169 -419
5907 -419 -213 -234 -48 91 -14 -28 247 418 -151 -80 32 -46 -208 90 311 9 -98 187 4 -75 39 -237
5929 -237 154 112 188 49 72 18 249 73 80 -23 -268 -88 -392 20 -67 480 2 65 69 112 -70 -173 -172 -94 -152
5954 -152 224 40 -115 5 149 -86 -130 -125 -116 215 235 -48 102 -44 -132 199 3 -152 -376 -69 -84 -110 -43
5977 -43 32 -74 -41 163 -21 -88 74 106 -123 277 182 -112 44 105 -216 168 12 41 -126 5 -212 -155 -1
6000 -1 -123 -110 -140 29 157 -83 -164 -182 -25 -239 93 17 46 316 35 -295 -164 -185 16 -13 6 7 -28 86 -131
6025 -131 44 190 -83 95 102 -59 -88 -107 -210 -12 -99 -74 183 294 -127 -7 47 179 254 123 111 23 96 33
6049 33 -90 12 -100 -34 -209 -36 3 95 -62 -34 25 5 162 -252 -91 219 -149 120 26 116 317 -200 263
6072 263 -82 173 78 -167 380 209 266 62 101 -33 -222 -40 56 48 182 -318 37 182 -150 -34 117 31
6094 31 217 -205 23 138 215 -170 71 -2 364 186 3 106 6 -82 -102 -45 284 83 23 21 137 189 161 250
6118 250 212 165 137 -145 141 -115 275 67 107 48 -85 -135 -112 -111 415 143 -81 192 -57 49 16 59 -20 -198
6142 -198 -99 68 -79 -44 294 12 -139 69 110 244 51 258 -374 318 -15 365 -212 -41 114 -285 1
6163 1 229 -28 118 -157 164 -110 11 -43 83 208 -3 28 -185 272 -38 191 64 6 -359 5 180 -132
6185 -132 159 107 134 -23 16 130 -82 324 -125 -100 -199 -198 106 -47 9 98 0 -7 -12 35 -111 -140 -22 44 139 73
6211 73 -265 86 144 -33 38 301 -193 184 -77 -201 11 -9 200 169 21 -22 -206 29 16 -120 98 195 -142
6234 -142 -38 18 -47 -124 210 223 333 -29 -71 84 137 190 -103 50 -304 109 82 -33 90 317 -252 -221 -147
6257 -147 15 154 -117 52 51 209 211 -84 7 -59 -239 -207 145 -95 -343 264 322 127 -272 30 100 137 -40
6280 -40 10 50 -32 -241 -321 211 -183 116 146 -105 9 104 -135 -62 103 19 121 308 -175 -117 310 24 47 -2
6304 -2 -49 -79 -196 140 -109 393 -35 -6 73 131 -205 47 11 174 -39 227 -70 155 354 14 120 304 -176
6327 -176 -61 413 -223 -197 120 -6 -21 225 -154 -87 -62 441 -255 -49 59 300 91 -89 34 -184 11
6348 11 -123 154 -303 171 6 29 -116 277 -248 -127 -171 11 213 -278 -192 235 36 -181 102 -179 -44
6369 -44 163 73 -159 102 -180 -65 61 -7 71 -279 71 -149 -60 26 118 161 -87 -223 -249 -17 92 105 68 -113
6393 -113 -123 -38 -154 -74 -26 185 286 76 -48 360 140 -29 95 117 76 202 95 -93 -11 37 225 -34 -106
6416 -106 266 62 176 -49 -170 67 -59 44 274 162 -275 -240 -151 69 170 -87 -230 66 -116 -245 23
6437 23 -27 33 59 3 154 -70 -16 -216 -353 74 -246 -65 131 139 -18 -178 -250 -60 30 204 -201 -147 123 78
6461 78 -34 -36 154 -178 270 -218 74 63 110 329 -271 -60 -87 -204 281 39 173 -36 -140 -152 -85 -126 -210
6484 -210 -121 88 42 98 -210 2 204 12 51 13 -68 134 95 209 53 -283 204 215 -284 -128 96 -318 -21
6507 -21 -13 -140 -25 -6 231 206 304 -1 -260 24 122 85 31 -11 -183 83 220 139 119 68 81 143 335 25 -54
6532 -54 158 60 -234 -155 87 -98 162 260 64 5 -124 30 -54 47 -32 -148 132 118 153 -114 -383 -112 -50
6555 -50 58 -93 175 115 73 -90 -149 -106 -57 -19 -79 -48 -209 211 244 -149 -72 108 -143 90 50 3 -12 -255 -52
6580 -52 -204 24 45 14 -113 186 -107 -25 -171 48 163 -37 -55 26 48 220 -84 -130 -96 -226 -216 190 3
6603 3 -10 145 -48 28 388 -48 -119 104 15 -85 -174 70 -46 -40 27 -45 -13 -354 15 45 129 -60 -361 67 -110
6628 -110 94 255 90 -100 22 111 160 98 -181 -165 19 270 219 37 -48 -105 -191 3 -16 -159 94 -339 -86
6651 -86 299 21 183 -207 124 173 -79 119 -123 122 -52 52 37 6 -74 -3 8 168 -81 -241 65 34 109
6674 109 -194 -47 175 249 -246 114 -62 -187 -63 47 -23 84 279 44 -168 -53 -58 22 -121 99 103 -24
6696 -24 -255 110 97 -111 55 -271 -299 -204 286 5 -12 -60 95 -98 -80 19 333 561 278 -299 -43 120 290
6719 290 8 -155 -28 -57 117 50 0 -230 46 -19 -58 -12 96 -106 48 -125 -212 -76 249 19 -225 -192 189
6742 189 19 -95 186 -23 163 18 -15 25 -174 154 14 -75 104 -325 -125 -46 92 12 -21 -13 78 165 -129
6765 -129 -80 60 214 160 -102 -207 -164 134 -90 154 -284 -4 -106 45 -218 -76 33 -99 -167 -215 72 -65
6787 -65 99 44 -257 -24 -8 -48 -10 63 10 -21 8 -176 -64 17 46 -156 193 56 33 116 161 -129 -74 -40 -107 75
6813 75 84 76 -164 -108 135 15 45 287 135 -108 62 85 -176 -27 347 -64 -118 -154 303 165 -194 -204 40 272
6837 272 -107 -15 -255 30 137 -157 -231 311 -126 28 90 66 196 398 -74 -175 -58 -175 60 222 -10
6858 -10 19 -153 201 64 -73 -264 209 -106 165 -133 1 -11 -30 -285 -206 130 55 210 1 171 -153 298
6880 298 -235 -18 -203 82 92 -29 129 162 40 23 -64 70 -2 77 61 270 5 40 235 115 30 -164 283
6903 283 83 -8 -153 12 -216 25 -67 136 16 -69 338 -42 229 50 51 166 -65 3 -202 -249 17 -202
6925 -202 18 190 194 -1 -43 -112 -62 101 -180 228 -9 70 -132 97 140 -142 -69 -91 -85 106 -141 52 26 -15
6949 -15 13 -221 -89 -85 -189 -139 -82 82 -197 -292 126 33 22 161 -87 -208 -166 -138 -156 67 -7 -498 24 -71 -51
6974 -51 -243 -20 -46 1 49 232 -108 -10 199 -57 -130 -91 -36 32 -36 104 130 -61 28 1 -77 -19 -174 -53 68
6999 68 -95 160 -135 -128 -157 52 -46 52 132 -193 -11 -150 -55 -2 -29 -84 -107 14 152 161 290 -221 -62 59 -91
7024 -91 -302 -226 -132 -197 -74 -46 -27 150 329 157 -47 52 129 -24 -17 75 -19 1 -60 259 -399 14 197 45 -113
7049 -113 -138 24 -6 161 -166 -132 -309 -42 -87 23 -52 -298 -38 -64 136 -25 -80 167 7 -418 3 -136
7071 -136 -254 116 -235 30 131 6 -450 -61 -293 141 42 111 108 71 -145 1 92 -274 139 39 275 -28
7093 -28 -249 213 -24 409 -21 10 -90 -8 -116 -1 -107 256 -30 -171 -57 -229 74 244 76 228 125
7114 125 -158 217 60 -141 -317 -225 -71 -8 -55 213 -126 81 43 -239 99 13 171 73 201 28 -34 138
7136 138 75 66 86 150 -171 183 182 176 -19 -266 -188 90 -73 -238 10 -120 45 -239 -66 -43 -265 -511 -214 133
7160 133 115 -315 -166 210 127 -32 202 76 41 -200 -100 35 -137 207 -83 76 98 112 90 -9 306 -69
7182 -69 165 -104 -111 130 15 24 25 394 109 120 -70 -9 -209 -3 -42 77 -192 -329 91 -125 -143 360 -6 89
7206 89 112 -197 -145 -210 206 -26 15 -148 -10 -157 -406 7 -131 -166 154 243 -7 -216 137 -97 -112 -73 -284
7229 -284 -162 -60 134 139 233 161 -72 67 -129 -198 25 -138 -192 149 -62 47 -183 120 -61 -47 75 105 14
7252 14 110 119 -28 5 -176 43 -151 43 -195 23 -253 -87 279 98 149 -184 -209 70 108 46 126 150 130 6
7276 6 -83 -186 -6 87 4 -44 14 -28 95 193 -169 -15 148 99 185 132 -117 -105 -139 -65 -252 113 -30 -25 -28 -91 -71
7303 -71 -124 3 -16 -45 -47 23 -93 3 101 -281 13 -169 128 -378 32 -160 -40 111 -201 -73 388 -17 -84
7326 -84 -63 355 90 -232 6 -66 -243 -225 -51 -68 446 50 -4 -165 101 77 -8 114 245 169 30 -61 106
7349 106 38 -20 -100 -92 -118 -66 30 38 73 -154 -101 196 273 -38 144 -15 39 160 179 -26 42 -73 18 33 -69 319
7375 319 1 101 56 -94 248 64 -48 386 -95 212 182 -366 -251 70 -49 72 192 102 185 71 53 -102
7397 -102 165 126 -67 215 -213 8 26 -21 -185 48 185 213 -329 -353 217 25 34 14 94 -114 158 -17 53
7420 53 55 204 196 -81 21 5 216 10 -43 -92 22 200 -46 335 138 72 10 111 177 -105 -74 203 -43 -6
7444 -6 -49 30 -75 53 63 76 39 84 -87 35 -13 71 -124 156 208 8 384 -212 -16 130 12 -13 295 246
7468 246 215 -80 -41 73 43 -234 -89 45 -43 180 148 129 135 176 -98 -103 -40 -73 249 105 -168 -298 -154 -253 -172
7493 -172 209 -6 353 -198 37 -24 -36 -38 -303 48 -53 -33 -252 -38 166 -304 -156 129 127 79 89 154 -116
7516 -116 345 175 23 564 67 -268 -193 6 -393 -34 12 -82 -144 -102 329 118 141 -19 -245 -49 408 -107
7538 -107 -54 116 -26 91 20 122 -133 74 -135 -59 254 -81 305 -245 -187 85 -105 14 -299 -166 34
7559 34 288 4 3 -170 2 164 417 -106 -62 -61 6 -158 51 -337 22 83 -51 -140 83 113 -115 -7 -426
7582 -426 29 -118 128 116 -115 106 -142 -129 377 -17 -167 -63 -178 72 -129 -93 3 -146 -127 72 -111 -269
7604 -269 -139 385 257 176 74 -253 -44 254 -291 42 62 -85 115 79 -184 -184 34 -81 -224 -187 -12 -272
7626 -272 118 103 -82 -90 -87 -292 -294 -119 142 19 17 -206 108 233 118 -173 51 -384 -45 174 281 33 94
7649 94 -84 -22 -102 -68 133 -190 -237 -242 -30 55 85 65 -63 150 64 -103 162 -31 23 -154 2 197 53 151
7673 151 -408 202 -155 187 159 -22 61 -119 119 372 -114 -115 56 -2 -55 -119 223 -248 67 110 178 44 -17
7696 -17 216 66 -44 156 108 -6 -150 -88 64 281 99 84 269 -262 -184 267 -40 110 272 -249 -365 251
7718 251 78 -7 122 -132 176 -82 261 -134 134 224 -198 -47 79 -296 -91 265 123 -178 238 8 -23
7739 -23 238 -119 -142 165 68 59 251 93 209 98 164 125 -2 11 -165 -77 83 -42 -81 194 -113 -161 37 38
7763 38 -5 200 19 68 196 -48 286 -22 -98 -186 189 77 -144 -210 -1 -6 87 3 46 -11 372 -229 124 -127
7787 -127 -159 -52 -76 244 57 -159 -110 -18 149 43 -246 -167 -133 -26 40 -4 97 4 -10 22 63 -59 -97 -244
7811 -244 13 -179 -263 38 14 447 149 -101 224 281 189 179 -106 -45 -228 347 135 -43 -8 99 -237 78
7833 78 256 -56 152 -118 -11 -9 -15 -155 -18 26 -207 -2 -81 85 -29 62 25 237 440 318 5 -69 98
7856 98 93 83 49 -209 228 23 50 13 174 -147 -138 -175 -144 -47 -141 518 155 -250 -215 153 -1 -111 10 -47 145
7881 145 -53 85 150 145 -35 179 343 -229 -111 -310 -211 7 -232 204 44 -251 47 -103 -93 -113 43 -161
7903 -161 256 139 -56 -79 -25 53 -16 78 30 148 103 72 -87 -11 -91 -102 -177 263 -217 41 -115 -68 372 189
7927 189 -297 -133 160 130 -118 -145 225 105 113 229 195 43 -3 -267 89 -331 -346 -25 -171 180 111 102 318
7950 318 203 194 243 112 124 -292 -32 -197 31 -77 -30 -41 242 24 -252 -55 -196 -131 101 -319 148 184 -230
7973 -230 -129 -126 38 -501 -143 -104 -103 78 -271 -81 0 -59 -119 -115 196 -208 -129 155 183 20 -67 273 -8 124
7997 124 -161 -135 -51 22 168 -1 139 160 160 -396 113 -169 108 73 -32 -252 -115 -36 -155 216 109 236 277
8020 277 107 150 -256 27 -19 -47 43 -41 57 -3 298 174 336 84 62 109 -64 103 -166 51 28 104 152 104
8044 104 99 -154 -78 -83 -214 154 66 -147 374 33 178 31 -264 131 372 91 80 45 201 53 411 -70 -91
8067 -91 -56 212 -4 -26 97 -15 57 -165 -116 -177 -35 -9 -141 141 155 -8 19 252 -31 10 320 -127 -72 34
8091 34 231 -63 102 30 129 22 40 199 -268 78 -217 186 107 -34 -42 -161 140 127 155 16 122 -5 53
8114 53 113 300 -40 -70 -98 246 -142 -240 37 70 108 -96 62 -14 -255 -159 -224 -166 121 -131 -165 -172 31 -120 -50
8139 -50 50 5 -33 -380 79 -225 -45 -192 234 103 97 151 -71 -123 13 -197 148 -90 -136 -13 -272 124 -12
8162 -12 -120 -276 83 -195 217 -23 68 155 45 8 152 -91 -451 -326 -410 -7 -151 -143 -419 -59 -68 -129 -106 66
8186 66 165 -165 335 32 -192
8191a92
$$ Imaginary data points
##PAGE= N=2
##DATA TABLE= (X++(I..I)), XYDATA
0 0 0 0 0 0 0 0 0 0 -6 7 -7 7 -7 14 -14 18 -21 25 -28 35 -42 49 -56 63 -74 84 -96 109 -124 140 -158 179
32 179 -200 223 -249 278 -310 345 -382 424 -468 520 -575 636 -705 781 -867 967 -1078 1209
50 1209 -1362 1547 -1770 2053 -2417 2911 -3623 4742 -6778 11702 -52148 -21644 39520 -23849
64 -23849 23206 66217 26300 -6923 18400 -22187 -62353 -23573 -2018 -37070 4209 71360
76 71360 47695 3508 31594 28217 -30226 -33953 -10169 -34860 -21643 28234 22794 5543 43655
89 43655 46778 -16841 -30128 2852 -19749 -42557 -9995 7821 -89 20373 35470 4232 -5190
102 -5190 16694 -12271 -46623 -11687 12161 -14182 -10348 23077 18055 2227 14945 2109 -20508
115 -20508 -3102 3489 -21898 -13316 20548 12518 -13062 3730 20612 -1067 -7043 2864 -7129
128 -7129 -7782 8771 722 -14830 5218 17343 -10522 -12518 14692 9915 -7946 -2482 4204 -2485
142 -2485 -381 2602 -11818 -8496 12799 3391 -10458 7086 17705 -516 -10386 948 -858
155 -858 -7656 -2311 -6256 -6229 11239 13285 -2412 -609 12617 2158 -16017 -8163 176 -5204 -2362
170 -2362 1327 1581 9887 15385 731 -10238 2697 3251 -15710 -11677 3854 2822 798 6405
184 6405 6042 4133 9020 547 -15931 -6608 6844 -7245 -12899 6033 12743 1136 2264 8026
198 8026 -1990 -2153 1966 -13078 -12464 8640 5581 -11265 1166 18483 4023 -6401 4072
211 4072 -175 -8611 -1527 -2515 -10166 2913 15206 -2118 -9029 14309 11348 -13233 -7037 5179
225 5179 -5411 -6999 5083 -568 -4121 12787 7787 -12592 456 13771 -6832 -16814 3312
238 3312 7396 -7192 -264 8612 -2548 766 10575 -5031 -11389 8191 6137 -16073 -4954 15734
252 15734 900 -8440 5261 3816 -4676 3179 3195 -9879 -2515 11329 -4088 -11936 9404 10473
266 10473 -9892 -5639 8696 1556 -4809 4082 -1403 -7432 6466 5242 -11197 -1870 12568 -1379
280 -1379 -11698 5177 10139 -4651 -3403 2583 -4151 -1081 5960 -3219 -7956 6878 8595 -8759
294 -8759 -3600 11326 613 -9852 -1375 2183 -1588 1599 3082 -5038 478 10804 -1068 -9124
308 -9124 3447 5553 -7522 -7449 5397 4387 -1679 2189 169 -2158 4999 3130 -8037 -4724 6358
323 6358 455 -8346 2438 8477 -1063 -2412 1050 -662 590 2457 -4420 -7307 4011 6747 -4765
338 -4765 -2251 7166 2363 -5157 -1536 1496 -713 -304 -975 -5239 1997 9201 -1425 -6078 3033
353 3033 4930 -4511 -4445 2634 491 -1210 995 -2142 -12 7825 2075 -8058 -2050 6884 -1198
368 -1198 -7030 2066 3043 -1874 967 1649 -1090 2927 4128 -6074 -7796 6581 4459 -8100 -1866
383 -1866 6775 1016 -2322 2600 875 -3131 2291 -1018 -8910 1958 9282 -2684 -6715 5713
397 5713 7227 -4570 -2426 2693 -3907 -3159 2566 -3215 -2753 8726 4750 -7755 -727 10754 -2235
412 -2235 -9916 1124 1383 -4403 1609 4237 -1789 3029 8691 -3983 -8665 5414 2870 -11488
426 -11488 -5244 6717 1697 -1799 5773 3953 -2554 3122 522 -10833 -3685 6464 -3370 -8178
440 -8178 7366 11674 -1541 -652 4874 -3305 -5156 -745 -5491 -6512 5161 7606 -3370 1323
454 1323 13082 1516 -9433 -2602 -205 -6688 -4321 2096 -233 3078 11308 2980 -4974 3756
468 3756 3298 -10481 -10142 2298 1879 -3722 4260 7756 2648 4568 3038 -6859 -7008 1382 -2915 -10247
484 -10247 1564 10936 1522 -753 6860 3664 -3810 -2834 -4093 -8494 -1162 5532 -2179 -1334 10441
499 10441 6856 -4390 -2105 4019 -3522 -7894 -1254 -800 -993 6305 3979 -3062 2272 7064 -2726
514 -2726 -9713 1593 2183 -5924 -1969 3928 2252 2216 3070 -1392 -2713 3952 1863 -7880 -2761 5212
530 5212 -317 -4570 2208 4404 -617 -286 1035 -1809 1360 3063 -4816 -5529 2991 3244 -4112 -1676
546 -1676 5510 2212 -1530 1302 238 -825 1055 -2604 -6086 9 5953 -364 -3110 4582 4842
561 4842 -1360 -1564 -575 -2148 -2756 -1526 -3666 -416 6889 4021 -3081 969 5016 -1045 -5157 -2531
577 -2531 -661 -2609 136 1039 516 6054 4968 -2495 -4152 2873 684 -6188 -4113 1787 1247 1012
593 1012 2954 1410 1866 2421 -1639 -6728 -290 3509 -4400 -4021 3032 3938 1245 1479 464 -816
609 -816 241 -972 -4834 -2375 3325 160 -3495 954 6043 2100 -2256 -90 -572 -1917 373 -1847
625 -1847 -3804 3039 3176 -2849 -1020 5871 2483 -4228 -1848 699 -1268 -1346 318 -1364 576 3653
641 3653 1459 -2918 2022 4313 -4317 -5236 1613 1546 -1771 -667 1218 -403 2222 3276 -3291 -2834
657 -2834 3704 1173 -5260 -1497 4820 1038 -3119 1296 1772 -771 1364 -230 -3784 797 4409
672 4409 -1916 -4593 3494 2715 -4624 -1449 3465 517 -857 1411 -982 -1694 2845 1177 -5218 -493
688 -493 4984 -2149 -4278 2471 4368 -710 -867 1510 -2029 -613 1328 -3491 -3523 4115 3324 -2725
704 -2725 168 5897 316 -4275 -618 -1725 -2718 578 58 -1708 4157 7667 -391 -3618 3107 501
720 501 -7996 -3847 570 -1423 185 3263 1784 1063 4880 272 -7534 -1851 1656 -4606 -4320 3937
736 3937 4691 642 3360 3483 -1653 126 -65 -6882 -4777 3647 2340 -2901 3459 8674 1985 -1258
752 -1258 1321 -2388 -3893 -689 -2421 -4572 2907 7947 270 -1485 5738 2503 -4926 -2614 -1049
767 -1049 -4001 -1933 2414 -161 273 6312 1915 -5440 168 3212 -4570 -6928 429 1023 -1231 3676
783 3676 3966 -763 2159 3215 -4536 -4346 2322 64 -6961 -528 5308 387 182 3402 -29 -2204
799 -2204 1240 -425 -5539 499 5325 -2594 -3337 5770 3411 -3547 -971 1770 -3215 -1896 2022
814 2022 -2331 -2501 5259 2629 -4455 620 5262 -2948 -6161 1739 1540 -3240 1457 1801 -2903 976
830 976 4613 -1990 -4280 3656 2781 -5996 -930 5341 -637 -2708 1756 880 -2087 2775 2887 -4282
846 -4282 -666 4993 -2558 -5456 2704 3273 -3821 -1112 4455 -313 -1636 2249 -2356 -3844 3728
861 3728 3071 -4178 -633 5601 -1124 -5665 2192 2970 -2640 38 1706 -2941 -703 4167 -1536 -4283
877 -4283 4382 3927 -4788 -1645 3797 -971 -3289 1495 825 -2652 1593 1632 -4314 302 5913 -852
893 -852 -4602 2119 1922 -3994 -1065 3433 -942 -669 2287 -1794 -1900 3831 2128 -4919 -1682 4026
909 4026 -1089 -2880 2576 2057 -1718 201 962 -1688 458 3337 -3195 -4373 3853 2902 -2955 -294
925 -294 3130 -811 -1792 1203 -462 -1696 1824 -185 -3310 1659 4665 -1190 -3724 1988 1900 -2538
941 -2538 -67 1453 -1893 246 2457 -1487 -1162 3398 669 -4709 60 3757 -1906 -2962 1368
956 1368 595 -848 1792 676 -2283 1329 3454 -3451 -3745 2925 1490 -3233 287 3087 -284 -387
972 -387 2100 -1400 -2347 2516 -604 -4099 1533 4133 -1758 -2777 3520 2395 -2474 104 295 -2660
988 -2660 213 2353 -2051 -1758 5014 2762 -4290 -48 3607 -2108 -2953 1399 -212 -1616 2555 1818
1004 1818 -2649 1232 4150 -2512 -3665 2745 853 -4555 -561 3668 -242 -853 3139 -476 -1995
1019 -1995 2772 141 -4447 -86 4010 -1833 -3206 4043 3000 -2624 131 1502 -2119 -454 2006
1034 2006 -2482 -2801 4395 2056 -4425 84 4660 -941 -2973 1365 551 -1802 1176 961 -3231 1341
1050 1341 4566 -2240 -3391 2996 2364 -3647 -949 2820 -1143 -783 2199 -1076 -1372 3163 493 -4510
1066 -4510 -361 4385 -1371 -3192 1956 986 -2049 114 1000 -1767 -230 2051 -2100 -2164 4096 2128
1082 2128 -3777 -326 3071 -724 -1891 1199 206 -929 1764 512 -1814 1849 2540 -2967 -2985 2028
1098 2028 1581 -2895 -322 2139 -536 728 2227 -1107 -679 1415 -1173 -3927 623 3282 -1136
1113 -1136 -746 2664 1623 -784 684 -604 -2699 -902 701 -2361 -944 4039 1443 -1317 1406
1128 1406 1649 -1741 -1830 -565 -2655 -1652 2607 993 -971 3379 3759 -1597 -2504 1349 -560 -3530
1144 -3530 -544 719 -282 2565 2982 -469 -3 2379 -1428 -5665 -857 1834 -2477 -1238 3142
1159 3142 2017 715 2150 555 -2852 -842 341 -3921 -1825 3756 1447 -1416 2737 4026 -1234
1174 -1234 -1577 379 -3160 -3209 1609 -351 -2557 2213 4631 -491 -1764 2973 350 -3727 -987 -47
1190 -47 -1833 784 2947 -417 -676 4080 843 -4885 90 2332 -3775 -2997 2183 1369 -880 1955
1206 1955 2119 -1684 442 2757 -2628 -3143 1977 946 -2727 630 3405 -619 -875 1999 -571 -1828
1222 -1828 1652 -158 -3656 88 3891 -1370 -2444 3822 2284 -2479 -202 1630 -1647 -1304 1211
1237 1211 -1152 -2236 2963 2176 -2941 302 3074 -1366 -2258 1453 557 -2217 673 1096 -1456 1263
1253 1263 3243 -1388 -2284 2488 1611 -3531 -1329 2111 -1061 -2131 1717 620 -358 1473 1256 -1965
1269 -1965 -417 2379 -1007 -2908 1287 1363 -1183 -236 1583 312 -156 1137 -1184 -1632 1183 109
1285 109 -2349 -209 2600 613 -1234 988 1272 -945 -454 -99 -1662 119 1077 -616 -903 1617
1301 1617 1914 -1341 -639 603 -315 -1050 -764 -484 -213 1225 435 -575 780 1809 -820 -1352 152
1318 152 368 -513 -674 601 306 853 1137 -749 -390 1062 -915 -2251 -281 1391 -115 -848 932
1335 932 909 536 711 -798 -1362 98 683 -1028 -1058 1769 1289 -1039 -224 798 -180 -521 -254 -829 -217
1354 -217 1345 128 -1012 739 1584 -962 -1284 560 254 -983 -405 600 -248 1017 1187 -1552 -617
1371 -617 1307 -207 -2337 110 1802 -787 -842 1303 432 -432 932 -373 -1800 378 1835 -1500
1387 -1500 -1477 2486 1374 -1839 490 1207 -611 -781 447 -728 -668 1873 391 -2206 370 2216
1403 2216 -913 -1526 1054 339 -1681 -159 599 -739 781 1477 -1430 -1311 1516 756 -2484 57
1419 57 1806 -998 -908 1337 286 -747 1113 -39 -1820 163 2193 -1603 -1883 2291 1138 -1071
1435 -1071 62 1460 -332 -959 714 -557 -1188 1519 365 -2037 186 2441 -70 -1748 984
1450 984 1079 -1291 -353 957 -731 122 1435 -632 -1361 1383 1377 -1910 -1057 1666 -172 -1584 553
1467 553 735 -247 178 918 -873 -138 1207 -563 -1653 534 1145 -559 -594 1245 239 -748 321
1484 321 -251 -950 321 506 -1223 124 1579 465 -1471 284 760 -789 -693 166 -175 -351 862
1501 862 365 -480 1319 734 -2028 -823 586 -10 -1405 557 966 146 827 1016 -844 -333 810
1518 810 -1491 -2003 336 1082 -623 -462 1606 715 -36 369 -572 -1351 -121 -24 -1362 -529 2375 672
1536 672 -849 1058 740 -946 -991 -766 -1234 -386 835 186 -476 1759 1628 -998 -715 455 -800 -1914
1554 -1914 -486 242 108 1440 1653 -114 353 1421 -1357 -1964 -96 152 -1600 -296 1438 543 613
1571 613 1312 -454 -1165 290 -418 -2163 -685 1804 231 -287 1515 1170 -613 -228 -97 -1321 -349
1588 -349 1067 -769 -862 2316 1292 -975 -158 988 -858 -1542 449 -469 -855 978 719 -522 508
1605 508 2033 -519 -1570 788 625 -1549 -405 1010 -305 -419 1146 -16 -957 885 848 -1989
1621 -1989 -304 1914 -487 -1533 812 754 -895 103 880 -362 -232 1275 -583 -1537 1090 1022 -1549
1638 -1549 -1021 1719 536 -866 1375 908 -704 402 463 -1786 -969 1115 -401 -1632 1163 2769
1654 2769 -97 -94 995 -170 -1381 -174 -378 -1878 612 1785 -553 184 2773 848 -1352 -567
1670 -567 104 -1462 -1289 765 -278 -29 2303 957 -862 358 873 -1671 -2633 271 -23 -1669 507
1687 507 1213 232 768 1264 -736 -1799 508 -743 -2612 49 2065 73 36 1871 924 -1047 498
1704 498 -370 -1895 -153 675 -836 -252 2234 1279 -818 319 927 -1289 -1296 232 -991 -415 1274
1721 1274 359 -236 1050 1436 -1012 -1454 531 27 -1032 43 382 194 1076 1055 -642 -334 633 -838
1739 -838 -1592 136 483 -597 243 878 406 234 701 -355 -1337 399 447 -1327 60 1585 207 -606
1757 -606 411 402 -813 -198 112 -1189 14 1230 -199 -1096 738 586 -1208 -519 883 -320 -523
1774 -523 720 -6 -283 618 634 -1299 -377 1144 -842 -1192 796 1029 -541 140 799 -374 -392 528
1792 528 -1088 -1568 701 840 -476 269 1364 -1 -1015 323 27 -1314 -162 93 -866 411 1624
1809 1624 204 -889 883 711 -1738 -1098 447 -443 -706 979 754 -299 1369 710 -1111 -701 754
1826 754 -1107 -1715 309 882 -449 586 1495 129 -365 479 -1100 -1740 432 376 -1201 -321 2096
1843 2096 240 -1087 493 339 -1310 -206 17 -977 -644 1604 117 -1085 1143 1307 -1315 -573
1859 -573 495 -836 -1216 608 509 -731 1045 1468 -826 -490 1238 -523 -1847 201 669 -1117 -158
1876 -158 1133 -316 -166 1672 -6 -1242 600 790 -1739 -857 1513 95 -702 924 978 -508 203
1893 203 468 -1391 -749 1106 -651 -1543 1057 1326 -1002 -135 1522 20 -792 636 -267 -1404 997
1910 997 988 -1034 247 1588 29 -1081 459 143 -1243 -265 767 -707 -40 1358 162 -878 819
1927 819 1014 -1244 -538 1127 -24 -981 901 771 -179 854 588 -1105 -454 1161 -727 -1540 778
1944 778 648 -636 46 1476 -134 -534 635 -237 -1027 580 725 -1048 -213 1497 162 -950 703
1961 703 755 -1353 -397 710 -419 -521 1001 -292 -773 940 1139 -967 -733 651 -107 -1058 464
1978 464 485 -566 308 863 -504 -316 1226 -607 -1186 154 691 -783 35 1135 -56 -412 772
1995 772 248 -895 451 198 -1234 -694 1094 216 -1065 429 766 -434 -132 277 -606 -613 991 -179
2013 -179 -991 568 1060 -777 -128 1085 -56 -719 178 404 -945 88 689 -801 -552 1313 -8
2030 -8 -1040 274 1251 -829 -816 798 -171 -471 687 275 -288 600 894 -771 -847 957 -25 -1448 -123
2049 -123 527 -271 240 914 -78 -382 683 -218 -1358 139 279 -967 -372 1307 449 -207 633 346
2067 346 -760 -11 266 -1037 -437 717 -296 -243 967 1085 -85 -201 198 -744 -838 100 -314 -310 569
2086 569 1057 -125 335 1066 -399 -1117 -407 -19 -623 58 360 -297 322 1306 147 -511 225 -165 -979
2105 -979 -25 797 52 -155 1050 560 -163 412 -88 -849 -667 497 -364 -373 677 587 20 536 593 -480
2125 -480 -510 33 -841 -772 200 650 -365 352 1218 101 -376 -130 -74 -1061 -48 69 -316 69 871 -4
2145 -4 -472 473 -173 -832 -638 132 -440 -412 317 118 -345 565 344 -687 -211 649 -335 -1079 367 273 -603
2166 -603 285 714 -302 -225 265 -132 -391 568 502 -819 -198 447 -46 -482 493 59 -341 19 704 -345
2186 -345 31 790 -172 -562 250 212 -975 -383 688 -112 -235 904 269 -548 266 64 -823 -455 553
2205 553 -146 -628 829 795 -253 88 323 -544 -902 81 -211 -538 947 963 9 32 776 -11 -1070 -129
2225 -129 -213 -517 385 703 72 396 988 120 -533 48 41 -1274 -622 530 226 -161 805 351 162 431
2245 431 147 -984 -862 461 -181 -713 350 903 88 502 285 -273 -505 251 -739 -920 326 681 -241
2264 -241 494 868 156 -315 -297 -326 -794 -129 -42 -106 135 870 9 -4 298 503 -589 -133 26 -373 -30
2285 -30 240 101 46 410 615 -604 -295 839 -416 -493 37 289 -326 -223 488 -75 -19 248 -292 -604
2305 -604 376 167 -579 132 348 234 1 372 181 -302 396 81 -618 -313 87 -231 -327 340 288 -146 163
2326 163 588 -96 -150 61 -369 -482 226 157 -274 -9 790 60 -384 192 112 -721 -399 -56 -245 -103 400
2347 400 311 -289 522 452 -638 -409 282 -329 -771 167 395 -179 427 653 -203 -131 563 -390 -1020 162
2367 162 69 -638 114 598 390 -19 332 131 -688 -391 -216 -528 -248 567 329 -62 774 627 -447 -349
2387 -349 114 -588 -536 56 35 -405 506 1013 -366 -371 528 -455 -1047 -81 63 -471 163 643 174 44 932
2408 932 -348 -703 130 184 -736 -283 865 164 -54 539 441 -376 242 43 -823 -562 583 1 -441 258
2428 258 611 37 -28 263 -470 -580 213 201 -758 293 743 -175 47 377 60 -864 -414 -228 -340 -132
2448 -132 180 -220 -114 361 208 -432 36 210 -314 -523 178 -62 -24 490 201 -173 202 412 -305 -373 349
2469 349 275 -397 265 427 357 -40 221 107 -9 115 90 -619 -74 684 -244 -122 318 97 -304 -131 -11
2490 -11 -211 3 237 1 -189 341 17 -159 -113 366 -426 -380 175 121 -161 88 60 -259 203 94 -411 -207
2512 -207 145 -77 -265 135 146 24 16 412 21 -306 -24 -407 -485 42 315 -519 -311 316 247 -339 378 160
2534 160 -435 -134 212 -488 -176 311 70 -305 383 333 -439 -101 275 -78 -390 151 -63 -387 16 500
2554 500 -344 -218 444 -9 -462 -259 581 -382 288 589 -133 -32 579 -157 -378 270 320 -345 -342 650 146
2575 146 -379 518 212 -658 245 279 -461 -126 438 182 -366 370 532 -380 -16 299 -56 -576 241 134
2595 134 -209 148 603 -548 -393 706 -177 -385 90 338 -403 87 552 -402 -161 368 -46 -540 48
2614 48 289 -459 -92 694 44 -476 401 -14 -305 211 374 -377 -344 514 359 -231 266 591 -351 -398 206
2635 206 -188 -500 327 45 -741 213 1053 -123 -274 218 -15 -525 -139 127 -181 -168 506 -109 -487 548
2655 548 55 -653 -101 336 -208 -64 475 76 -132 128 353 -196 -44 96 -251 -674 380 -41 -487 178
2675 178 337 -153 -41 414 294 -499 -84 88 -594 177 720 -281 2 315 288 -449 54 386 -184 78
2695 78 192 44 -293 502 322 -666 14 462 107 -448 331 -251 -403 7 158 -464 13 532 -117 -194 576
2716 576 -172 -742 96 160 -475 -507 648 99 -140 191 449 -319 369 431 -555 -466 503 115 -305 325 551
2737 551 -218 126 158 -688 -307 576 -97 -612 268 751 -244 -227 312 -37 -255 -92 -202 -441 33 348 -230
2758 -230 -35 868 62 -434 259 10 -549 -588 136 -90 91 652 142 -413 432 557 -658 -739 262 -233
2778 -233 -704 296 451 -511 425 692 -262 -425 175 -409 -711 206 40 -433 -98 724 352 -285 125 -1
2798 -1 -747 -28 230 -536 -60 657 221 -283 349 353 -345 -325 -59 -304 -412 625 370 -44 120 705 -107
2819 -107 -590 32 24 -839 45 412 -146 114 356 145 -278 574 291 -712 -205 202 -414 -162 371 271
2839 271 -264 282 432 -319 -34 -86 -343 -630 650 308 96 -18 538 -283 -166 -48 -171 -359 123 174
2859 174 -185 186 628 -281 -568 26 -148 -313 -202 -16 -250 129 365 -185 -283 130 285 -726 134 158
2879 158 -218 -155 454 193 -91 17 229 -330 -1 67 -228 -142 446 371 -328 44 274 -228 -151 113 -248 -359
2901 -359 382 245 -111 146 293 -409 -367 -37 -256 90 235 53 -117 -33 716 -200 -227 287 -144 -757 355
2922 355 318 -345 203 238 -72 -320 205 -145 -560 -164 16 -516 -168 531 -14 -392 183 323 -319 -32 57
2943 57 -389 -99 46 -62 -192 190 507 -399 -62 409 -243 -10 66 -100 -292 305 356 -395 -107 639 -120
2964 -120 -148 -217 -38 -254 -220 309 -197 37 637 -78 -614 308 259 -209 -88 197 -11 -473 208 179 -325 245
2986 245 379 194 -306 237 199 -532 340 214 -123 -311 377 311 110 184 108 -336 -111 -1 -177 -229 30 405
3008 405 -319 103 338 -47 -114 399 217 -633 25 -26 -125 202 247 122 -17 419 -234 -677 277 -39 -120 -190
3030 -190 52 139 -15 528 -175 -372 271 280 -348 -442 114 324 -227 269 409 -412 -10 9 -495 -122 228 100
3052 100 -453 11 484 100 -64 350 -351 -145 136 174 -443 -218 479 -32 36 399 85 -170 274 116 -437
3073 -437 -318 485 88 -408 506 178 -188 329 447 -220 -400 330 94 -609 422 103 -335 67 -104 -243
3093 -243 -17 -78 -101 -212 110 183 -357 -173 301 14 -68 20 -272 -539 30 203 -326 -260 453 209 -22 346
3115 346 61 -65 -225 48 -342 -27 506 -178 -75 213 172 -77 7 271 -7 -231 315 20 -103 59 270
3136 270 -258 -183 30 4 -402 -87 128 -250 23 366 104 86 361 155 -231 -143 349 -276 -233 175 -63 -45
3158 -45 163 209 -254 -183 210 -286 -259 285 366 -45 21 490 -64 -86 390 -205 -181 -199 44 -102 -73 512 104
3181 104 49 -97 89 -448 -38 143 -435 -270 219 -87 -173 497 270 -201 -180 371 -282 -170 -230 -125 -103 289
3203 289 523 -69 355 133 -203 -334 -27 -18 -441 -121 56 -25 -159 431 279 -109 -247 72 -335 83 52
3224 52 -415 -30 546 81 -395 102 263 -43 -274 226 166 -182 74 197 -144 181 -19 -361 -185 202 81
3245 81 -264 -184 235 -62 84 330 -25 -202 -8 115 -379 159 375 -289 -200 326 103 66 129 -64 -132 35
3267 35 70 -387 -91 81 -34 -80 -52 340 -127 -37 92 -283 -6 -66 -241 90 -9 23 287 21 80 83 49 28
3291 28 91 -213 -57 -197 73 105 -39 85 -102 32 14 -250 90 303 112 205 170 93 88 237 364 -150 -352
3314 -352 203 66 -143 144 24 -178 -140 184 -176 21 -9 -64 -181 191 139 -166 -368 -259 41 -228 117
3335 117 136 80 143 266 -74 -266 -50 271 -90 139 305 112 92 45 43 -113 3 135 -296 -279 189 -59 -209
3358 -209 454 11 -258 -118 242 -260 -237 52 -121 -250 -128 273 -123 -138 389 153 39 -104 77 -124 -137
3379 -137 246 -97 -30 105 -6 -505 632 26 -454 88 125 -221 -256 292 85 -130 141 528 -218 56 95
3400 95 -253 -156 -187 233 -340 52 462 19 -118 163 -16 -302 175 94 -23 -129 315 42 45 162 67 426
3422 426 103 -28 -54 40 252 -67 -243 477 133 -69 231 13 -86 -267 209 -205 -357 -223 -22 -152 -105
3443 -105 138 -66 -52 266 150 -251 -161 72 -124 -55 64 -35 356 276 269 -581 216 -22 -129 -28 202 350
3465 350 307 0 255 -30 -135 277 -4 -235 -33 323 67 -150 313 -113 -68 204 -117 -73 -92 185 -146
3486 -146 -324 437 -263 -336 293 -79 -223 -178 -222 15 40 53 -99 -264 263 348 -511 109 -207 -239 -163 76 166
3509 166 -165 104 55 18 -132 230 2 -48 -88 87 -135 25 197 -116 -90 424 -252 -362 -24 -169 -87 -509
3531 -509 249 51 144 134 -130 18 288 -40 -28 -48 161 -54 -327 394 326 168 519 254 -321 -416 -138 -203
3553 -203 -539 -54 336 214 -99 250 176 -297 53 117 -641 -234 355 124 -185 253 -53 80 209 244 -42
3574 -42 -196 319 -248 -218 232 163 112 229 97 47 -127 -23 40 -189 113 268 -24 -37 160 386 -128 97
3596 97 -1 -220 163 140 155 -264 243 -59 -11 -408 348 -424 -127 -87 -30 -151 -18 37 -19 58 154 -336 -184 416
3620 416 -246 89 -16 271 200 -59 74 -51 -349 160 -111 -407 -178 -273 -28 119 350 116 -78 420 122
3641 122 158 -165 132 -67 -281 102 -169 -89 203 315 -144 4 116 -34 -323 283 -89 143 82 288 -44
3662 -44 -190 314 -278 2 57 233 -176 -4 -10 -367 -331 259 337 -326 82 69 61 -440 120 107 -284 -150 -110 -253
3686 -253 58 93 -156 -86 109 320 -169 -30 154 -215 120 116 -267 -110 109 147 -113 75 38 -107 -207 -119
3708 -119 -33 -149 77 219 -169 -91 237 132 -177 88 155 -293 227 342 85 127 163 -140 4 172 -146 -270
3730 -270 157 -78 -320 -56 70 74 145 33 -185 -331 -451 358 -79 -288 256 68 -28 56 -159 -231 21 101
3752 101 -118 -322 273 270 -53 124 333 -45 137 220 -131 -25 57 135 -10 194 63 -342 66 245 158 -250
3774 -250 130 131 158 -218 92 287 -469 74 305 -44 208 367 -222 -37 124 -185 7 331 -126 -188 -220 138
3796 138 -70 35 -20 396 -475 339 -226 -210 -16 57 225 103 214 349 -372 -58 172 -331 -191 21 135
3817 135 -144 -56 102 -213 -194 413 -276 -350 -164 21 -193 194 57 196 144 16 101 -157 154 68 -165 -276
3839 -276 169 -166 -67 267 218 -30 22 -192 -96 -34 120 -117 0 48 64 -22 114 110 -74 -470 -198 108 -78
3862 -78 190 280 -250 -7 154 -327 -12 -125 -133 -320 -61 282 -187 -126 352 318 76 155 12 -304 -210 430 -90
3885 -90 -189 167 90 -132 393 33 -358 -153 -170 -319 -52 45 151 -7 -102 32 -124 -531 -52 -172 31 240
3907 240 47 -166 137 246 -3 122 2 4 -233 91 -288 -79 -37 170 458 -61 -10 452 -72 -426 285
3928 285 -193 -307 -68 235 -39 -210 293 -79 57 158 -238 -261 93 49 58 -11 257 -123 41 136 71 -152
3950 -152 -86 22 -305 -121 -101 -105 -442 -39 55 139 -3 109 -124 -75 533 -149 -193 54 65 225 -100 378 -117
3973 -117 -80 53 76 -324 6 274 20 9 216 -159 -29 -40 116 -84 145 -156 99 67 236 51 -160 50
3995 50 62 106 -122 143 166 -208 204 177 -1 103 147 394 -193 124 -83 -322 125 -168 -27 302 112 -76
4017 -76 -259 78 72 -277 -162 -2 312 -114 22 -134 -96 -49 232 -71 -164 430 294 155 -16 174 -176 -210
4039 -210 169 -290 91 259 -15 -78 116 -187 -117 -32 103 -109 -219 43 166 107 -151 -22 17 -126 -93 -52
4061 -52 30 148 13 -296 -129 -136 158 2 395 107 -90 181 -16 -295 -127 215 -10 -123 -95 -66 82 -75
4083 -75 -8 123 130 -84 -134 -250 76 -165 39 -87 -38 -106 -19 156 20 -103 96 231 -68 -71 235 208 133 -7
4107 -7 236 -153 -24 -146 -44 125 251 73 -89 101 -51 1 1 -1 -43 -32 -3 217 112 -163 124 56 -1 175
4131 175 -43 311 126 -4 127 -23 84 24 -183 -35 -37 127 236 170 9 -237 -155 94 -72 56 153 -265
4153 -265 27 -272 35 -94 -104 -69 4 -27 20 -142 113 99 446 -165 -70 104 -226 -129 -104 -249 82 6 65 42
4177 42 -142 116 -141 -358 62 2 10 -159 23 24 -54 315 -392 11 107 105 112 -156 46 4 63 184 61 -45 242
4202 242 -151 -165 65 -9 108 202 46 -103 -39 79 -55 -49 122 145 -80 -62 55 262 -30 60 -6 -8 -107 74
4226 74 -300 -35 264 307 82 -142 288 -176 1 96 -122 -88 -83 258 87 -46 -89 -102 -149 137 -9 -223 8
4249 8 -159 197 -213 437 86 182 -53 131 -182 21 67 -240 -349 22 -86 74 -180 234 -87 16 20 -182
4271 -182 -138 74 -51 7 122 311 -29 -59 -63 -50 206 -180 -187 -86 254 42 105 297 245 11 -82 -67 -367 -59
4295 -59 -191 4 192 99 -86 2 -64 54 -301 -43 -197 -92 95 -25 25 73 -106 61 281 64 -88 180
4317 180 156 -151 139 -30 327 75 132 -73 198 20 30 -292 240 101 -341 -78 -85 -115 -70 -96 -55 -300 23
4340 23 -82 -151 18 434 -9 30 221 -53 96 -219 -22 -138 163 3 -108 -36 134 132 90 48 -328 -67 -16
4363 -16 181 -259 172 110 179 129 2 35 -91 -214 39 167 269 -119 158 66 -87 -121 79 216 134 173 226
4386 226 112 -306 -119 -69 144 -5 -209 -306 80 -10 56 62 -38 -6 82 -7 -34 18 140 -73 -236 -240 -166 159 -228
4411 -228 -30 -211 -163 103 -115 -316 160 -95 -107 -162 84 295 -28 299 149 -63 -18 22 2 -355 4 -122
4433 -122 -163 7 206 38 200 446 -206 149 -70 -54 -255 -136 252 22 -322 -94 -235 -16 80 -57 108
4454 108 -65 47 -193 -34 -75 190 8 169 194 13 100 -7 79 -18 -7 -18 -5 99 49 22 -103 209 -85
4477 -85 -289 221 77 247 -172 -12 71 96 116 387 -247 -247 297 -338 6 352 226 355 11 -65 -469 121
4499 121 165 -193 -2 1 -69 86 -209 142 251 84 -111 34 -258 231 168 306 102 -157 482 -548 142
4520 142 167 -266 5 295 37 252 66 101 9 32 20 -171 -146 369 166 -166 213 370 9 -185 32 -50
4542 -50 48 -113 142 103 310 87 55 94 92 -149 -121 62 145 -84 66 -47 -97 -142 -29 114 -455 -49 -83 -74 342
4567 342 36 -185 -41 205 -93 -380 -79 238 -152 -43 -75 -91 -85 229 -41 -314 145 1 -243 -172 -151 -35
4589 -35 -132 -78 -49 -326 -27 11 282 27 -221 -206 -24 55 -387 41 13 217 132 -124 -66 114 166 -7 -67 -84
4613 -84 -23 168 -119 -62 183 -26 -152 142 -59 3 -154 -104 -55 1 253 214 71 180 61 -28 -80 259 139
4636 139 179 151 203 132 -2 94 -69 334 -416 -84 -105 155 62 142 -97 29 14 -466 -121 -7 90 -203 95
4659 95 -348 -252 -171 250 66 262 323 -73 -224 26 -12 -57 81 -50 253 117 224 160 -161 148 -139 -184 -50
4682 -50 -31 -115 59 180 78 -138 224 1 -29 -104 62 46 -78 11 -112 -130 51 -4 326 -86 63 19 -34 61
4706 61 48 -393 -43 -46 -1 -164 199 -51 -181 145 78 -164 -183 25 -334 200 176 189 -61 159 159 -67 174 -18
4730 -18 156 77 46 402 -94 -101 494 -163 76 263 -15 69 -69 -86 -220 -237 32 137 -172 41 -259 -64 37
4753 37 377 14 -52 249 75 -33 -64 304 -70 -259 -179 -100 -149 -218 209 35 -111 -35 -226 -171 186 104 -122
4776 -122 53 189 -12 -140 -65 -18 117 152 25 -226 -16 -181 -419 -288 88 247 151 17 -198 -38 217
4797 217 141 -202 119 145 152 -57 199 105 177 -178 -122 -288 16 -192 -207 146 52 -39 128 -272 -161 -39 -14 174
4821 174 57 -156 -94 -19 134 -12 -95 -176 -76 114 -276 -85 -108 11 -43 34 -235 471 -37 246 251 7 -203
4844 -203 -260 41 -105 -66 214 89 -6 31 60 150 -435 170 -143 -105 15 213 66 -137 9 -322 -116 97
4866 97 75 -171 206 51 -18 373 -99 63 -14 85 -5 78 126 199 -23 181 78 -26 90 83 -196 -181 126 -25
4890 -25 -193 229 -154 -260 -43 296 322 213 -137 131 -44 259 -105 195 -413 141 -138 -479 81 -78 -263
4911 -263 -263 247 -17 138 128 -97 -33 78 -159 -222 43 -178 139 -81 -128 89 -220 136 -84 -113 -143 -152 5
4934 5 -301 358 -18 -165 -272 -116 46 -66 -283 -274 52 104 -74 -48 22 -124 202 -125 15 -9 98 39 96
4957 96 -224 -54 -222 -114 218 -139 -7 -63 -440 -126 -161 -31 -16 -93 -154 184 -177 -58 106 66 112 -111 -93
4980 -93 293 -192 -77 -265 137 -18 -72 -46 23 -54 166 192 194 -102 -110 359 -142 -214 180 -80 -89 -63 301 -76 251
5005 251 208 150 122 138 -188 93 218 -158 -129 -41 125 -252 158 -32 135 73 -21 -58 -37 -294 -119 -253 -17
5028 -17 197 155 -126 -29 -26 214 32 -104 -170 -4 86 12 327 215 -125 152 172 -145 -294 -86 115 -126 42
5051 42 300 60 -13 -67 -96 126 -110 13 -90 -146 136 -180 251 -15 -55 286 30 -206 151 0 62 149 -78
5074 -78 -360 13 -33 256 -49 -3 -133 25 53 -18 -65 -99 -40 -72 52 40 17 -98 -125 -64 -113 38 213 129 240
5099 240 136 -302 -308 106 100 -142 271 -79 -72 83 -67 61 140 6 -201 -63 -66 -10 80 177 -137 58 474 91
5123 91 86 -179 -143 9 -35 60 -204 -105 82 220 204 44 -132 59 -114 -146 -150 20 -152 82 449 137 -123 -140
5147 -140 27 -198 -9 -161 101 -37 -107 -132 -236 -128 -11 49 -87 -25 83 -46 -23 -47 -87 69 -17 27 143
5170 143 -184 -139 81 82 -150 -10 162 -45 197 -92 -144 97 -50 288 69 -159 -322 -119 45 285 475
5191 475 -103 302 89 195 -85 0 29 48 3 -234 65 -184 5 233 54 -23 16 -64 -73 95 -113 -56 -97 -4
5215 -4 -32 -156 -22 -120 70 103 55 -212 241 30 -14 341 191 -127 61 -233 -138 -200 207 -57 -122 -4 -26 -226
5239 -226 -173 -136 -229 -179 -204 110 382 95 159 70 -225 -7 22 -50 71 76 -263 229 -49 -123 128 -113 221 -8
5263 -8 126 -121 -98 81 -50 299 -257 88 48 -181 149 75 139 -197 178 29 37 -116 125 118 -284 232 -236
5286 -236 173 -73 152 -54 145 -129 115 -13 194 285 -51 297 236 279 -51 -161 103 -178 122 -223 97
5307 97 107 117 -47 122 58 -186 240 -35 19 197 -245 76 -238 -198 -69 30 -14 20 251 96 111 120 -32 -22
5331 -22 -134 56 90 -48 184 304 28 -49 150 -134 -76 -242 168 -109 -128 26 58 285 -142 -10 105 -97
5353 -97 -21 -158 -200 -224 -232 143 325 -220 -74 -69 24 -22 -43 -272 313 61 375 89 62 -107 -70 -102 -153 -42 -333
5378 -333 270 48 350 -154 -9 -12 -300 50 54 -21 -238 265 -54 20 -24 21 -56 49 61 190 24 133 -371
5401 -371 -355 95 34 -34 5 -54 -262 -257 -169 -47 -54 -429 242 66 -161 -220 340 31 -251 -169 53 -106 27 -91
5425 -91 -300 96 55 -90 -106 -13 -81 -165 86 165 -50 150 204 324 -121 242 80 -29 -84 245 -47 -25 -300
5448 -300 -169 -268 -80 465 167 -138 208 321 -113 -83 -163 -383 -126 29 -32 -66 -254 18 -52 -77 -151 172 88
5471 88 -170 -37 -107 -20 -307 34 114 -95 -72 34 153 149 61 -195 73 -14 194 170 -146 113 -28 141 -382
5494 -382 89 -61 142 -11 78 51 264 -120 -60 -58 -130 -87 45 66 58 114 127 32 -40 102 -9 13 132 88 97 64
5520 64 56 41 -23 -66 -162 7 -107 -17 26 -173 -36 -158 -185 3 41 46 -210 150 -132 -81 -333 -238 265 115 -20
5545 -20 324 -15 -283 -258 3 -84 -189 22 69 -263 85 -205 -41 -312 120 237 288 19 -106 -353 202 166
5567 166 92 -143 -415 142 -78 146 -72 24 -95 47 -274 183 152 330 -64 29 -190 -267 -398 -131 392 202
5589 202 15 72 25 456 237 -214 145 -128 -27 167 65 223 276 -61 -92 -189 277 132 -176 -96 -112 -6
5611 -6 155 21 399 -82 116 -37 -123 -28 -76 192 -77 -19 -53 -400 -106 120 -77 -40 -32 -79 88 -22 80 65
5635 65 268 160 15 -147 -58 -176 -234 232 -133 149 260 363 -11 -30 -259 -177 -4 121 35 -306 169 0
5657 0 346 -339 -239 89 -124 -90 -48 -20 15 -90 -149 65 -360 149 -305 -45 22 216 284 -223 92 154 -244
5680 -244 234 246 -144 -77 -154 365 -60 184 -94 -7 -195 -97 -452 356 -202 250 99 154 331 27 -108 -285
5702 -285 -102 133 208 250 -140 -143 87 -142 -154 39 347 -266 -46 -63 -123 -345 242 -123 114 19 169 -15 142
5725 142 67 -111 -77 24 122 -9 176 21 -84 -61 46 -162 -151 -121 -33 109 -169 -324 7 45 -70 -8 193
5748 193 12 72 198 38 -57 42 140 219 324 -33 246 321 -274 10 -45 -52 91 122 -240 106 86 -165 -71 78
5772 78 58 -274 -50 1 -62 -11 212 -68 -59 -335 -122 204 -257 118 -59 86 100 112 51 -83 188 -101 157
5795 157 -98 -224 -220 -141 33 -58 -179 -61 5 223 172 -233 -293 51 139 -246 -64 -49 58 26 159 -158 -21
5818 -21 210 -221 -17 67 27 52 68 347 126 -133 58 98 97 86 102 195 2 -111 86 -142 -112 -154 -88 136 73
5843 73 22 69 -80 -49 -152 -177 94 1 -152 -37 -13 -31 -56 119 118 -122 42 2 265 34 -2 384 70 69 -59
5868 -59 -71 -156 9 -24 276 -108 45 124 242 25 -98 -213 28 -24 -131 -213 -89 49 192 116 -198 55 -202
5891 -202 80 -157 -94 -57 -300 1 166 222 -52 149 -186 -29 87 -41 307 138 -185 66 19 -325 -1
5912 -1 -128 -110 -166 -216 -138 42 -92 310 184 100 244 67 -95 96 27 40 -56 78 244 133 265 -115 -51 -171
5936 -171 -189 -55 174 -98 40 179 9 169 86 34 -325 128 -332 184 62 -558 186 74 -34 63 -113
5957 -113 106 0 7 -35 -38 -123 328 42 126 223 332 -45 -361 65 -217 161 87 56 95 -308 111 -50 -138 -153
5981 -153 35 -50 -178 -25 -107 -191 9 -104 -55 -10 -403 23 -249 -40 4 -68 291 27 -77 169 102 155 -231
6004 -231 271 261 -33 -104 -106 341 37 -186 -7 -143 -73 3 -319 -99 -52 120 -19 335 61 0 181 369 96
6027 96 53 389 -87 134 201 194 105 24 68 -89 142 24 -148 46 -27 39 -249 -39 -168 -292 -94 -83 -229 49
6051 49 -197 -88 49 -146 -4 -128 68 -142 -112 69 36 47 11 35 25 238 -72 -91 -140 136 -182 -159 -68 193
6075 193 -36 163 -110 -108 38 -370 -134 -130 9 58 -27 166 -150 6 -104 -48 -88 -70 -70 31 39 -123 170 117 416
6100 416 3 -18 44 -109 84 164 -138 -104 32 -159 244 104 32 -156 1 -294 -19 -202 -158 36 -155 -152 121
6123 121 186 -193 -19 -118 -49 -203 -28 94 -113 -144 -149 149 77 -272 -40 181 -152 -334 20 35 31 -58 246 -216
6147 -216 79 69 -407 10 -110 -175 -140 -71 149 -138 2 63 -218 -166 -121 140 -2 64 269 -104 -175 -26 212
6170 212 86 -7 185 -3 -127 -16 -119 -72 -39 -22 -198 -74 116 -49 144 91 -203 -17 -98 492 111 177
6192 177 261 49 -309 -67 276 169 352 -55 -136 -55 -1 -113 135 -182 -147 -92 -56 -86 120 101 -202 42 351
6215 351 -189 20 415 -127 120 -14 274 220 186 341 187 -49 240 -338 268 -215 -13 -99 -52 -13 -72 283
6237 283 95 -40 29 248 38 85 109 215 -142 -101 -160 -272 -64 51 6 2 159 22 23 -43 6 5 -27 152 -24
6262 -24 69 -263 34 125 -78 245 155 3 106 21 258 71 -195 -182 2 169 63 -373 -270 -109 -67 17 -12
6285 -12 -6 97 -36 -5 185 -114 88 255 251 -58 -344 97 254 -183 265 -142 -318 -151 -32 -155 56 107
6307 107 184 -228 1 143 -177 -154 -142 -74 -50 -277 -90 322 308 92 84 -406 -256 233 327 -155 120 -47 99
6330 99 241 84 -25 64 30 -15 -44 -103 309 -254 -98 -136 123 66 -117 -224 -322 -224 -74 -59 -269 -21 -158 270
6354 270 -149 -312 -59 -18 172 -290 73 -240 -22 -412 -190 94 -32 -297 87 5 135 173 -118 -150 -51 175
6376 175 -234 -74 -135 29 -85 48 -136 79 135 56 -160 69 -29 -185 -150 157 17 168 -68 -291 77 145
6398 145 -84 -106 -29 217 -32 -100 3 157 -18 61 -161 -95 -120 209 -168 -37 -15 -462 179 -249 165 -117
6420 -117 -291 23 11 89 247 -335 -81 -370 41 140 42 16 304 -30 -200 -101 74 -136 -60 -84 179 113 119 -275
6444 -275 -191 152 206 197 200 291 -179 323 56 -69 -116 -201 -93 87 418 -224 42 149 -102 -83 302 -144 -272
6467 -272 -5 191 33 -275 55 -45 -240 18 -231 -167 4 -206 -99 168 -33 101 204 -48 -214 142
6487 142 -154 -46 83 -21 42 -143 190 -127 123 11 51 -50 433 -225 508 -126 -170 -82 13 -13 -175 -26
6509 -26 317 117 -33 183 59 -156 -233 39 260 -36 -131 62 -160 -196 222 66 32 277 154 194 -5 199
6531 199 59 -73 -163 64 150 15 -36 -73 213 36 -24 320 -243 -23 45 -79 263 -194 6 36 -103 115
6553 115 107 -256 -141 -29 116 -185 22 131 -52 132 -297 148 -13 -112 -94 35 -105 -167 207 -251 230 69
6575 69 17 249 -177 -105 323 229 -8 -16 -142 201 30 400 82 167 126 61 -145 204 -135 72 100 -245 -3
6598 -3 -243 261 -195 -94 236 29 57 -91 52 -143 -213 227 191 24 -93 -24 198 -200 -193 -30 -257 119 -162
6621 -162 -300 156 -1 85 45 295 231 318 -459 -144 249 131 -124 -187 82 -108 161 242 -364 104 -257 95
6643 95 -208 168 36 95 1 57 -32 60 66 74 87 102 190 333 59 59 -153 10 78 155 160 36 164 -263 -14 32 169
6670 169 192 -188 19 190 -78 218 53 116 25 145 -63 15 -52 -166 -25 273 71 -194 3 -186 -195 48
6692 48 53 -56 194 -36 157 -58 185 71 440 186 -99 -52 104 241 -236 37 11 71 -196 276 -44 65
6714 65 41 -110 -221 309 -83 -85 65 106 91 59 -66 -327 166 81 44 95 57 62 -149 16 -210 -39 87 -15
6738 -15 -147 -140 82 -184 198 -320 309 -128 -354 -12 -164 213 185 146 -295 -129 -45 147 60 22 66 53 172
6761 172 29 142 -163 31 -19 -51 -232 83 143 -215 65 -280 93 -14 399 94 69 158 -60 -76 32 69
6783 69 -88 163 68 2 -182 -116 -318 253 -119 -80 286 -83 41 -66 -99 -196 -115 -14 75 69 145 273 -141 -210
6807 -210 18 -128 -247 16 157 -397 2 -101 105 -87 -167 67 -44 181 119 60 -138 -144 -79 -53 -81 16 -59
6830 -59 12 215 33 -276 150 -244 89 -215 79 98 -305 366 50 -33 155 134 -107 48 -91 -76 -13 127
6852 127 -63 447 -170 273 -285 -95 152 -260 78 -64 242 -42 194 129 231 -36 -147 -45 171 333
6872 333 -204 -166 -51 -169 -150 -51 186 -3 -61 -152 -44 269 241 -19 78 323 -262 219 211 -68 255 -51 8
6895 8 74 183 61 -5 98 145 -353 -64 13 39 -93 -61 -94 -68 82 48 189 10 -267 74 -75 -414 -53 -127
6919 -127 96 135 31 76 123 258 116 -2 -156 -208 -53 -284 -471 189 154 205 62 -15 174 -287 -91 -218
6941 -218 -52 -34 87 -26 81 6 71 1 -239 116 -85 42 82 41 21 -199 -51 -61 10 127 -304 -50 -29
6964 -29 265 -41 85 -116 -103 384 89 -272 7 23 60 -73 -252 8 102 256 -106 -151 -108 110 -36 -3 187
6987 187 -11 64 -11 -115 5 88 -63 36 314 285 -186 -19 -217 -132 238 131 39 21 -33 -154 -163 -82 20 42
7011 42 -77 51 -125 37 59 -98 -336 16 -254 209 -37 44 -130 -5 193 59 14 -235 67 -43 200
7032 200 -156 141 132 350 180 -43 146 28 27 95 46 -319 157 -146 -65 -21 109 -5 171 -105 59 259 153
7055 153 60 -82 214 308 153 -134 -83 -242 -46 -176 -278 -351 67 33 -80 307 87 93 -113 -100 -129 -3 -329
7078 -329 -127 -132 63 -14 -78 -149 -169 155 -131 157 214 107 -64 -176 -31 77 -140 -59 -38 -249 -34 -18 -44 -144
7102 -144 39 380 -83 -98 -6 66 -54 -129 131 135 97 121 -86 492 1 -382 -228 59 -23 64 -259 -316 -37 25
7126 25 -165 68 202 -33 -119 127 -286 -24 -39 -165 -122 -83 -36 56 -162 -123 -182 -224 -8 -109 179 -50 -254
7149 -254 265 139 -291 47 -92 -139 0 -175 -50 -77 231 -160 154 175 28 80 -45 216 133 -138 -91 400
7171 400 -209 -51 -224 148 37 -71 -111 -11 -120 -13 225 19 212 -95 73 141 18 140 251 364 6
7192 6 -24 241 -41 -68 8 30 -205 -64 -37 -302 -122 79 154 -291 -172 153 101 -26 -60 -98 94 300 -6 62
7216 62 -156 -70 -124 152 79 357 -35 320 -52 -216 -162 -16 146 -193 40 -78 -81 -51 -88 67 112 239 -256
7239 -256 -214 -148 -125 40 -40 -162 32 -131 23 186 95 -11 201 131 -320 -10 -432 110 373 -128 -163 -155 -14
7262 -14 -197 98 58 157 244 58 207 108 205 289 62 307 -201 207 148 132 127 64 -8 -60 -48 -10 -71 249 124 51
7288 51 -52 -185 118 -76 -165 -89 85 175 153 -118 -150 -25 46 184 -96 18 1 109 -48 111 71 93 36 85
7312 85 128 -230 -154 121 -203 144 -35 -139 25 -54 -251 115 120 -263 87 -186 -390 20 14 -180 138 -291 -31
7335 -31 -350 90 185 30 -14 10 -150 -139 -85 45 -153 -51 -8 95 -70 -90 71 232 123 -31 102 -78 -138
7358 -138 -62 -334 37 -52 -129 130 -36 -11 -21 16 -114 -45 -296 -361 118 217 -33 4 -186 -67 183 58 -25 -80
7382 -80 54 481 -148 89 -59 -152 -204 -316 12 -121 19 -234 250 -80 -28 -118 -27 209 -49 -11 113 113 -181
7405 -181 -16 -147 -154 -148 27 102 -30 -86 5 173 158 214 220 -177 325 -128 177 -84 36 126 -279 -65 -14 -16 -145
7430 -145 -69 -48 -88 -139 -176 -459 -51 144 378 -301 257 99 41 -151 136 8 -75 150 121 -12 57 1 -6 184
7454 184 -227 -92 302 80 -13 -58 98 -106 -189 -203 199 25 -106 -24 134 -72 -73 -94 -389 209 3 -79 127
7477 127 277 -82 245 145 331 77 48 -89 71 276 -319 10 -111 78 -65 88 -28 -137 -11 -222
7497 -222 2 187 -86 -294 -174 140 297 -152 291 143 282 122 95 -143 -64 57 -51 301 24 91 -33
7518 -33 7 54 -46 -336 -425 223 156 72 53 -145 -42 -166 61 112 212 107 215 255 268 -156 -4 -43 -101 262
7542 262 29 77 32 51 98 36 -98 162 307 99 -250 -59 -104 209 -118 -40 209 -36 16 63 -117 148 1
7565 1 -85 124 -15 -185 -58 -77 -124 -147 -130 109 -104 108 114 42 10 -96 100 -420 181 172 11 40 -218 82 -35
7590 -35 -181 -113 138 24 -189 9 -112 -117 131 78 95 -77 145 109 355 -61 76 22 84 -150 42 -84 -39
7613 -39 -107 14 49 -181 -27 102 -61 -125 -44 -268 -120 186 50 -220 161 -23 177 95 -144 -117 76 -145
7635 -145 -145 191 49 102 -87 -91 -16 -44 52 -34 36 121 102 119 -87 -245 -99 27 -25 -66 -239 -349 -8 168 58
7660 58 155 -111 -123 77 -127 -114 313 -308 102 100 48 210 -55 258 -66 36 226 363 6 -25 -103 32 -174
7683 -174 -101 -82 -147 -301 -100 -152 238 -179 97 444 95 162 143 -170 135 -5 73 182 -65 333 -31 -64 -3
7706 -3 -116 137 70 -161 31 19 -208 -167 153 106 170 356 71 113 0 -264 -101 154 48 60 124 -89 -118 43
7730 43 295 -132 53 -33 12 117 -68 -36 -107 -53 365 21 141 245 89 -262 59 -191 46 291 128 -129
7752 -129 -33 290 27 114 9 149 64 -93 -1 81 34 -229 160 -185 -73 -166 71 -85 340 -3 -28 29 -7
7775 -7 173 376 -236 -159 -51 -279 272 289 -57 -69 56 -260 26 -96 65 73 76 138 52 236 69 -108 -213 155
7799 155 114 103 -91 -167 -70 -133 134 284 -38 2 12 11 -72 162 -92 17 -51 112 -26 245 -29 72 113 -360
7823 -360 92 105 -198 38 36 -255 -184 156 230 110 11 -361 51 71 -156 -396 110 -265 -49 39 -223 -218 -204 -380
7847 -380 -46 171 129 101 -55 -323 -2 -272 -260 -64 -78 89 138 214 71 -57 -209 68 -133 383 337 -61
7869 -61 -201 180 -78 -171 -31 -136 155 129 -108 301 61 -40 69 1 -36 -73 192 -130 -240 37 105 -43
7891 -43 213 -237 -120 -154 -44 44 -154 65 99 -64 7 95 129 -155 -191 143 -180 -50 355 -8 -80 -14 -148
7914 -148 -252 13 -251 20 -52 -62 397 -135 -114 40 93 143 -26 100 18 115 -147 393 -319 -10 147 -25
7936 -25 75 -96 62 46 -36 190 139 -56 109 112 232 22 98 87 -194 -208 -164 -16 -132 11 -178 -59 -168
7959 -168 -133 -2 68 -94 -109 66 50 171 -57 -24 -70 -203 -275 -14 -32 -13 -54 -221 22 184 30 -38 179 -194
7983 -194 -157 -156 -67 -27 -59 -87 31 -11 63 -88 -10 9 -235 94 15 97 -450 -139 43 -9 106 192 -26 69 -62
8008 -62 14 -127 -24 -106 -99 -119 -304 7 132 5 -63 188 132 64 -60 143 132 -163 -35 186 127 -48 -240 -81
8032 -81 4 -228 90 63 88 -261 68 105 13 18 -122 16 -64 49 84 23 80 338 -18 29 -53 198 7 -165 -126
8057 -126 344 86 53 6 116 -317 -128 -155 -36 -34 -121 -223 -185 97 -18 293 -8 90 -213 67 349 134 -304
8080 -304 166 261 8 -69 287 148 -2 163 183 157 -25 215 -182 -258 -143 218 66 -221 -267 149 -70 -130
8102 -130 -69 92 -112 -98 -48 -186 -128 62 41 14 -59 -113 -47 257 -244 55 -430 274 -150 98 126 -332 250
8125 250 104 -21 -247 55 -157 -210 63 173 -204 -21 30 60 13 71 70 14 421 149 -27 -38 -467 -117 110
8148 110 174 -226 90 239 196 88 55 138 -288 -55 -111 -395 91 169 -66 -216 -147 203 198 16 31 -163 -78 -186
8172 -186 -16 -145 159 104 -192 -109 -99 -70 129 -228 -540 -391 -420 -147 207 11 222 -7 40
8191D0
##END NTUPLES=NMR FID
##END=
