##TITLE=1H_Ser 2188-ox-4(DMSO)
 CDCl3
 8 sc, 
 4.7.2024
##JCAMPDX= 6.0         $$ Bruker NMR JCAMP-DX V2.0
##DATA TYPE= NMR FID
##DATA CLASS= NTUPLES
##ORIGIN= UXNMR, Bruker Analytische Messtechnik GmbH
##OWNER= root
$$ XWIN-NMR		Version 3.5
$$ Thu Jul  4 15:05:55 2024 Russian Standard Time (UT+4h)  she@DPX200
##.OBSERVE FREQUENCY= 200.1314
##.OBSERVE NUCLEUS= ^1H
##.DELAY= (6, 6)
##.ACQUISITION MODE= SIMULTANEOUS
##.ACQUISITION SCHEME= undefined
##.AVERAGES= 8
##.DIGITISER RES= 18
##SPECTROMETER/DATA SYSTEM= spect
##.PULSE SEQUENCE= zg30
##.SOLVENT NAME= DMSO
##.SHIFT REFERENCE= (INTERNAL, DMSO, 0, 15.7039)
##AUDIT TRAIL= $$ (NUMBER, WHEN, WHO, WHERE, WHAT)
$$ ##TITLE= Audit trail, XWIN-NMR		Version 3.5
$$ ##JCAMPDX= 5.01
$$ ##ORIGIN= Bruker BioSpin GmbH
$$ ##OWNER= she
$$ F:/spectra/data/she/nmr/H-F/1/audita.txt
$$ ##AUDIT TRAIL=  $$ (NUMBER, WHEN, WHO, WHERE, WHAT)
(   1,<2024-07-04 15:01:15.35 +0400>,<she>,<DPX200>,
      <created by zg, POWCHK disabled, PULCHK disabled
       configuration hash MD5:
       00 E9 B6 7A A2 85 ED C7 34 08 36 98 17 FE 4E 26
       data hash MD5: 16K
       37 2B 41 87 1F B3 31 B5 66 F5 4C A0 D1 B1 06 AC>)
$$ ##END=
$$ 
$$ hash MD5
$$ 95 5A F6 E3 4F 55 0F B4 F6 F9 9B 10 87 45 DF 1E
##$RELAX= 
##$RELAX= 
##$RELAX= 
##$RELAX= 
##$RELAX= 
##$RELAX= 
$$ Bruker specific parameters
$$ --------------------------
##$DU= <F:/spectra>
##$EXPNO= 1
##$NAME= <H-F>
##$PROCNO= 1
##$TYPE= <nmr>
##$USER= <she>
##$AMP= (0..31)
100 100 100 100 100 100 100 100 100 100 100 100 100 100 100 100 100 100 
100 100 100 100 100 100 100 100 100 100 100 100 100 100 
##$AQSEQ= 0
##$AQ_mod= 1
##$AUNM= <au_zg>
##$AUTOPOS= <>
##$BF1= 200.13
##$BF2= 200.13
##$BF3= 200.13
##$BF4= 200.13
##$BF5= 200.13
##$BF6= 200.13
##$BF7= 200.13
##$BF8= 200.13
##$BYTORDA= 1
##$CFDGTYP= 0
##$CFRGTYP= 5
##$CHEMSTR= <none>
##$CNST= (0..31)
1 1 145 1 1 1 1 1 1 1 1 1 1 1 1 1 1 1 1 1 1 1 1 1 1 1 1 1 1 1 1 1 
##$CPDPRG= <>
##$CPDPRG1= <>
##$CPDPRG2= <>
##$CPDPRG3= <>
##$CPDPRG4= <mlev>
##$CPDPRG5= <mlev>
##$CPDPRG6= <mlev>
##$CPDPRG7= <mlev>
##$CPDPRG8= <mlev>
##$CPDPRGB= <>
##$CPDPRGT= <>
##$D= (0..31)
0 1.2 0 0 0 0 0 0 0 0.06 0 0.03 0 0 0 0 0.0002 0 0 0 0 0 0 0 0 0 0 0 0 
0 0 0 
##$DATE= 1720090874
##$DBL= (0..7)
120 120 120 120 120 120 120 120 
##$DBP= (0..7)
150 150 150 150 150 150 150 150 
##$DBP07= 0
##$DBPNAM0= <>
##$DBPNAM1= <>
##$DBPNAM2= <>
##$DBPNAM3= <>
##$DBPNAM4= <>
##$DBPNAM5= <>
##$DBPNAM6= <>
##$DBPNAM7= <>
##$DBPOAL= (0..7)
0.5 0.5 0.5 0.5 0.5 0.5 0.5 0.5 
##$DBPOFFS= (0..7)
0 0 0 0 0 0 0 0 
##$DE= 6
##$DECBNUC= <off>
##$DECIM= 24
##$DECNUC= <off>
##$DECSTAT= 4
##$DIGMOD= 1
##$DIGTYP= 9
##$DL= (0..7)
0 120 120 120 120 120 120 120 
##$DP= (0..7)
150 150 150 150 150 150 150 150 
##$DP07= 0
##$DPNAME0= <>
##$DPNAME1= <>
##$DPNAME2= <>
##$DPNAME3= <>
##$DPNAME4= <>
##$DPNAME5= <>
##$DPNAME6= <>
##$DPNAME7= <>
##$DPOAL= (0..7)
0.5 0.5 0.5 0.5 0.5 0.5 0.5 0.5 
##$DPOFFS= (0..7)
0 0 0 0 0 0 0 0 
##$DQDMODE= 0
##$DR= 18
##$DS= 0
##$DSLIST= <SSSSSSSSSSSSSSS>
$$ [...]
##$SUBNAM2= <"">
##$SUBNAM3= <"">
##$SUBNAM4= <"">
##$SUBNAM5= <"">
##$SUBNAM6= <"">
##$SUBNAM7= <"">
##$SUBNAM8= <"">
##$SUBNAM9= <"">
##$SW= 24.0689651099613
##$SWIBOX= (0..15)
0 0 2 0 0 0 0 0 0 0 0 0 0 0 0 0 
##$SW_h= 4816.95568400771
##$TD= 16384
##$TD0= 1
##$TE= 0
##$TE2= 300
##$TE3= 300
##$TEG= 300
##$TL= (0..7)
0 120 120 120 120 120 120 120 
##$TP= (0..7)
150 150 150 150 150 150 150 150 
##$TP07= 0
##$TPNAME0= <>
##$TPNAME1= <>
##$TPNAME2= <>
##$TPNAME3= <>
##$TPNAME4= <>
##$TPNAME5= <>
##$TPNAME6= <>
##$TPNAME7= <>
##$TPOAL= (0..7)
0.5 0.5 0.5 0.5 0.5 0.5 0.5 0.5 
##$TPOFFS= (0..7)
0 0 0 0 0 0 0 0 
##$TUNHIN= 0
##$TUNHOUT= 0
##$TUNXOUT= 0
##$USERA1= <user>
##$USERA2= <user>
##$USERA3= <user>
##$USERA4= <user>
##$USERA5= <user>
##$V9= 5
##$VALIST= <valist>
##$VCLIST= <CCCCCCCCCCCCCCC>
##$VD= 0
##$VDLIST= <DDDDDDDDDDDDDDD>
##$VPLIST= <PPPPPPPPPPPPPPP>
##$VTLIST= <TTTTTTTTTTTTTTT>
##$WBST= 1024
##$WBSW= 4
##$XGAIN= (0..3)
0 0 0 0 
##$XL= 0
##$YL= 0
##$YMAX_a= 75407
##$YMIN_a= -111518
##$ZGOPTNS= <>
##$ZL1= 120
##$ZL2= 120
##$ZL3= 120
##$ZL4= 120
##$ABSF1= 10
##$ABSF2= 0
##$ABSG= 5
##$ABSL= 3
##$ALPHA= 0
##$AQORDER= 0
##$ASSFAC= 0
##$ASSFACI= 0
##$ASSFACX= 0
##$ASSWID= 0
##$AUNMP= <proc_1d>
##$AZFE= 0.1
##$AZFW= 0.1
##$BCFW= 1
##$BC_mod= 2
##$BYTORDP= 1
##$COROFFS= 0
##$CY= 11.3945322036743
##$DATMOD= 1
##$DC= 2
##$DFILT= <>
##$DTYPP= 0
##$F1P= 15.6554695791079
##$F2P= 12.8336369535428
##$FCOR= 0.5
##$FTSIZE= 0
##$FT_mod= 4
##$GAMMA= 1
##$GB= 0.15
##$INTBC= 1
##$INTSCL= 1
##$ISEN= 128
##$LB= 0.24
##$LEV0= 0
##$LPBIN= 0
##$MAXI= 10000
##$MC2= 0
##$MEAN= 0
##$ME_mod= 0
##$MI= 1.114404
##$NCOEF= 0
##$NC_proc= 0
##$NLEV= 6
##$NOISF1= 3.799351
##$NOISF2= 2.8
##$NSP= 1
##$NTH_PI= 0
##$NZP= 0
##$OFFSET= 15.70392
##$PC= 1
##$PHC0= -25505.65
##$PHC1= 9.787479
##$PH_mod= 1
##$PKNL= yes
##$PPARMOD= 0
##$PSCAL= 0
##$PSIGN= 0
##$REVERSE= no
##$SF= 200.130013532006
##$SI= 16384
##$SIGF1= 3
##$SIGF2= 2
##$SINO= 400
##$SIOLD= 16384
##$SREGLST= <1H.CDCl3>
##$SSB= 0
##$STSI= 0
##$STSR= 0
##$SW_p= 3612.71676300578
##$SYMM= 0
##$S_DEV= 0
##$TDeff= 0
##$TDoff= 0
##$TI= <>
##$TILT= no
##$TM1= 0
##$TM2= 0
##$TOPLEV= 0
##$USERP1= <user>
##$USERP2= <user>
##$USERP3= <user>
##$USERP4= <user>
##$USERP5= <user>
##$WDW= 1
##$XDIM= 8192
##$YMAX_p= 0
##$YMIN_p= 0
$$ End of Bruker specific parameters
$$ ---------------------------------
##NTUPLES= NMR FID
##VAR_NAME=  TIME,          FID/REAL,        FID/IMAG
##SYMBOL=    X,             R,               I
##VAR_TYPE=  INDEPENDENT,   DEPENDENT,       DEPENDENT
##VAR_FORM=  AFFN,          ASDF,            ASDF
##VAR_DIM=   8192,          8192,            8192
##UNITS=     SECONDS,       ARBITRARY UNITS, ARBITRARY UNITS
##FACTOR=    0.0002076,     1,               1
##FIRST=     0,             0,               0
##LAST=      1.7004516,     0,               0
##MIN=       0,             -111518,         0
##MAX=       1.7004516,     75407,           0
$$ Real data points
##PAGE= N=1
##DATA TABLE= (X++(R..R)), XYDATA
0@%%%%%%%%%%oJ3j4J4j4J6k3K8l3M0m4N1o1O8p6Q8j01J15j31J48j66J85k07K34
$$ 0 0 0 0 0 0 0 0 0 0 0 -6 7 -7 7 -7 9 -14 14 -19 21 -23 28 -33 35 -41 47 -54 61 -70 78 -88 97 -110 124
34A24k62K89l20L57l96M39m87N40n98O62p33Q12r02J007j125J261j423J619j862
$$ 124 -138 151 -169 188 -208 231 -256 284 -314 348 -385 427 -475 532 -593 668 -755 864 -998
53i98K166k562L107l905N180p538J3321n5069o5220J05411R576o1702L8519P6948
$$ -998 1168 -1394 1713 -2192 2988 -4550 8771 -46298 -111518 -6107 3469 -58233 -19714 57234
67E7234j2456J93K2762m0399m1006K7832k6998q0074J9361P4397j7209k3105N8913
$$ 57234 44778 44971 67733 27334 -13672 14160 -12838 -92912 -73551 846 -16363 -39468 19445
80A9445L7549j8477N45j3415l7194J4085J0849o4507j3309Q2577J2486o1247K6526
$$ 19445 56994 38517 39062 25647 -11547 2538 13387 -51120 -64429 18148 30634 -30613 -4087
93d087O1145l1817m0604J8945j1994l0527K8569Q808m3276L0541P3221k9701n0808
$$ -4087 57058 25241 -15363 3582 -8412 -38939 -10370 -1562 -44838 -14297 58924 29223 -21585
106b1585M9530L2414o0240k9145K4810o707j1831J1715j3693k450M9064M947n2776
$$ -21585 27945 60359 119 -29026 -4216 -10923 -22754 -11039 -24732 -27182 21882 26829 -25947
119b5947J5714N6894k7400m4955L2471J9653l2075O311J2844l6704N969M5966
$$ -25947 -10233 46661 19261 -25694 6777 26430 -5645 666 13510 -23194 -17225 28741
131B8741l7801n0281O2467M4768o7971j7474P2240J303n4262J1391K2335k5883
$$ 28741 -9060 -59341 3126 47894 -20077 -37551 34689 35992 -18270 -6879 15456 -10427
143a0427K199K2309k7710n163N3454m454n4338J7460L8538l5617l5130K0103O792
$$ -10427 -8228 14081 -13629 -18792 34662 30208 -24130 -6670 31868 -3749 -38879 -18776 -11984
156a1984m928J9493o13q860M1964K2442n4100j8511M7436j6251o4891J0258L7085
$$ -11984 -16912 2581 1968 -6892 35072 57514 3414 -15097 32339 16088 -48803 -38545 -1460
169a460j8503l309L4383k130n724L6271p178n4539J1793L8080m0541l9748M4028
$$ -1460 -19963 -23272 11111 8981 3257 39528 32350 -22189 -10396 27684 -12857 -52605 -8577
182h577L0827k4096J533K3284n176k057J025l5496j6235L3848m143m2429K4427
$$ -8577 22250 -1846 -313 22971 17795 15738 16763 -18733 -34968 -1120 -5263 -47692 -23265
195b3265N3415j2417j8020K9292L368k5868N942p072m2362J0530M0520l1573l1177
$$ -23265 30150 17733 -287 29005 32373 6505 12447 5375 -36987 -26457 14063 -17510 -48687
208d8687N9123L4763m9652j0989M5900r131l8231Q727O249j7192J7037J7420k5635
$$ -48687 10436 45199 -4453 -15442 30458 21327 -16904 -8177 -1928 -19120 -2083 15337 -10298
221a0298K512M2604j0463m3615J2065K3494k5030j8080J4440J982N023K0213j1502
$$ -10298 -7786 34818 24355 -19260 -7195 16299 -8731 -26811 -12371 -10389 -5366 14847 3345
234C345j3868L4906J2809m8143r379M1858j1029l9876J6478K2701j7303J631J7088
$$ 3345 -10523 24383 37192 -10951 -20330 21528 10499 -29377 -12899 9802 -7501 -5870 11218
247A1218j8087n324L2893r411m0480K1603L7936k9163k4615L2702J2562k3111
$$ 11218 -6869 -12193 20700 11289 -29191 -7588 30348 1185 -23430 9272 21834 -1277
259a277n53M863j0684R201P425k8639k290L8371m324l5902J7473L0750k0459j4842
$$ -1277 -1830 3033 -7651 1550 8975 -19664 -21954 16417 12093 -23809 -6336 24414 3955 -10887
273a0887J9750m628j1630K0636l887l2258K0442L3497l6824k9005M2790J5574
$$ -10887 8863 4235 -7395 13241 9354 -22904 -2462 31035 -5789 -34794 7996 23570
285B3570m3522j966L4276n990j4546J4784n24j2065J9127M783l2431J552L2734
$$ 23570 -19952 -21918 12358 6368 -8178 6606 6082 -5983 13144 17927 -14504 -12952 19782
298A9782j3618k9880J7114J8605j4523m018P149p277P754J3996k1948j3764L4888
$$ 19782 6164 -23716 -6602 12003 -2520 -6538 611 -6666 1088 15084 -6864 -20628 14260
311A4260R113l8417J897L5631j0176k6653J3719P994j7214O628R600k3157K066
$$ 14260 23373 -15044 -13147 22484 12308 -14345 -626 7368 -9846 -3218 6382 -16775 -14709
324a4709L4732j1530l2255K4472K7632k7204j7424K2850L852j4637M266j210q685
$$ -14709 20023 8493 -23762 710 28342 1138 -16286 6564 10416 -4221 45 -1165 -9850
337i850J6635P027k8522p63L3227r218l1611J6087K1094j7564l199J6207r350
$$ -9850 6785 13812 -14710 -15473 17754 8536 -23075 -6988 14106 -3458 -6657 9550 200
350B00l429K3631j0720l1215K1711K5694l6367k1278L7900R455l2010M271K4680
$$ 200 -3229 20402 9682 -21533 178 25872 -10495 -31773 6127 15582 -16428 -12157 12523
363A2523q376n664J2200j0566r833K1506l1l0280P489K8313j2621j9293J5644
$$ 12523 4147 -1517 10683 117 -9716 11790 11759 -18521 -11032 17281 4660 -14633 1011
376A011R534j0449J194k098j2472J2730J2303k4311q641L4492O921l1564O161
$$ 1011 10545 96 1290 -808 -13280 -550 11753 -12558 -21199 13293 20214 -11350 -5189
389e189K8135j3046j8360J1682l091j4610J2898M520k3472Q522L3453j2534k5289
$$ -5189 22946 9900 -8460 3222 131 -14479 -1581 2939 -20533 -12011 21442 8908 -16381
402a6381K2442J8762k4549j2451J3926j664p069O983n046n325K2417O004k7123
$$ -16381 6061 24823 274 -12177 1749 85 -6984 -1 -5047 -10372 12045 18049 -9074
415i074J392K6372j3049k6139J2247J1760j3699M931J3165j1355M599K5118j4438
$$ -9074 -7682 18690 5641 -20498 -8251 3509 -10190 -5259 7906 -3449 1150 26268 11830
428A1830k8724K0957J7987l5621j6297L1672M740k1666R554J6489p430K846Q877
$$ 11830 -16894 4063 22050 -13571 -29868 1804 6544 -15122 -5568 10921 3491 6337 15214
441A5214j7238q487K0822m449k7466J0489K4262j0753j0445J3815L163o132L971
$$ 15214 -2024 -10511 10311 5862 -21604 -11115 13147 2394 -8051 5764 8927 2795 6766
454F766q102j5031J4975J1442k5005m967L3551L607k6183Q607K0026j4445j0523
$$ 6766 -1336 -16367 -1392 10050 -14955 -19922 13629 17236 -8947 -340 19686 5241 -5282
467e282R630q885j0327J7697J637k3299J1342K8238j4932k0749J8656J2355j8856
$$ -5282 4348 -4537 -14864 2833 4470 -18829 -7487 20751 5819 -14930 3726 16081 -2775
480b775n000R322l183Q68P769j0715n844K1287J120k6192L208K2861j1171j6131
$$ -2775 -7775 1547 -1636 -768 7001 -3714 -9558 11729 12849 -13343 -10135 12726 1555 -14576
494a4576J3956N455r787Q422M167j6773N913K1335j6533k2342K4097J7049k7073
$$ -14576 -620 4835 -4952 3470 7637 -9136 -3223 18112 1579 -20763 3334 20383 -6690
507f690q466K4656o33j8042N952M558r909P688Q781j5485l21K4283l692k2428
$$ -6690 -15156 9500 8867 -9175 -3223 1335 -8574 -886 7895 -7590 -7911 16372 12680 -9748
521i748Q601J4035j3679r176O880k650P44J0742o564r856K0071J0806k6659o697
$$ -9748 -1147 12888 -791 -9967 -3087 -5737 -4993 5749 -815 -10671 9400 20206 -6453 -13150
535a3150K4290m710k3948R228J4489r212K147J2838r225n539J7640n951k7192
$$ -13150 11140 6430 -17518 -8290 6199 -3013 -866 11972 2747 -2792 14848 8897 -18295
548a8295P437K0038j5571j4734K0608J1808r032K761N742p032J679L194j8809
$$ -18295 -10858 9180 -6391 -21125 -517 11291 2259 5020 10762 3730 5409 8603 -10206
561a0206o823J9187R2j9158J0201K1600p378q357R972l514j0986P558k989j9141
$$ -10206 -17029 2158 2250 -16908 -6707 14893 7515 -842 9130 5616 -5370 2188 -801 -19942
575a9942J0674K2930j3970j3526K5686J2278k4128o110J4109p749j2832O069j074
$$ -19942 -9268 13662 -308 -13834 11852 24130 2 -6108 8001 252 -12580 -6511 -7585
588g585n161J5471Q574j4400K838K0460q410k0387N901O819j1135k612O273l144
$$ -7585 -12746 2725 11299 -3101 -263 20197 11787 -8600 -2699 4120 -7015 -9627 -3354 -6498
602f498O303J3269j0314j0652J8060N211k5733m587K1281n054j4772J1229R438
$$ -6498 -195 13074 2760 -7892 10168 15379 -10354 -14941 6340 1286 -13486 -2257 7181
615G181p808N330P884j4503m071J6909p075k2932J1016J8734j3278r450J5498
$$ 7181 -627 4703 12587 -1916 -5987 10922 3847 -19085 -8069 10665 -2613 -12063 3435
628C435M916p746K563l37p583P615N240j6142k625J9726j922j8244P424J2949
$$ 3435 8351 605 3168 2831 -4752 2863 8103 -8039 -10664 9062 7140 -11104 -3680 9269
642I269j0266m393Q456n092l556J3858l018j6932J1280J7239j8637j4458K0342
$$ 9269 -997 -5390 3066 -2026 -5582 8276 5258 -11674 -394 16845 -1792 -16250 4092
655D092O737j8217M37J3361m395l293P481o472p372J2203N34j7945L188J8657
$$ 4092 10829 -7388 -6951 6410 2015 -1278 6203 -269 -7641 4562 5096 -12849 -9661 8996
669H996n645j0524J0413O430o198N16r93j0593M300Q266j4400p848K1381P490
$$ 8996 3351 -7173 3240 9670 3472 3988 2995 -7598 -3298 4968 -9432 -17280 4101 11591
683A1591j7628K679J8632o475j2935O111j365j1113O955N197j2527L626K1273
$$ 11591 -6037 -3358 15274 8799 -4136 1975 610 -10503 -3548 1649 -10878 -7252 14021
696A4021m246j6285J0023J1261j5215j0291P391q37l795N983K90k646J3759O355
$$ 14021 9775 -6510 3513 14774 -441 -10732 -3341 -4178 -7973 -1990 -1700 -4346 9413 15768
710A5768j5893k952J4930p707j7563N229P606p764L170R618n111J381J5007o725
$$ 15768 -125 -3077 11853 4146 -13417 -8188 -582 -8346 -5176 4442 -669 712 15719 8994
724H994j8529R916J1827j9378j0866J8332M972j1611N080R636n349O84N216j1417
$$ 8994 -9535 381 12208 -7170 -18036 296 5268 -6343 -1263 8373 3024 3708 8924 -2493
738b493o590J2387j608j5358N551J5882n135n890Q118J413m199K957l661j0867
$$ -2493 -9083 3304 1696 -13662 -8111 7771 2636 -3254 4864 6277 2078 5035 1374 -9493
752i493O950R611j4505o345J9742L771j6192L359J3060p181o468O879l319o672
$$ -9493 -2543 7068 -7437 -13782 5960 9731 -6461 -3102 9958 2777 -3691 3188 -131 -6803
766f803R968K637j4731L465J6229p208j3948J0022R483j0367l781O760j946r13
$$ -6803 3165 5802 -8929 -5464 10765 3557 -10391 -369 9114 -1253 -5034 1726 -220 -1133
780a133N089o322m944J2104L050j4641J141J4505m186j0047O301L482p352K498
$$ -1133 3956 -2366 -7310 4794 7844 -6797 -5656 8849 4663 -5384 917 4399 -2953 -455
794d55K999j0480J829J4632p152j3073J3820J1787j4781o295J3649p67j1252K962
$$ -455 2544 -7936 -6107 8525 1373 -11700 2120 13907 -874 -7169 6480 5713 -5539 -2577
808b577K371n881N023O204r087j094J4110j203j4031M240Q795p917n325M954q63
$$ -2577 -206 -6087 -1064 5140 -3947 -5041 9069 7866 -6165 -1925 6870 -1047 -6372 -1418 -2281
823b281m82P882l212p652J0556P667j5521o359J4526j237j4085M450R648n243
$$ -2281 -2763 5119 1907 -5745 4811 12478 -3043 -9402 5124 3887 -10198 -5748 3900 -1343
837a343n83Q207m498m660J1019j112j5915L453J2653q369r913J0249O437o659
$$ -1343 -1926 6281 1783 -2877 8142 7030 -8885 -5432 7221 -1148 -11061 -812 5625 -1034
851a034P40L872l808J591M037r101m146J1379J394j2758K988J2310m947o005O461
$$ -1034 -294 3578 -230 1361 5398 -3703 -7849 3530 4924 -7834 -4846 7464 2517 -3488 2973
866B973l32n514M962M71j1221M237J2878q724j0210J2866Q547j2872l326J0104
$$ 2973 2641 -2873 2089 2560 -8661 -4424 8454 -270 -10480 2386 10933 -1939 -5265 4839
880D839j891o407L920o59n194O715L889j0474r3J2595k801j0841M882O423n746
$$ 4839 2948 -3459 461 -198 -5392 1323 5212 -5262 -5355 7240 4439 -6402 -1520 4903 -843
895h43j259L285l538J160P445o071q171J1002N865j3767k762J2999j587j0126
$$ -843 -2102 1183 -2355 -1195 6250 179 -7992 3010 8875 -4892 -7654 5345 3758 -6368
909f368N474M734o061J805N509p734k253J1249j787j3008N481J1166p506p480
$$ -6368 -894 3840 -2221 -416 5093 -2641 -4894 6355 4568 -8440 -2959 8207 701 -6779
923f779P926K530m926J368L51m317M602M303r115k112J1405K6j0888L827P988
$$ -6779 1147 3677 -1249 119 470 -3847 755 5058 -4057 -6169 5236 5262 -5626 -1799 6189
938F189n396l604M930l206l304P396j009j0272O159J1800r201q768J1730M495
$$ 6189 793 -2811 2119 -1087 -4391 3005 1996 -8276 -2117 9683 482 -8286 3444 7939
952G939j1197j137P262l337k198M700l123l611Q590K140j0328P98J0076m580p858
$$ 7939 -3258 -4395 2867 -470 -2668 2032 -1091 -4702 3888 6028 -4300 -3502 6574 1994 -5864
967e864M347L352m000J356K160m237L267P489p406o848J0172L405j2694j305J0229
$$ -5864 -1517 1835 -2165 -809 1351 -2886 381 7870 464 -6384 3788 7193 -5501 -6806 3423
982C423k101o492N796J867m557M087L781q904j274J0658l691j0851N808Q685p059
$$ 3423 1322 -5170 626 2493 -2064 2023 5804 -3100 -4374 6284 2593 -8258 -2450 6235 -824
997h24l653O713k08k521K725k242m215N876L356r431j311J0433j203q280M036
$$ -824 -4477 2236 2028 -493 2232 -10 -4225 1651 5007 -4424 -5735 4698 3495 -4785 -749
1012g49N311m817n51M173n163j597Q311k803j0315O920R042r638o113J0340K543
$$ -749 4562 -255 -806 3367 -1796 -3393 4918 2115 -8200 -1280 7762 -1876 -7989 2351 4894
1027D894p561J608M491l556M60L457n326l701P774P42r767K889Q907l307n054
$$ 4894 -2667 -1059 3432 -124 336 3793 -1533 -5234 2540 3282 -6485 -3596 5311 2004 -3050
1042c050N415M52l212K438j504o696M544O548q001m081J1200K948r434J037P256
$$ -3050 2365 2817 -395 2043 539 -6157 -1613 4935 -3066 -7147 4053 7001 -2433 -1396 5860
1057E860m382m928L752j942m584O012L180p516K168J0903l553q604M811M488o968
$$ 5860 1478 -3450 302 -1640 -6224 -212 2968 -4548 -2380 8523 4970 -3634 1177 5665 -1303
1072a303l298K824j280L22M142j637k251P434K785r192j493P346l698p002L262
$$ -1303 -4601 -1777 -3057 -2735 1407 -230 -2481 4953 7738 -1454 -2947 4399 701 -6301 -3039
1087c039K903l060L374M173n022Q59P717m775r563N309N924r135m104R149J949
$$ -3039 -136 -3196 178 4351 -671 188 7905 3130 -6433 -1124 4800 -4335 -8439 710 2659
1102B659m371L267K482l420J760K608p806k704P723j161p827L735P101l183j968
$$ 2659 -1712 1555 4037 617 2377 4985 -2821 -5525 2198 1037 -6790 -3055 4046 863 -1105
1117a105L903r47j859L205k846o637N635N465q088k607R632J566p978J780N127
$$ -1105 2798 1851 -8 3197 351 -6286 -651 4814 -3274 -5881 3751 5317 -2661 -881 4246
1132D246m396j454L572l580k879O814Q00p706K319Q432m525o485N151L387m621
$$ 4246 -150 -1604 1968 -1612 -4491 2323 3123 -4583 -2264 6168 1643 -4842 309 3696 -925
1147i25l69K331k285R49L259m756l008P328P47p225J393O768k400l790L362J57
$$ -925 -1294 1037 -1248 -299 2960 -1796 -4804 2524 3271 -3954 -2561 4207 1807 -1983 1379 1536
1163A536l404K795N73o182J656P523m025o672P696N560p181k604N500j586m052
$$ 1536 -1868 927 1500 -4682 -3026 4497 472 -6200 1496 7056 -125 -2729 2771 1185 -2867
1178b867K174k13k959M452L216n024m71P525j618p328K084L078m098j259K421
$$ -2867 -693 -906 -3865 587 3803 -1221 -1692 5833 4215 -3113 -1029 2049 -2049 -3308 -887
1193h87j447J045N882k863m350N941L114q437l027O701j215n900L287L999k699
$$ -887 -2334 -1289 4593 1730 -2620 3321 6435 -2002 -5029 1672 457 -5443 -2156 1843 -856
1208h56J578L967m295j955N688j554q632J903P092m043l626N495K401k169J383
$$ -856 722 4689 394 -1561 4127 2573 -6059 -4156 2936 -1107 -4733 762 3163 994 2377
1223B377k92l275J276K430o029k361P079J002n601K773N317k756k323K661k273
$$ 2377 2085 -1190 86 2516 -3513 -5874 1205 2207 -3394 -621 4696 1940 -383 2278 5
1238Ek936M115p72n764L269P418m482n144O494L063o201j405L805k198j703K993
$$ 5 -2931 1184 412 -5352 -2083 5335 853 -4291 2203 5266 -935 -2340 1465 -733 -2436 557
1254E57j681j967N274J864n959N49N675k832m875K530J945k456Q30J502l019K028
$$ 557 -1124 -3091 2183 4047 -1912 -1363 4312 1480 -3395 -865 1080 -1376 -546 956 -2063 -35
1270c5M325l950m588N303L222p344n39O074r87l942L013J274l400K043K516n458
$$ -35 4290 340 -4248 1055 4277 -3067 -3606 2468 1481 -2461 552 1826 -1574 469 2985 -2473
1286b473q16O326r52o604L458N225l772k786L660j25k012J806r42k801L286K512
$$ -2473 -3289 3037 2085 -4519 -1061 4164 392 -2394 1266 1141 -871 935 -7 -2808 478 2990
1302B990n028q92N884m19n355J930L169l355j37K657k379p89M611o17n982L012
$$ 2990 -2038 -2930 2954 2535 -2820 -890 2279 -1076 -1213 1444 -935 -1724 2887 2270 -3712 -700
1318g00N392n110m285N569J762m525O26L121k315N51K485l284k027M675M21n454
$$ -700 4692 -418 -4703 866 2628 -1897 -1271 1850 -465 86 2571 -713 -2740 1935 2356 -3098
1334c098R20N144k262k862L097J12j857J738n4l848K217M364m555l012N935J897
$$ -3098 -2178 2966 704 -2158 939 1051 -806 932 878 -2970 -753 3611 -944 -3956 1979 3876
1350C876n598Q3M591k298k556K440p07k651L534K016n131L94O101k103n319L171
$$ 3876 -1722 -1639 2952 654 -1902 538 -169 -2820 714 2730 -2401 -2007 4094 1991 -3328 -157
1366a57K886l822j105K465p84k45K393j161k550L574K160n525p88M795j368m043
$$ -157 2729 -1093 -2198 267 -517 -762 1631 470 -2080 1494 3654 -1871 -2659 2136 768 -3275
1382c275K403K038k307J292K050l131j21M710k266n417L228M085m641k692M958
$$ -3275 -872 1166 -1141 151 2201 -930 -1051 3659 1393 -4024 -796 3289 -1352 -4044 914
1397I14J492l562J269J677k242J261J595l674j818M966l46m600J691M279j991
$$ 914 2406 -1156 113 1790 -452 809 2404 -1270 -3088 1878 1532 -3068 -1377 2902 911
1412I11j811K470j005j167J922r96l646K614L727m412k290N685J357n012J036
$$ 911 -900 1570 565 -602 1320 324 -3322 -708 3019 -1393 -3683 2002 3359 -1653 -617
1427f17L296k493j219J839j767k112L901R26m393J081N508j990m157K262J912
$$ -617 2679 186 -1033 806 -961 -3073 828 1754 -2639 -1558 3950 1960 -2197 65 1977
1442A977k721o26J329j574R34K751k327j341L695J063m782k41L914j755k858K042
$$ 1977 -744 -1370 -41 -1615 -681 2070 -257 -1598 2097 3160 -1622 -1863 2051 296 -2562 -520
1458e20N19j412K236J252l087M96M196k735m961L659L009m247j249L953j63j750
$$ -520 -1 -1413 823 2075 -1012 -516 3680 945 -4016 -357 2652 -1595 -2844 1109 946 -804
1474h04J995k50k096K043J519l925j188M242p38l387K083K529j669l29J433j777
$$ -804 1191 941 -1155 888 2407 -1518 -2706 1536 798 -2589 -506 2023 354 25 1458 -319
1490c19o65K631j694l233L230K736m052p64M230J28l902J326J800k510K34K193
$$ -319 -984 1647 -47 -3280 -50 2686 -1366 -2130 2100 2228 -1674 -348 1452 -1058 -824 1369
1506A369k213j328L934K93m583J611M160k701l027K491J256j992R62M62j903J811
$$ 1369 -844 -2172 1762 2055 -2528 -917 3243 542 -2485 6 1262 -730 232 694 -1209 602
1522F02J735l091j750M133L11m055Q17L132j278j476K394r51j719K210nl763J208
$$ 602 2337 -754 -2504 1629 1940 -2115 -1298 1834 556 -920 1474 523 -1196 1014 1009 -2754 -1546
1539a546M296k314l471M100K095l579o80K396j316j265J879j317j532K767K050
$$ -1546 2750 436 -3035 1065 3160 -419 -1099 1297 -19 -1284 595 -722 -2254 513 2563
1554B563l543p9L965j611l128J282R26j369R7J120j679J124L461j933l316L023
$$ 2563 -980 -1059 2906 1295 -1833 -551 375 -994 -897 223 -1456 -332 3129 1196 -2120 903
1570I03J680m266j323L526n13j979J848J578j335J050K061l800q39L045j118m307
$$ 903 2583 -1683 -3006 520 7 -1972 -124 1454 119 1169 3230 -570 -1409 1636 518 -3789
1586c789J731L418j634q46K769N19j647R09o47k728J119J675k975r81M182Q47
$$ -3789 -2058 1360 -274 -1120 1649 2168 521 1430 783 -1945 -826 849 -2126 -3107 1075 1922
1602A922k420J027K462k217q38J128k194j558K771J11l384K522M260k192k663
$$ 1922 -498 529 2991 774 -64 1064 -1130 -2688 83 194 -3190 -668 3592 1400 -1263
1617a263K993P30l373l82J235j479j63K302r32j059L298J050l698K2L012k312
$$ -1263 1730 2460 -913 -1295 -60 -1539 -1702 600 -332 -1391 1907 2957 -741 -719 2293 -19
1633a9k429J586P23j075J538J080k110J388K588k673k738K581J306l925j82L339
$$ -19 -2448 -862 -139 -1214 324 1404 -706 682 3270 597 -2141 440 1746 -2179 -2361 978
1649I78j146q95K212j40j580J915P74l361n14L353q64k966J701K305j861q61J718
$$ 978 -168 -1063 1149 1009 -571 1344 2118 -1243 -1757 1596 732 -2234 -533 1772 -89 -950 768
1666G68o52q39K095j138j932K012J701l221n85L161o81k274J208J054j552O83
$$ 768 116 -723 1372 234 -1698 314 2015 -1206 -1791 1370 689 -1585 -377 677 -875 -192
1682a92J824j817n95K836j085l378J199L143k902j483L066N88j894J106J204j652
$$ -192 1632 -185 -780 2056 971 -2407 -1208 1935 -967 -2450 616 1204 -690 416 1620 -32
1698c2L20J149k213j472K519N57l122J272K795p27n92Q51j59j471Q28o49l008
$$ -32 288 1437 -776 -2248 271 828 -2294 -1022 1773 1046 454 1305 1146 -325 503 -146 -3154
1715c154J387K799j813j184L611J389k671j76J519j781j425J206o81j560K453
$$ -3154 -1767 1032 -781 -1965 1646 3035 364 188 1707 -74 -1499 -293 -974 -2534 -81
1730h1J737k790Q26L416j203k677P06Q91k354k74R33n72O80K321n02j482K563
$$ -81 1656 -1134 -308 3108 1905 -772 -66 825 -1529 -1803 -870 -1442 -762 1559 1057 -425 2138
1747B138M86l203p36K109j229j793J403O57p88J731J953k676k06K588j507l632
$$ 2138 2624 -579 -1315 794 -435 -2228 -825 -168 -956 775 2728 52 -154 2434 927 -2705
1763b705J667J994k576m43K282O34r16J265M36j928Q32P39k308j082K308K91k210
$$ -2705 -1038 956 -1620 -2063 219 853 -63 1202 1638 -290 542 1281 -1027 -2109 199 490 -1720
1780a720Q84K392j127n92J422j152q96J895j118k253J808J722j751j164K820M85
$$ -1720 -836 1556 429 -163 1259 107 -789 1106 -12 -2265 -457 1265 -486 -1650 1170 1655
1796A655k325Q00R55j385K0J439j546j170K391K26k477K32K870j204j658J265
$$ 1655 -670 130 1085 -300 -280 1159 -387 -1557 834 1060 -1417 -1185 1685 481 -1177 88
1812H8R92j319K36N41j361M64J354j375j420K269Q73k120j14K498j096q76R19
$$ 88 1080 -239 -3 538 -823 -359 995 -380 -1800 469 1342 -778 -892 1606 510 -366 553
1829E53j86j615J097O38k175L17L226j197k087J568K083k259j093J904r62r20
$$ 553 367 -1248 -151 487 -1688 -1371 1855 658 -1429 139 2222 -37 -1130 774 -188 -1108
1845a108R97j93p94J380J507k188n48K517o54j905M15N48j031K43J191p10k23
$$ -1108 -111 -304 -1098 282 1789 -399 -947 1570 916 -989 -574 -26 -1057 -814 377 -333 -556
1862e56K433q52k180J458J624k308j452K324k19j528R14P44p27K12J784j432j403
$$ -556 1877 1025 -1155 303 1927 -381 -1833 491 272 -1256 -342 402 -325 -113 1671 239 -1164
1879a164K028P7k658O09K111j208o51J330N03j329J066k14j582R25J245j556j110
$$ -1164 864 941 -1717 -1108 1003 -205 -856 474 977 -352 714 500 -1082 -157 1088 -468 -1578
1896a578K032P13j913N08R73n73n77J209j235m49J240L18k129N56K325j313j307
$$ -1578 454 1167 -746 -238 735 162 -415 794 -441 -890 350 668 -1461 -905 1420 107 -1200
1913a200J602P92j871R8J386j198j98J299m60j409J709Q97j937n84K156p45j349
$$ -1200 402 1194 -677 -579 807 -391 -589 710 250 -1159 550 1447 -490 -1074 1082 337 -1012
1930a012Q39L62p47M69J089j609M06J807j051k041J854J134k209p75K172n33j076
$$ -1012 -173 189 -558 -89 1000 -609 -203 1604 553 -1488 366 1500 -709 -1484 688 155 -921
1947i21J314M15j715R71Q83j666o12J996j25j800R43J732j287p21J441n15m57
$$ -921 393 808 -907 64 947 -719 -1331 665 540 -1260 -317 1415 128 -593 848 333 -124
1964a24Q33j46j707R03J102j492o64K026M42j667Q43L46n95k36M98r32r64K060
$$ -124 709 563 -1144 -241 861 -631 -1295 731 1173 -494 349 695 100 -136 362 -570 -1534 526
1982E26N1j663P52K220j413j242J223N03j921K82Q26p96J92J016m20q04J893K71
$$ 526 577 -1086 -334 1886 473 -769 454 957 -964 -682 144 -652 -460 556 136 -668 1225 1496
2000A496j907j63J503j049j005R37J18o80J296j37r61N05J687j351j535J435O50
$$ 1496 -411 -574 929 -120 -1125 -188 -70 -750 546 409 -552 -47 1640 289 -1246 189 839
2017H39j636k65J495j99m72J280m48j349J207P12j777k95J681l10j631J081Q78
$$ 839 -797 -1062 433 234 -238 1042 594 -755 452 1164 -613 -908 773 463 -1168 -87 791
2034G91p68k01P08l57k12Q71o53j228J148N83j452l70J654k62j284Q46N13o48
$$ 791 23 -178 530 173 -39 832 179 -1049 99 682 -770 -1140 514 252 -1032 -186 327 -321
2052c21K26J137j144n10J292K07k490R64J463j202q27J619Pl82N87O77j543J45
$$ -321 -95 1042 -102 -612 680 887 -1603 -639 824 -378 -1205 414 421 39 626 1303 -240 -95
2070i5R42j726n79J497N52j438L25J370k90l41P01q73o99P55m77j495R56J694
$$ -95 847 -879 -1458 39 591 -847 -522 848 558 217 918 45 -654 101 -376 -1871 -915 779
2088G79r78p23K045J51j169J52O10j317m67O80o42o52J536J116j329J08J916q74
$$ 779 -199 -922 1123 1274 105 257 867 -450 -917 -237 -879 -1531 5 1121 -208 -100 1816 942
2106I42j542K35K14j049K98M41l50Q50J083k39j046J193M93j771q78J223m27j002
$$ 942 -600 -365 -151 -1200 -902 -461 -811 39 1122 883 -163 1030 1523 -248 -1126 97 -330 -1332
2124a332J299K91n85J138M71r76k81J201j223j790Q84R55q37j79J275L04n52O24
$$ -1332 -33 258 -327 811 1282 306 25 1226 3 -1787 -903 52 -785 -964 311 615 63 687
2142F87L8j006K14Q11j670k69J332J06j033P56R74q58J57N35p96m57N90Mj292
$$ 687 725 -281 -67 744 -926 -1195 137 243 -790 -34 940 82 239 774 -22 -479 111 115 -1177
2161a177O31J457j083o68J381K60r98q3P75j025J16J172p23q30J430K22j701L29
$$ -1177 -546 911 -172 -840 541 801 -197 -280 495 -530 -414 758 35 -795 635 857 -844 -515
2179e15J101m40n52Q16N3p53N73N07j493L40O75p66n51J247O59j170r4J202o14
$$ -515 586 146 -406 410 463 -290 283 790 -703 -363 312 -454 -1005 242 901 -269 -363 839 225
2198B25m7N30o45r28N73O49j452O10J401j69j237J025N03j487K27K38p53j57J131
$$ 225 178 708 63 -865 -292 357 -1095 -485 916 747 -490 535 1038 -449 -222 16 -737 -894 237
2217B37l96p08J354N76q18k60P35n18p94K35J01o66P31N43o11J55J453o27j113
$$ 237 -159 -867 487 1063 245 -15 720 202 -592 -357 -256 -922 -191 352 -259 -104 1349 722 -391
2236c91N76N66j491p91J392k2j43O77N67p72L58O65j102m78O76l64j101K85J377
$$ -391 185 751 -740 -1531 -139 -161 -304 373 940 168 526 1191 89 -389 287 -77 -1178 -893 484
2255D84l13k04P40k00n47P11l19j102M16O76j146l50J562N97j052K70R09j066
$$ 484 171 -33 707 507 -40 671 352 -750 -334 342 -804 -1154 408 1005 -47 223 1132 66
2273F6m29Q18p94p20J045L32j067K84J643p00q24P29M18j313J63J82l60Q8Q29
$$ 66 -363 455 -339 -1059 -14 318 -749 -465 1178 478 -346 383 801 -512 -349 -167 -527 -439 390
2292C90M8r69Q04P73j432N2Q07n00o15M07K55k89O03M31j114o1J265q98j026P98
$$ 390 438 -531 273 1046 -386 -334 473 -27 -642 -235 20 -269 334 765 -349 -410 855 -43 -1069 -271
2312b71J128j369J54Q31k11p44J027m10r12R44N04j000n40J189J20q14N88M66
$$ -271 857 -512 -358 473 262 -482 545 135 -777 167 671 -329 -869 320 440 -374 214 680
2330F80p20p01P58k56k02P97j58n54M89O87r84n78R68j25p99M60K67m55P41J11
$$ 680 -40 -741 17 -239 -441 356 198 -356 133 820 -164 -742 226 101 -698 -238 29 -426 315 426
2350D26m41Q1N58J14j812N44R05p89m82J124L3k61K68M54p26l09J081j079l52
$$ 426 -15 66 624 738 -1074 -530 375 -414 -896 228 261 0 268 722 -4 -313 768 -311 -663
2369f63Q37m0o59J41J008p7n69N05j21o98N81p9q61L1J235k59q95J013N11q91
$$ -663 174 134 -525 -384 624 547 -22 483 362 -336 245 166 -695 -664 571 312 -583 430 941 50
2389E0r5M83n77k20M20l80m00P73O34n52j82J110p42p89L08J04l72k14R28q12
$$ 50 -45 438 -139 -359 61 -319 -719 54 688 136 -46 1064 322 -467 -159 -55 -427 -641 287 -525
2409e25K35Q35j81m93M70L81r59l13N88m4m57Q1N52n57P89K01m66n37Q29l11j039
$$ -525 -290 545 364 -129 341 722 -237 -550 38 -6 -463 -382 170 -387 402 603 137 -400 429 118 -921
2430i21Q66M58l56p56J005R0n00O60n0j015M01P00p66m75J016R2r04K02R52n31
$$ -921 -55 403 47 -709 296 386 -114 546 496 -519 -118 582 -184 -659 357 449 -455 -253 699 168
2450A68l01M65m00n61Q37K58j073N99N21m21p02O45N39r16N52J09m67%O57n04
$$ 168 -133 332 -68 -629 208 466 -607 -8 513 92 -610 35 574 -342 210 319 -148 -148 509 5
2470Eo26P66J85n80k77Q50q0o71Q01l38j4J19N31j122J06P56q6r56Q00N15r37
$$ 5 -621 145 330 -250 -527 323 243 -428 373 35 21 140 671 -451 -345 411 325 -631 169 684 -253
2491b53K70Q1p3j20j07M14p86M00O02r58n1J207L0r89M01K99l80n70R64m11l58
$$ -253 17 98 25 -95 -202 212 -574 -174 428 -530 -581 626 656 -333 68 367 -13 -583 381 -30 -388
2512c88P17o2q22L33R43p52n08R55q0n84J3L90m31N2N53n38j73P67R3p41L19R35
$$ -388 329 267 -555 -222 721 -31 -539 416 336 -248 -235 155 -276 -224 329 -209 -382 385 478 -263 56 991
2534I91j384k49O07K02m98K62K53m94L6P93q11j66P01R7n26l72J005o18k86L07
$$ 991 -393 -642 -35 167 -331 -69 184 -310 -274 519 -292 -458 243 340 -186 -558 447 -171 -457 -150
2554a50L06j06K64p4o55L54N26o27l63N57L70n86q4R75n93l65O68m24p15O91L09
$$ -150 156 50 314 240 -415 -61 465 -162 -525 32 402 -184 -268 707 114 -251 417 -7 -722 -31 278
2575B78o66K2Q28r3n37K00N40o01mJ77k56j15N95l84p57Q91K70q13K65L85p9o75
$$ 278 -388 -366 462 369 -168 32 572 -29 -33 144 -112 -227 368 -16 -773 118 388 -425 -160 225 146 -529
2597e29N28N39r76N94J66p41L36M23n1q96M54O71q49J41M12n8j50M09L08p15K85
$$ -529 -1 538 -438 156 322 -419 -83 340 289 -607 -153 518 -331 -190 222 164 14 423 731 16 301
2618C01m6k90p42O01L37o32M60M18n89K94K20k15l70M85k17n20O5O07k22p8K37
$$ 301 255 -35 -777 -176 161 -471 -11 407 -182 112 332 117 -253 232 15 -505 -440 167 -55 -133 104
2639A04L33p45L74L58n64k70O46o33k91R63J57p60L27P15o67m28P01J62p49J97
$$ 104 437 -308 66 424 -140 -410 236 -397 -688 275 432 -328 -1 714 47 -381 320 482 -267 -70
2659g0J29k05p8P05k85m63P60L4o18l0K46l01j84K44L01m79O07K43p15r5O41l4
$$ -70 59 -146 -224 481 196 -267 493 527 -91 -121 125 -176 -360 -116 185 -294 313 556 -159 -254 387 353
2681C53j147O39J87r5l9M78n13L4M09l23l81L27O75o94l71Q16q4o38J75O33m50
$$ 353 -794 -155 32 -63 -102 376 -137 -103 306 -17 -398 -71 604 -90 -461 355 271 -367 -192 441 -9
2702iN2J43m75r9O64L5n52M63J10n18l59P25k13l48M21J12l17M58M69m57m04M92
$$ -9 43 186 -289 -388 276 311 -241 222 332 -186 -545 180 -33 -381 40 152 -165 293 762 305 -99 393
2724C93k79o75L91J46k16k0M69k70K73J12k0n14R7K68m33k80P62l1k03L7M04l67
$$ 393 114 -561 -170 -24 -240 -260 209 -61 212 324 304 -210 -113 155 -278 -558 204 173 -30 7 411 44
2746D4K29Q0k00p12L50p9m86j53J066J4j67N97j12l91J99l33j61p7K39j34k88
$$ 44 273 353 153 -559 -209 -288 -774 -927 139 153 -14 583 471 80 279 -54 -215 -292 -53 -187 -475
2767d75P20K04k32l83Q06p31K1J96k14l81K82L5j62J53K62L89p19N77J23n76m37
$$ -475 245 449 217 -166 640 -91 -70 126 -88 -469 -187 -152 -314 -161 101 490 -229 348 471 -105 -542
2788e42P02j33p63R39j26k59K74L60k37n60N95n60k57L61L07j40j12K30n8l30
$$ -542 160 27 -736 203 77 -182 92 452 215 -345 250 -310 -567 -206 101 -39 -151 79 21 -309
2808c09N86No32J97N81n73p15J067j43m87N22J04J8l12N34m09q3K09j17k27j58
$$ -309 277 282 -350 -153 428 -145 -860 207 64 -423 99 203 221 -91 443 34 -49 160 43 -184 -342
2829c42M39K15n90M16k07j0J94N8m01L67J51k62j81L70%n25K59K78j92k13K66
$$ -342 97 312 -278 138 -69 -79 115 173 -228 139 290 28 -153 217 217 -308 -49 229 37 -176 90
2850I0M52m42K2M57q44j97O03k19l18L23M40k75Q9J66k05j74J47m38l75O54K0
$$ 90 542 100 122 579 -265 -462 141 -78 -396 -73 367 92 181 347 142 -32 115 -323 -698 -44 -24
2871b4rm45J034j90p89J020l83n68J68K08l94O1L35J73o68P11L55m77j25J91l3
$$ -24 -33 -478 556 366 -423 597 214 -354 -186 22 -372 -311 24 197 -471 240 595 118 -7 184 151
2892A51n56M23R6n85J31M15l87L7Q80j05n28q1J26k20l36M83J40j54L28K07m54
$$ 151 -405 18 114 -471 -340 75 -312 -275 605 500 -28 -109 17 -203 -539 -56 84 -70 258 465 11
2913A1o5N94o88j78J37M49o46L09R5l90n7P78o49K00L43K2m38j69L85j25j95L99
$$ 11 -54 540 -148 -326 -189 260 -386 -77 18 -372 -429 349 -300 -100 243 265 -173 -342 43 -82 -277 122
2935A22J04n16J39K01m3k11L46o6m65M90J49j44n00O31ko05M11J39m80K46J06
$$ 122 226 -290 -151 50 7 -204 142 76 -389 101 250 106 -394 237 235 -370 41 180 -300 -54 52
2956E2J1n30P52l49k04K59j86k12k1Q67n56j62L04M5j14J07L4o3m29P15l19k96
$$ 52 63 -467 285 -64 -268 -9 -195 -407 -428 439 -117 -279 25 70 -44 63 97 34 -395 320 1 -295
2978b95K14M64n70J71L92k67p0Q1J79o46J52P70q01j02P27j35m97K9K78j85j6
$$ -295 -81 383 -187 -16 376 109 39 120 299 -347 -195 575 -226 -328 399 264 -233 -204 74 -111 -127
2999a27M27m21k06N09m35M17r0K78j56m10O81j68n53L52q4k22J41O06n48j14N55
$$ -127 300 -121 -327 182 -253 164 74 352 196 -214 467 299 -254 98 14 -208 -67 539 -9 -123 432
3020D32q5o28P7O29m17j08J90j79k00M95j53k36j47M49l73J43j3O12n93n2M70
$$ 432 347 -281 -204 425 8 -100 90 -89 -289 206 53 -183 -330 119 -254 -111 -124 488 -105 -157 313
3041C13j83k88M69n3n36K96O48n63l71N56Q0o64M10L9l43K68r8j98k7N94l46k18
$$ 313 130 -158 311 258 -278 18 666 103 -268 288 368 -296 114 153 -190 78 -20 -218 -245 349 3 -215
3063b15L33l74j04L92p9jl88L99K40m04k0M68j95j5L6Q1n72M23L64m99J42r4J21
$$ -215 118 -256 -360 32 -47 -48 -436 -37 203 -201 -221 247 52 37 73 154 -418 5 369 -130 12 -82 39
3086C9l14L0O64n09K30N3k01k17M16j31p5k80N27m33m4L05K42k00K1L31p95J62
$$ 39 -275 -245 419 -90 140 193 -8 -225 191 60 -15 -295 232 -201 -245 60 302 102 123 454 -341 -179
3108a79J54q4k57N23n7k20r0M55l94J6M71l62j11K42j74q9J6O59n28k73M58j91
$$ -179 -25 -109 -366 157 100 -120 -210 245 -149 -133 338 -24 -135 107 -67 -156 -140 519 -9 -282 176 -15
3130a5l17J30N36q55L96L00m43L05J45k47J10k75O46l82q2j7J17n7j00K49k10
$$ -15 -332 -202 334 -521 -125 175 -268 37 182 -65 45 -230 416 34 -48 -65 52 -5 -105 144 -66
3151f6O9J67pn84M81K88n40n1M04N4p3N8J18l96M3K43l44o8L21Q4n39K51K29m15
$$ -66 3 170 163 -421 60 348 -192 -243 161 215 142 200 318 -78 -35 208 -136 -204 117 201 -338 -87 142 -273
3175b73L26K07m62l48P71p2k01o4M62l72q2j26M33l44m1K82k7L2J63n43K59Q9
$$ -273 53 260 -202 -550 221 149 -52 -116 346 -26 -108 -234 199 -145 -186 96 69 101 264 -279 -20 69
3197F9M7j86J27O3j93OK43l24LK43J99o62K73L52l93K61PK69q72M17J72J0l61
$$ 69 116 -70 57 120 -73 -67 176 -148 -145 98 297 -365 -92 260 -133 128 135 404 -468 -51 121 131 -230
3220b30O29k26Kj28k23K78k67L62Ol46K73J65l60q0L57l11j35K70j21k66K68r2
$$ -230 399 173 175 47 -176 102 -165 197 203 -143 130 295 -65 -145 212 -99 -234 36 -85 -351 -83 -175
3242a75QL0L70J6k59Q8p8l71K12K95j64olM10n06K05K63k00k73N51n77N1j91L25
$$ -175 -167 -137 233 249 -10 78 0 -371 -159 136 -28 -34 -37 373 -133 72 335 135 -138 413 -164 -113 -304 21
3266B1k85K17J06p0o7K35j73n03M61j03o0K3K31j23o6P3N24o04L4L87m35l7l4
$$ 21 -264 -47 59 -11 -78 157 -16 -519 -58 -161 -221 -198 33 -90 -156 -83 441 -163 -129 258 -177 -214 -248
3289b48M25n94K31P59k49l65J34k88K56J02j35k16k18Q40m70j63M90j13l75N6
$$ -248 177 -417 -186 573 324 -41 93 -195 61 163 28 -188 -406 434 -36 -199 291 178 -197 -141
3309a41K69Ok71K23k2j47J49J3j87L18Rk91N5J22l14j08O33k43j15k22N62m06
$$ -141 128 134 -137 86 64 -83 66 79 -108 210 219 -72 -17 105 -209 -317 316 73 -42 -264 298 -108
3331a08k12N95j73l09l51N69lJ12J05l37q9K79k34K25j19J48l19K3J84k6j66J94
$$ -108 -320 275 102 -207 -558 11 8 120 225 -112 -201 78 -156 69 -50 98 -221 -198 -14 -40 -206 -12
3353a2J71l3j83N0q6K44R8j72l25P6N62k91k6L2J5l4oM50n08k03J46pj07J70K16
$$ -12 159 126 -57 -7 -93 151 249 77 -248 -172 390 99 73 105 120 86 80 530 22 -181 -35 -42 -149 21 237
3378B37l20k82L92j75N7J77j3k5j22J34l8k48L69l49j3K3M20j75J07Jj22L1l0
$$ 237 -83 -365 27 -148 -91 86 73 48 -74 60 22 -226 143 -206 -219 -196 224 49 156 157 35 66 36
3401C6q9L12j13p2l65j28L45J21J44k95K83k46j75J84j95j05M23j50k52K25L43
$$ 36 -53 259 146 74 -291 -419 -74 47 191 -104 179 -67 -242 -58 -253 -358 65 -85 -337 -112 231
3422B31l12P8r1L66m06j24L78k18l62M77Ql82P83l37l95M69L28m99k29o1N33l13
$$ 231 -81 -3 -94 272 -134 -258 120 -98 -460 17 25 -357 426 89 -306 163 491 -8 -237 -298 235 -78
3444g8O5K2k72O1M37j00j11K1j2j83k68L05J82OJ39qJ4j48L18m99j24N81k59k71
$$ -78 -13 9 -263 -202 235 135 24 45 33 -150 -418 -113 69 75 214 206 220 72 390 -109 -233 348 89 -182
3468a82K96Q7n29K86M74o00M6M31l73O5o8K98k30j2j31j50Q1R2M36m16l0K68k95
$$ -182 114 201 -328 -42 432 -168 -122 309 -64 1 -67 231 1 -11 -142 -292 -211 -119 317 -99 -129 139 -156
3491a56OJ8r1m2O3O57l24q9J49k6j50K5K61n36K26p0j08j7J97k3J49l08N06j24
$$ -156 -150 -132 -223 -265 -202 455 131 42 191 165 15 40 301 -235 -9 -79 -187 -204 -7 -30 119 -189 317 193
3515A93pj15K4j20K16o5k95l2L92O7l85J22M2j71K29o4l7l5rJ66k89J87j0j44
$$ 193 186 71 95 -25 191 126 -169 -201 191 258 -127 -5 37 -134 95 31 -6 -41 -50 116 -173 14 4 -140
3539a40p4L72o0k36J98j27k17J88M6J13J24p6j22j67J45P0J55j55M5J88n35M48
$$ -140 -214 158 98 -138 60 -67 -284 -96 -50 63 187 111 -11 -178 -33 37 192 37 82 270 -265 183
3561A83o1j46K66k60l57K14K81k2k61K19k05K63o5K50J01j46p5j27J72m4j61j23
$$ 183 122 -24 242 -18 -375 -161 120 98 -163 56 -149 114 49 299 400 254 179 52 224 180 19 -104
3583a04o2J64j96j3J84J84q1p1O4k38J47K38p4k63K12P3r6j03K95k47L04k04N7
$$ -104 -166 -2 -198 -211 -27 157 76 5 69 -169 -22 216 142 -121 91 164 68 -35 260 13 317 113 170
3606A70k34p4M68m39k37M88j99j9N3l0n7j11K39J37j20J04q8J42k95M21j93r1
$$ 170 -64 -138 330 -109 -346 142 -57 -76 -23 -53 -110 -221 18 155 35 139 51 193 -102 319 126 35
3628C5j50J62k36N3M44o75J87K99J46j51J53k82o1K0J23k7l25k39P90l29p4M4
$$ 35 -115 47 -189 -136 308 -367 -180 119 265 114 267 -15 -76 -56 67 40 -285 -524 266 -63 -137 -93
3650i3K8k3K93l3j71p9J07r0m82O68l1j74J90J07k59J01R9l15j14K25j20j76L68
$$ -93 -65 -88 205 172 1 -78 29 -61 -543 125 94 -80 110 217 -42 59 158 -157 -271 -46 -166 -342 26
3673B6L6J50j47N7j94k1J03Q8k86j65M34l27K11J28o3N4K65k51lj98J86m88L11
$$ 26 62 212 65 122 -72 -93 10 98 -188 -353 81 -246 -35 93 30 84 349 98 95 -103 83 -405 -94
3696i4J89J71m03J43n9J10m59o2O55j93n2J27O6J21j64k9l03K85J97j97k41K99
$$ -94 95 266 -137 6 -53 57 -402 -464 191 -2 -54 73 139 260 96 67 -236 49 246 49 -192 107
3718A07l9j17J54j34L2o8K03o6n9J01k00J99K1J16j22o2j60K93Q3j04M6k63J83
$$ 107 68 -49 105 -29 3 -65 138 72 13 114 -86 113 134 250 128 66 -94 199 282 178 224 -39 144
3741A44q7M9j4K40q7l34N74m05l19J66J03k06R9M23l49k31L75J38m69L8J42j72
$$ 144 57 106 92 332 245 -89 485 80 -239 -73 30 -176 -77 346 -3 -234 141 279 -190 -152 -10 -182
3763a82M3K3K05j77j49J02Pj8L43k18k85K32R1j98OL48j52k66L14J38k20j40M22
$$ -182 -139 -116 89 -88 -237 -135 -128 -146 197 -21 -306 -74 17 -181 -175 173 21 -245 69 207 -13 -153 269
3786B69l64m16N74O9l29L82j57j55lp7K80j48k30M35m27L10j87J23J52J25l9j94
$$ 269 -95 -511 63 132 -197 185 28 -127 -130 -207 73 -75 -305 130 -297 13 -174 -51 101 226 187 -7
3808gL34l12l51K80k64N48l70O3J25k75Q4O2No8K95M9k77l9L68n27K33J40j59
$$ -7 327 15 -336 -56 -320 228 -142 -79 46 -229 -145 -83 -78 -146 149 198 -79 -118 250 -277 -44 96 -63
3831f3j18K92J15m68L83p8p6j54K16j30J6j01L60k52K89Ok10j84n3MJ76J63j36
$$ -63 -181 111 226 -242 141 63 -13 -167 49 -81 -65 -166 194 -58 231 237 27 -157 -210 -206 -30 133 -3
3854cL01l93J47J83j22j6k0J85m32QK61Q4j15j07k14J02K99o0R6j70J83j37R6
$$ -3 298 -95 52 235 113 97 77 262 -170 -162 99 183 68 -39 -253 -151 148 88 184 14 197 60 156
3877A56R9n71K5L52q1j66J92K87l82P8Q5o9j33P2L87n58J8L79j75K37k83L04l96
$$ 156 255 -316 -291 61 -20 -186 6 293 -89 -11 74 5 -128 -56 331 -227 -209 170 -5 232 -51 253 -143
3900a43K35J75k78J15j62r7J72j79L13k69l8K99m29K56J12L24l80j24J76k69L71
$$ -143 92 267 -11 104 -58 -155 17 -162 151 -118 -156 143 -286 -30 82 406 26 -98 78 -191 180
3921A80n4q0j5m70Q42m62K00m8k54K33j28Q0j71J48K02l29K16k8N2k54o7J87M8
$$ 180 126 46 31 -439 403 -59 141 93 -161 72 -56 24 -147 1 203 -126 90 62 114 -140 -207 -20 28
3944B8j31J73j64N7J42K74n11j46K64r5j24N92n84O9K57J23m69K40K01j84K8k65
$$ 28 -103 70 -94 -37 105 379 -132 -278 -14 -109 -233 359 -225 -156 101 224 -245 -5 196 12 40 -225
3966b25L40P1r0Ol02K24L02k93j04J20K59l66J10l4R0r0k8l9J03l30K14K36l60
$$ -225 115 186 96 102 -200 24 326 33 -71 49 308 -58 52 18 108 18 -10 -49 54 -276 -62 174 -186
3989a86M34N1n27J04K50N4l30PJ9K22K55k32j25j26L35n94L09K85m75M16J96j02
$$ -186 248 299 -228 -124 126 180 -150 -143 -124 98 353 121 -4 -130 205 -389 -80 205 -270 146 342 240
4011B40m8k56K46l20L7M1L95j66j68L07j56k25J81m75M20J08l29K50J88j61J05
$$ 240 192 -64 182 -138 -101 -60 335 169 1 308 152 -73 108 -367 53 161 -168 82 270 109 214
4032B14k09m48L32J19J7j46R3J96jj37j00K03J6k24oJ29kM0j74j09J0K25k44L82
$$ 214 5 -443 -111 8 25 -121 -28 168 167 30 -70 133 149 -75 -81 48 46 86 -88 -197 -187 38 -206 176
4056A76k51J00K46m40O06o60J87k27K30J07j73L25m03J72J63p8q3J0J24Lj3l93
$$ 176 -75 25 271 -169 437 -223 -36 -263 -33 74 -99 226 -177 -5 158 80 -3 7 131 134 121 -272
4078b72P04m00O8l34L48N1k80J61k80K77K60n12O0M02k10n4j25N1n3j82P5J64
$$ -272 432 32 100 -234 114 165 -115 46 -234 43 303 -209 -149 253 43 -11 -136 -85 -138 -320 -245 -81
4100h1j32L61Q8j30l72K67O6j65Q8j94j4M70J05n39J9J69j69r0K59M9k12J97L00
$$ -81 -213 148 236 106 -266 1 67 -98 -10 -204 -218 252 357 -182 -163 6 -163 -253 6 55 -157 40 340
4123C40n66K67M0Q6m11K5K29q4K6m3K96p7q0J47k40m14P71j97l55J19J16j88K6
$$ 340 -226 41 81 167 -244 -219 10 -74 -48 -91 205 128 48 195 -45 -459 312 115 -240 -121 -5 -193 -167
4146a67N65p40m2M88j28p7J72J4j57o6L53k98k46L86P3n3j20K27j22r3l8J63j32
$$ -167 398 -342 -384 104 -24 -101 71 85 -72 -138 215 -83 -329 57 130 77 -43 184 62 -31 -69 94 -38
4169c8n2M82k98j52J52k03L79k13j28K86j69q4j84L6K70p1L47k84k46r6Q2J87
$$ -38 -90 392 94 -58 94 -109 270 57 -71 215 46 -38 -222 -186 84 13 360 76 -170 -266 -184 3
4191Ck64M14k13J76n1j28J03O4l10N13l36j88j29L75k62K21J62l58K46J09l19
$$ 3 -261 153 -60 116 65 -63 40 104 -206 307 -29 -217 -346 29 -233 -12 150 -208 38 147 -172
4212a72J70n2J41J2J93l51k34L95p9r2O6j06J52O9j3o3j71J53J99k27k9J88J09
$$ -172 -2 -54 87 99 292 -59 -293 102 23 -69 -3 -109 43 112 99 36 -135 18 217 -10 -39 149 258
4235B58N2m72q3L42o10N92k77K65m5Q5J41j61L0k42J0J46m5j47K03J86k52p3j72
$$ 258 310 -162 -245 97 -513 79 -198 67 22 107 248 87 117 -125 -115 31 -14 -161 42 228 -24 -97 -269
4258b69M67l32J61o0R3k35M32J06l50K05l74L86l14K01k33kJ04Ln3J76m2p3j66
$$ -269 198 -134 27 -33 60 -175 257 363 13 218 -156 230 -84 117 -116 -118 -14 -11 -64 112 70 -3 -169
4281a69J40P5k20J25L3k5r2P4K58m22p5K67L32j93j21N2jK44k53p9L35l3k39k46
$$ -169 -29 46 -174 -49 -16 -41 -133 -59 199 -223 -298 -31 301 108 -13 39 38 282 29 -50 285 252 13 -233
4305b33L20R1j04p4J00lp3k70M28l56K6K69N5j97r1j13j36N09J18l83j20N44m31
$$ -233 87 178 74 0 100 97 24 -246 182 -174 -148 121 176 -21 -112 -225 -361 148 266 -117 -237 307 -124
4328a24K98q4l02J28K13q4j32J20r9J40R1k4O0m70K99j18JJ39J15j11n40N48j32
$$ -124 174 90 -212 -84 129 45 -87 33 -66 74 165 141 201 -269 30 -88 -87 52 167 56 -484 64 -68
4351f8J72p7j44J41m8o3L80j19k43J69J31j35k85K24m10M32o5J83l06K30k54O4
$$ -68 104 27 -117 24 -24 -87 293 174 -69 100 231 96 -189 35 -375 57 -8 175 -131 99 -155 -91
4373i1K03j56p5k8K02j92P7m5Q7o3J45k30K16J29j29k1J8k93J83k73J82n1L78
$$ -91 112 -44 -119 -147 55 -137 -60 -105 -18 -81 64 -166 50 179 50 29 47 -246 -63 -336 -154 -205 173
4396A73J73j11m81K13M5J26j09j37J71k31rJ52l6J48R2l68Q6k29M35k0j06o9J10
$$ 173 346 235 -246 -33 12 138 29 -108 63 -168 -177 -25 -61 87 179 -189 -103 -332 103 83 -23 -92 18
4419A8O7j73J37K52m21K69P8k88r2N3J32K0J19r9j40L80k13n2j32L6J96m03J29
$$ 18 85 -88 49 301 -120 149 227 -61 -153 -100 32 52 171 72 -68 312 99 47 -85 -49 147 -256 -127
4442a27J84M8J06l24J74M8r2o6P2ok9k27qM10o3O6NK37k75k9L90l00o64P05k57
$$ -127 57 105 211 -113 61 109 17 -49 23 17 -12 -239 -247 163 100 166 171 408 133 104 494 194 -470 235 -22
4467b2N8n8p2p3M78j49k25J48j07l7p8OJ87P3l7k09N3m8K61j54k25K96Pl25K52
$$ -22 36 -22 -94 -167 311 162 -63 85 -22 -59 -137 -131 56 129 92 -117 -64 -112 149 -5 -230 66 73 -252 0
4492@j12j36J73j98M61P4k63J8pl55M39K37l58j45P6K83m83L76J90k91j6M6L15
$$ 0 -112 -248 -75 -273 188 262 -1 17 10 -345 94 331 -27 -172 -96 187 -296 80 270 -21 -37 9 324
4515C24o20L68n4k9J21LJ7k03K9L13l58J9j0J93j84k81M94J6k70K9k83J52J47
$$ 324 -296 72 18 -11 110 113 130 -73 -44 269 -89 -70 -80 113 -71 -352 142 158 -112 -83 -366 -214 -67
4538f7L4j67J5K66N6k24n4J61l05J91n0J82r4j07j39L17o2OL3J61k82J30J54j30
$$ -67 -33 -200 -185 81 137 -87 -141 20 -285 -94 -144 38 -56 -163 -302 15 -47 -41 -8 153 -129 1 155 25
4562B5p6j44M82j58j36j01K8J40n5Q1qL18m94J81l9K92j96k99j16N63m24M4J29
$$ 25 -51 -195 287 129 -7 -108 -80 60 5 86 78 396 -98 83 44 336 140 -159 -275 288 -136 -92 37
4585C7k18J38L4J31QK6O5k51k62P1K28P1l9k79R8K22k86L24j20j85R5p0J26R0
$$ 37 -181 -43 -9 122 130 156 221 -30 -292 -221 7 78 39 -240 -142 80 -206 118 -2 -187 -92 -162 -36 54
4609E4j08nk84K46j9K67l15M9N6j53R9K34j02k69O9K64l52N07l77m9Q2O1K4oN2
$$ 54 -54 -59 -343 -97 -116 151 -164 -115 -59 -212 -113 121 19 -250 -181 83 -269 238 -139 -188 -106 -45 -21 -27 25
4634B5k02L1l7J32j38M23ql01J92j65j87L64Q9l74L02r9r1m9J49ok9J74M2j11
$$ 25 -177 -146 -183 -51 -189 234 226 -75 117 -48 -235 129 218 -156 146 47 -44 -93 56 50 21 195 237 126
4658A26l84O38l81j37L1L61k10k40K40K15l54r1M08j77k07N6P3j66p1K95j80L29
$$ 126 -258 380 -1 -138 -107 254 44 -196 44 259 -95 -186 222 45 -162 -106 -33 -199 -270 25 -155 174
4680A74k19r1J89k57Q8K39P6m6j68M0J56L5k92J99q5j46N45l81O6j42J90l41L41
$$ 174 -45 -136 53 -204 -116 123 199 153 -15 25 181 216 -76 123 38 -108 437 56 122 -20 170 -171 170
4703A70l09mJ35j32R4j34L8L05k5o6M2J79j2m85J70K36j03m4r8Q5k88L93j29j83
$$ 170 -139 -143 -8 -140 -46 -180 -142 163 138 72 114 293 281 -204 -34 202 99 55 -43 42 -246 147 18 -165
4727a65N23m76p9j12K35J87l15J91k21K75L4jOk33N6J83j71K47n2j31j61k4L0
$$ -165 358 -118 -197 -309 -74 113 -202 -11 -232 43 77 76 82 -151 -95 88 -83 164 112 -19 -180 -204 -174
4750a74J68n9j15K84r9R2j62J58j39K08k87K7J42k3k43k3M22J4l4r4k17J01j4
$$ -174 -6 -65 -180 104 5 97 -65 93 -46 162 -125 -98 44 21 -222 -245 177 191 157 63 -154 -53 -67
4773f7j05Q6j25K18M7K07k34J79m13L78k1j16J20m13K22m4J75k45J25J87r7J31
$$ -67 -172 -86 -211 7 54 261 27 206 -207 171 150 34 154 -259 -37 -81 94 -151 -26 161 64 195
4795A95l34L1m0q7O47l55K08j55m47L27r1L86r5n6k14k4q6L3QK05p2J12r7j4K
$$ 195 -139 -108 -148 -235 412 57 265 110 -337 -10 -101 285 190 134 -80 -104 -190 -157 -149 56 -16 96 -1 -15 -13
4820a3l4j54K65l9p9o0q7L54lp6J66l36M9J08K16l61M3J28k17J89O1K2k71j37
$$ -13 -47 -201 64 25 -54 -114 -201 153 150 74 240 -96 -47 61 277 -84 -41 87 -130 59 120 142 -129 -266
4844b66J59K49l08J83l51L37J91q9j01J20M6k96L02j40j36J02N7k35P3M27m97
$$ -266 -107 142 -166 17 -334 3 194 105 4 124 170 -126 176 36 -100 2 59 -176 -103 324 -173
4865a73R9J88n60L46j78M65l67Q9j28K06M3j62J99l13J90Q8k02J08J75O1J92l70
$$ -173 -74 114 -446 -100 -278 187 -180 -91 -219 -13 30 -132 67 -246 -56 32 -170 -62 113 174 366 -4
4887dl0m9p6J8K53l46J7K98J01o89N94K47n90K29K3j72Q6K6K67j64k24J51M31
$$ -4 -34 -83 -159 -141 112 -234 -217 81 182 -507 87 334 -256 -27 -4 -176 -90 -64 203 39 -185 -34 397
4910C97m46j01K46n8Q5k32RJ69m0k5J36j99k0K48j83m5J77o4M0j55o5R5J32j28
$$ 397 -49 -150 96 38 123 -109 -100 69 29 4 140 -59 -79 169 -14 -59 118 54 94 -61 -126 -31 101 -27
4934b7Q6m38M34N0m31K87K95m15L75n69L82j12M1J02j87K45k84J70k14J70M1P4
$$ -27 59 -379 55 105 -326 -39 256 -159 216 -353 29 -83 -42 60 -127 118 -166 4 -210 -40 1 75
4956G5o7O6n9K36m19k04L91j49J08k53K81N4k57J74L4j30k3M20ok67K95k41k3
$$ 75 8 74 15 251 -168 -372 19 -130 -22 -275 6 60 -197 -23 11 -119 -142 278 272 5 300 59 36
4979C6k92L67k06J86m84L04K37l24L20j84k89L01k4P5o7l8K20j08J86p8j97J12
$$ 36 -256 111 -95 91 -393 -89 148 -176 144 -40 -329 -28 -52 23 -44 -82 138 30 216 138 -59 53
5001E3j25PP1K02k55J02k4l5j9k30L38j94qL0jJ95L59l91k31O5q3J25J33m0n13
$$ 53 -72 -65 6 208 -47 55 31 -4 -23 -253 85 -109 -117 -87 -88 107 466 75 -156 -91 -174 -49 84 44 -469
5026d69M04L8q3L87l43J22m39L35J1j07L80K7l42N5O0J72p2j86K49l20n2J67o7
$$ -469 -65 -27 -110 277 -66 56 -383 -48 -37 -144 236 263 -79 -24 36 208 136 -50 199 -121 -173 -6 -73
5049g3J41j86J99l4j26P5J40K09l33j07j28N53l2p40L32Q0L8M6pj7n0l3q8K33
$$ -73 68 -118 81 47 -79 -4 136 345 12 -95 -223 330 298 -442 -110 -30 8 54 47 30 -20 -53 -141 92
5073I2nJ09j92M02l39k36M5K06j80j63K03R9j78j58K96o7J07n1Jj51K91j94J36
$$ 92 87 196 4 406 67 -169 -124 82 -98 -261 -58 41 -137 -295 1 -66 41 -10 -9 -160 131 -63 73
5096G3j21K02q2p4j52M0o1J01L67j86k53M20l52r8K87l41J15k22L69NJ49l85Q8
$$ 73 -48 154 72 -2 -154 -114 -175 -74 293 107 -146 274 -78 -176 111 -230 -115 -337 32 37 186 -199 -111
5119a11K4K54j94L64k43j49L51j54j61k01N3J60j00K14k23J07n0L65l47J73n2
$$ -111 -87 167 -27 337 94 -55 296 142 -19 -220 -167 -7 -107 107 -116 -9 -59 306 -41 132 80
5140H0j06K28j82j42J49J00j35J45k8p0m4J32k33O7j14J33n7r3K79j17n9J5j41
$$ 80 -26 202 20 -122 27 127 -8 137 109 39 -5 127 -106 -39 -153 -20 -77 -170 109 -8 -67 -52 -193
5163a93J54l8oJ74j5j44j66J0K97k98K57Q2l7l7J85k92K01l35K73L7Q0k15J32
$$ -193 -39 -77 -83 91 76 -68 -234 -224 73 -225 32 114 77 40 225 -67 134 -201 72 109 189 -26 106
5186A06n6mj13J4L36j06j32k50K55M3q5J65k08k16L23k27L92j09j73nK71l18P6
$$ 106 50 46 -67 -53 283 177 45 -205 50 93 8 173 -35 -251 72 -155 237 128 -45 -50 221 -97 -21
5209b1k11L46j96N0K14o14M09N2J91l8l46J42J18j25o3K52k90J18Q7j24k22L01
$$ -21 -232 114 -82 -32 182 -432 -23 29 220 182 -164 -22 96 -29 -92 160 -130 -12 75 -49 -271 30
5231C0k56J0M37q8j07j77l9J70J20m32K68K51m99P5j8L57q3j84K43J22P6k98j66
$$ 30 -226 -216 221 133 26 -151 -190 -20 100 -332 -64 187 -312 -237 -255 102 19 -165 78 200 276 -22 -188
5254a88L55l1j13p1K17n40L81J37k03J34K33J36k70Lj62m7j34L59N4m43J49j10
$$ -188 167 136 23 -48 169 -371 10 147 -56 78 311 447 177 180 18 -29 -163 196 250 -193 -44 -154
5276a54J85l01J74p0L38k58N7O5j06k4j24L7J81k4q0J29j83L16m01K44J52p6j40
$$ -154 31 -270 -96 -166 172 -86 -29 36 -70 -94 -218 -181 0 -24 -104 25 -158 158 -243 1 153 77 -63
5299f3M7K5l4L71rm32k19J58M07k89l77L99m56M98J46K22l92R9l15K53n5j22k3
$$ -63 -16 9 -25 346 337 -95 -314 -156 251 -38 -415 -16 -472 26 172 394 2 101 -214 39 -16 -138 -161
5322a61q5J56K33J80k36p7j55j81L58J77J34l60q6j86M2r0N97l74K23l5k38L19
$$ -161 -246 -90 143 323 87 10 -145 -326 32 209 343 -17 -103 -289 -247 -337 260 -114 109 74 -164 155
5344A55O3k70k84K39m4j67M02J14l73K16J22l61J24K00j49r5J28j59j02M07J6
$$ 155 218 -52 -336 -97 -141 -308 94 208 -165 51 173 -188 -64 136 -13 -108 20 -139 -241 166 182
5365A82q4j65K29Rk66J21L3k16J95K49k55j36P4L79l50R9Kk13J21K7L1P9l09N26
$$ 182 98 -67 162 171 -95 26 59 -157 38 287 32 -104 -30 349 -1 98 100 -113 8 35 66 145 -164 362
5389C62m69JR2k31J45M1L3p8J87M35p50L58J63n52L57J3k42N9Q9O9r6K4KJ76m9
$$ 362 -107 -106 -14 -245 -100 -59 -26 -104 83 518 -232 126 289 -263 94 107 -135 -76 13 82 -14 10 12 188 139
5414A39l26L17N2j45r7K46m40j45O50r7J5k16j95K4L96r0k2k43N0K13k55K18%
$$ 139 -187 130 182 37 -60 186 -254 -399 251 154 169 -47 -242 -218 178 88 66 -177 -127 86 -169 49 49
5437D9m18P5M57l86L0rM89p1k88j65J56J15l9m1M5J20j75qq8J77J84j78L2K98
$$ 49 -369 -294 163 -223 -193 -202 287 216 -72 -237 -81 34 -5 -46 -1 119 -56 -64 -152 25 209 31 63 361
5461C61l46K67l44r1J53J40k05K27j15j16p1j0K45r7o9M95m24j15O8j59K03l9
$$ 361 15 282 -62 -153 0 140 -65 162 47 -69 -140 -150 95 -2 -71 424 0 -115 -47 -206 -3 -42
5483d2jJ72k28j64J23Q6l7K38M8k64K66j85l40N19l13L71K4m12L05j87l3n3J78
$$ -42 -43 129 -99 -263 -140 -54 -91 147 195 -69 197 12 -328 191 -122 249 273 -139 166 -21 -54 -107 71
5506G1O3J4J10k19j47Q0K78l12J36r9j58J59q3L7M2L62k13q4k88L77k76J24M1
$$ 71 134 148 258 39 -108 -28 250 -62 74 -25 -183 -24 -107 -70 -28 334 121 37 -251 126 -150 -26 15
5529A5P3n1r1j28n5L0p5L40n6n4J47K62k39j07P0J47l5o5m9l26J09r7L8J31O2
$$ 15 88 37 -54 -182 -237 -207 -282 58 2 -52 95 357 118 11 81 228 193 128 79 -247 -138 -235 -197 -66 -4
5554dj99L75l33k9K00o8n3L08l46K91l02K11r3J40j90J33j19l2O3j6K63k24J11
$$ -4 -203 172 -161 -190 10 -58 -111 197 -149 142 -160 51 -42 98 -92 41 -78 -110 -47 -63 200 -24 87
5577H7l02L92l60k26J86K46p0J53m4k39J69J07j06oP5NM8J2M7j71r2J6O1K78n26
$$ 87 -215 177 -183 -409 -223 23 -47 106 62 -177 -8 99 -7 -13 62 67 115 127 174 3 -89 -73 -12 266 -260
5602b60K45j52L86n20K84l1P7J53j70k00r0lM84k55K28k62O8rK61j6l50J55k33
$$ -260 -15 -167 219 -301 -17 -48 29 182 12 -188 -278 -281 203 -52 176 -86 -18 -27 234 218 -132 23 -210
5625b10J41l61M86j50j42K20L5j54L66k35L23j96j05j24J71k15Q1K7JJ55j40M79
$$ -210 -69 -430 56 -94 -236 -16 19 -135 231 -4 319 123 18 -106 65 -150 -69 -42 -41 114 -26 453
5647D53l11mJ01l70L09P3l8k40m2J09K95l61k29M91k13%k84K31K15k60K3j8J2
$$ 453 142 138 239 -131 178 251 213 -27 -69 40 335 -26 -255 236 23 23 -261 -30 185 -75 -52 -70 -58
5670e8K8O2j34L20k42R1j6j11j75K60K20j6k19m1j01L5K9R2r3q0j2M46j69j95
$$ -58 -30 32 -102 218 -24 67 51 -60 -235 25 245 229 10 -31 -132 -97 -68 24 -69 -149 -161 285 116 -79
5694g9J65q2O4k3j5K1p4j40R0K0RK16m3j13J61l86K70j54q3L31k49j95L88l75
$$ -79 86 4 68 45 30 51 -23 -163 -73 -53 -44 172 129 16 177 -209 61 -93 -176 155 -94 -289 99 -276
5718b76K24L08k83J12j48K07r1K6j86P2q4M62l01J04J6k35k03K23J05L5q2k22
$$ -276 -52 256 -27 85 -63 144 53 79 -107 -35 -119 343 42 146 162 -73 -276 -53 52 87 5 -217
5740b17K09K1J40k50J46J34j71M1M7k31K67j51j65P7M76l37j14KJ00K01J43o29
$$ -217 -8 13 153 -97 49 183 12 53 100 -131 136 -15 -180 -103 373 36 -78 -76 24 225 368 -261
5762b61J95K54m16M54k04M3k9K7M9k64K0j32K11Q7K71k21k22P8l8n8K48j78o7
$$ -261 -66 188 -228 226 22 65 36 63 112 -152 -132 -264 -53 34 305 84 -138 -60 -98 -156 92 -86 -153
5785a53L30k08k72n0M21j18J15Kj13K01j97R0J33l30J96j27K10k38J79j25K98
$$ -153 177 -31 -303 -353 68 -50 65 67 -46 155 -42 48 181 -149 47 -80 130 -108 71 -54 244
5806B44k41P5j08n1o3n1M27j11k64M66k29J57m33K4K43j40J09j40O5L59m47K28
$$ 244 3 78 -30 -81 -144 -195 232 121 -143 323 94 251 -182 -158 85 -55 54 -86 -21 338 -109 119
5828A19J73l58K61k26r0j63J82M5k58N57l17j80o5K26K94l90L09QK07n29J32j17
$$ 119 292 -66 195 -31 -121 -284 -102 -57 -315 242 -75 -255 -320 -94 200 -190 119 127 334 -195 -63 -180
5850a80j26N14n60M27J75l15q1L8p1R3N3k41M06l78L64m5j32K34j71p2j87M89
$$ -180 -306 208 -352 75 250 -65 -146 -108 -179 -86 -33 -274 132 -246 118 73 -59 175 4 -68 -255 234
5872B34j18l7l6mj39J66l06J66J56j69j8j25L73k35n1K84l52L17j19J60k17L84
$$ 234 116 79 43 39 -100 66 -240 -74 82 -87 -105 -230 143 -92 -143 141 -211 106 -13 147 -70 314
5894C14o36L76k49J47N9m7r3Q8K89p3J1j28k76K4L11k15K22j15K10l60K54k01
$$ 314 -322 54 -195 -48 11 -36 -129 -41 248 175 186 58 -218 -194 117 -98 124 9 219 -141 113 -88
5916h8L33j79O7P1l39L33r2j02q1L93l76n3J15J74k25n0j69J69Q3o8N2j90K66
$$ -88 245 66 133 204 -135 198 106 4 -77 316 -60 -113 2 176 -49 -99 -268 -99 -16 -84 -32 -222 44
5939D4J50l25J59J44k09K31k61J98o6j40N5P1lk47R3J34J58l08K62J51l12O5K02
$$ 44 194 -131 28 172 -37 194 -67 131 65 -75 -20 51 48 -199 -106 28 186 -122 140 291 -21 44 246
5962B46n32L74N8k87K33k65J98j00p7L64k54J44j45j23K97n3j35J80K34o02Q5
$$ 246 -286 88 146 -141 92 -173 25 -75 -152 212 -42 102 -43 -166 131 78 -57 123 357 -245 -160
5983a60J19L25m65R2n3M4l65M25j68J99K50l69j76O89l69k02K78n2q0J75p6n0
$$ -160 -41 284 -181 -89 -142 -98 -463 -38 -206 -7 243 -126 -302 387 18 -184 94 42 -38 137 61 11
6005A1K14l49K85l65J27K90k75L65o79L37L13l90L24l08k11M82r4j38K90m67J85
$$ 11 225 -124 161 -204 -77 213 -62 303 -376 -39 274 -116 208 -100 -311 171 77 -61 229 -238 -53
6026e3m3J22J80k3k29l10J49J40m02O15J34l33J93N3L4k37R2p5R5l70M11k77K10
$$ -53 -96 26 206 183 -46 -356 -207 -67 -469 146 280 -53 140 193 227 -10 82 7 102 -268 143 -134 76
6049G6N6P6l92M20l17K65l41J92L7J32n36L29K9k5O7j62K72r9j45oL14m74L22
$$ 76 132 208 -184 236 -81 184 -157 35 72 204 -332 -3 26 1 68 -94 178 79 -66 -72 242 -232 90
6072I0L4q8m2m6J51j87j02L56p8J33m13JK64L02p35K42J95k6j40k5K08m01K08
$$ 90 124 36 -6 -52 99 -88 -190 166 88 221 -192 -191 73 375 -360 -118 77 51 -89 -114 94 -307 -99
6095i9K39J32k44j21J69P7m62N4K19j40J48jJ15j31K58l19K66k45K25j39J32j39
$$ -99 140 272 28 -93 76 153 -309 -255 -36 -176 -28 -29 86 -45 213 -106 160 -85 140 1 133 -6
6117fj2J12J11O1l93J96j98l0q2M27R9m85K60LLJ4m4m1j41M18l13M40m44M29j68
$$ -6 -18 94 205 266 -127 69 -129 -159 -241 186 285 -200 60 63 66 80 36 -5 -146 272 -41 399 -45 384 216
6142B16l42L93m42J7K10J21l21K6K56j75J1J75r3j94J48L9o4k06K37J94k73LJ34
$$ 216 -126 267 -175 -158 52 173 -148 -122 134 -41 -30 145 52 -142 6 45 -19 -225 12 206 -67 -64 70
6165G0P2J07r8q4m9L5nm79P95m80j4N27l99k23O07k67j86J92k21M08k64n5k94
$$ 70 142 249 151 67 18 53 48 -431 364 -116 -130 397 -2 -225 382 115 -71 121 -100 308 44 -11 -305
6188c05K46O4J76j56J00l62J57r3L76l36m0N9N0J97l75N0L07q8j82K3m8L25k77
$$ -305 -59 5 181 25 125 -237 -80 -173 203 -133 -173 -114 -64 133 -242 -192 115 27 -155 -132 -180 145 -132
6211a32L69p7k95q5J86j36N4j67L65j38lrj23M94r7m26L90l21O9K7j18K46l07
$$ -132 237 160 -135 -220 -34 -170 -116 -283 82 -56 -59 -68 -191 303 206 -220 170 -151 -82 -55 -173 73 -234
6234b34M66k66J91j42l5l05J59J06J10j66O4m4J99K8k53K65j61L57n61o7J72j05
$$ -234 232 -34 157 15 -20 -325 -166 -60 50 -116 -52 -96 103 131 -122 143 -18 339 -222 -289 -117 -222
6256b22K47K0N6lJ15m7m24K60J29k85M5lM8OJ50J02j71Nj65L23k51o7O9Q1J17
$$ -222 25 45 101 98 213 166 -258 2 131 -154 -109 -112 -64 -58 92 194 23 28 -137 186 -65 -132 -63 18 135
6281A35l23j14K18J55j88J58j92K83K54k68L3Q4q8N9j39l4J11j05Lm4M8L7j3n6
$$ 135 -188 -302 -84 71 -117 41 -151 132 386 118 151 235 147 206 67 33 144 39 42 -2 46 83 70 14
6305A4N8Q9k26Q7K09j66J29M1l22o8M1L06Rk78J63l9j60R8j05K08m3K4N3N2r1
$$ 14 72 161 -65 22 231 65 194 235 -87 -155 -114 192 201 -77 86 47 -113 -15 -120 88 45 69 122 174 83
6330H3L37l66m6l34M10J13l29L04o3Nl76Q9LJ26q7j30J71k66j11M73L1j05J83
$$ 83 420 54 8 -326 84 197 -132 172 109 114 -262 -173 -170 -44 -131 -261 -90 -356 -467 6 37 -68 115
6353A15l3l4R0k72j09K44mK8j66J03nJ28q8K51l16O0Q0m8m5J0O0J10oj69J27j35
$$ 115 82 48 138 -134 -243 1 -3 25 -141 -38 -43 85 -3 248 -68 -8 72 24 -21 -11 49 159 153 -16 111 -24
6379b4J85j69Q3QJ24m07L72o88O17J24j12J01k44j31o8j7L39p7q3K41j31k19L6
$$ -24 161 -8 75 83 207 -200 172 -516 101 225 113 214 -30 -161 -229 -246 93 16 -67 174 43 -176 -140
6402a40L52k53O7r8L50j6j84j68L07j46j19J33j58k72M18j47J26n1k45K28o0Q4
$$ -140 212 -41 26 -72 278 262 78 -90 217 71 -48 85 -73 -345 73 -74 52 1 -244 -16 -76 8
6424Hr2M9j00L3n4J94J8j51J41j90J6Q2j66J03k06L35LL1j89K4M0K61m59J09Q3
$$ 8 -84 -35 -135 -102 -156 38 56 -95 46 -144 -128 -46 -212 -109 -315 20 23 54 -135 -111 -71 190 -269 -160 -77
6449g7j02J28pQ6O8o9k9K00j60Q0j9j55j44K55j57K03r7Rr2K46o4p2k7j3r0j15
$$ -77 -179 -51 -58 28 96 27 -2 198 38 118 99 -56 -200 55 -102 101 4 13 -79 167 103 31 4 -9 -99 -214
6475b14K02J0O9J47k0m07J57L85k78k26K16j27K84j13kj77J42k5J24j44R7K9k3
$$ -214 -12 -2 67 214 194 -213 -56 329 51 -175 41 -86 198 85 83 -94 48 23 147 3 100 129 106
6498A06J44j93l9K15k50j51L74j97J81j94K3Kj25J46J0l14K44J39q8m0j3N4j6
$$ 106 250 57 18 233 -17 -168 206 9 190 -4 19 21 -104 42 52 -262 -18 121 33 -7 -20 34 18
6521A8J12j67j19n0j42O01n50L19J00k1k17K26n8o1K42k69j13J02l4M2J07j52
$$ 18 130 -37 -156 -206 -348 253 -297 22 122 101 -116 110 52 -9 233 -36 -149 -47 -81 -39 68 -84
6543h4L57k62O2l24K42j73l01Q15q3j30j82j04M39l44Q9k54R0M6L1KK00l63K62
$$ -84 273 11 73 -251 -9 -182 -483 332 249 119 -63 -167 272 -72 17 -237 -147 -101 -70 -68 132 -231 31
6566C1M8p3k02L94j86k9o9o7L62k24P2l7k0k0l1r8n5J7L28m1M7m2n91P70l01J24
$$ 31 79 6 -196 198 12 -17 -86 -153 209 -15 57 20 0 -20 -51 -149 -204 -187 141 100 147 105 -486 284 -17 107
6592A07m6J82k02j62K62k2N9p9L9k55j40Q9J98M1k19k06K93K9Q3k33K73l7J84
$$ 107 61 243 41 -121 141 119 178 99 138 -117 -257 -168 30 71 -148 -354 -61 -32 51 -182 91 54 238
6615B38k72J36k36O7k49L30j95M25m02O8J27r9J22k59M05q3k59L81r4q1j32K03
$$ 238 -34 102 -134 -67 -316 14 -181 244 -158 -90 37 -62 60 -199 206 123 -136 245 151 70 -62 141
6637A41p7j2k68pJ41k33L36m14L83l14L06j88N17o09J83J67k16K45q7n0J82m07
$$ 141 64 52 -216 -223 -82 -315 21 -393 -10 -324 -18 -206 311 -298 -115 52 -164 81 -6 -56 126 -281
6659b81L69q1j70L56j55p5n3N3K9j98J24k2L41k6l41M33m87o7L89Nlj4j79J86
$$ -281 88 7 -163 193 38 -37 -90 -37 -8 -206 -82 -104 237 211 -130 303 -184 -251 138 143 140 126 -53 133
6683A33j87j56L36J91k84J09m15K08LJ65k75K1J17L34O9m85J58r4L45j83L40k90
$$ 133 -54 -210 126 317 33 142 -273 -65 -62 103 -172 -151 -34 300 369 -116 42 -52 293 110 450 160
6705A60Jj36j51L16j49j69k5J26J17o%k05J49j1nJ81j62k5O9J17l08j8L0K12j77
$$ 160 161 25 -126 190 41 -128 -153 -27 90 84 84 -121 28 17 12 193 31 6 75 192 -116 -134 -104 108 -69
6730f9m2K49l23K14L8j75M11l08p2J46p4J50j37j25J26k7n0J01%j33L48k45m2
$$ -69 -111 138 -185 29 67 -108 303 -5 -77 69 -5 145 8 -117 9 -18 -68 33 33 -100 248 3 -39
6753c9M9K6N5j77p7J59J14j04J60q5j52K41j29o8l03J88K67l8P9n8q1p5m2J90
$$ -39 10 36 91 -86 -163 -4 110 6 166 81 -71 170 41 -27 -330 -142 125 87 166 108 27 -48 -90 100
6777A00P5n6k04K0l04L40L8j60o2L19j46K05j24j54jJ69j55L3J59j81k7m7J94
$$ 100 175 119 -85 -65 -369 -29 9 -151 -213 106 -40 165 41 -113 -114 55 -100 -67 92 -89 -116 -163 31
6800C1Rp1L48j07o5j41m7NK58j2k00J53j19q1K63j18j49j97J12J52j41j36M38
$$ 31 40 -31 317 210 145 4 -43 -38 220 208 8 161 42 -39 224 106 -43 -240 -128 24 -117 -253 185
6823A85m26M74l08Q8m0PL2K04L92n82J50k02J44j04J06M0L19m27k6k00J30J52
$$ 185 -241 233 -75 13 -27 -20 12 216 608 26 176 -26 118 14 120 160 479 52 26 -174 -44 108
6845A08K76m61k15L89l14L84k65QJ79N1m42L49p8K30m26J67m5L00n22M40n8l3
$$ 108 384 -77 -292 97 -217 167 -98 -90 89 140 -302 47 -31 199 -227 -60 -105 195 -327 113 55 22
6867B2k22N35l86K52l45P9J99k89J06J4j31J96J85l66M55l78j12J71P2L55m20
$$ 22 -200 335 -51 201 -144 -65 134 -155 -49 -35 -166 30 215 -151 304 -74 -186 -15 57 412 -8
6888hL38k35j95P8L9K3n7K15k05J58m27M79Q8l50q5j06L28j33p1K47k66K44o2
$$ -8 330 95 -100 -22 17 40 -17 198 -7 151 -276 203 291 -59 -144 -250 78 -55 -126 121 -145 99 37
6911C7J04l13M66k56K18m44L2n6L09P7mj27j79l9K12J25k94P1R3o1j13j90J97
$$ 37 141 -172 294 38 256 -188 -156 -212 97 174 170 43 -136 -175 37 162 -132 -61 32 -29 -142 -332 -135
6934a35J67j45J05j3K8O3k33J75k72J51K69J2l03J55k96M09j40m01K97J30J11
$$ -135 32 -113 -8 -21 7 70 -163 12 -260 -109 160 172 -131 24 -272 137 -3 -404 -107 23 134
6955A34n3K67l05J18k10M13m66r4M10j86n8q2J10J1n5k08j43M31K20P1l82K04
$$ 134 81 348 43 161 -49 364 -102 -196 214 28 -30 -112 -2 9 -46 -254 -397 34 254 325 -57 147
6977A47l23N5K09k99N10q9k20j4l58M93k42N1K1J62l26j12M68k52J05J66l4p8
$$ 147 -176 -121 88 -211 299 210 -10 -24 -382 111 -131 -80 -59 103 -223 -335 133 -119 -14 152 118 40
6999D0n5J1j44R6L25l6k63K7q4K39m37K45o6mm8J60J35l29K1K64j11K99j57k48
$$ 40 -15 -4 -148 -52 273 237 -26 1 -83 156 -281 -36 -102 -106 -154 6 141 -188 -167 97 -14 285 128 -120
7023a20M61n49Q7L5M19n28j3L9J73j52J7K92j72j23K95p5L5k1k47J85j1k3r8q9
$$ -120 341 -208 -121 -86 333 -195 -208 -169 4 -148 -131 161 -11 -134 161 86 121 100 -147 38 27 4 -94 -183
7047a83R3m1L48j48j31N8K6J16k18L07m08k06L76k99M05J4j17j06J05n2K15j56
$$ -183 -90 -131 217 69 -62 -4 22 138 -80 227 -181 -387 -11 -310 95 109 -8 -114 -9 -61 154 -2
7069bj59R7K08r3q5k6j41K34PK36j0l06J06k68j76M88k44M6K3n5K50l91L07j74
$$ -2 -161 -64 144 51 -34 -60 -201 33 40 276 266 -40 66 -202 -378 110 -134 -88 -65 -120 130 -261 46 -128
7093a28M24m24K61l67R1J83j18p8K34j84N14k73k30J38k17J39j85L03m7l4L6J89
$$ -128 296 -128 133 -234 -143 40 -78 -156 78 -106 408 135 -95 43 -174 -35 -220 83 36 2 38 227
7115B27m15P9j4RJ96P8m78M43K9j75j6q7M76k57M1J1j78L05m29L10o0K44l33L07
$$ 227 -188 -109 -123 -114 82 160 -318 125 154 -21 -37 -124 352 95 136 147 -31 274 -155 155 95 339 6 313
7139C13k3l81j4K3K11Q5k85Q4J29j87Ln1j00K41K9J9J21k39P1k28M64m27O6K03
$$ 313 290 -91 -105 -82 129 214 -71 13 142 -45 -42 -93 -193 48 77 96 217 -22 49 -179 285 -142 -76 127
7163A27q9j82L80l92J30J08Q6K3k64j30M71k76K59M5j68o9J31j58k14J8k8J57
$$ 127 38 -144 236 -156 -26 82 168 191 -73 -203 268 -8 251 296 128 59 190 32 -182 -164 -192 -35
7185c5K71j61J6k77J35P6l78L20J4L23l21J70k19Lm5p8j16L52q4JK31k72O6J28
$$ -35 236 75 91 -186 -51 25 -353 -33 -19 304 -17 153 -66 -63 -108 -186 -302 50 -34 -33 198 -74 -8 120
7209A20L7k63k25L80R7l12K11l5J51L9m9k30l36K89K33n1k95K22KK25n27M21O3
$$ 120 157 -106 -331 49 146 -166 45 10 161 200 151 -79 -415 -126 107 56 -239 -17 -15 210 -317 104 167
7232A67n52K64k62K53K95l45L81l33K43j28k32J73R1J72j62kl09k7L70J2k22J93
$$ 167 -385 -121 -383 -130 165 -180 201 -132 111 -17 -249 -76 15 187 25 23 -286 -313 57 69 -153 40
7254D0p3N6j71J10r0K35q8J09k62N1J06j53N6P0J35N3j95j28J33J02N3l91J48
$$ 40 -33 23 -148 -38 -128 107 19 128 -134 -83 23 -130 -74 -4 131 184 -11 -139 -6 96 149 -242 -94
7277i4j54K18j70l10M11L30m73J1M31J47j61j51lj03J21k9M7K18n79K85J65j76
$$ -94 -248 -30 -200 -510 -99 231 -242 -231 200 347 186 35 32 -71 50 21 68 286 -293 -8 157 -19
7299a9j05M31l12L69m76J40R5j73L5m7J85j79J80j89L14k78O2j83M3K50o1k12
$$ -19 -124 307 -5 364 -112 28 123 -50 -15 -62 123 -56 124 -65 249 -29 33 -150 -107 143 82 -130
7321a30j20QJ98j06o5L84j12lk61J11m0L5K12n6k49J25J10P7P9j26j06J46q5j95
$$ -130 -250 -242 -44 -150 -215 169 57 54 -207 -96 -136 -101 111 55 -194 -69 41 118 197 71 -35 111 26 -169
7345a69K11k08K11j02J07J28j45RO4j66K05R3l42L4O3L8J63k37p1o6M71j35k88
$$ -169 42 -166 45 -57 50 178 33 42 106 -60 145 238 -104 -70 -7 31 194 -43 -114 -180 291 156 -132
7368a32M74j61j09j36k85J31K8R3k38O40k16j23P4m88N31o9R5k67K65l42K16K08
$$ -132 342 181 72 -64 -349 -218 -190 -97 -335 305 89 -34 40 -448 83 14 109 -158 107 -235 -19 189
7390A89j7j41j01k1L03j89R7k40K56j05J73k3l64K38J00j7q7Q9k42K45L1l34J07
$$ 189 172 31 -70 -91 212 23 120 -120 136 31 204 181 -183 55 155 138 51 140 -102 143 174 -160 -53
7413e3O2R2j41j67M80n25R9Q5M94l05P8l89J32K26km27MK36lP9j83J9J30J10j87
$$ -53 9 101 -40 -207 273 -252 -153 -68 426 121 199 -190 -58 168 166 -261 -257 -21 -24 55 -128 -109 21 131 -56
7438e6K7k86K62L93o23Q9J82j9j97N00l52P6j44J39j34K95k7M2n5J1k25Q5N6l4
$$ -56 -29 -315 -53 340 -283 -194 -12 -31 -228 272 -80 -4 -148 -9 -143 152 125 167 112 123 -102 -17 39 5
7462Ej3J71j77n9r8j17N08o3j95K09M4k05L91j09l72RM37l19J36j09k00K45k61
$$ 5 -8 163 -14 -73 -171 -288 220 157 -38 171 215 10 401 292 -80 -71 366 47 183 74 -126 119 -142
7485a42P2j45K08J12k27M01l83j0J04J99R4R4l43K06j33n2qOm6o4K49m89K17K46
$$ -142 -70 -215 -7 105 -122 279 -104 -114 -10 189 283 377 34 240 107 55 47 53 7 -57 192 -297 -80 166
7509A66R6m55J45J10j44L98m79K87l20J00K0R2J14n14N86k62K45k42J04K49j31
$$ 166 262 -193 -48 62 -82 316 -163 124 -196 -96 -76 16 130 -384 202 -60 185 -57 47 296 165
7530A65Pj14J2j24o2J45k66K95k48J54K56j34P6k97K32l9J5J8J04q8J19j25j86
$$ 165 172 58 70 -54 -116 29 -237 58 -190 -36 220 86 162 -135 97 58 73 91 195 107 226 101 -85
7553h5K1K42l21K85k77K25o7L18l44n1k04P0L71k19J21k2k8nJ08k74j7m7l5JJ5
$$ -85 -64 178 -143 142 -135 90 23 341 -3 -54 -258 -188 183 -36 85 63 35 30 138 -136 -153 -200 -235 -234 -219
7578b19R5K47k11K13l66K18j14P8K0j8n1j73P6O01k07l32J50n6K15L1j40j06L2
$$ -219 -124 123 -88 125 -241 -23 -137 -59 -39 -57 -108 -281 -205 396 189 -143 7 -49 166 197 57 -49 -17
7601a7J18k06K03j22k01J30k2J17J00j31m7r0N64l59k30Q0j97L89k28%K0Q9N5
$$ -17 101 -105 98 -24 -225 -95 -117 0 100 -31 -78 -168 396 37 -193 -113 -310 79 -149 -149 -129 -40 15
7624A5J15j66r5o1J61J39k8j44P7K3l50K51K34j54K52k46m9j70J83K7Q1j13O6
$$ 15 130 -36 -131 -192 -31 108 80 -64 13 36 -314 -63 171 17 269 23 -26 -196 -13 14 95 -18 48
7647D8M4j88L62j22l2J41R5l77j41J63k8L88k29l60O16l91k2J47l41J66Q7J31
$$ 48 92 -96 266 144 112 253 348 -29 -170 -7 -35 353 124 -236 380 -11 -33 114 -227 -61 26 157
7669A57l29J38o7M8j68J99j3Q0Ok51K47j11j63K26JJ17k10j47K66M7R4j59O1k
$$ 157 -172 -34 -101 -53 -221 -22 -35 45 51 -200 47 -64 -227 -1 0 117 -93 -240 26 73 167 8 69 67
7693F7j18K95p6J81n96L04k04J29k02L46k68R1J39j6n6M0n7R5k38J68k40P2J02
$$ 67 -51 244 168 349 -247 57 -147 -18 -220 126 -142 -51 88 72 16 56 -1 94 -144 24 -216 -144 -42
7716d2q2m5K59m7L33l62J32k44r0K28j82K5K87j38j29j1J41q9r7J28P2p7J93j71
$$ -42 -124 -169 90 43 376 14 146 -98 -188 40 -142 -117 170 32 -97 -108 33 -56 -153 -25 47 -30 163 -8
7740hmj19J70j09j9J46m01L32j3p0P0p1J95j07k60L78J30j89P7J01l77K51m1Q8
$$ -8 -12 -131 39 -70 -89 57 -344 -12 -25 -95 -25 -96 99 -8 -268 110 240 51 128 229 -148 103 62 150
7764A50r1P4m37M06n1k07J21k20M64k39J37k18M4J33r1J61J4j87l08N13j91J29
$$ 150 59 133 -304 102 51 -156 -35 -255 209 -30 107 -111 -67 66 -25 136 150 -37 -345 168 -23 106
7786A06J22L3P6k69J77j40j23j6M2Q1J06o3J47j06R3l22j4R4k03K41k64J87l9
$$ 106 228 261 337 68 245 105 -18 -34 8 89 195 132 279 173 266 -56 -70 24 -179 62 -202 -15 -54
7809e4j09L10m66K76K84l95jr3L95m7J08j38K07om22M78m53P0N9p6K43p5l06j14
$$ -54 -163 147 -319 -43 241 -154 -155 -248 147 100 208 70 277 271 -151 327 -126 -56 3 -73 170 95 -211 -325
7833c25K11J47l47n3J76L29o0J21k8k61k3J3J05o4K63o16K14K63k23J42L7OK77
$$ -325 -114 33 -314 -367 -191 138 78 199 171 -90 -113 -100 5 -59 204 -412 -198 65 -158 -16 21 27 304
7856C04l86O53q34L25j33J87l15K20J50k23q6K97k00L6j81J74l6K29j76N6l99
$$ 304 -82 571 -263 62 -71 116 -199 21 171 -52 -138 159 -41 -5 -186 -12 -48 181 5 61 -338
7877c38K70J52k04J3j58J44L42l29J65M7n7r8J58P3k8j17J33k08K23k68J70O3
$$ -338 -68 84 -120 -107 -265 -121 221 -108 57 104 47 -51 107 180 152 35 168 -40 183 -85 85 148
7899A48l38M72j36k27k2nK63p7O3J47l14j55O1L69j88lQ9j79m3J12J20j12n1K86
$$ 148 -190 282 146 -81 -103 -108 155 78 141 288 -26 -181 -120 249 61 58 147 -32 -75 37 157 45 -6 280
7923B80m64K27j05J0k11Q1L4Q2J41P7k19J8m3L94j75j67J49k25J78K53l90K54
$$ 280 -184 43 -62 -52 -263 -182 -148 -66 75 152 -67 -49 -92 302 127 -40 109 -116 62 315 -75 179
7945A79k22M71m19J91l10R8J10P7m8l45J30K76m95K34K56Q3k02k31r1L27r8P9
$$ 179 -43 428 9 200 -110 -12 98 175 127 -218 -88 188 -307 -73 183 266 64 -167 -258 69 -29 50
7967E0J97m3k35o5R6j18L38k50l7J48j05j32K34L3k4O6k30J3K93m1j85J55k12
$$ 50 247 204 -31 -96 0 -118 220 -30 -67 81 -24 -156 78 111 87 153 -77 -64 229 188 3 158 -54
7990e4k32M02K65k00l74J85J08M7k99K61j33j7K87n7l19J57j02j10j14M20q2l88
$$ -54 -286 116 381 181 -193 -8 100 147 -152 109 -24 -41 246 189 -130 27 -75 -185 -299 121 39 -349
8012c49R8J01K02o6j33n4K14l13j42Q87m36l2l0j22K89j03q6j6M38l24K07Ok67
$$ -349 -251 -150 52 -14 -147 -201 13 -300 -442 445 9 -23 -53 -175 114 11 -75 -91 347 23 230 236 -31
8035c1LK16n1k34O3K6Q2P7k33J6J26m81N93m4j22j18o4J99J02j40nK29j63p1k83
$$ -31 -28 188 137 -97 -34 -8 74 151 -82 -66 60 -421 172 128 6 -112 -176 23 125 -15 -20 209 46 -25 -308
8060c08J17J78Q4l42L03Q8j18m3k55Q4O2K85n78M31J08J45n14K74m4j80j17L91
$$ -308 -191 -13 71 -271 32 120 2 -41 -296 -212 -150 135 -443 -12 96 241 -273 1 -43 -223 -340 51
8082E1j2p0J14R0j56n4K4R7N3ml63K97j44N0j44K22K60l41Oq2J80jk55j19M40
$$ 51 39 -31 83 173 17 -37 -13 84 137 133 -230 67 -77 -27 -171 51 311 -30 -24 -106 74 73 -182 -301 139
8107A39q3j33P1K1K2j69M6Jp0L00j87p3K62j87j28K23m56M50Q7j39k01J65r7L11
$$ 139 56 -77 -6 15 37 -132 -86 -85 -155 145 -42 -115 147 -40 -168 55 -401 49 136 -3 -204 -39 -136 175
8131A75l05J43K59k19N5J16j20p6j69K79j30j00K17m3O4l59L05K02j78r1R3n1
$$ 175 -130 13 272 53 108 224 104 28 -141 138 8 -92 125 82 146 -213 92 294 116 25 118 67
8153F7k7l4k24J23J33k32K77j76K22j70K02k68K92m43p3K38J75k8pk02mk7L72
$$ 67 40 6 -218 -95 38 -194 83 -93 129 -41 161 -107 185 -258 -331 -93 82 54 47 -155 -159 -186 186
8176A86j92ro4l8L1J93l14L21j17O9NQ7k38k4l0
$$ 186 -6 -15 -79 -117 -86 107 -207 114 -3 66 71 158 -80 -104 -134
8191a34
$$ Imaginary data points
##PAGE= N=2
##DATA TABLE= (X++(I..I)), XYDATA
0@%%%%%%%%pJ4j4J4j4K1k8L5m2M9o2O9p7R1j08J29j47J68j95K21k50K83l19L58
$$ 0 0 0 0 0 0 0 0 0 -7 7 -7 7 -7 14 -14 21 -21 28 -34 35 -42 49 -59 70 -77 91 -104 117 -133 150 -169 189
32A89m01M49n02N60o24O94p71Q57r50J052j162J286j426J580j754J949k174K435
$$ 189 -212 237 -265 295 -329 365 -406 451 -499 553 -609 677 -749 831 -923 1026 -1148 1287
50A287k737L096l532M071m760N679o970Q932j2321J9799o6879L0820O9616q2410
$$ 1287 -1450 1646 -1886 2185 -2575 3104 -3866 5066 -7255 12544 -54335 -23515 46101 -36309
64c6309L7558P3749j7530m5258J7023l3608l8445K7284Q531n5044L1400Q4597
$$ -36309 1249 74998 57468 12210 29233 -4375 -42820 -15536 -7005 -62049 -30649 53948
76E3948j2969m9450L8557K3446m9552k8319k956k5198J6312L2770k8246j313Q7311
$$ 53948 40979 -8471 30086 53532 3980 -24339 -27295 -52493 -36181 -3411 -31657 -32970 54341
89E4341K1066p0304M247N5499m1722o3322J6379P413k8912K3013K5456l0559J7767
$$ 54341 75407 5103 9350 64849 23127 -40195 -23816 -16403 -45315 -22302 3154 -27405 -9638
102i638O6305k7167o2011M0858M1282n8604l1872M3320J0205j8693J0145j374
$$ -9638 56667 29500 -32511 8347 49629 -8975 -40847 2473 12678 -6015 4130 2756
114B756j0199K9744J429n5575K833N5600k1902n0420L4446L7001k9411l735K6468
$$ 2756 -7443 22301 23730 -31845 -29012 26588 4686 -45734 -11288 25713 -3698 -7433 19035
127A9035k0585m414M2702k3566n2429M8592M5502p0350l5416O8345P014o5429
$$ 19035 -1550 -5964 36738 13172 -39257 9335 54837 -15513 -50929 17416 24430 -40999
139d0999O826M2272j5450m048L1027j0544j0753M2890j500n9852N382M1489l2968
$$ -40999 -34173 8099 -7351 -11399 19628 9084 -1669 41221 39721 -20131 -14749 26740 -6228
152f228m1196K7864K1842r896J0887O626j2024K2933J6605n1135k3354N0067R05
$$ -6228 -47424 -19560 2282 -7614 3273 9899 -2125 20808 37413 -13722 -37076 12991 13896
165A3896n6858J6459N6248j1460j8562K7344k940k6272J3318p222n1805P479M9012
$$ 13896 -42962 -26503 29745 18285 -277 27067 24127 -2145 11173 3951 -47854 -40375 8637
178H637k1856l2774N2400M3420k9606j3011K2943q895k0233l108k2975j3874L5052
$$ 8637 -13219 -45993 6407 49827 20221 7210 30153 21258 1025 -2083 -25058 -38932 -3880
191c880Q714l5401J8725N3374j6323l6681K0630Q631l1662m29J0275k2989J1840
$$ -3880 4834 -30567 -11842 41532 25209 -11472 9158 17789 -13873 -14302 -4027 -27016 -15176
204a5176M6044j7969l4638M5491L1614o0324k8823M3985l193m5828J1112K5957
$$ -15176 30868 12899 -21739 23752 55366 -4958 -33781 10204 7011 -38817 -27705 -1748
216a748r004J1438K3874j8286o676L4811r129m7976P902L1253k1925k2284K1139
$$ -1748 -10752 686 24560 6274 -402 34409 25280 -22696 -14794 16459 -5466 -27750 -6611
229f611J0652m581J1375p165j7675K3074J3881m2950j0599M7278P67l9742J5794
$$ -6611 4041 -540 10835 3670 -14005 9069 22950 -20000 -30599 16679 17446 -22296 -6502
242f502L3456j8171j1404J5996j3319j5029K3398l219l8574J6790M1646k4184
$$ -6502 26954 8783 -2621 13375 56 -14973 8425 5206 -33368 -16578 25068 884
254H84k9279L4575K0594k7526n513J4050o709J229R068k0256p223L3130j243l9604
$$ 884 -28395 6180 26774 -752 -6265 7785 1076 2305 11373 -8883 -16106 17024 15781 -23823
268b3823J0221L3783j9802k3173K2039O532j4376J5276O290k6516J2923L3566
$$ -23823 -13602 20181 379 -22794 -755 5777 -8599 6677 12967 -13549 -626 32940
280C2940l0054l3839L9107K1231m6331r329L9222k772k4708J2020P092j3140J0916
$$ 32940 2886 -30953 8154 29385 -16946 -26275 12947 10175 -14533 -2513 4579 -8561 2355
293B355J0481k5698r61L4695p027l1496J5908K3786j8081j2736R632m116j502
$$ 2355 12836 -12862 -13823 20872 13845 -17651 -1743 22043 3962 -8774 858 -3258 -4760
306d760J0651j4639j3708K9957J3217l5188k835L9663n565l2182J2559J7387j6668
$$ -4760 5891 -8748 -22456 7501 20718 -14470 -17305 22358 16793 -15389 -2830 14557 -2111
319b111j805J3419j6141n305K8521p365l4849J7767L0911k6369k1966K7148J1924
$$ -2111 -3916 9503 -6638 -11943 16578 9213 -25636 -7869 23042 -3327 -25293 1855 13779
332A3779j7653J985P771o582R453P309k4606n709K9601n244l4309J2488K6943
$$ 13779 -3874 -1889 5882 -700 8753 16062 -8544 -14253 15348 10104 -24205 -11717 15226
345A5226j6839j1909J9023k149j0073J8493k955k8400J7163K9097l0157k4390
$$ 15226 -1613 -13522 5501 3352 -6721 11772 8817 -19583 -2420 26677 -3480 -27870
357b7870L8027J5445l6616l096K8066p916j6017J0319l197j1955J7430P015k5409
$$ -27870 10157 25602 -11014 -14110 13956 6040 -9977 342 -2855 -14810 2620 9635 -15774
370a5774N940L1959q994k4415J4559J3338j5489o003K601q836O402J3533j8138
$$ -15774 -9834 22125 13131 -11284 3275 16613 1124 -4879 -2278 -11114 -4712 8821 -9317
383i317j0577L2008J0051l3269M17L0441j0657k4198J2199P929j3781Q331J0769
$$ -9317 -19894 12114 22165 -11104 -10687 19754 9097 -15101 -2902 5027 -8754 -423 10346
396A0346j8275K449K8207j1406l1242J5920K1423k4982j6379K1333O459q750P539
$$ 10346 -7929 -5480 22727 11321 -19921 -4001 17422 -7560 -23939 -2606 3853 -4897 2642
409B642K731m884J4004N303k7036m804K5216r873k8288J2878K0316j2524j486
$$ 2642 5373 489 14493 19796 -7240 -12044 13172 3299 -24989 -12111 8205 -4319 -5805
422e805J6164p129m148J8632j0044k9072J7057K3452k9330j6866L5407J2237k6793
$$ -5805 10359 3230 -918 17714 7670 -21402 -4345 19107 -10223 -27089 8318 20555 -6238
435f238L130J9189j0660q985O799j1802j0139K0675K755k2698J0347K8775r148
$$ -6238 -3108 16081 5421 -3564 3235 -8567 -18706 1969 4724 -17974 -7627 21148 12000
448A2000j6794J2141N396j3004j619k448j1505J1104J4410j8790p653L1518N437
$$ 12000 -4794 7347 12743 -261 -1880 -4328 -15833 -4729 9681 -9109 -16762 14756 20193
461B0193k9967K396K2821j2559j6017J2441R28r940J4570P092k0469M546K5585
$$ 20193 -9774 -7378 15443 2884 -13133 -692 236 -9704 4866 11958 -8511 -3965 21620
474B1620j4698k6651J6382J5982k0066q250J6093J792l276P467m822p232J6467
$$ 21620 6922 -19729 -3347 12635 -7431 -15681 412 2204 -1072 6395 1573 -5659 10808
487A0808L234k5120%K4347p910k0553J2337J1079j2264J374Q235j2946N84K0248
$$ 10808 14042 -11078 -11078 13269 5359 -15194 -2857 8222 -4042 -2668 5567 -7379 -6795 13453
501A3453j0115k2369K1791K0477k6208j3065K6148K347k2686L167J1121q671J863
$$ 13453 3338 -19031 2760 23237 -2971 -16036 10112 12459 -10227 -7060 4061 -4610 -2747
514b747J0320j1840m042K0997j934k4403O473J8303j1592j1673J1903L909k888
$$ -2747 7573 -4267 -8309 12688 10754 -13649 -7176 11127 -465 -12138 -235 3674 786
527G86P773l032j1941J2161R221k5401j0214K5360J596k3595Q923K1516q047m819
$$ 786 8559 5527 -6414 5747 14968 -10433 -20647 4713 6309 -17286 -8363 13153 5106 287
541B87J2058o753j0820J2059j912k4717O325K4970j0933j6314J9928J4287j4986
$$ 287 12345 5592 -5228 6831 4919 -19798 -13473 11497 564 -15750 4178 18465 3479
554C479n290O802o801l261M772j0444n032K1805O124j8372O191K1200j0424j7168
$$ 3479 -1811 4991 -1810 -5071 -299 -10743 -15775 6030 12154 -6218 -27 21173 10749 -6419
568f419O658l01j2326M845M831j1775R140K4045j0240j7863K0371J2153k7344
$$ -6419 239 -62 -12388 -7543 -2712 -14487 -5347 18698 8458 -9405 10966 23119 -4225
581d225j1460J7689j809j4039P918P862m741R781P793j5212l972J6330p704k1615
$$ -4225 -15685 2004 195 -13844 -5926 1936 -2805 6976 14769 -443 -4415 11915 4211 -17404
595a7404O590J4734p923k910J1019J013M53Q322r242j3897J2233O645k3808n472
$$ -17404 -10814 3920 -4003 -6913 4106 5119 5572 13894 4652 -9245 2988 9633 -14175 -19647
609a9647K4549Q32j6628R937J3948r668k003P768j1501p418J5635j898k0168R298
$$ -19647 4902 5734 -10894 -957 12991 3323 1320 9088 -2413 -9831 5804 3906 -16262 -6964
623f964K1846j1867j4167J5277O630j2381j565L263n592L998P087j1171l688J9293
$$ -6964 14882 3015 -11152 4125 10755 -1626 -3191 72 -5520 -1522 5565 -5606 -9294 9999
637I999Q89j9764M795J5561r687r613R640r24o675J0048K75j5959P308J7889j5295
$$ 9999 10888 -8876 -4081 11480 1793 -7820 1820 896 -5779 4269 4544 -11415 -4107 13782 -1513
652a513j5478K0412J1434j9410k902J6652k817r305N586k819q873R385L961j5364
$$ -1513 -16991 3421 14855 -4555 -7457 9195 6378 -2927 2659 -160 -9033 352 4313 -11051
666a1051K204J9808l730j3911Q659Q403r541m012K409o609K020J0573q059p908
$$ -11051 -8847 10961 7231 -6680 1979 10382 841 -3171 -762 -7371 -5351 5222 -2837 -10745
680a0745J8988R000k0216l101J7433o410j7439N871N611q184N763J0616q634L50
$$ -10745 8243 17243 -2973 -6074 11359 4949 -12490 -6619 -1008 -9192 -3429 7187 -1447 -1097
694a097J7941m230k0684N758J2000j4755j1868J1496N680m144N360L820l950P301
$$ -1097 16844 12614 -8070 -2312 9688 -5067 -16935 -5439 241 -3903 1457 5277 1327 8628
708H628M700j6769o145J4294l745j6856P600J4448n357j160R627m359m782R065
$$ 8628 13328 -3441 -9586 4708 963 -15893 -8293 6155 798 -362 9265 4906 124 9189
722I189n913j8152O881J5304j4224j0199K1035R449j4429J371J1195o985n748
$$ 9189 3276 -14876 -7995 7309 -6915 -17114 3921 13370 -1059 312 11507 4522 -1226
735a226L944p772o806J2187L166j3919N047J7434n305j0615O777L710q098m4M53
$$ -1226 2718 -5054 -11860 327 3493 -10426 -5379 12055 6750 -3865 2912 6622 -1476 -1520 -1067
750a067p424N612J0932j0236p555J7808N306j8738r80J4795o300j0686P582J312
$$ -1067 -8491 -2879 8053 -2183 -9738 8070 13376 -5362 -6342 8453 2153 -8533 -951 361
764C61o940P853N392j2036P73J6142n374j6003Q640J1336j0758o903Q104P78l772
$$ 361 -6579 1274 6666 -5370 -4597 11545 6171 -9832 -1192 10144 -614 -7517 587 1365 -2407
779b407L930k850n217R902M616j3168p86J5065k879j2731N254O578p572o55M887
$$ -2407 1523 -1327 -6544 3358 7974 -5194 -5980 9085 6206 -6525 -1271 5307 -2265 -2920 1967
794A967o562m76J3228l967j4011J0529J2999j5025r791J4568K232j3101K470P514
$$ 1967 -4595 -5071 8157 4190 -9821 708 13707 -1318 -11109 3459 5691 -7410 -4940 2574
808B574l749J669O684p019l943J1341j222j5440K504J1296o224p115Q262K845
$$ 2574 -1175 494 7178 159 -3784 7557 6335 -9105 -6601 4695 -1529 -8644 -382 2463
822B463k507N569q51q507O151P483j4038p877J4973K540j4430L440J3031m755
$$ 2463 -44 5525 4674 -3833 2318 9801 -4237 -12114 2859 5399 -9031 -5591 7440 2685
836B685m761P251l007o811P804J268j4038K019J5120n596j1013J0058R043q796
$$ 2685 -2076 5175 2168 -4643 3161 4429 -9609 -7590 7530 1934 -9079 979 10022 1226
850A226l240M754l099j689L592n740m517J1334L511j1517J581J3127m025r756
$$ 1226 -2014 2740 -359 -2048 1544 -4196 -8713 2621 6132 -5385 -3804 9323 5298 -4458
864d458N531K261o782K946K851q838K110J2728o077j1897J1381R370j3473n770
$$ -4458 1073 3334 -3448 -502 2349 -6489 -4379 8349 2272 -9625 1756 11126 -2347 -8117
878h117J1648M13q823L682L003m817M411M703q732k478J1913k236j2205M315Q657
$$ -8117 3531 3944 -4879 -1197 1806 -3011 1400 6103 -2629 -5107 6806 4570 -7635 -3320 5337
893E337n927l526N102j231n99N365l425p670Q223P052j2486m662J3688R64j2003
$$ 5337 -590 -4116 986 -245 -844 4521 1096 -6574 1649 8701 -3785 -8447 5241 6205 -5798
908e798L105P842o029j653O065n034l951R814K35j2056L879J2459o447r491Q073
$$ -5798 -2693 5149 -880 -2533 3532 -1502 -5453 4361 4596 -7460 -3581 8878 2431 -7060 1013
923A013M726p134m48K672l477K266M643p017l385J0940J556j1444J699R900n190
$$ 1013 5739 -1395 -1843 829 -2648 -382 4261 -2756 -6141 4799 6355 -5089 -3390 6510 1320
938A320n768N116J12m492N715J437q680L507J1144q077j0347J0357O256j2025
$$ 1320 -4448 668 780 -3712 2003 3440 -5240 -1733 9411 1334 -9013 1344 7600 -4425
952d425k518R342j009m578M776K7l971O035K418r929p83R842l222r505M730O169
$$ -4425 -6943 2399 1390 -3188 1588 1615 -2356 3679 6097 -3832 -4615 5227 2005 -7500 -2770 3399
968C399m233l49L422k685L46O045n741p827R087N391j2209k319J2582r72q278
$$ 3399 -834 -1183 2239 -446 -100 5945 204 -7623 1464 6855 -5354 -7673 4909 3937 -4341
983d341M642M688o060R66L848p236j925R620j132j0899N093J0828o529o181O763
$$ -4341 301 4989 -1071 -105 3743 -3493 -5418 4202 3070 -7829 -2736 8092 1563 -4618 2145
998B145J946n018J205l9l828L623M273q122k077J0291M14r747K889P163m553k758
$$ 2145 4091 -927 278 239 -3589 34 4307 -3815 -5892 4399 4813 -4934 -2045 5118 565 -2193
1014b193M487k588k977O687o40r670M838R814q240p657J0482M475r440m92O218
$$ -2193 2294 -294 -3271 3416 2776 -6894 -2056 7758 -482 -8139 2343 6818 -2622 -3114 3104
1029C104k680k566L864k907l827P206K118q604J465R493l339o997M051K431m586
$$ 3104 424 -2142 1722 -1185 -5012 2194 4312 -4292 -2827 6666 3327 -3670 381 2812 -1774
1044a774Q64K87m384K975P180n563m771R789M029j0953j455P849l203o974M148
$$ -1774 -910 -623 -5007 -2032 5148 -415 -5186 4603 8632 -2321 -3776 4073 870 -6104 -1956
1059a956K044m179M713M699o820k01R689l423j0552L548O470o551m002N963J340
$$ -1956 88 -4091 622 5321 -1499 -1700 7989 4566 -5986 -2438 4032 -2519 -6521 -558 782
1074G82r48L660o16l770M377K368r547k729Q058j199p418M389N883k659P31L829
$$ 782 -166 3494 2878 -892 3485 5853 -3694 -6423 1635 436 -6982 -2593 3290 631 1362 5191
1090E191m073k250O008l534j0081N123Q299p486m436J0088L433o396P43L626m434
$$ 5191 1118 -1132 4876 1342 -8739 -3616 4683 -2803 -7239 2849 6282 -114 629 4255 -179
1105a79j083K839n297k810Q051J520p240K569Q043l265m799L127l01l306J813
$$ -179 -1262 1577 -3720 -6530 1521 3041 -4199 -1630 6413 3148 -1651 1476 1175 -2131 -318
1120c18o23m556M428O093o129l767R510J897r474N9O347l002m395M648r97l159
$$ -318 -941 -5497 -1069 5024 -1105 -4872 4638 6535 -2939 -2880 3467 465 -3930 718 -279 -3438
1136c438N342K041p523Q34Q330k937q004M829M659m534k435L987j217p71K805
$$ -3438 1904 3945 -3578 -2744 5586 2649 -5355 -526 4133 -401 -2836 1151 -66 -837 1968
1151A968l084l012N864K605p370J41P249j546o130K907J950l924J284K924m924
$$ 1968 -1116 -4128 1736 4341 -3029 -2888 4361 2815 -3315 -408 1542 -2382 -1098 1826 -3098
1166c098O27P664k895o904N768O055q099m460O296M67n306K351K362k153K978
$$ -3098 -2471 5193 2298 -4606 1162 7217 -882 -5342 954 1421 -3885 -1534 828 -1325 1653
1181A653L274n022j989O417j346q173J746N056l098j681L821K57o86L959j691
$$ 1653 4927 -95 -2084 4333 2987 -5186 -3440 1616 -1482 -3163 658 915 229 4188 2497
1196B497n394L417L835p763m053Q504J448o286L022N166k527j083L009l337m402
$$ 2497 -2897 520 4355 -3408 -7461 1043 2491 -3795 -773 4393 1866 783 3792 455 -3947
1211c947N040j21p175J919Q229k512m602N082L043m094j068Q79k867K96L079l548
$$ -3947 1093 972 -6203 -4284 3945 1433 -3169 1913 4956 862 -206 673 -2194 -1898 1181 -2367
1227b367k153O879K043o301J171O099l580m097K063l44k959L342J915n017K239
$$ -2367 -4520 2359 4402 -1899 -728 5371 1791 -2306 -243 -587 -3546 -204 1711 -3306 -1067
1242a067O931l618o063N239L449p042k486N469q99k590L289M14k646L363K358
$$ -1067 5864 2246 -3817 1422 4871 -2171 -4657 812 -87 -2677 612 1026 -1620 1743 4101
1257D101n762j061N665j654n767K947L977l000k78K612j885l2L533l189m643M677
$$ 4101 -1661 -2722 2943 1289 -4478 -1531 2446 -554 -832 1780 -105 -137 3396 207 -4436 241
1273B41L905o732j747P343Ln569K609K674l975M95K761l673j749N962r6o419K496
$$ 241 4146 -2586 -4333 3010 3013 -2556 53 2727 -1248 -753 2008 -1665 -3414 2548 2452 -3967 -1471
1290a471N920l794l937L599J684l204R25M47j682J886L043m672j669N595J64n957
$$ -1471 4449 655 -3282 317 2001 -1203 -278 169 -1513 373 3416 -1256 -2925 2670 2834 -3123
1306c123J186M473k953j556L032r48j653L887J1n963K241N694m280m965N795K488
$$ -3123 -1937 2536 -417 -1973 1059 111 -1542 2345 2356 -3607 -1366 4328 48 -4917 878 3366
1322C366m699o71M119j607j332K431k475j996M145J245n097N19N356j686l963
$$ 3366 -1333 -2004 2115 508 -824 1607 -868 -2864 1281 2526 -2571 -2052 3304 1618 -2345
1337b345K568J304k350N93J010k873J112L885k773l718N284K869o443j038N309
$$ -2345 223 1527 -823 -230 780 -2093 -981 2904 131 -3587 1697 4566 -1877 -2915 2394
1352B394j161m142K491J155k695K237K702m012j037N735j599n841K224M258l438
$$ 2394 1233 -2909 -418 737 -1958 279 2981 -1031 -2068 3667 2068 -3773 -1549 2709 -729
1367g29k075L029P10j104J702k91k870K617J779m698j546M945j7m481K126L238
$$ -729 -2804 225 935 -169 1533 1242 -1628 989 2768 -1930 -3476 1469 1452 -3029 -903 2335
1383B335k404R7K090k294j772M068j071n192K685N201m359l038N293J761l946
$$ 2335 -69 28 2118 -176 -1948 2120 1049 -4143 -1458 3743 -616 -3654 1639 3400 -546
1398e46k6K339k436j53K027k708j926M877Q84m650J180M305j951k653K139j76
$$ -546 -572 1767 -669 -822 1205 -1503 -3429 1448 2332 -2318 -1138 3167 1216 -1437 702 526
1414E26j750J276m5k881J978M364l727k620M913J891n606j87L913j996k531K833
$$ 526 -1224 52 7 -2874 -896 3468 -259 -2879 2034 3925 -1681 -1868 2045 49 -2482 351
1430C51m60j887L364J507m135K0M768j459n407K347K924l178j052K557k07M3J970
$$ 351 -109 -1996 1368 2875 -1260 -1240 3528 2069 -3338 -991 1933 -1245 -2297 260 53 96 2066
1447B066j239k416K962J534m841j323M492l87l281J891K278j967R05J566k812
$$ 2066 827 -1589 1373 2907 -1934 -3257 1235 848 -2433 -542 1736 -231 674 2240 -572
1462e72r86L966j606n031L137M202l613k259M244Q04k822J014N90k259R34J503
$$ -572 -1558 2408 802 -4229 -1092 3110 -503 -2762 1482 2286 -536 478 1068 -1191 -257 1246
1478A246k761j197M476j40l697J786L054k052j910K040q50r62J855l45l143K421
$$ 1246 -1515 -2712 1764 1624 -2073 -287 2767 715 -1195 845 -5 -967 888 543 -2600 -179
1494a79L629l812k336M061J339m542L47L105j891r10K385j059j765L389M95m267
$$ -179 3450 -362 -2698 1363 2702 -1840 -1493 1612 -279 -1189 1196 137 -1628 1761 2256 -2011
1510b011N44M202k057l601K685K453k522j68J485j747K55K128k141j713L301J265
$$ -2011 -1467 2735 678 -2923 -238 2215 -307 -475 1010 -737 -482 1646 -495 -2208 1093 2358
1526B358l405p31L791j224k135J814J51k073J261J436l662J011M091j491m019
$$ 2358 -1047 -1778 2013 789 -1346 468 619 -1454 -193 1243 -2419 -1408 2683 1192 -2827
1541b827L343K647l980j385K648K00k208J611L14j198J716K193l736q49L567j005
$$ -2827 516 3163 -817 -2202 446 646 -1562 49 363 -835 881 3074 -662 -1511 2056 1051
1557A051l761J354K027j519n8J881r05p3K393j203l397J957K279l985j385L925
$$ 1051 -2710 -1356 671 -848 -906 975 70 -3 2390 1187 -2210 -253 2026 -1959 -3344 581
1573E81P66k672J663K108k283J91J166k393k227L297M12l714J373M778j902j877
$$ 581 1347 -1325 338 2446 163 354 1520 -873 -3100 197 609 -3105 -1732 3046 1144 -733
1589g33K371O34k779J93L42k462J081K358j787r87L644J492l291k54K374k561
$$ -733 1638 2272 -507 -314 28 -2434 -1353 1005 -782 -1769 1875 3367 76 -178 2196 -365
1605c65j765J763o63j507K740J454k620R57L865k207l641K083J580l672m77K307
$$ -365 -2130 -367 -1030 -2537 203 1657 -963 -6 3859 1652 -1989 94 1674 -1998 -2475 -168
1621a68j36q71K938l01j972K508N98l835o97K854r86k756J524K405r79M83J160
$$ -168 -304 -1175 1763 1462 -510 1998 2596 -1239 -1936 918 -68 -2824 -1300 1105 126 609 1769
1638A769j700j32K283k037l364K554J888k882o31L906M3k149J279Q26k515O48
$$ 1769 69 -63 2220 183 -3181 -627 1261 -1621 -2252 1654 1697 -452 827 1653 -862 -214
1654b14J499k647r84L678j51l496J782K810j949j076J435k07j403J193r9j871
$$ -214 1285 -1362 -2346 1332 1181 -2315 -533 2277 328 -748 687 480 -923 270 171 -1700
1670a700J894J420k205j385L612m69k753Q55J975j085m82J964j529j346K308m38
$$ -1700 194 1614 -591 -1976 1636 1167 -1586 -731 1244 159 -323 1641 112 -1234 1074 636
1686F36l210J106L442k054k278L056J430k134j64J433j728l73R25q29j639K732
$$ 636 -2574 -1468 1974 -80 -2358 698 2128 -6 -170 1263 -465 -838 87 -742 -2381 351
1702C51J026k463P01K948j146j821Q70j42j729Q69K07j679P37L670j550k008L239
$$ 351 1377 -1086 -385 2563 1417 -404 466 324 -1405 -536 -329 -2008 -1271 2399 849 -1159 2080
1719B080J026l775r68K139j158j793J597M73q76K040J636k010q20L201j579l382
$$ 2080 3106 -669 -1637 502 -656 -2449 -852 -379 -1255 785 2421 411 -409 2792 1213 -2169
1735b169M55J790j645n58K459j12L38J779o99k269J174J233l581j011K623L25
$$ -2169 -1714 76 -1569 -2127 332 220 558 2337 1638 -631 543 1776 -1805 -2816 -193 132
1751A32k078J690J963j072K92J281k082j462K177o94l516J924K769j664j158K757
$$ 132 -1946 -256 1707 635 927 2208 126 -1336 841 147 -3369 -1445 1324 -340 -1498 1259
1767A259N70j794Q41K81k069p6J501j708q31K415J022k377O96K239j194j560J316
$$ 1259 1829 35 876 1157 -912 -988 513 -1195 -2026 389 1411 -966 -270 1969 775 -785 531
1784E31m70j073J189K66k228J386K519j983k040K806R31k488l63J947j024p76
$$ 531 61 -1012 177 443 -1785 -399 2120 137 -1903 903 1834 -654 -1017 930 -94 -870
1800h70J451p14j410K162R68l008J34L039j116k001J343J057j236l54O52p09j2
$$ -870 581 -133 -1543 619 1587 -1421 -1287 1752 636 -1365 -22 1035 -201 -555 97 -612 -624
1817f24J366o67j347K050R02k327j85K427j034j654J058N66j549R93Q07j851N23
$$ -624 742 75 -1272 778 1680 -647 -832 1595 561 -1093 -35 531 -1018 -25 782 -1069 -546
1834e46K447p33k677J371K191k679j196K001j07r29J374k14r10J095J366k118
$$ -546 1901 1168 -1509 -138 2053 -626 -1822 179 72 -857 517 303 -607 488 1854 -264
1850b64p46J805l9k520O64J541q63k11J419n82l52J684o50k416J313J526k062
$$ -264 -1010 795 756 -1764 -1100 441 -422 -633 786 204 -148 1536 886 -1530 -217 1309 -753
1867g53j246K418M60j567P22J074j194J20J390j518j380K012L94k510L07K571
$$ -753 -1999 419 879 -688 34 1108 -86 34 1424 -94 -1474 538 932 -1578 -1271 1300
1883A300o40j505J123R44j382J49M48j097qJ303j110r44K166N45k036K12K061
$$ 1300 660 -845 278 1222 -160 -11 437 -660 -668 635 -475 -1419 747 1292 -744 -532 1529
1900A529j367r00R84j64j198J284M20j513j45K790r66k005J041J530j565p18J411
$$ 1529 162 -738 246 82 -1116 168 588 -925 -1070 1720 754 -1251 -210 1320 -245 -963 448
1917D48p06k09J304l99j464J274R75k009n23K222l64j600P88Q90q80P7R61q33
$$ 448 -258 -467 837 438 -1026 248 1223 -786 -1309 913 549 -1051 -263 627 -253 -176 785 -48
1935d8n40J675o93j983J541J495k290m11K005M73j779P48O01j296O7J383j692
$$ -48 -588 1087 394 -1589 -48 1447 -843 -1254 751 1224 -555 193 794 -502 -435 948 -744
1952g44p85K179L2k121J096J891q26j464J088q5r36P21J42j283Q55J540j308q24
$$ -744 -1529 650 682 -1439 -343 1548 722 -742 346 261 -675 46 188 -1095 -240 1300 -8 -832
1970h32K068L56k324M26J025j116k45O36l28o19J775K96j952N35K002r78k147
$$ -832 1236 1592 -732 -306 719 -397 -642 -6 -334 -953 822 1118 -834 -299 1703 725 -1422
1987a422J277N49j427O1J284n51r8J593m93j607J450N44j742p02J482j23j154
$$ -1422 -145 404 -1023 -962 322 -229 -327 1266 773 -834 616 1160 -582 -1284 198 75 -1079
2004a079R45Q13r16O87Q19j692L53Q55o11j864J310J291j510j93J966o95r17J107
$$ -1079 -134 679 -237 450 1269 -423 -70 785 174 -1690 -380 911 -599 -792 1174 479 -438 669
2022F69J41j399M90R32j422p21J749J6j600R43J245p47o20P77q8p40P40k2j177
$$ 669 810 -589 -99 833 -589 -1310 439 455 -1145 -202 1043 296 -324 453 365 -375 365 343 -834
2041h34O33J226j296j064J976J74j314M38Q07q22R0J114j473m07J331J68j988
$$ -834 -201 1025 -271 -1335 641 815 -499 -61 746 -76 14 1128 -345 -752 579 747 -1241
2058a241O25J905j055j006J202O54j230OO39j112l5J081j025o08J450R58j438
$$ -1241 -616 1289 234 -772 430 1084 -146 -140 499 -613 -648 433 -592 -1200 250 1208 -230
2075b30L20J559r79p72J47l08p00O65J99r60Q15J716q90r29J180N71j826l78M95
$$ -230 90 1649 670 -102 45 -263 -963 -298 -99 -1059 -244 1472 582 -347 833 1404 -422 -800 -305
2094c05m52n17J200k6p18J672Q38j235o13J151p74j726M18Q70o76L02Q61J27j
$$ -305 -757 -1274 -74 -100 -818 854 1692 457 -156 995 221 -1505 -1087 -217 -893 -591 270 397 396
2113C96J240q13j201M06O28j975l16J409Mm84J006P22p06J78O11j229q64J417
$$ 396 1636 823 -378 28 656 -1319 -1635 -226 -222 -706 300 1022 316 494 1105 -124 -988 429
2131D29l76k011J193J638j186P1R35L60j171N00l8j338K38J111r30q14J757M57
$$ 429 53 -1958 -765 873 -313 -242 693 1053 -118 382 344 -994 -756 355 -575 -1389 368 825
2149H25j016L87R42j002o80O92m45q65J205K14j050O52J375r69j386J370M96j090
$$ 825 -191 196 1138 136 -544 148 -297 -1162 43 257 -793 -141 1234 265 -1121 249 745 -345
2167c45j19P90m88m78J203m19q79J062O74j548q7J472n72j059R69P85p11n48M82
$$ -345 -464 326 -162 -640 563 144 -735 327 1001 -547 -634 838 266 -793 176 961 250 -298 184
2186A84n86k19J105m27r23J023O45q95j1J013o18p08N04j82r19P58P54o36l32
$$ 184 -402 -621 484 57 -866 157 802 -93 -104 909 291 -417 87 -95 -1014 -256 498 -138 -470
2205d70J592j88j438O86L68j112m19O65%k51P85J90p09J337J93j273o87R94l25
$$ -470 1122 934 -504 182 550 -562 -981 -316 -316 -567 218 408 -301 1036 1229 -44 -731 263 -62
2224f2q74M99Q77k18j97J057n37m62P78k77j598k9J568j241o13J625N88q41M88
$$ -62 -936 -437 440 222 25 1082 545 83 861 584 -1014 -1043 525 -716 -1329 296 884 43 531
2243E31Q41j543j18J187j640o47J128M72q61J97J606l94n29K91j36o73J00j53
$$ 531 1372 -171 -289 898 -742 -1389 -261 211 -650 -453 1153 759 230 521 385 -288 -188 -341
2261c41m93K09J025m05l52R03L66n58m97M75k56p10O95k54j065J599P36j510M21
$$ -341 -834 -625 400 -5 -357 546 912 354 -143 332 76 -634 61 -193 -1258 341 1077 -433 -12
2280a2J014n92j379O48M49n67k71P32P0n5O68j30o13L22M45j359l44J307q7q14
$$ -12 1002 410 -969 -321 128 -439 -710 22 92 37 705 575 -38 284 729 -630 -974 333 246 -568
2300e68N43L15j15j31L35l91p22J271m09q69J027M64q76m10R41K16j310L98K92
$$ -568 -25 290 175 44 379 -12 -734 537 128 -741 286 750 -126 -536 405 621 -689 -291 1
2319An24L16Q21r82k08J176j78j155J30J173o41m26L08L23l32M51j95k97M44L88
$$ 1 -523 -207 614 -368 -576 600 422 -733 -603 570 -71 -497 -189 134 -198 253 58 -239 205 593
2339E93n79o03P43J30p03J42O14n38J93P71p94k39M80K66j452K42J258o64o41
$$ 593 14 -589 154 284 -419 -277 337 -201 -8 763 -31 -270 210 476 -976 -734 524 -140 -781
2358g81R03M83q39M31L86n39p07J196n77q02Q62M97o96P8R33k94p70L53l93n70
$$ -781 122 605 -234 197 583 44 -663 533 -44 -846 16 513 -183 -105 828 534 -236 117 -276 -846
2378h46N69M66o11J37J366o94n51J49Q30j192n36R92j30o31N81J43n18P45P23
$$ -846 -277 189 -422 -285 1081 387 -164 -15 815 -377 -913 79 -51 -682 -101 42 -476 269 992
2397I92r40l56O93j23r29j43J160k50p08J025k55o23J211k53j007O18M10q79o49
$$ 992 52 -304 389 266 -663 -806 354 104 -604 421 166 -457 754 501 -506 112 522 -357 -1006
2416a006J077J86l35J52N33m73j94N05l74p13J064k7j464P64Q97m48k19L38K5
$$ -1006 71 257 -78 74 607 134 -60 445 71 -642 422 395 -1069 -305 592 144 -75 263 288
2435B88l35J63M6p31L28R82j001r7N32M9n35K82O53n49p1L22j79p56N03K59r54
$$ 288 -47 116 162 -569 -241 741 -260 -357 175 224 -311 -29 624 75 4 326 147 -609 -106 153 -801
2456h01K56J141n49p63Q40L98p56o2O89p20K0Q18o65m69P97M31p85k98J103k24
$$ -801 -545 596 47 -716 124 522 -234 -296 393 -327 -307 511 -154 -623 174 605 -180 -478 625 401
2476D01o40k69N79l35K50J84o65K2Q55k38p10N83O42n59n08N08j87n31Q23K5o34
$$ 401 -239 -508 71 -264 -14 170 -495 -473 382 144 -566 17 659 100 -408 100 -87 -618 205 230 -404
2497d04K60Q68o04o74J429o34r62K35J070q09j32N06j03k93J84M84o95K74N68
$$ -404 -144 724 120 -554 875 241 -721 -486 584 -225 -357 149 46 -247 -63 421 -274 0 568
2516E68m08o48O23R9o74K46L61l04J2L94p7n80R60k15q13K81P52p97k79O09L71
$$ 568 160 -488 135 234 -440 -194 167 -137 -125 269 192 -388 572 357 -456 -175 577 -220 -499 110 481
2537D81n76j91Q24o73J89N34k36j022P00M71n34l90R09m57l58R14p0p73J35K93
$$ 481 -95 -286 538 -135 54 588 352 -670 30 501 -33 -423 486 29 -329 585 515 -258 -123 170
2557A70o59k3Q86r3r92O99O28o53k40M65k03m31O48o2q91Q19M81p29m11J279j44
$$ 170 -489 -512 374 281 -711 -12 616 -37 -277 188 -15 -446 202 140 -751 68 549 -180 -591 688 544
$$ [...]
8191a0
##END NTUPLES=NMR FID
##END=
