##TITLE=1H_Ser 2188-ox-4(DMSO)''
 CDCl3
 8 sc, 
 4.7.2024
##JCAMPDX= 6.0         $$ Bruker NMR JCAMP-DX V2.0
##DATA TYPE= NMR FID
##DATA CLASS= NTUPLES
##ORIGIN= UXNMR, Bruker Analytische Messtechnik GmbH
##OWNER= root
$$ XWIN-NMR		Version 3.5
$$ Thu Jul  4 15:55:45 2024 Russian Standard Time (UT+4h)  she@DPX200
##.OBSERVE FREQUENCY= 200.1314
##.OBSERVE NUCLEUS= ^1H
##.DELAY= (6, 6)
##.ACQUISITION MODE= SIMULTANEOUS
##.ACQUISITION SCHEME= undefined
##.AVERAGES= 8
##.DIGITISER RES= 18
##SPECTROMETER/DATA SYSTEM= spect
##.PULSE SEQUENCE= zg30
##.SOLVENT NAME= DMSO
##.SHIFT REFERENCE= (INTERNAL, DMSO, 0, 15.7039)
##AUDIT TRAIL= $$ (NUMBER, WHEN, WHO, WHERE, WHAT)
$$ ##TITLE= Audit trail, XWIN-NMR		Version 3.5
$$ ##JCAMPDX= 5.01
$$ ##ORIGIN= Bruker BioSpin GmbH
$$ ##OWNER= she
$$ F:/spectra/data/she/nmr/H-F/1/audita.txt
$$ ##AUDIT TRAIL=  $$ (NUMBER, WHEN, WHO, WHERE, WHAT)
(   1,<2024-07-04 15:54:24.20 +0400>,<she>,<DPX200>,
      <created by zg, POWCHK disabled, PULCHK disabled
       configuration hash MD5:
       00 E9 B6 7A A2 85 ED C7 34 08 36 98 17 FE 4E 26
       data hash MD5: 16K
       54 54 0D E2 27 AE AE 4F 05 58 B2 58 1A 75 F7 D7>)
$$ ##END=
$$ 
$$ hash MD5
$$ A9 B1 FA 58 66 36 AB 01 54 6D 40 03 72 F6 E6 77
##$RELAX= 
##$RELAX= 
##$RELAX= 
##$RELAX= 
##$RELAX= 
##$RELAX= 
$$ Bruker specific parameters
$$ --------------------------
##$DU= <F:/spectra>
##$EXPNO= 1
##$NAME= <H-F>
##$PROCNO= 1
##$TYPE= <nmr>
##$USER= <she>
##$AMP= (0..31)
100 100 100 100 100 100 100 100 100 100 100 100 100 100 100 100 100 100 
100 100 100 100 100 100 100 100 100 100 100 100 100 100 
##$AQSEQ= 0
##$AQ_mod= 1
##$AUNM= <au_zg>
##$AUTOPOS= <>
##$BF1= 200.13
##$BF2= 200.13
##$BF3= 200.13
##$BF4= 200.13
##$BF5= 200.13
##$BF6= 200.13
##$BF7= 200.13
##$BF8= 200.13
##$BYTORDA= 1
##$CFDGTYP= 0
##$CFRGTYP= 5
##$CHEMSTR= <none>
##$CNST= (0..31)
1 1 145 1 1 1 1 1 1 1 1 1 1 1 1 1 1 1 1 1 1 1 1 1 1 1 1 1 1 1 1 1 
##$CPDPRG= <>
##$CPDPRG1= <>
##$CPDPRG2= <>
##$CPDPRG3= <>
##$CPDPRG4= <mlev>
##$CPDPRG5= <mlev>
##$CPDPRG6= <mlev>
##$CPDPRG7= <mlev>
##$CPDPRG8= <mlev>
##$CPDPRGB= <>
##$CPDPRGT= <>
##$D= (0..31)
0 1.2 0 0 0 0 0 0 0 0.06 0 0.03 0 0 0 0 0.0002 0 0 0 0 0 0 0 0 0 0 0 0 
0 0 0 
##$DATE= 1720094063
##$DBL= (0..7)
120 120 120 120 120 120 120 120 
##$DBP= (0..7)
150 150 150 150 150 150 150 150 
##$DBP07= 0
##$DBPNAM0= <>
##$DBPNAM1= <>
##$DBPNAM2= <>
##$DBPNAM3= <>
##$DBPNAM4= <>
##$DBPNAM5= <>
##$DBPNAM6= <>
##$DBPNAM7= <>
##$DBPOAL= (0..7)
0.5 0.5 0.5 0.5 0.5 0.5 0.5 0.5 
##$DBPOFFS= (0..7)
0 0 0 0 0 0 0 0 
##$DE= 6
##$DECBNUC= <off>
##$DECIM= 24
##$DECNUC= <off>
##$DECSTAT= 4
##$DIGMOD= 1
##$DIGTYP= 9
##$DL= (0..7)
0 120 120 120 120 120 120 120 
##$DP= (0..7)
150 150 150 150 150 150 150 150 
##$DP07= 0
##$DPNAME0= <>
##$DPNAME1= <>
##$DPNAME2= <>
##$DPNAME3= <>
##$DPNAME4= <>
##$DPNAME5= <>
##$DPNAME6= <>
##$DPNAME7= <>
##$DPOAL= (0..7)
0.5 0.5 0.5 0.5 0.5 0.5 0.5 0.5 
##$DPOFFS= (0..7)
0 0 0 0 0 0 0 0 
##$DQDMODE= 0
##$DR= 18
##$DS= 0
##$DSLIST= <SSSSSSSSSSSSSSS>
$$ [...]
##$SUBNAM2= <"">
##$SUBNAM3= <"">
##$SUBNAM4= <"">
##$SUBNAM5= <"">
##$SUBNAM6= <"">
##$SUBNAM7= <"">
##$SUBNAM8= <"">
##$SUBNAM9= <"">
##$SW= 24.0689651099613
##$SWIBOX= (0..15)
0 0 2 0 0 0 0 0 0 0 0 0 0 0 0 0 
##$SW_h= 4816.95568400771
##$TD= 16384
##$TD0= 1
##$TE= 0
##$TE2= 300
##$TE3= 300
##$TEG= 300
##$TL= (0..7)
0 120 120 120 120 120 120 120 
##$TP= (0..7)
150 150 150 150 150 150 150 150 
##$TP07= 0
##$TPNAME0= <>
##$TPNAME1= <>
##$TPNAME2= <>
##$TPNAME3= <>
##$TPNAME4= <>
##$TPNAME5= <>
##$TPNAME6= <>
##$TPNAME7= <>
##$TPOAL= (0..7)
0.5 0.5 0.5 0.5 0.5 0.5 0.5 0.5 
##$TPOFFS= (0..7)
0 0 0 0 0 0 0 0 
##$TUNHIN= 0
##$TUNHOUT= 0
##$TUNXOUT= 0
##$USERA1= <user>
##$USERA2= <user>
##$USERA3= <user>
##$USERA4= <user>
##$USERA5= <user>
##$V9= 5
##$VALIST= <valist>
##$VCLIST= <CCCCCCCCCCCCCCC>
##$VD= 0
##$VDLIST= <DDDDDDDDDDDDDDD>
##$VPLIST= <PPPPPPPPPPPPPPP>
##$VTLIST= <TTTTTTTTTTTTTTT>
##$WBST= 1024
##$WBSW= 4
##$XGAIN= (0..3)
0 0 0 0 
##$XL= 0
##$YL= 0
##$YMAX_a= 79006
##$YMIN_a= -113351
##$ZGOPTNS= <>
##$ZL1= 120
##$ZL2= 120
##$ZL3= 120
##$ZL4= 120
##$ABSF1= 10
##$ABSF2= 0
##$ABSG= 5
##$ABSL= 3
##$ALPHA= 0
##$AQORDER= 0
##$ASSFAC= 0
##$ASSFACI= 0
##$ASSFACX= 0
##$ASSWID= 0
##$AUNMP= <proc_1d>
##$AZFE= 0.1
##$AZFW= 0.1
##$BCFW= 1
##$BC_mod= 2
##$BYTORDP= 1
##$COROFFS= 0
##$CY= 11.3945322036743
##$DATMOD= 1
##$DC= 2
##$DFILT= <>
##$DTYPP= 0
##$F1P= 15.6554695791079
##$F2P= 12.8336369535428
##$FCOR= 0.5
##$FTSIZE= 0
##$FT_mod= 4
##$GAMMA= 1
##$GB= 0.15
##$INTBC= 1
##$INTSCL= 1
##$ISEN= 128
##$LB= 0.24
##$LEV0= 0
##$LPBIN= 0
##$MAXI= 10000
##$MC2= 0
##$MEAN= 0
##$ME_mod= 0
##$MI= 1.114404
##$NCOEF= 0
##$NC_proc= 0
##$NLEV= 6
##$NOISF1= 3.799351
##$NOISF2= 2.8
##$NSP= 1
##$NTH_PI= 0
##$NZP= 0
##$OFFSET= 15.70392
##$PC= 1
##$PHC0= -25505.22
##$PHC1= 12.18748
##$PH_mod= 1
##$PKNL= yes
##$PPARMOD= 0
##$PSCAL= 0
##$PSIGN= 0
##$REVERSE= no
##$SF= 200.130013532006
##$SI= 16384
##$SIGF1= 3
##$SIGF2= 2
##$SINO= 400
##$SIOLD= 16384
##$SREGLST= <1H.CDCl3>
##$SSB= 0
##$STSI= 0
##$STSR= 0
##$SW_p= 3612.71676300578
##$SYMM= 0
##$S_DEV= 0
##$TDeff= 0
##$TDoff= 0
##$TI= <>
##$TILT= no
##$TM1= 0
##$TM2= 0
##$TOPLEV= 0
##$USERP1= <user>
##$USERP2= <user>
##$USERP3= <user>
##$USERP4= <user>
##$USERP5= <user>
##$WDW= 1
##$XDIM= 8192
##$YMAX_p= 0
##$YMIN_p= 0
$$ End of Bruker specific parameters
$$ ---------------------------------
##NTUPLES= NMR FID
##VAR_NAME=  TIME,          FID/REAL,        FID/IMAG
##SYMBOL=    X,             R,               I
##VAR_TYPE=  INDEPENDENT,   DEPENDENT,       DEPENDENT
##VAR_FORM=  AFFN,          ASDF,            ASDF
##VAR_DIM=   8192,          8192,            8192
##UNITS=     SECONDS,       ARBITRARY UNITS, ARBITRARY UNITS
##FACTOR=    0.0002076,     1,               1
##FIRST=     0,             0,               0
##LAST=      1.7004516,     0,               0
##MIN=       0,             -113351,         0
##MAX=       1.7004516,     79006,           0
$$ Real data points
##PAGE= N=1
##DATA TABLE= (X++(R..R)), XYDATA
$$ [...]
2116b840K223O58k520J089K687l07n80J888r05k190J496l20l454R14L668k306
$$ -2840 -617 41 -2479 -1390 1297 990 410 2298 1393 -797 699 379 -3075 -2161 1507 -799
2132g99j903M208J637k907k18J986k084j277J533j115j994K841J878l019K83L851
$$ -799 -2702 1506 3143 236 18 2004 -80 -1357 176 -939 -2933 -92 1786 -1233 -950 2901
2148B901j270l088J490Q98k126J55J388j757Q28K369j165k391K632J650l852n21
$$ 2901 1631 -1457 33 931 -1195 -1040 348 -1409 -581 1788 623 -1768 864 2514 -1338 -1859
2164a859K979q03j913K086K18j853J272J733k540j081L670o64l660J906K671k237
$$ -1859 1120 317 -1596 490 708 -1145 127 1860 -680 -1761 1909 1245 -2415 -509 2162 -75
2180g5r53K331o91j483J160j62j961J825J530k240o30L385j63k715P12J077j712
$$ -75 -1028 1303 612 -871 289 127 -1834 -9 1521 -719 -1349 2036 1873 -842 -130 947 -765
2197g65m18J375j252j77K900O2k444R75K791l343k534K889O21l418J659K114j087
$$ -765 -1183 192 -1060 -1237 1663 1725 -719 256 3047 -296 -2830 59 680 -2738 -1079 1035 -52
2214e2M39K208j812j888K532k66l383j88K865q53j600K925N26r39J069L65k950
$$ -52 387 2595 783 -1105 1427 1161 -2222 -2410 455 -398 -1998 927 1453 514 1583 1948 -1002
2231a002K37J683k209k282L449J429k657J445K669j250j421R73r08k681J522J284
$$ -1002 -765 918 -1291 -3573 -124 1305 -1352 93 2762 1512 91 1064 156 -2525 -1003 281
2247B81k677K86M208l78k501K081J179k668p91Q13j301m50J592n9p78K573J481
$$ 281 -2396 -2110 2098 1720 -781 1300 2479 -189 -980 -167 -1468 -1918 -326 -385 -1163 1410 2891
2264B891k487l45J847j257k666J155L99j718J643J829j426r4K976r15l205J354
$$ 2891 404 59 1906 649 -2017 -862 -463 -2181 -538 1291 -135 -229 2747 1832 -1373 -19
2280a9J827l324r59K508j01j138J828R12j382J20J668k419j552K746j58k825J389
$$ -19 1808 -1516 -2475 33 -68 -1206 622 1534 152 272 1940 -479 -2031 715 557 -2268 -879
2297h79J896j308j50J493o38j291J827n27k243J221K645k948j236L489k3k239
$$ -879 1017 -291 -441 1052 414 -877 950 423 -1820 -599 2046 -902 -2138 1351 1328 -911
2313i11N31J883j661q86K146j131j434K084O59k408o7L066j643j527J313J024
$$ -911 -380 1503 -158 -1044 1102 -29 -1463 621 1280 -1128 -1195 1871 228 -1299 14 1038
2329A038j669N60Q68q00K39J080j874q64J837L70k414N93K404j009p70J754l82
$$ 1038 -631 -71 797 -3 236 1316 -558 -1422 415 785 -1629 -1036 1368 359 -411 1343 961
2346I61j635J124M23k595n3K919j051j931K282J931k091o57K147j073j723J208
$$ 961 -674 450 873 -1722 -1775 1144 93 -1838 444 2375 284 -373 1774 701 -1022 186
2362A86p98j351J310J804j747L18K549q42j974P95Q82j966n46J170j331M43K535
$$ 186 -612 -1963 -653 1151 -596 -278 2271 1429 -545 250 1132 -834 -1380 -210 -1541 -1098 1437
2379A437p6k041J797J495k694j529K120m30k516J380J422j054P46J663j147r12
$$ 1437 1361 -680 1117 2612 -82 -1611 509 79 -2437 -1057 365 -689 57 1720 573 -339
2395c39J860l91k855P19J580j381r46K000O16p45R91j2j478J084O83k224j376
$$ -339 1521 1130 -1725 -1006 574 -807 -1753 247 863 118 1109 1097 -381 703 1386 -838 -2214
2412b214K619J0k257J626J555j038l66J215m68j444J362M1k338Q33K161j351j778
$$ -2214 405 415 -1842 -216 1339 301 -65 1150 682 -762 600 641 -1697 -864 1297 -54 -1832
2429a832K269J129j611j02J250r64p08J381j173r72J565P24j908M22J891r22j394
$$ -1832 437 1566 -45 -147 1103 139 -569 812 -361 -1333 232 956 -952 -530 1361 439 -955
2446i55J499M66j644O52Q59j915M10J949j164j819K287R57k469mK266r24r87P67
$$ -955 544 1010 -634 18 877 -1038 -628 1321 157 -1662 625 1582 -887 -891 1375 451 -536 231
2464B31J09j006K94J026j324l35K087l16j720J364P26j048q27J225p44l33Q12
$$ 231 340 -666 -372 654 -670 -1005 1082 766 -954 410 1136 88 -739 486 -258 -591 221
2481B21k00j090J646P51k008m17K704p97k001R91J250j787J64J274j173k55J961
$$ 221 21 -1069 577 1328 -680 -1097 1607 810 -1191 -200 1050 -737 -573 701 -472 -727 1234
2498A234n10j673O58K102k040j053J305M98j595P98J038r35J51Q45r63o83J735
$$ 1234 724 -949 -291 1811 -229 -1282 23 521 -1074 -276 762 -173 -22 823 -140 -823 912
2515I12k19k112Q05J659j546p51J641k68o06J051K67j589L94J498j374j460J898
$$ 912 693 -1419 -614 1045 -501 -1252 389 121 -485 566 833 -756 -362 1136 -238 -1698 200
2532B00P40j668K51J398p15q73J001j60p79J019L11j553M0J794j006j006J506
$$ 200 940 -728 -477 921 206 -667 334 174 -605 414 725 -828 -788 1006 0 -1006 500
2549E00M53j045J65K77o29j64J215j003j071K215L3j932L64J838o13j597J423
$$ 500 953 -92 73 350 -279 -443 772 -231 -1302 913 946 -986 -622 1216 603 -994 429
2566D29M5j516J228N84r54m53J774p18j550J283J116j724o39J587j06r61J174
$$ 429 474 -1042 186 770 -184 -637 1137 419 -1131 152 1268 -456 -1095 492 386 -575 599
2583E99Pj275P09P76j666k48J876n37j351R42J268j370k6J216o22j102J510m12
$$ 599 606 -669 40 816 -850 -1098 778 241 -1110 -168 1100 -270 -296 920 298 -804 706 294
2601B94j995J152J493j097r54J737M11j466L16J312r70n77L42l11j045J237O40
$$ 294 -1701 -549 944 -153 -1107 630 1041 -425 -109 1203 233 -344 -2 -313 -1358 -121 519
2618E19j445R15J491j079o21P62k61j365R61j66q66Q01J314j085j16J407J67k011
$$ 519 -926 -11 1480 401 -220 542 281 -1084 -123 -289 -1155 -354 960 -125 -241 1166 1333 -678
2636f78K83J293j578o80J403j01n42P78Q01j357M16J634j070j632P46P49j354
$$ -678 -395 898 -680 -1360 43 -58 -600 178 979 -378 38 1672 602 -1030 -284 465 -889
2653h89KJ409q79N40P37l21q78J089Kj896R0J435n57j366J344J029j218M98Q38
$$ -889 -887 522 -357 183 920 599 -279 810 812 -1084 -994 441 -116 -1482 -138 891 -327 171 1009
2672A009p64n72J303o82j725J311J122j493m95J735j88j033P18N44j264N18J44
$$ 1009 245 -327 976 294 -1431 -120 1002 -491 -986 749 561 -472 246 790 -474 44 188
2689A88n71m89J500o12j079J160L29o62j58J139n53n68R22l80q66N87J014j634
$$ 188 -383 -872 628 16 -1063 97 426 -236 -394 745 192 -376 546 166 -700 -113 901 -733
2707g33o78J905r2j250Q12J218q50k71O72p12r61J099j26j230O17J239o22j37
$$ -733 -1411 494 402 -848 -36 1182 332 61 733 21 -940 159 33 -1197 -580 659 37 -100
2725a00R56K05j151K19K07j141L15M93r76j65J654M57j190M84J316r79j291P98
$$ -100 856 1061 -90 129 336 -805 -490 3 -973 -1138 516 973 -217 267 1583 604 -687 111
2743A11k36j211N90Q25q21N80J274m94q94Q70N49j670m55Q92n15r5N84N30l48
$$ 111 -125 -1336 -746 79 -742 -162 1112 618 -276 594 1143 -527 -982 -90 -605 -700 -116 414 66
2762F6P85L06q21j27R47j333j055Q72J68o42L75J018l44L05P53p10j512J127K62
$$ 66 851 1157 336 209 1156 -177 -1232 -360 -192 -834 -459 559 215 520 1273 563 -949 178 440
2781D40j391m96J694k55o97R25P35r78Q6L32o45k77Q97m37j024R54Q58p65M6N77
$$ 440 -951 -1447 247 -8 -705 220 955 -23 63 395 -250 -527 370 -67 -1091 -137 721 -44 2 579
2801E79j42o63M10L02r27M61O67j068L5R04m30r16N50R50r99k64Q10J76r43N44
$$ 579 437 -226 184 486 -441 20 687 -381 -346 558 128 -788 -238 712 -287 -551 259 435 -508 36
2821C6k1l39k6J021o80q17J173L55j199QJ139l27l89L83n34m66Q83j67q15Q29
$$ 36 15 -324 -350 671 -9 -826 347 702 -497 -489 650 323 -66 317 -217 -683 200 33 -782 47
2841D7O09o53l32P62J08j092M78J76n76k24Q02m05l06J327K66j380O9R99m29j389
$$ 47 656 3 -329 433 541 -551 -73 103 -473 -697 105 -300 -606 721 987 -393 -324 675 246 -1143
2861a143O65K2r8N14N02p94M40R24m81o89L60O0j175O9R37n62J56R35K31q41P80
$$ -1143 -478 -456 -554 -40 462 -332 108 1032 551 -138 222 282 -893 -824 113 -449 -293 642 873 32 812
2882H12J76j304m83J090n73r00R29O60j93n05J129m52m32M81m91r50O59O65p47
$$ 812 988 -316 -799 291 -282 -1182 -253 407 214 -291 838 386 -46 435 -56 -1006 -347 318 -429
2901d29k91R45K49n29K37K74q16N8M06o20j24Q34%j095R83O99p11n27P78k52n52
$$ -429 -720 225 474 -55 182 456 -360 -302 104 -516 -640 194 194 -901 82 781 70 -457 321 69 -483
2922d83L0M51n04P17M60q76l82J084L09j387l0J024q41l62Q50n5k51O92J15j010
$$ -483 -453 -2 -506 211 671 -205 -587 497 806 -581 -611 413 -428 -790 60 5 -246 446 561 -449
2942d49M59O29q42m32J045%p95N59L54o19mP32q04k41O90L1q61J02J080n03q76
$$ -449 10 639 -203 -635 410 410 -385 174 528 -91 -95 637 -167 -408 282 313 -548 -446 634 131 -745
2963g45R76L36o55j15M84m73o7M46q5m13K71N06q25j64Q67l35m33N67J0m30K71
$$ -745 231 567 -88 -203 281 -192 -259 187 102 -311 -40 466 -359 -523 344 9 -424 143 153 -277 -6
2984fM84p94J97O62o41m71N18L76n77k16J133o58l68R08l58p10O79L48q34j64
$$ -6 478 -316 -119 543 -98 -569 -51 325 -252 -468 665 7 -361 547 189 -521 158 506 -328 -492
3004d92Q73k3r40P83L25n70r8O21q08J36M67l51j67M48M36q62J79N54m0r91N89
$$ -492 381 358 -582 201 526 -44 -142 479 -329 -193 274 -77 -244 204 640 -222 -43 511 471 -520 69
3025F9M0p39M78N64o18m75J037j6p40M29M92o70m88R69r8n80K34M61p11L26M31
$$ 69 109 -630 -152 412 -206 -681 356 340 -400 29 521 -149 -637 332 234 -346 -112 349 -362 -36 395
3046C95m19j15L76J38q11K46O63m43k35O57j02p08O26J53j055O34N43p92l62M72
$$ 395 -24 -139 237 375 -436 -190 473 30 -205 452 350 -358 268 421 -634 0 543 -249 -611 -139
3066a39N77q33M15J50J2n26Q41k53o57J6N58p53J58R21n80m20R57l24l80N74L4
$$ -139 438 -395 20 170 182 -344 497 244 -413 -397 161 -592 -434 487 -93 -513 444 120 -260 314 348
3087C48p54j2O67m47n92Q02O73r33l41J606p12q04O86j88n46M92O23j168J98R02
$$ 348 -406 -418 249 -198 -790 12 685 -248 -589 1017 305 -499 187 -1 -547 -55 568 -600 -402 500
3107E00K2r07L93K60n51k58N02ll75N69q0l08K22O47q15k21R55l16r08M72k4J71
$$ 500 522 -385 8 268 -283 -541 -39 -42 -417 152 72 -236 -14 633 -182 -403 552 236 -672 -200 -224 -53
3129e3K4N25l29l74P77j77q54L04O73r88k46R88K09r73M44M15k68n80O29j11l64
$$ -53 -29 496 167 -207 570 393 -461 -157 516 -472 -718 270 479 -494 -50 365 97 -483 146 35 -329
3150c29M50R9j027O83M61n21r9M34J38k86p1N01o41m7P55n85N1J17M44r14K39
$$ -329 121 220 -807 -124 337 -184 -283 151 289 3 -68 433 -208 -255 500 -85 -34 83 527 -387 -148
3171a48K87m91k8P64k64n63K69N22o44j22Q33j80p96K07N14l97J90M43l86k21
$$ -148 139 -352 -380 384 120 -443 -174 348 -296 -418 415 235 -561 -354 160 -237 -47 396 10 -211
3191b11N43j43j51n8M85p69k28Q31m77j95Q30n03m58N73L22p47k26J124p00j97
$$ -211 332 189 38 -20 465 -304 -532 299 -178 -373 457 -46 -504 69 391 -356 -582 542 -158 -355
3211c55M76O37j257K80P79k27n81M78n5l7R4O3l71k6P17m63m06r1O81p74Q9M31
$$ -355 121 758 -499 -219 560 333 -248 230 175 138 232 295 -76 -102 615 152 -254 -345 336 -438 -349 82
3233H2n9j24L49j53j95J55O29j099l33R87l4p59J70P09l38j28Q18n98l99L83J61
$$ 82 23 -101 248 95 -100 55 684 -415 -748 239 205 -554 -384 325 -13 -141 677 79 -320 63 224
3254B24j026O98M27j93k31M64J93o11kK11l46L6L16l69m72N17N79n81J38P37o04
$$ 224 -802 -104 323 130 -101 363 556 -55 -57 154 -192 -156 160 -209 -681 -164 415 -166 -28 709 105
3275A05k79M05k61m24L93J74p32O19N97j07o77P81k66n55n5J88o0l01N24L3l35
$$ 105 -174 231 -30 -454 -61 113 -619 0 597 490 -187 594 328 -227 -282 -94 -154 -455 69 102 -233
3296b33M88L80q30K52K90m19j84q5J65q0L23L40m81j06N90n26k15L42K61o81n8
$$ -233 255 635 -195 57 347 -72 -256 -341 -176 -256 67 407 -74 -180 410 -116 -331 11 272 -409 -467
3317d67R17m53m50N66N03p49j10O80p20n3N76j82o53K92M67k05j29N62k67j88
$$ -467 450 -3 -453 113 616 -133 -243 437 -283 -336 240 58 -595 -303 164 -41 -170 392 125 -63
3337f3M67j82m29L48K96p77p6R88l37o37L18N64o74L4N02l14l84L69J52o14N14
$$ -63 404 222 -207 141 437 -340 -416 572 235 -402 -84 480 -194 -160 342 28 -356 13 165 -449 65
3358F5N41m19l72L45r0l8R6K16o93J64K25m25J2N01j83m45M61K34q0q6J99j49
$$ 65 606 187 -185 160 70 32 128 344 -349 -185 40 -385 -373 128 -55 -500 -39 195 115 29 228 79
3380G9o36N55K63m94N5M67l15n30Q69K12r40K55P41n61m82L12K33n16M92K13j95
$$ 79 -557 -2 261 -233 -178 289 -26 -556 313 525 -415 -160 581 20 -462 -150 83 -433 59 272 77
3401G7L3M80l65k55K1K62n16k49Q45n71P3N82m57j9K14R5j2k05J75m90k06L68
$$ 77 110 590 225 -30 -9 253 -263 -512 333 -238 -165 417 -40 -59 155 250 238 33 208 -282 -488 -120
3423a20M66p18L16O87l47k02%j62m70K64N15n62l69R44j4n37M71K72l14Q0j13
$$ -120 346 -372 -56 631 284 82 82 -80 -550 -286 229 -333 -702 242 228 -309 162 434 120 200 87
3444H7l29Q6L90j21m78K71L82kl39O11l54l52K47j4k74J47M67m75l79O50jn13
$$ 87 -242 -156 234 113 -365 -94 288 286 -53 558 204 -148 99 85 -189 -42 425 -50 -429 221 220 -293
3466b93M12N8m34j44J17J80P1J59J36m63J94J18j69N5k07K65k78P9M49m05l32
$$ -293 119 177 -257 -401 -284 -104 -33 126 262 -201 -7 111 -58 -3 -210 55 -223 -144 305 -100 -432
3487d32N10j41m06P49R9o87L28L70k76k97K11K55l87M8K91o31K30L82j00m49M56
$$ -432 78 -63 -469 280 379 -308 20 390 114 -183 28 283 -104 -56 235 -396 -166 216 116 -333 123
3508A23K62m12J0L38l59l67J41J45k62K78L59m04J16O16m12m68K99l2j15j27M22
$$ 123 385 -27 -17 321 -38 -405 -264 -119 -381 -103 256 -148 -32 584 172 -296 3 -29 -144 -271 151
3529A51m35J74J22K25l78R4M30m27l45P05k88j83J04L91m89L23J45l42l14L09
$$ 151 -284 -110 12 237 -141 -47 383 -44 -389 316 28 -155 -51 340 -149 174 319 -23 -337 -28
3549b8l5L6J96k43j9n24N73j94R7L60k93J67n4K53k50k82M46k00MM9K01k32j97
$$ -28 -63 -27 169 -74 -93 -617 -44 -238 -141 219 -74 93 39 292 42 -240 206 6 10 59 260 28 -169
3572a69L18j08l1J7J59k13k86Q37n59l19M72L91p51L4J82k8j5J18n3n8L21P5m81
$$ -169 149 41 10 27 186 -27 -313 524 -35 -354 118 509 -242 -208 -26 -54 -69 49 -4 -62 259 334 -147
3595a47m0M34l75n42J060l57k09N24j7p29L40O0J42n85M94l2j67j23M21K00o21
$$ -147 -187 247 -128 -670 390 33 -176 348 331 -398 -58 2 144 -441 53 21 -146 -269 152 352 -269
3616b69K54P5j57L09j56l18K17j20N9k19L84M14o98L91K08m08l76N50j19l13N1
$$ -269 -15 60 -97 212 56 -262 -45 -165 -106 -325 59 473 -225 166 374 -34 -410 140 21 -292 -241
3637b41J55j62J60O3N61l99J32k4j58l38j13Q0l92P13O6PK6M98l81K6J14j26j076
$$ -241 -86 -248 -88 -25 536 137 269 245 87 -251 -364 -284 -676 37 103 110 136 634 253 279 393 267 -809
3660h09R70J2l65M6L88j7j58K21J7n78L85j62j81j55O15k26k60K23L38n4k50j0
$$ -809 161 173 -192 -146 242 225 67 288 305 -273 112 -50 -231 -386 229 3 -257 -34 304 250 0 -10
3682a0oK06o53L08j06L16M5k28RJ77j00k07L35J7p4l76M41n7m18M21o1j70L06
$$ -10 -16 190 -463 -155 -261 55 100 -128 -119 58 -42 -249 86 103 29 -347 94 37 -381 40 -21 -191 115
3705A15J98m72j81N31k32l19J89M87l14j48K02n1l10M72l6j06K8K92m07j38J28
$$ 115 313 -159 -340 191 -41 -360 -171 316 2 -146 56 5 -305 167 131 25 53 345 -62 -200 -72
3726g2j8k74M25k2m07K26L78k40k70N56J89n38MJ97n48O1O16l11J30J85J55l28
$$ -72 -90 -364 61 39 -368 -142 236 -4 -274 282 471 -67 -63 134 -414 -353 263 -48 82 267 422 94
3748I4J02J00n13j23N54m63j76L87K07m04K86L87n8n84nJ60l13PM26l50K05N05
$$ 94 196 296 -217 -340 214 -249 -425 -38 169 -235 51 438 380 -204 -209 -49 -362 -355 71 -279 -74 431
3770D31l64m57O64qn78M56mm60j72M79L3J63k26K88oK4j92K71p34L2N66l25q1
$$ 431 67 -390 274 266 -312 144 140 -320 -492 -13 20 183 -43 245 239 263 71 342 -392 -360 206 -119 -200
3793b00N51l71O6L52j59Jr8q6k9r8K16K9j98K45Km10O0J93N3l39r7O4j30J79P23
$$ -200 351 -20 46 398 239 240 142 56 27 -71 145 174 -24 221 223 -187 -127 66 119 -220 -317 -253 -383 -204 519
3818E19l74j53K62J1k76M6j46M5q4J51n4q3L6L33k26l75N94m30k04M11l9j75K28
$$ 519 145 -8 254 265 -11 35 -111 -66 -150 1 -53 -136 -100 233 7 -368 226 -204 -408 3 -36 -211 17
3841A7NP5j82QJ9j32L57j67l87P4N12n9m59M07M69n06j8r1O0k39L29k6j08r9M17
$$ 17 22 97 -85 -77 -58 -190 167 0 -387 -313 199 140 -319 88 557 51 33 -58 2 -237 92 66 -42 -141 276
3866B76l87R2j84P6k52M27j45l13N81J34Nm64L70j74j65J78K76l38j45K15k42
$$ 276 -111 -19 -203 -127 -379 48 -97 -410 171 305 310 -154 216 42 -123 55 331 -7 -152 63 -179
3887a79m2L40M5l00J85R3j3kq6J81m16K10O8j2k54M46m61j15M79J11n89K59J86
$$ -179 -221 119 164 -136 49 142 129 127 41 222 -194 16 84 72 -182 264 -197 -312 167 278 -311 -52 134
3910A34p9J37j90k76N66l54Rj39j49L97m2j60KM88l04m8J15m31L37N1j00M9K5
$$ 134 55 192 2 -274 292 -62 -53 -192 -341 56 14 -146 -144 344 40 -8 107 -324 13 64 -36 13 38
3933C8J99o51L58L18l70m0L03j68k83R4M05q3j21rR3j87L63n3k04k79N08l57n5
$$ 38 237 -414 -56 262 -108 -148 155 -13 -296 -202 203 120 -1 -10 83 -104 259 206 2 -277 231 -126 -181
3956a81J81J60j34Q3N9j78j06L30j97JK1P9l89J09M62j90j18K52N2o34K23J74
$$ -181 0 160 26 109 168 -10 -116 214 17 18 39 118 -271 -162 300 110 -8 244 296 -338 -115 59
3978E9l41R5N75o07J85J11p3j0m4Q5k31p7M57r3k42K36P0m77L90J93k58O8L8N7
$$ 59 -282 -187 388 -219 -34 77 4 -6 -50 35 -196 -273 184 91 -151 85 155 -322 68 261 3 71 109 166
4002A66k7r0k40l2J70j31M58k11q0K19j12j60K19j17m8j17K23k10J8J25J4K71
$$ 166 139 49 -191 -223 -53 -184 274 63 -17 202 90 -70 149 32 -16 -133 90 -120 -102 23 37 308
4024C08Ok81%j02J5l3j03K94L8l78M08p2p3J63N4k95r5N47j26l75P4J65k21M1
$$ 308 314 33 33 -69 -54 -87 -190 104 142 -236 172 100 27 190 244 -51 -146 401 275 -100 -26 139 -82 -41
4048d1K56j79k85K61J90l16M04k29k65r8L51K7k47Q9J49L35m54N8L48l65p8M68
$$ -41 215 36 -249 12 202 -114 290 61 -204 -302 49 76 -171 -82 67 402 -52 6 354 -11 -89 379
4070C79n30J1J75j78l6K52n7j93K65k19K47j84J1J45n33K81N4k23M45j26l55L26
$$ 379 -151 -140 35 -143 -179 73 16 -177 88 -131 116 -68 -57 88 -445 -164 -110 -333 112 -14 -369 -43
4092d3J64Q6n21K71K35j26k6J06l3k17L81l24R3L02l14l10J10K48L2j23J90kk70
$$ -43 121 207 -314 -43 192 66 40 146 113 -104 277 -47 46 348 34 -276 -166 82 114 -9 181 179 -91
4115i1J70j10L61o27L71P2j67qJ27o1j34L25k12j20k20M06O9k50J6j51J16m4J46
$$ -91 79 -31 330 -297 74 146 -21 -29 98 37 -97 228 16 -104 -324 82 151 -99 -83 -234 -118 -162 -16
4138a6q0J28M56l64k54P8L71l27Q8J3k45K6N6N5OJ8K4j5J27n3j98L48j94n3k18
$$ -16 -96 32 488 124 -130 -52 319 -8 80 93 -152 -126 -70 -15 -9 9 33 18 145 92 -106 242 48 -5 -223
4163b23L28M6l03K97j74l06K9K66K65m26r0K80j15o4J53R8J9k25J47N1k63K14
$$ -223 105 151 -152 145 -29 -335 -306 -40 225 -201 -291 -11 -126 -190 -37 61 80 -145 2 53 -210 4
4185DK64n65J89N32q3n53J37K40j80J34j43j37J1L56j12k49L40K68p06L46rl42
$$ 4 268 -297 -108 424 341 -212 -75 165 -15 119 -24 -161 -150 206 94 -155 185 453 -253 93 84 -258
4207b58Q9K55L7k71K35L16m14n5J34l3J59l74J2Q5j23J96j34L63K0J3l90M48k31
$$ -258 -169 86 123 -148 87 403 -11 -66 68 35 194 -180 -168 -83 -206 -10 -144 219 239 252 -138 310 79
4230G9N4n3L12m41O8N5m4j29q2J46j69L56l8p4j67L48k26j39p8K45Nj07J10M97
$$ 79 133 80 392 -49 19 74 30 -99 -181 -35 -204 152 114 40 -127 221 -5 -144 -222 23 28 -79 31 528
4254E28n50J10j13K36r7On8j39P0j2o8K08j22J11J74k90J3m2J7o6k8o9L35k85
$$ 528 -22 88 -25 211 114 120 62 -77 -7 -19 -87 121 -1 110 284 -6 7 -35 -18 -84 -112 -181 154 -131
4278a31L39K6j14J8j38K65k80L1j06K68j92R8M1K4o8K31j77kK12n13N0J04J50
$$ -131 208 234 120 138 0 265 -15 16 -90 178 -14 84 125 149 81 312 135 133 345 -168 -118 -14 136
4301A36k18MJ33J36k53L93j75l32k0lJ56J25k31K23o05L96N64k45O0l28J30m60
$$ 136 -82 -78 55 191 -62 331 156 -176 -196 -199 -43 82 -149 74 -531 -135 429 184 244 -84 46 -414
4323d14L97N0J0K29l76l3L5J42k9P8j57K07ql53J01K3K89Rk21J89m4n4l7k75J27
$$ -414 -17 33 43 272 -104 -137 -102 40 11 89 -68 139 131 -222 -121 -98 191 200 -21 168 124 70 33 -242 -115
4348a15K40m90K38K35k08J62R8J17j66l90O18l77kL62k92l4L82q00J77K4N6N2
$$ -115 125 -365 -127 108 -100 62 160 277 111 -279 339 -38 -40 322 30 -4 378 -422 -245 -221 -165 -113
4370a13q8L78j51k9K10m24K61l57J62Q0j5K54l01R4R1J70j23l8J60r3j32k2k8
$$ -113 -201 177 26 -3 207 -217 44 -313 -151 -71 -86 168 -133 -39 52 222 99 61 221 128 -4 -26 -54
4393e4j8k40L58K34JQn8J71m07k04q6J52p4J75o4P1L01o2j86J29k16L2J5k07J28
$$ -54 -72 -312 46 280 281 289 231 402 -5 -209 -295 -143 -217 -42 -106 -35 266 204 18 147 -69 -37 -22 -229 -101
4418a01j21K51J38j03J60n0l09K10o1k31j00L28l26K33j99K67J17J61r5k13K12
$$ -101 -222 29 167 64 224 174 -135 75 14 -217 -317 11 -315 -82 -281 -14 103 264 169 -44 168
4439A68o6j13j11j06L12j16N8j54L48k88Q7J47j26m3K0L3l37K74J2j01Q9J62l0
$$ 168 102 -11 -122 -228 84 -32 26 -128 220 -68 19 166 40 -3 17 50 -287 -13 -1 -102 -13 149 119
4462A19Qj30J65j18q7P6n3k7J68j43l15M66k3o4K2j61J00j53K37j63P1P1K3j24
$$ 119 127 -3 162 44 -43 33 -20 -47 121 -22 -337 129 106 42 64 -97 3 -150 87 -76 -5 66 89 -35
4486c5M7J16K47m83L49J3n63R6L99k92K2J88k74J30k0Q2p5j81L51Ml37K62k25
$$ -35 12 128 375 -108 241 254 -309 -213 186 -106 -84 104 -170 -40 -60 22 -53 -234 117 121 -216 46 -179
4509a79p7M1N26n33L2L77J62m82M29j47k92K99k07J17q9N0k15K69o4N17k06o99
$$ -179 -256 -215 311 -222 -190 187 349 -133 296 149 -143 156 -51 66 -23 27 -188 81 17 534 328 -371
4531c71J42K72q4J50k14j84P9M92n5m35K60j30K68p9p6n4k43L07j87K72j16J72
$$ -371 -229 43 -41 109 -105 -289 -210 282 227 -208 52 -78 190 111 35 -19 -262 45 -142 130 14 186
4553A86k77K30N3L1l36K6O7k09J23l16M69q3p8K53J37l48K26j33j03K23k85o5
$$ 186 -91 139 192 223 -113 -87 -20 -229 -106 -422 47 -36 -114 139 276 -72 154 21 -82 141 -144 -209
4575b09N24j43k41J49L3J38k88K38k5l06L05Ok40J09m8J72k28J87j5l88J40K54
$$ -209 315 172 -69 80 113 251 -37 201 176 -130 175 181 -59 50 2 174 -54 133 118 -270 -130 124
4597A24m17J64J66J90k06n7j0J41l94L55R4k65J48l29J60j46M48k52R4o7J38l02
$$ 124 -293 -129 37 227 21 -36 -46 95 -299 56 150 -115 33 -296 -136 -282 166 -86 8 -59 79 -223
4619b23J20J31k09J63K11k07J14k39mk39M58Q0J52k86k6N3k96N61l62j73J44J22
$$ -223 -103 28 -181 -18 193 -14 100 -139 -143 -382 76 156 308 22 -4 49 -247 314 -48 -221 -77 45
4641D5R2l77K47J71k91n1J78Q9l31M60j68J18j82J93l81M99l86J85m9o2Q0q4K17
$$ 45 137 -240 7 178 -113 -164 14 103 -228 232 64 182 0 193 -188 311 -75 110 61 -1 79 -5 212
4664B12k06k38p8L47j08l22M68Lj31R8m5j7R1J08O4l96K16j02J94j41J6Nk60P4
$$ 212 6 -232 -310 37 -71 -393 75 78 -53 45 0 -17 74 182 246 -150 66 -36 158 17 33 38 -222 -148
4688a48J09J92k64J38q3K11k07k19K49j07J03M6j18K75l19Q5J32j34l98M69j67
$$ -148 -39 153 -111 27 -56 155 -52 -271 -22 -129 -26 20 -98 177 -142 -57 75 -59 -457 12 -155
4709a55O03p46M19J6k81j8Q6K1m3M33j79j6k71J21j55N8Q1J30l97Q8M82k78N9
$$ -155 448 -298 121 137 -144 -162 -76 -55 -98 335 156 140 -131 -10 -165 -107 -26 104 -293 -205 277 -1 58
4732E8R2l34J42N8j76J99k07K95n7k04K56r3j31K32l8M7m08K72k98L32k36K53
$$ 58 150 -184 -42 16 -160 39 -168 127 70 -134 122 29 -102 130 92 139 -269 3 -295 37 -199 54
4754E4N9o8O9R6k09l1o3l0Q9J62k11P1J17j6K89l12j79Q3j71K16k87L42mn5k49
$$ 54 113 45 114 210 1 -30 -93 -123 -34 128 -83 -12 105 89 378 66 -113 -30 -201 15 -272 70 66 11 -238
4779b38K10L95l37j48J18o7l13K98j3J1m7J1J19J32j6J5k89L45l01l16L18O41
$$ -238 -28 367 30 -118 0 -67 -380 -82 -95 -84 -131 -120 -1 131 115 130 -159 186 -115 -431 -113 528
4801E28q08M22o4j05m2J94j68J05pM0k19Q1k8J9k23L74m05M41j30j39M58j53k16
$$ 528 -280 142 78 -27 -69 125 -43 62 55 95 -124 -43 -71 -52 -275 99 -306 135 5 -134 324 171 -45
4824d5L12k20K49j6k50K20l56q2O1j48j04L02m8j60LP7J65K00o5j01K0k81J45
$$ -45 267 47 296 280 30 250 -106 -188 -127 -275 -379 -77 -125 -285 -282 -205 -40 160 95 -6 14 -267 -122
4847a22K61k39k79L71K77m56M79n62K22Jk0k0j99M6M12j50l1J39k1k39J24r1n3
$$ -122 139 -100 -379 -8 269 -187 292 -270 -48 -47 -67 -87 -286 -240 172 22 -9 130 109 -130 -6 -97 -150
4870a50N46n64Q2q9m9K91j19q0J20J55j08l1J7P5k38J77j15jJ68j23J54l69M26
$$ -150 396 -168 -86 -175 -224 67 -52 -132 -12 143 35 4 21 96 -142 35 -80 -81 87 -36 118 -251 175
4893A75q4n8j5k63L18j56j36K49j04L06k31j65Q7J06J54n6P4k95j5K17J30l03
$$ 175 91 33 18 -245 73 -83 -219 30 -74 232 1 -164 -77 29 183 127 201 -94 -109 108 238 -65
4915f5p9K5J66m2j84J43%L46p2j57P2K8j50L0K27l18N2K7l2j52j94M41k6j10P
$$ -65 -144 -119 47 5 -179 -36 -36 310 238 81 153 181 31 61 288 -30 22 49 17 -135 -329 112 86 -24 -17
4940a7L44k91q9j85K65j12Q1L04k77j24J01k28K60j0Qq0J09J5k07O0L12n55Q3
$$ -17 327 36 -53 -238 27 -85 -4 300 23 -101 0 -228 32 22 30 -50 59 74 -133 -73 239 -316 -233
4963b33J82L16l12J27k5j36Q6J32O5k00J66j93j12J82J02K17k88k33M81m88L3
$$ -233 -51 265 -47 80 55 -81 5 137 202 2 168 -25 -137 45 147 364 76 -157 324 -164 -131
4984a31K94P2l58K64l35J88P1j1m2k32N28j73n23K85L87j35j52L96j62k30K38
$$ -131 163 235 -123 141 -194 -6 65 54 12 -220 308 135 -388 -103 284 149 -3 393 231 1 239
5005B39k98L3K01L8j98J60k70N4J48Nj25j04L9K74l68J67J48N4j42r8L7P4j21
$$ 239 -59 -26 175 213 15 175 -95 -41 107 112 -13 -117 -78 196 -172 -5 143 197 55 -43 -6 68 -53
5028e3j2L72l59L50p4k16q1J8k69K85j30K51l36M90n00K99m4J19l40j2J94j32
$$ -53 -65 307 -52 298 224 8 -73 -55 -324 -39 -169 82 -254 236 -264 35 -9 110 -230 -242 -48 -180
5050a80J24J85K77o48j20L77R0J70k16K05n03N80m38n4L85j57l1O9j54J79k14
$$ -180 -56 129 406 -242 -362 15 105 275 59 264 -239 341 -97 -151 234 77 46 115 -39 140 -74
5071g4p8K53m3K7k02J79Q0k54j64M34J26k37j58m5K64m4m6J50k1j16m24M99l03
$$ -74 -152 101 58 85 -117 62 142 -112 -276 158 284 47 -111 -156 108 64 18 168 147 31 -393 106 -197
5094a97J88L1J66j2L1o9q4j1j43O2K1k70N37j52J21j74j35lK20R4l14k6r6J58
$$ -197 -9 22 188 176 207 138 54 43 -100 -38 -17 -287 250 98 219 45 -90 -93 127 221 -93 -119 -215 -57
5118e7J21J75j45N0k47K21K29k39j56O6r2K09l1m11K79k26R2J34J08j06k46M79
$$ -57 64 239 94 144 -103 118 347 108 -48 18 -74 135 104 -307 -28 -254 -162 -28 80 -26 -272 207
5140B07l51mK75j8Qok7m1j97J11K07j31j20O2J46k70K41k15k6pJ91N2N8k28J48
$$ 207 -144 -148 127 109 117 111 84 43 -154 -43 164 33 -87 -25 121 -149 92 -123 -149 -156 35 87 145 -83 65
5165F5N6onk54K89l93Q8M81m70J14K7j27K62K51l16K9lj12J40j46j53R6K97l04
$$ 65 121 115 110 -144 145 -248 -160 321 -149 -35 -8 -135 127 378 62 91 88 -24 116 -30 -183 -87 210 -94
5189i4Q8j56j72R06p47j02K16M5J8l2L06l28K56k59P0K05j45k12O8J06j09J14
$$ -94 -6 -162 -334 572 -175 -277 -61 -16 2 -30 276 -52 204 -55 15 220 75 -137 -69 37 -72 42
5211D2m3J61l64K43k10n7Q7M0MK54J21j85j8k56L30l26M52P9m31pJ55mr3K10j81
$$ 42 -1 160 -204 39 -171 -228 -141 -101 -97 157 278 93 75 -181 149 -177 275 354 -77 -84 71 67 -26 184 3
5236CJ38j80k2j06J58k44K17P1lj38J20J25L1l94L64k26j7j15L62k08K9k8k40
$$ 3 141 -39 -61 -167 -9 -253 -36 35 32 -106 14 139 170 -224 140 -86 -103 -218 144 -64 -35 -63 -303
5259c03M00nKLK99p0n46K64J8j76O5j44J00k08L62l63M22j64j34K65J5k80K9l36
$$ -303 97 92 94 97 396 326 -220 44 62 -114 -49 -193 -93 -301 61 -302 120 -44 -178 87 102 -178 -149 -485
5283d85M08N9J4L4K10j20k17J7R0n1j2K58q4k07n0P2J50j26K8R2J35j98J02k83
$$ -485 -77 -18 -4 30 240 120 -97 -80 10 -41 -53 205 121 -86 -136 -64 86 -40 -12 80 215 17 119 -164
5307a64K52J1nk9k04J00L14k29kJ21l30L71o79M72k73L74l29N7K18k7K06j21j98
$$ -164 88 99 94 65 -139 -39 275 46 44 165 -165 206 -473 -1 -274 100 -229 -172 46 19 225 104 -94
5330i4M1K00n23K39K86j30p7p4K6J02O3j73K91j13q7k28K77J62k03r4m2Q8o4N02
$$ -94 -53 147 -376 -137 149 19 -58 -132 -106 -4 59 -114 177 64 -23 -251 26 188 -15 -109 -151 -63 -127 375
5354C75k65j01P2p1R6j33O8J6J86m23K83N8k28o2K00o9k84K82J42l38K48j36K5
$$ 375 110 9 81 10 106 -27 41 57 243 -180 103 161 -67 -129 71 2 -282 0 142 -196 52 -84 -59
5377e9k9R4j57K2k7K04k62K84J48l26R4L36k15l49L74m9n7k84M63J07k25p4k3
$$ -59 -88 6 -151 -129 -156 48 -214 70 218 -108 -14 322 107 -242 132 83 26 -258 205 312 87 13 -10
5400a0j10nl6M70q6l4k51O7p3j01J95J54m0j77k78L47LM5j64J20K8q6R0K9k38
$$ -10 -120 -125 -161 309 223 189 -62 5 -68 -169 26 180 140 -37 -315 32 35 80 -84 36 64 -22 68 97 -141
5425a41k7L22k46J29J56j1j53K7K4k10L4P7P2j59J62L86m26J37j51M4P1l22Q5
$$ -141 -168 154 -92 37 193 182 29 56 80 -130 -96 -19 53 -106 56 442 16 153 2 46 117 -205 -120
5448a20L7K66l96K8K84j38r6K76J17k85Q1k03Q6j79K88q1Q7k47K97j84j13K27
$$ -120 -83 183 -213 -185 99 -39 -135 141 258 -27 54 -149 -63 -242 46 -35 52 -195 102 -82 -195 32
5470C2p8K33k58J06J13k97L55j28j18R0j63j74L52r8M7m1j8RJ16J15j22J35l63
$$ 32 -46 187 -71 35 148 -149 206 78 -40 50 -113 -287 65 -33 14 -27 -45 -36 80 195 73 208 -155
5493a55J25J18Ql2k8J63o8j25j65J98j40R5L0k09J50j12L07j47M7J12K23k46l6
$$ -155 -30 88 96 64 36 199 131 6 -159 39 -101 -6 24 -185 -35 -147 160 13 60 172 395 149 113
5516A13o6M0N0J8k83N2Q3J14Nm8L22m62N0J92l87J30j71N40k41n1k74L27J1p1
$$ 113 47 87 137 155 -128 -76 7 121 126 78 400 -62 -12 180 -207 -77 -248 292 51 0 -274 53 64 -7
5540gJ1J09r0j43K24M5p3k02o2K23p7P6n0l33K56j35P7K34j15K41m0l97M69k49
$$ -7 4 113 23 -120 104 149 76 -126 -188 35 -42 34 -16 -349 -93 -228 -151 83 -32 209 169 -228 241 -8
5564hj41L83j75J32L2k0k62M7j48L68M9l43n4K08M23l49K27j76j55K2l25j94N00
$$ -8 -149 234 59 191 223 203 -59 -12 -160 208 257 -86 -140 68 491 142 369 193 38 60 -265 -459 41
5587D1ON2k53K0K59q1j9N2k34N33k70j20j5j38K26k7K6Nk01K17O2m00L23j47J80
$$ 41 47 99 -154 -134 125 44 25 77 -157 376 106 -14 -29 -167 59 32 58 63 -138 79 141 -259 64 -83 97
5612I7j75R9J92k93L00j62k03K75j85pJ90k54N72k75l32N0p0K91J24n04J93K04
$$ 97 -78 21 213 -80 220 58 -145 130 -55 -62 128 -126 446 171 -161 -111 -181 110 234 -270 -77 127
5634A27j19j7M8M03n56J71k71K38K5j5L4J09l99J01M1n8J60J4l3j58R4k9J49p2
$$ 127 8 -9 39 442 -114 57 -214 24 49 34 68 177 -222 -121 -80 -138 22 36 3 -155 -61 -90 59 -13
5658a3r1L0J59k37Q5N39m03J42l78k2pJ72J13R2l29L48l71N50o97J89KK49q6k24
$$ -13 -104 -74 85 -152 -67 472 69 211 -167 -189 -196 -24 89 181 -148 200 -171 379 -318 -129 -127 122 36 -188
5682a88L23k84L45n9l4n09K94q5P8j14M80j07P7R9l84K5PR8q0N85o26l42L48L8
$$ -188 135 -149 196 137 103 -406 -112 -197 -119 -233 247 140 217 316 -68 -43 -36 62 -18 567 -59 -401 -53 -15
5706a5N7J16l00K17P7Mj90k5P1k13K71J81n09J57L8K7K96j99j38L31l77K04k2
$$ -15 42 158 -142 75 152 156 -34 -59 12 -201 70 251 -258 -101 -63 -36 260 61 -77 254 -123 81 59
5729E9J54l08J73K52k21k12J95j99P2k42N54o0k09J13k22j0J19m5Q9J29k89J60
$$ 59 213 -95 78 330 109 -103 92 -107 -35 -277 277 217 8 121 -101 -111 8 -37 52 181 -108 52
5751E2Q9k89jJ43J26L65m20j29M79n50p1K98j41K29k35K8J8l88K51K9j75O25l26
$$ 52 141 -148 -149 -6 120 485 65 -64 415 -135 -206 92 -49 180 -55 -27 -9 -397 -146 -117 -292 333 7
5774Gk00K15%j08L3J69J20J50k86Kj54O5q9rJ53Q0k43L65k0j19k02m5p3K48m6
$$ 7 -193 22 22 -86 -53 116 236 386 100 102 -52 13 -76 -85 68 148 -95 270 250 131 -71 -116 -189 59 13
5799A3J38p1P6j48Q6n5K31j82J07m24L0J37J83j07L1O0k05N0n7l6P1L12l68m5
$$ 13 151 80 156 8 94 39 270 88 195 -229 -199 -62 121 14 45 105 -100 -50 -107 -143 -72 240 -128 -173
5823a73J91N5K2j93M85m86L06l42N2k16J50N40n02J14n6J83k04J36k29N31l42
$$ -173 18 73 95 -98 387 -99 207 -135 -83 -299 -149 391 -111 3 -53 130 -74 62 -167 364 22
5844B2K60l78p5K27R7j00J02p6P8l03K8K05k59LJ75l1LR1%o6k5p7J28Mk9l11K25
$$ 22 282 -96 -171 56 153 53 155 79 157 -146 -118 87 -172 -169 6 -25 -22 69 69 3 -22 -99 29 33 4 -307 -82
5871h2P6Q0K0k22K79M3l1l00K46j77j28N2Q5n6K46k28J74K8j44J8l29M34k48K57
$$ -82 -6 74 94 -128 151 194 163 -137 109 -68 -196 -144 -59 -115 131 -97 77 105 -39 -21 -350 84 -164 93
5895I3J09J8k57L5L95n23J11l3j9j69j46L01P9L3J76k67j25K42Q5j23Lk8q1K02
$$ 93 202 220 -37 -2 393 -130 -19 -52 -71 -240 -386 -85 -6 27 203 -64 -189 53 138 15 18 -10 -91 111
5919A11j33J08k91L79J0l3j58k1J46L1k75L29o2l17K09j60P4j25K87j2k33J79
$$ 111 -22 86 -205 174 184 151 -7 -28 118 149 -126 203 141 -176 33 -127 -53 -178 109 97 -136 43
5941D3l17L10OJ19l4j64k24L00j39j1M08k39j39J61j36j73J76j15L3M76m20J18
$$ 43 -274 36 42 161 127 -37 -261 39 -100 -111 297 58 -81 80 -56 -229 -53 -168 -135 341 -79 39
5963C9K53m59K89k94N01l7l80K08j23o4J40m5k70M46j70j34K0K80j9k68K84j99
$$ 39 292 -167 122 -172 329 292 -88 120 -3 -67 73 28 -242 204 34 -100 -80 200 181 -87 197 -2
5985bK79m27L04k43Q2l1J6J93k09K77j30m24L29J77m13lK46j95L19j52P6L1j49
$$ -2 277 -150 154 -89 -7 -38 -22 171 -38 239 109 -315 14 191 -222 -225 21 -174 145 -7 69 100 -49
6008d9L9J19R7m84K17k63ML34J0J55J4j25K83j72J08k6l67L27k34K82l19l37N22
$$ -49 -10 109 206 -278 -61 -324 -320 14 24 179 193 68 351 179 287 261 -106 221 -13 269 -50 -387 135
6031A35n28L69J12K5l00J37J24o3K40l79L37r5l95M30j45M7O5n5J66k51K05j20
$$ 135 -393 -24 88 113 -187 -50 74 11 251 -128 209 114 -281 149 4 51 116 61 227 -24 181 61
6053F1o2M6O6j25j21J65rr3J17K54k28j94P7k59L75j44K68j05M3o8J00j25k09
$$ 61 -1 45 111 -14 -135 30 21 -72 45 299 71 -123 -46 -305 70 -74 194 89 132 64 164 39 -170
6076a70J83J65J68m18J32j59J85p6K0P5l06K02j32K5K24k17K31L6j14p1o2J04
$$ -170 13 178 346 -72 60 -99 86 10 30 105 -201 1 -131 -106 118 -99 132 168 54 -17 -79 25
6098B5k2no3j9J91n6J32r0k02J44k8j16K41l10L58l73J46l33K67J26K4L58k50
$$ 25 3 -2 -65 -84 107 51 183 93 -109 35 7 -109 132 -178 180 -193 -47 -380 -113 13 37 395 145
6121A45M6J9k68J03J55j87O8J08l91Q9P5n0Q9J77l09l5M66m39M67l51J43l24N4
$$ 145 191 210 -58 45 200 13 81 189 -202 -113 -38 -88 1 178 -131 -166 300 -139 328 -23 120 -204 -150
6144a50L42k68K06o3J39n32L93j86M8j03L55N5l11L5j70K56m9o0j54M46m3j38
$$ -150 192 -76 130 67 206 -326 67 -119 -71 -174 181 236 -75 -40 -210 46 -3 -63 -217 229 186 48
6166D8l52M25j40J2j17K26j26J53l91J27j35J28L7j47L0J28K20l16J74K24l97
$$ 48 -304 121 -19 -7 -124 102 -24 129 -262 -135 -270 -142 -105 -252 -222 -94 126 -190 -16 208 -189
6187a89J1K20j76K12J92J25k98J79l01j3l93N00j10R3l5n7K2j00L99l66J07p7
$$ -189 -178 42 -134 78 270 395 97 276 -25 -38 -431 69 -41 52 17 -40 -18 -118 281 -85 22 -55
6209e5o5J74L06n72P9r1Q7K2J29N1k06n4PN12k22j93j16M00k1l76J12K27l23J42
$$ -55 -120 54 360 -212 -133 -224 -137 -115 14 65 -141 -195 -188 324 102 -91 -207 193 172 -204 -92 135 -188 -46
6233d6K35l08K93k94mJ60o1R4L1l33N66l56k95N01R6l78J58j58k76M80j17J71
$$ -46 189 -119 174 -120 -124 36 -25 69 100 -233 333 -23 -318 183 279 -99 59 -99 -375 105 -12 159
6255A59j8q7M6k87J12K16J9l90J41K06l7N3Q7j78l3l1K04kj00p3k4R5j06K24R3
$$ 159 141 54 100 -187 -75 141 160 -230 -89 117 80 133 220 42 9 -22 182 180 80 7 -17 78 -28 196 289
6280B89m80M43l09K84r4J82l66PL12k63j49k50N25l03L64k00j00J14j65m0N45
$$ 289 -191 252 -57 227 133 315 -51 -44 268 5 -144 -394 131 -172 192 -8 -108 6 -159 -199 346
6301C46l29J66j12j86K16Mo8J42J42k29M21k73l56P7J25Q8j11J5P9m09K73j44
$$ 346 17 183 71 -115 101 105 37 179 321 92 513 240 -116 -39 86 174 63 78 157 -252 21 -123
6323a23K57p6n2N5j19R7k99J6L6M07l91J96J75j02k68L18r4J79j85K07j33P0k93
$$ -123 134 58 6 61 -58 39 -260 -244 -208 199 -192 4 179 77 -191 127 33 212 27 234 101 171 -122
6346a22M9o5N63o70M17k44R4o9j47M22l29j38L51l8n3J21q1J42j58q2n1Q4k40
$$ -122 -73 -138 425 -245 172 -72 22 -47 -194 228 -101 -239 112 74 21 142 61 203 45 -37 -88 -4 -244
6369b44J51j92K45J23J21k16K24l55L67l26K93M0m58J49O0K66k17O0j8Q7k68j01
$$ -244 -93 -285 -40 83 204 -12 212 -143 224 -102 191 231 -227 -78 -18 248 31 91 73 160 -108 -209
6391b09J72J00n1j54O9J00j45k29R0M21j78J59p3r5J64l64L88Lk98L72O1m77J31
$$ -209 -37 63 12 -142 -73 27 -118 -347 -257 164 -14 145 72 -23 141 -223 165 168 -130 242 303 -174 -43
6414d3N7J53Jk19K51j49O6j98K91j60l58N38n36N74l57L46j96Jm4J93j85K62m38
$$ -43 14 167 168 -51 200 51 117 -81 210 50 -308 230 -306 268 -89 257 61 62 18 211 26 288 -150
6437a50K39P2r3k3m1K16k58j31K94jj49O0p0j5M04k10k10J74k28L60k13k02J30
$$ -150 89 161 68 45 4 220 -38 -169 125 124 -25 35 -35 -50 354 144 -66 108 -120 240 27 -175 -45
6460d5r7R5n9K10J81m82K76j36J63K76m49M08k71o60N68Q6mj53Pk4NK36m4J4K43
$$ -45 -142 -47 -106 104 285 -197 79 -57 106 382 -67 341 70 -590 -22 64 60 -93 -86 -110 -105 131 87 101 344
6485C44l42P6o8j98L4R7K4J15j72K0j23K57J71l08O2m8J64j04o4K7M54l75p3J70
$$ 344 2 78 10 -188 -154 -57 -33 82 -90 -70 -193 64 235 -73 -11 -59 105 1 -63 -36 418 43 -30 140
6509A40k88K55l02K68l23J80N0r4R2j50m0M8K08J4k83K26q2Q1l4j88K84K77J58
$$ 140 -148 107 -195 73 -250 -70 -20 -114 -22 -172 -212 -164 44 58 -225 1 -81 0 -34 -222 62 339 497
6532D97l76j35J56J00m73K78P2N7j48K36k90j29J64q3J92n03M33J57j32r7q3J72
$$ 497 121 -14 142 242 -231 47 119 176 28 264 -26 -155 9 -74 118 -385 48 205 73 -24 -107 65
6554F5j7m5o9j32J82k23J25M3p2j0J99j57j37L98j75P6l7p4K13l07l0P7J28j25
$$ 65 48 3 -66 -198 -16 -239 -114 -71 -143 -153 46 -111 -248 150 -25 51 14 -60 153 -154 -184 -107 21 -104
6578a04J90J40n2j92k60M80k20O2j03J76m25M50l48K74R8j33J53k15L1r6N0r9
$$ -104 86 226 174 -18 -278 202 -18 44 -59 117 -308 142 -206 68 166 33 186 -29 2 -94 -44 -143
6600a43J28o7J5LR4L2P7k9m5J67l17J67Rk27L05o2k15K3L56m08Q3l6J54p6O8j67
$$ -143 -15 -82 -67 -64 30 62 139 110 65 232 -85 82 91 -136 169 107 -108 -85 271 -137 -54 -90 64 -12 56 -111
6626a11k16O68l82j14K89j10J21k51O1j52K43j20M4J31j7n6q6j1J6j35K85j68
$$ -111 -327 341 -41 -155 134 24 145 -106 -45 -197 46 -74 -30 101 84 28 -58 -69 -53 -188 97 -71
6648g1J2L9k66K40j8M80l84J30j02j08k9O0J47j54K91k6l40K18l61K58k49j16
$$ -71 -59 -20 -286 -46 -64 416 32 162 60 -48 -77 -17 130 -24 267 241 -99 119 -242 16 -233 -349
6670c49L79j99K29O1k36k9O7O2K99p16L13Q9j44L06R6r5k36P9l2kJ7M29j61n56
$$ -349 30 -169 60 121 -115 -144 -77 -15 284 -432 -119 -30 -174 132 228 133 -103 -24 -56 -58 -41 388 227 -329
6694c29O12J71m29p1K9J54j0n8j76Q8K12j13k87J32J90j95r2L7Q6k85N29m75J18
$$ -329 283 454 25 -46 -17 137 127 69 -107 -19 193 80 -207 -75 115 -80 -172 -135 -49 -334 195 -280 -162
6717a62J04j7L59k40j27J94k08j40L54o7O9j51R8k74K75k11J33N2J35l92J88p0
$$ -162 -58 -75 284 44 -83 111 -97 -237 117 50 119 -32 66 -208 67 -144 -11 41 176 -216 -28 -98
6739i8j55N19k29q4J2K38N3k80r3J86J0m08L97J35j05k99M27j02M3k15l92L64
$$ -98 -253 266 37 -47 -35 203 256 -24 -117 69 79 -329 68 203 98 -201 226 124 167 -48 -440 -76
6761g6J65j41M76o89j20j0M68M9k28j1j0K90r8j62k12J97N49k34L1j50l69M72
$$ -76 89 -52 424 -265 -385 -395 73 122 -106 -117 -127 163 65 -97 -309 -112 437 203 234 84 -285 187
6783A87l49J28q6r0J4K02j06K9p8K08Kj47R5j41P2J46m7l06J80K15J20J71n38
$$ 187 -162 -34 -120 -210 -196 6 -100 -71 -149 59 61 -86 9 -132 -60 86 39 -267 -87 128 248 419 -119
6806a19J77k55N55k78r1k34K26J3J4lJ43J8k27J71k26M60m28j01J42k90k9M57
$$ -119 58 -197 358 80 -11 -245 -19 -6 8 5 148 166 -61 110 -116 344 -84 -185 -43 -333 -362 95
6828I5J4j49p6M94k41j86K87j77l37O9L99n29L48j37M4P5n1J30mJ8o8LL26l21
$$ 95 109 -40 -116 378 137 -49 238 61 -276 -207 192 -337 11 -126 -82 -7 -58 72 68 86 18 21 347 26
6852B6J11k22M7l7j5K06j98j98J49J07L22n38N05l28J28j97J04J60r1j15K49j01
$$ 26 137 -85 -38 -75 -90 116 -82 -280 -131 -24 298 -240 265 -63 65 -132 -28 132 41 -74 175 74
6874G4k8M5j34K61k65K47k36J16r8j8O4K21m41P1j8R3n2L17m21K53q4j56O9r7
$$ 74 46 91 -43 218 -47 200 -36 80 -18 -36 28 249 -192 -121 -139 -46 -98 219 -202 51 -33 -189 -120 -217
6898b17M83m29K54j22nR5q4J07Kj41K11q6R4K0k32o6j15M4p8J90J02O3k11r5L81
$$ -217 266 -163 91 -31 -36 59 -25 82 84 -57 154 68 162 182 -50 -116 -231 -187 -265 -75 27 90 -121 -216 165
6923A65o2J43k11L5j46K45j63j17J39Q2N7k12J46l23j37M49M8Ql50L84J36j12
$$ 165 103 246 35 70 -76 169 6 -111 28 110 167 -45 101 -222 -359 90 138 146 -204 180 316 204
6945B04j43n9O1L63m38k96L69O1p6m5l2K18m17J18K67k64K34k3j8k79O3L2N47
$$ 204 61 2 63 426 -12 -308 61 122 46 1 -31 187 -230 -112 155 -109 125 102 84 -195 -132 -100 447
6968D47q6l33k76K27L6J07K8k15P6M56m38j91J08j99j00M70j11RJ89l14k3K31
$$ 447 361 28 -248 -21 15 122 150 -65 11 467 29 -162 -54 -253 -353 117 6 15 204 -110 -133 98
6990I8j77J07j76K28j23K45j54n3K04k02nj74J59q3J5J80l46J71K13J66k89J06
$$ 98 -79 28 -148 80 -43 202 48 -5 199 -3 -8 -182 -23 -106 -91 89 -257 -86 127 293 4 110
7012A10j0J06n08K91L9m8j27M29l7j87j04K60j75k32K84N1k40L50k32O4j78L2
$$ 110 100 206 -302 -11 28 -20 -147 282 245 58 -46 214 39 -193 91 142 -98 252 20 84 -94 -62
7034f2j77K74r6L14k25p5J34j36n9J02q1J47Q0m10M21j53K49j62j36k42K06N2
$$ -62 -239 35 -61 253 28 -47 87 -49 -108 -6 -87 60 140 -270 151 -2 247 85 -51 -293 -87 -35
7056c5J70o7J53k91n8L4j63M68l0j7kj54N34n06j14J6k4L17m87J24K91k64j70
$$ -35 135 68 221 -70 -128 -94 -257 211 181 164 162 8 542 36 -78 -62 -86 231 -256 -132 159 -105 -275
7079b75J75Q5O7l46K30K18k55J58k01P5m2j45L0l2K45M7M1N1k19O3Q9j86K16j70
$$ -275 -100 -15 52 -294 -64 154 -101 57 -144 -69 -111 -256 -226 -258 -13 34 75 126 -93 -30 59 -127 89 -81
7103h1K8j47oK25K94j54J84l64K04j84k8p8Q9k5L16k97j55K63k5L67k00m57J36
$$ -81 -53 -200 -206 19 313 159 343 -21 183 -1 -29 -107 -18 -43 273 -24 -179 84 59 426 226 -231 -95
7126i5J62nJ58j39j72J08Q3k21M1J22J34n48L92j36K33l28k5J68L3J03jQ0kk31
$$ -95 67 62 220 81 -91 17 100 -121 -80 42 176 -372 20 -116 117 -211 -236 -68 -35 68 67 147 145 -86
7150h6k5L9j23K19J13j38J7n4J96J71n00N5K45l3l36K84l68N05k87J13o6J07j36
$$ -86 -111 -72 -195 24 137 -1 16 -38 158 329 -171 -116 129 96 -240 44 -324 181 -106 7 -59 48 -88
7173h8l0J44j16O7k6O1k71L91k33K28J40j62m3R8k94J66l69M25lM1l26J67Q7k61
$$ -88 -118 26 -90 -23 -49 12 -259 132 -101 127 267 105 62 160 -134 32 -337 88 85 126 -200 -33 54 -207
7197b07K13J93j97k61K03j72L30j58J94L9l42R9L03j67m1J27K52m87M6j6K28n6
$$ -207 6 199 2 -259 -56 -228 102 -56 138 177 -165 -66 237 70 29 156 408 -79 -33 -49 179 123
7219A23pk90M43m78L45r1j19O7m6o4K72k29P5M4M2l23L83l64K66n7J54J32k48
$$ 123 116 -174 269 -209 136 45 -74 -7 -53 -117 155 -74 1 45 87 -236 147 -217 49 -8 146 278 30
7242C0r7K24j24P8j15l4L1J98p6j09J29R4k61J33l03K16P5q1J06R5j68kJ68j89
$$ 30 -67 157 33 111 -4 -38 -7 191 115 6 135 229 -32 101 -202 14 89 8 114 209 41 39 207 18
7266A8j45P2L37l25k9M0r6K85K3l25Q9NJ54R5l87O4j17K03J34k01J76m74M94k44
$$ 18 -127 -55 282 -43 -72 -32 -128 157 180 -145 -56 -51 103 198 -189 -125 -242 -39 95 -106 70 -404 90 -154
7290a54L67j10r0Q5j81k54K75R3r4k38L07J79m42M87m00j1K37L8j65j88K06k38
$$ -154 213 103 13 98 -83 -337 -62 31 -63 -301 6 185 -257 230 -170 -181 56 94 -71 -259 -53 -291
7312b91M31K9l77O9K59q9j23J91J54k56j12J55J39J28r2l71J00n8K63j27j25J43
$$ -291 140 169 -208 -139 120 31 -92 99 253 -3 -115 40 179 307 215 -156 -56 -114 149 22 -103 40
7334D0n1P1N5k12l5J00L2j86j3M34j50M7R7k5k25j36J15k2J31n0o0K2J11l57n7
$$ 40 -11 60 115 -97 -132 -32 0 -186 -199 235 85 132 229 204 -21 -157 -42 -64 67 17 -43 -21 90 -267 -324
7359c24J65L34k44J76n1o7J80k58L12l78R2m9L46o6l05K31J23m62K81l8J97o1
$$ -324 -159 175 -69 107 56 -11 169 -89 223 -155 -63 -112 234 168 -137 94 217 -245 36 -2 195 134
7381A34j12N1j18K9J15j5J5j09J29j54R9j09K7K03q3k25J75j75J13K40l82J63
$$ 134 22 73 -45 -16 99 84 99 -10 119 -35 64 -45 -18 185 102 -123 52 -123 -10 230 -152 11
7403A1J35j18K32j79J10m37K50k0M1N55n34j8J61k28q5L46k12P6K84m46L66qm19
$$ 11 146 28 260 81 191 -246 4 -16 25 580 46 28 189 -39 -124 222 10 86 370 -76 290 282 -137
7426a37K66k19J4K51k71K8P1L23j58k79K08N8J5k98L92k72Q7k52J17l57L36J91
$$ -137 129 -90 -76 175 -96 -68 3 326 168 -111 97 155 170 -128 264 -8 79 -173 -56 -413 -77 114
7448A14n8P9l25J17K79k02j86J28mK65j84L8P3j87r4j44K34m2R2J49J51j92k57
$$ 114 56 135 -190 -73 206 4 -182 -54 -58 207 23 61 134 -53 -147 -291 -57 -99 -7 142 293 101 -156
7471a56J51o8L32j05k07K04N1j18J02K6j17r0%L29k34k92J94j0m5J14j29M31k55
$$ -156 -5 -73 259 154 -53 151 202 84 186 212 95 5 5 334 100 -192 2 -8 -53 61 -68 363 108
7494A08k54K82l25L94N9m27P3j96J46M00j76j20j52J26J81l28K73J74j91j02N0
$$ 108 -146 136 -189 205 264 -163 -90 -286 -140 260 84 -36 -188 -62 119 -209 64 238 47 -55 -5
7515ej48M9R0J95R2l33K0J04J9j23j15N03m01J34K1l43o7L06k64p7M15j4j3j06
$$ -5 -153 -104 -14 181 273 -60 -40 64 83 -40 -155 348 -53 81 102 -241 -308 -2 -266 -343 72 58 45 -61
7539f1N58n73J47m5j17O5J42o7J7L5p2k5K37l18j7L50J2k56K97n03K75M8j19J07
$$ -61 497 -76 71 26 -91 -26 116 49 66 101 29 4 241 -77 -94 256 268 12 309 -194 81 129 10 117
7563A17k12L9j0l7q6J12O3j67O1j35R6J74j90L92l58Q1p7L11k02J05K3l49j41
$$ 117 -95 -56 -66 -103 -189 -77 -14 -181 -120 -255 -159 15 -175 217 -141 -60 -137 174 -28 77 100 -249 -390
7586c90K79L12P1j75M0m16J20q0J22J16l20L40N3J4O0j91j93k2L87O0k6K4k36
$$ -390 -111 201 272 97 137 -279 -159 -239 -117 -1 -321 19 72 86 146 -45 -238 -260 127 187 161 185 -51
7609e1K2j45J65k07L08m1Oo6J03ml93M58k01J96j19j7m30N91k64J54L1l49J09
$$ -51 -29 -174 -9 -216 92 51 57 -9 94 90 -303 155 -46 150 31 14 -416 175 -89 65 96 -253 -144
7632a44K33k9j04K76l56R0K2r6J66o1K00M6m02K38m9j61K07j4j96P5n2P5j52J12
$$ -144 89 60 -44 232 -124 -34 -12 -108 58 -3 197 243 -159 79 30 -131 76 62 -134 -59 -111 -36 -188 -76
7656g6j40k0J76P5k5nJ5K69j92q2r0Q7j62K02K32j34k39K03J39m24J69K70m51
$$ -76 -216 -236 -60 15 -10 -15 0 269 77 -5 -95 -8 -170 32 264 130 -109 94 233 -191 -22 248 -203
7679b03mJ43k74K07r0K60O1k01R9R3j90nk8o3MlO4K2M19p1k76m9L52j89j07R7
$$ -203 -207 -64 -338 -131 -221 39 100 -101 -2 91 -99 -104 -132 -195 -191 -194 -130 -108 311 240 -36 -85 267 78 -29 68
7705F8k64K64M8J8j72J58n3L8q0l10q2M18L0P1k80j28J0N76j06o2j62r5l21M32
$$ 68 -196 68 116 134 -38 120 67 105 25 -285 -367 51 81 152 -128 -256 -246 330 224 162 0 -95 -416 16
7729A6o3N9J07jK35j76j70Q4k23K13l3j61j6J75J54j05N2k76k5j8K95k01J85J57
$$ 16 -47 12 119 118 353 177 7 91 -132 81 48 -113 -129 46 200 95 147 -129 -154 -172 123 -78 107 264
7753B64j0m43j10N00n03M52k60O3L9j32L78o1j65Kn8k24N02k07K91k1Oj86j57
$$ 264 254 -189 -299 201 -302 150 -110 -47 -8 -140 238 177 12 14 -44 -268 234 27 318 297 303 117 -40
7776d0K61n1k01L7k54K00p2K6J42KJ95n71M90j18J88k60l32J35L17j69j81L14
$$ -40 221 170 -31 6 -248 -48 -120 -94 48 50 245 -326 164 46 234 -26 -358 -223 94 -75 -256 58
7798E8J11j30o5J72j61O5k02O0J3J35j13l98N34j64K50l39J90j43K8p0M8J21J91
$$ 58 169 39 -26 146 -15 50 -152 -92 -79 56 -57 -455 79 -85 165 -174 16 -127 -99 -169 -121 0 191
7821A91k14n8K45l09L59k44M1po9N1J00k06L21k28J21L8q4K95q0j93R5N7k17K04
$$ 191 -23 -81 164 -145 214 -30 11 4 -65 -14 86 -120 201 -27 94 132 48 343 263 70 165 222 5 209
7845B09o1k16n1L78j84l24J76J65j73mR0m6J29j37P2j55r3L01J12l64J87K9j00
$$ 209 148 -68 -119 259 75 -249 -73 92 -81 -85 5 -41 88 -49 23 -132 -225 76 188 -176 11 40 -60
7868f0M8j44K4K15k54j9L44K2j19M4k40J42j40J00R9M33l61j50L9l5J55k13k33
$$ -60 -12 -156 -132 83 -171 -190 154 176 57 101 -139 3 -137 -37 62 495 134 -16 23 -12 143 -70 -303
7891c03J85J03lQj04J48k01J31o2J2L19n14K90K00k18J93r5l67J27J26J44j51
$$ -303 -118 -15 -18 -10 -114 34 -167 -36 -98 -86 233 -281 9 209 -9 184 89 -278 -151 -25 119 -32
7913c2k95K64J60k19P7K4K78j50j82J74j26J85O7j82J80l38m8M85l00j09K70j0
$$ -32 -327 -63 97 -122 -45 -21 257 107 -75 99 -27 158 225 43 223 -115 -163 322 22 -87 183 173
7935A73l74K02r8LO9j05R0J05P8n25M22j80L07m06J22M2J36p5O1J12r0j02J0j50
$$ 173 -201 1 -97 -94 -25 -130 -40 65 143 -382 40 -140 167 -239 -117 -75 61 -14 47 159 69 -33 -23 -173
7959a73J81M5k05J69j32K02L8k39J61J1j26k47J56K17j27K18k39k02J28N5j62
$$ -173 8 53 -152 17 -115 87 125 -114 47 58 -68 -315 -159 58 -69 149 -90 -292 -164 -109 -271
7980b71J57K94k84j93K28lj02j25M03j80L26k17K4k74M01j29k3j3k1j56j1J25
$$ -271 -114 180 -104 -297 -69 -72 -174 -299 104 -76 250 33 57 -217 184 55 32 19 -2 -158 -169 -44
8002d4n0J78k01J01pK07J22l1k11k23Q2k87j69K89l9J60J30r5K56k10J72m9l5
$$ -44 -94 84 -117 -16 -23 184 306 275 64 -159 -77 -364 -533 -244 -283 -123 7 -88 168 -42 130 81 46
8025D6k21J59k9j2K66l60L09o2m02J86J54K5k47L47k97N0M66l74j48N0K12j34
$$ 46 -175 -16 -45 -57 209 -151 158 96 -306 -120 34 59 -188 159 -138 -88 378 4 -144 -94 118 -16
8047a6K15j17j8q1K49k52J01n7j9j2Q1j56j7J02k04M47l33R7k15j5M40N1m60J92
$$ -16 199 82 64 -17 232 -20 81 24 5 -7 74 -82 -99 3 -201 246 -87 10 -205 -220 220 271 -189 3
8071CJ6q3l04M65rj84m3K86K65k21j58j10K11m72L97k09J35JJ93j64j43L85m01
$$ 3 19 -64 -368 97 88 -96 -139 147 412 191 33 -77 134 -338 59 -150 -15 -14 179 15 -128 257 -144
8094a44j9L79k00j4J03j72K27Qj51j18J02k76K62J00K6l2q5N1o0J81j24j68J26
$$ -144 -163 216 16 2 105 -67 160 168 17 -101 1 -275 -13 87 113 81 -4 47 -13 168 44 -124 2
8117BJ85k28J55j73J92N8j91J73l2J11j03o7j77m9M4M35j74J1k28J50j8P1j85
$$ 2 187 -41 114 -59 133 191 0 173 141 252 149 82 -95 -144 -100 335 161 172 -56 94 76 147 -38
8140c8r0J29K81k47k56O5P4j05k4K15O4j7N8j80j69L52Lk45l8K08J68l27qL18
$$ -38 -128 1 282 35 -221 -156 -82 -187 -211 4 68 51 109 -71 -240 112 115 -130 -168 40 208 -119 -127 191
8164A91P8p22M64L3j24J18O4J00j58p9R1j41j45M24l29J58j68L69j05l39L67l90
$$ 191 269 -453 11 44 -80 38 102 202 44 -35 56 -85 -230 194 -135 23 -145 224 119 -220 147 -243
8186b43K00nM72m27K13
$$ -243 -43 -48 424 -3 210
8191B10
$$ Imaginary data points
##PAGE= N=2
##DATA TABLE= (X++(I..I)), XYDATA
0@%%%%%%%%pJ4j4J4j7K4k8L5m2M9o3P5q6J00j16J32j52J76k01K29k60K94l31L72
$$ 0 0 0 0 0 0 0 0 0 -7 7 -7 7 -10 14 -14 21 -21 28 -35 40 -46 54 -62 70 -82 94 -107 122 -138 156 -175 197
32A97m17M67n22N83o51P24q04Q91r87J094j211J341j485J644j825K031k265K535
$$ 197 -220 247 -275 308 -343 381 -423 468 -519 575 -636 705 -780 864 -961 1070 -1195 1340
50A340k850L223l678M243m961N917p261R307j2842K0669p1667L3133P2579q4277
$$ 1340 -1510 1713 -1965 2278 -2683 3234 -4027 5280 -7562 13107 -58560 -25427 47152 -37125
64c7125L7648P5739j6473m6895J7107l3745l9582K7067Q691n5705L2065Q5222
$$ -37125 523 76262 59789 12894 30001 -3744 -43326 -16259 -7568 -63273 -31208 54014
76E4014j2830m9771L9461K2359m9626k7311l944k7088J8197L5320l0609k063R1266
$$ 54014 41184 -8587 30874 53233 3607 -23704 -27648 -54736 -36539 -1219 -31828 -33891 57375
89E7375K1631p4366L333N7957m2601o6673J7108R634k9599K2276K7179k8702J6871
$$ 57375 79006 4640 7973 65930 23329 -43344 -26236 -16602 -46201 -23925 3254 -25448 -8577
102h577O5908k6570o1799L9843L9914n7007l1506M0720J0301j5735R674n600q247
$$ -8577 57331 30761 -31038 8805 48719 -8288 -39794 926 11227 -4508 5166 -434 -8681
115h681L3165j371n9213O714N9370k6069n2480M0023L8383l4465k996K9849k3206
$$ -8681 24484 23113 -36100 -29386 29984 3915 -48565 -8542 29841 -4624 -7620 22229 -977
128i77o960M4796k2798n5123M8390M7861p1365l7704P0073R556o6282N514M2715
$$ -977 -7937 36859 14061 -41062 7328 55189 -16176 -53880 16193 25749 -40533 -35019 7696
141G696j1633l443K7482j1264o415M1643q585n9242J1211L7815l8554l5566L2229
$$ 7696 -3937 -7380 20102 8838 2423 44066 35481 -23761 -12550 25265 -13289 -48855 -16626
154a6626J6886j0009J7863N121j7911K6645J9326n7211k5615N6821J279o2257
$$ -16626 260 -9749 8114 13235 -4676 21969 41295 -15916 -41531 15290 16569 -45688
166d5688J8105O1967j3521k3581K8162r48k7384R537p458m7682J0010M6821k1417
$$ -45688 -27583 34384 20863 -2718 25444 24496 -2888 6649 -809 -48491 -38481 8340 -13077
179a3077k6174N1915L7706k8041j0501J5784j2875j4311l560l0214r092M4297
$$ -13077 -39251 12664 50370 22329 11828 27612 14737 426 -3134 -33348 -42440 1857
191A857M125m1044K7352N7728k6423l9856K8012Q145l8540K366J5616k4550J0004
$$ 1857 5982 -35062 -7710 50018 23595 -16261 11751 19896 -18644 -16278 -662 -25212 -15208
204a5208M8476j7802l6998M4634L0479o1675k9306M3733j978m1338R842K4962
$$ -15208 33268 15466 -21532 23102 53581 -8094 -37400 6333 4355 -36983 -27141 -2179
216b179l311J4278J5978k1021J347L2582k0442m5493J7764K5141k8439j3511K6485
$$ -2179 -5490 8788 24766 3745 5092 37674 17232 -28261 -10497 14644 -13795 -27306 -821
229h21K926m630J8283j0674k3652K8565J6962m9294j1285N5099L1m5845J6676
$$ -821 2105 -2525 15758 5084 -18568 9997 26959 -22335 -33620 21479 21510 -24335 -7659
242g659L7505j8937j6515J4234r810j3200J9837n996l1523K1209L5064k5418k0714
$$ -7659 29846 10909 -5606 8628 -1182 -14382 5455 -541 -32064 -10855 24209 -1209 -21923
255b1923L3362J2122k4345k04O463j0454J1119P170l0154j922M3055j0466m6362
$$ -21923 11439 23561 -784 -988 5475 -4979 6140 13310 -16844 -18766 24289 13823 -32539
268c2539K1060L8464l0264k3735L1398O641k1029J6258R561k7867J1035L2880
$$ -32539 -11479 26985 -3279 -27014 4384 11025 -10004 6254 15815 -12052 -1017 31863
280C1863l0555l3131L8807J9518m4393p552L6121j658j9690Q416K613n765J5196
$$ 31863 1308 -31823 6984 26502 -17891 -25443 10678 9020 -10670 -2254 359 -5406 9790
293I790o18k6657J1981L2460k0417k7349K6787J5356k6412l990J3572j2725M3
$$ 9790 9172 -17485 -5504 26956 6539 -20810 5977 21333 -5079 -9069 4503 -8222 -8179
306h179J8454j8212j7510L6068J5161m1579k232M4162p282l7151J2843K0754j5876
$$ -8179 10275 -7937 -25447 10621 25782 -15797 -18029 26133 18851 -18300 -5457 15297 -579
319e79m759R569j1415K64K2078j2876k6329K3053K0535k8220j0148K5950J950
$$ -579 -5338 4231 -7184 -6920 15158 2282 -24047 -994 19541 -8679 -18827 7123 9073
332I073j1746Q813k167r361J9197M019l6420J093L9574j5408m0279K5047L1113
$$ 9073 -2673 6140 3973 -5388 13809 17828 -18592 -17499 22075 6667 -33612 -8565 22548
345B2548k7214j1924K7315k702j5056J8203k135k7222J6810K5913l0280j9888
$$ 22548 -4666 -16590 10725 8023 -7033 11170 9035 -18187 -1377 24536 -5744 -25632
357b5632L6328J1098l3050m94K1997o972r088M952r583l24K2885o629k5866K1175
$$ -25632 10696 21794 -11256 -11750 10247 3275 -5813 -861 -10444 -10768 12117 5488 -20378 797
371G97K8896k5544j7937K5295L014k3811L970N150j5634Q604J9368k0546j2341
$$ 797 29693 4149 -13788 11507 14521 -9290 -5320 -170 -15804 -7200 12168 -8378 -20719
384b0719L7506R254l8705J027L3195j1738k6846J1149R905q970N947M025j3096
$$ -20719 16787 26041 -12664 -11637 21558 9820 -17026 -5877 4028 -4942 1005 5030 -8066
397h066R774J9861k0527k0578K2131Q783k6190j613J8912k597q44J3459q239q078
$$ -8066 1708 21569 1042 -19536 2595 11378 -14812 -16425 2487 -110 -954 12505 4266 -3812
411c812K4178l42l9492L010L4170j8960l2589K5787K4209k0496k091K1119p795
$$ -3812 20366 20024 -19468 -16458 17712 -1248 -33837 -8050 16159 -4337 -6428 14691 6896
424F896p744J5342j1313k4927J8912J7915k7777q590L3180N741k1884M307R706
$$ 6896 -848 14494 3181 -21746 -2834 15081 -12696 -21286 11894 17635 -4249 58 9764
437I764r274p00J42j8845M389K6659j1464k1757K7243K3147k5550j1196K1316
$$ 9764 490 -210 -68 -18913 -14524 12135 671 -21086 6157 29304 3754 -7442 13874
450A3874n776j9277Q043n59j6093J5422J8671k2297p043L4688K483l4538L824
$$ 13874 8098 -11179 -3136 -3695 -19788 -4366 14305 -7992 -15035 19653 22136 -12402 -8578
463h578K3044j2382j5164R653K648j967J1811l807j5238J4933J4146k5024j3655
$$ -8578 14466 2084 -13080 -3427 -779 -2746 9065 5258 -9980 4953 19099 -5925 -19580
476a9580K3282K624j9743O465J2422p339M736J1807j7174p312K6344l229l5103
$$ -19580 3702 6326 -13417 -6952 5470 -1869 2867 14674 -2500 -9812 16532 13303 -21800
489b1800J0140L1606j7980k3809K2370J2392j8142M71J0200j0390J684J6069j2590
$$ -21800 -11660 19946 1966 -21843 527 12919 -5223 -4752 5448 -4942 -3258 12811 221
502B21j4753K2742R857k5024m606K1284m222j6582P637J381m048J2616O33j9393
$$ 221 -14532 8210 18067 -6957 -11563 9721 5499 -11083 -3446 -2065 -6113 6503 7136 -12257
516a2257J0197K3783j9713k3583K3511J3368k4484k703K1064m580p400J3388m834
$$ -12257 -2060 21723 2010 -21573 1938 15306 -9178 -11881 9183 4603 -2797 10591 5757
529E757j6726J4465Q690k8442n733K9659J4k2469J1619J9690p620n239L761q941
$$ 5757 -10969 3496 12186 -16256 -21989 7670 7684 -14785 -3166 16524 8904 3665 7426 -1515
543a515j794Q821j3349j5411K1506J5117k0345k035K4920k224j6951N936K40j5140
$$ -1515 -3309 5512 -7837 -23248 -1742 13375 -6970 -9005 15915 13691 -3260 2676 2916 -12224
557a2224P010R295j8557M71L2391j635k7938J4249K1744k0711k1963J4396L66
$$ -12224 -5214 4081 -14476 -14005 18386 16751 -11187 3062 24806 4095 -17868 -3472 -3106
570c106r813M128Q595p851J4845J4956j5912j0204J7059J292k9184J527J2178
$$ -3106 -12919 -8791 -196 -8047 6798 21754 5842 -4362 12697 13989 -15195 -13668 -1490
583a490n199j698R752j571J793J5570l147k6864J0106J9874k7289j3927K1647
$$ -1490 -6689 -8387 1365 -206 1587 17157 14010 -12854 -2748 17126 -10163 -24090 -2443
596b443J1399j5051K813J7217o320m283Q435j0996j6193J4347P778k5722P83L0144
$$ -2443 8956 -6095 -3282 13935 7615 3332 11767 771 -15422 -1075 6703 -19019 -18236 11908
610A1908l935j4828J1773P731q438m45j526j1294L012J3780j3454j1811K1679
$$ 11908 7973 -6855 4918 12649 4211 3766 2240 -9054 -6042 7738 -5716 -17527 4152
623D152J2978k2977j432J8384n500j2738R035l051r781J5241O503k2696K265K9458
$$ 4152 17130 -5847 -7279 11105 5605 -7133 1902 -1149 -10930 4311 10814 -11882 -9617 19841
637A9841r629k7430J4070J9879j7519j1148J3204L60n065P671m042j0778J2387
$$ 19841 10212 -17218 -3148 16731 -788 -11936 1268 1628 -3437 4234 192 -10586 1801
650A801R337j7444k821J8888j182j5036P246P729r914K82L680j4631J594K0761
$$ 1801 11138 -6306 -9127 9761 8579 -6457 789 8518 -1396 -1114 2566 -12065 -10471 10290
664A0290p439j9071J6322J9220j7366j1587J9845R67k0528K253O630r389N217
$$ 10290 2851 -16220 102 19322 1956 -9631 10214 11181 -9347 -7094 -464 -9853 -4636
677d636J3610j0353l569J9823p14k3212J912J3980q676j0775O155K675J659J0516
$$ -4636 8974 -1379 -4948 14875 14161 -9051 -7139 6841 -1835 -12610 -6455 -3780 -2121 8395
691H395j638q694J0649Q972k1237j1508J7926Q88j9701L900J6004l591n78J2477
$$ 8395 6757 -1937 8712 17684 -3553 -15061 2865 3753 -15948 -12048 3956 365 -213 12264
705A2264n461q819J2410j988k4921K073K1554r477j5048J7784J4151j0502j427
$$ 12264 6803 -2016 10394 8406 -16515 -14442 7112 -2365 -17413 371 14522 4020 2593
718B593P026o310l399M952j1167j0339J5345O592j5923L622K0168l686j0515P271
$$ 2593 9619 3309 -90 4862 -6305 -16644 -1299 5293 -10630 -7008 13160 9474 -1041 6230
732F230n48j1463M790J186j7169L769K1824p945j6628J9206J5011j8604p652J4395
$$ 6230 5682 -5781 -991 195 -16974 -13205 8619 674 -15954 3252 18263 -341 -7993 6402
746F402k653j2086N337J514p341Q404Q755j3344j690J7532m476j6992O096J0211
$$ 6402 3749 -8337 -3000 -1486 -8827 -423 8332 -5012 -6702 10830 6354 -10638 -4542 5669
760E669q689l602O723l121J730J1002o738j1772J4959J0185k0325o950K0088p14
$$ 5669 -3020 -6622 101 -3020 -1290 9712 2974 -8798 6161 16346 -3979 -10929 9159 8445
774H445j7123N128Q989q853m6Q571q784m856J6163J8j8131O242J6680j0258j3538
$$ 8445 -8678 -3550 5439 -3414 -3460 5111 -3673 -8529 7634 7652 -10479 -4237 12443 2185 -11353
789a1353J0471N310q005P15K308m791O780P555j2549m822J7177j144j8953L959
$$ -11353 -882 4428 -3577 -2862 -554 -5345 1435 8990 -3559 -8381 8796 7652 -11301 -7342
803g342J3846p726n723R998q65n780J0930L26j6741M898J6118j4046j5960J6788
$$ -7342 6504 -1222 -6945 3053 2188 -3592 7338 7664 -9077 -4179 11939 -2107 -18067 -1279
817a279J0818j5077n24J3950j944n091N028m798o929R684J598j5585J849J5912
$$ -1279 9539 -5538 -6062 7888 5944 853 5881 1083 -5846 3838 5436 -10149 -8300 7612
831G612n679j0275R231O342o517J787K607r532J530R695j1457j1134J7544R716
$$ 7612 1933 -8342 889 7231 714 2501 5108 -4424 -2894 6801 -4656 -15790 1754 11470
845A1470j7140m26J8459l878j3748N106K235q494L435O853r518k02J5483k823
$$ 11470 -5670 -6096 12363 8485 -5263 -157 2078 -6416 -2981 3872 -5646 -5848 9635 6812
859F812j5299P855J1419j0369p133P137J99m042L884j938m479J0790N742j5461
$$ 6812 -8487 -632 10787 418 -6715 422 621 -3421 463 -1475 -5954 4836 10578 -4883
873d883k186J5905l865j5423P349J0185q409k390P795n146l336J2416k316j5478
$$ -4883 -7069 8836 4971 -10452 -3103 7082 -1327 -3717 4078 -1068 -4404 8012 5696 -9782
887i782P595J2805j3736j0206J5423O502j1882K17P017l812K77M430p042l872
$$ -9782 -2187 10618 -3118 -13324 2099 8601 -3281 -3064 3953 141 418 4848 -2194 -6066
901f066J1433r51j3678N701J3137q078p862P935M57n423N714J02j0296O261J1620
$$ -6066 5367 4416 -9262 -3561 9576 1498 -6364 1571 2028 -3395 2319 2421 -7875 -1614 10006
916A0006j1966p532J6843L824j8134m28J3829l880q263O225j11n791P865L342
$$ 10006 -1960 -9492 7351 11175 -6959 -7387 6442 2562 -5701 524 413 -5378 2487 5829
930E829j0744J751J2423p077j0913R436O636r846k509N769k042J072N176o804
$$ 5829 -4915 -3164 9259 2182 -8731 705 7341 -2505 -5014 755 -1287 -215 4961 -1843
944a843m596J3193K599j5891l15J3921n583j1267R064O148p923K067O711p631
$$ -1843 -6439 6754 9353 -6538 -6853 7068 1485 -9782 -718 5430 -2493 -426 6285 -1346
958a346r25J0047o683j3200J0502J0469j2416o525J2210L031o511K732J931m628
$$ -1346 -2271 7776 1093 -12107 -1605 8864 -3552 -10077 2133 5164 -1347 1385 3316 -1312
972a312M047K104j1249r13J2601l152j0795P938R135q965k497P614l089m768O782
$$ -1312 2735 4839 -6410 -7323 5278 2126 -8669 -731 8404 -561 -3058 4556 1467 -3301 3481
987C481k369r505Q269R142j3558n431J7679K979j5787J292R504n171m299M964
$$ 3481 1112 -8393 -124 9018 -4540 -9971 7708 10687 -5100 -3808 5696 525 -3774 1190
1001A190l290k592Q843j027j1057N380J1627p190p676P773K662p039J849J475
$$ 1190 -2100 -4692 4151 3124 -7933 -2553 9074 1884 -5792 1981 4643 -2396 -547 928
1015I28n070L910O185j0218m446J4280J689j4093L794J2287p591q335Q513J250
$$ 928 -4142 -232 5953 -4265 -8711 5569 7258 -6835 -3041 9246 1655 -6680 1833 3083
1029C083p863M126L581q506K166J1207n982q964J0813N265j2070l039Q392k409
$$ 3083 -4780 -654 2927 -5579 -3413 7794 1812 -7152 3661 8926 -3144 -6183 2209 -200
1043b00l998L735j103k176Q249J580r780L468J0286q762j0828Q371M174r182N58
$$ -200 -4198 -463 -1566 -3742 4507 6087 -3693 -225 10061 1299 -9529 -1158 3016 -6166 -5608
1058e608P632l590L30Q904l687r089Q880L906j4387m333J3709m31j0131M907Q353
$$ -5608 2024 -1566 -1236 7668 3981 -5108 3772 7678 -6709 -11042 2667 2236 -7895 -2988 5365
1073E365k771R5L181n718k360N802m991r245P711P798p518j477R967M94m809L201
$$ 5365 2594 2689 5870 152 -2208 3594 -1397 -10642 -2931 4867 -2651 -4128 5839 6333 1524 4725
1089D725j954p786M270M060j0810j672J4488k77j1323P294J0272q735n976O089
$$ 4725 2771 -5015 -745 3315 -7495 -9167 5321 5044 -6279 1015 11287 2552 -3424 2665
1103B665k808n903N532O97p812N177J0315o697n531R221J190r157k98M179l988
$$ 2665 -143 -6046 -514 183 -7629 -2452 7863 1166 -4365 4856 6046 -3111 -3409 770 -3218
1118c218Q00L980n052k17J0793o60j2258M621R663p913p757P779J627o079K987
$$ -3218 -2418 1562 -3490 -3707 7086 6426 -5832 -1211 8452 539 -7218 561 2188 -3891 -904
1133i04L608o131L273P517p834o913J0788M572j3275j219J1482j462p383K946
$$ -904 2704 -3427 -154 7363 -471 -7384 3404 7976 -5299 -6518 4964 3502 -3881 -935
1147i35K454l131K438O96n654K796P551n958o257Q593L387r361n69O231l763j355
$$ -935 1519 -1612 826 1522 -4132 -1336 6215 257 -6000 2593 5980 -3381 -3950 2281 -1482 -2837
1163b837N981l172n074Q737M412j1309j870J1393l527j0535M765O459n159m35
$$ -2837 3144 -28 -5102 3635 8047 -3262 -5132 6261 2734 -7801 -3036 3423 -1736 -2171
1177b171N617k656o88O457m516q585O218N794j0738l920J0344J874n531L737K744
$$ -2171 3446 790 102 6559 2043 -6542 -324 5470 -5268 -9188 1156 3030 -2501 1236 3980
1192C980l463K475J609q671j305Q766l486q712Q005Q357p390k524P794j547o483
$$ 3980 517 2992 4601 -4070 -5375 3391 -95 -8807 -802 7555 165 -2359 5435 3888 -2595
1207b595L365p34q086M567P829p676l677J2215L605j0189M2O761m185m725J915
$$ -2595 770 36 -8050 -3483 4346 -3330 -7007 5208 8813 -1376 -1334 5427 1242 -3483 -1568
1222a568j229j046N801k53n453N409O609p992m832P445m58q360K994L826l953
$$ -1568 -2797 -3843 1958 1705 -3748 1661 8270 278 -4554 2891 2433 -5927 -2933 893 -3060
1237c060K211O790n483l938R699J253j3360k00J0495l951q068N758M992l263O50
$$ -3060 -849 5941 458 -3480 6219 7472 -5888 -6088 4407 456 -7612 -1854 3138 -125 525
1252E25L104m228L52M772n495n380O614L502q069J160P072j904k958L308j946
$$ 525 3629 -599 -247 4525 -970 -6350 264 3766 -4303 -3143 3929 2025 -933 2375 429
1267D29l318N112J14r527K911J1209m930q965Q237O388q252k861O081k028m251
$$ 429 -2889 2223 2337 -7190 -4279 6930 2000 -6965 1272 7660 -592 -3453 2628 600 -3651
1282c651N353j434n208N240N787p738k812Q570O0p742J738M179l232K2K153l015
$$ -3651 1702 268 -4940 300 6087 -1651 -4463 4107 4167 -3575 -1837 2342 -890 -868 1285 -1730
1298a730O82O027m347o728P326M808r044k206Q868j141n461L714J580m879K636
$$ -1730 -1048 4979 632 -6096 1230 6038 -3006 -5212 3656 2515 -2946 768 2348 -2531 105
1313A05M372p180l307J0154Q79j0585K523R088m541n533M596Q69l362K190M75
$$ 105 4477 -2703 -6010 4144 5023 -5562 -3039 6049 1508 -4025 571 1440 -1922 268 743
1328G43m218L700M978n860l164P002N66p116J406L646l279j0L619l633o20P191
$$ 743 -3475 225 5203 -657 -3821 3181 3747 -3369 -1963 1683 -1596 -1606 2013 -1620 -2240 4951
1344D951j457q534M192P936p836o521P785L131o828J177N146l333j09M969l978
$$ 4951 3494 -5040 -848 7088 -748 -7269 516 3647 -3181 -2004 3142 -191 -300 4669 691
1359F91n376O332K620q842n10Q083r85m754L553J596k237J909J68n297J008O004
$$ 691 -4685 1647 4267 -4575 -5085 2998 2013 -2741 812 2408 171 2080 2248 -3049 -2041 3963
1375C963m631o113O948M649o736n65O759k408l404L308j169m436L743L111p377
$$ 3963 -668 -6781 167 4816 -1920 -2485 4274 1866 -1538 1770 601 -3835 -92 3019 -4358
1390d358N62Q736j783p152M103N237n480k488K999j965p03M125k449l632O596
$$ -4358 -3796 4940 3157 -3995 108 5345 -135 -2623 376 -1589 -2292 1833 -616 -4248 2348
1405B348L454p609r63P768j997p108L020K288m657K375L610m820p03Q942j725
$$ 2348 5802 -1807 -2770 4998 3001 -4107 -1087 1201 -3456 -1081 2529 -2291 -2994 5948 4223
1420D223r481M524P332p204n707O568J979m973K041K780l256J819L990m703l683
$$ 4223 -5258 -734 6598 -606 -6313 255 2234 -2739 -698 2082 -1174 645 4635 -68 -3751
1435c751N820N67p008R95N651k042j985L341m77j701L812j619n515L148M684o050
$$ -3751 2069 2636 -4372 -3377 2274 232 -1753 1588 1111 -590 3222 1603 -3912 -764 3920 -2130
1451b130l690P722J935o634J905M546k941j744L366l118l124N325J136p104K103
$$ -2130 -5820 1902 3837 -2797 -892 3654 713 -1031 2335 -783 -3907 1418 2554 -4550 -2447
1466b447P864l407n700M734K407m340l66J215k427J207M551m427l147P905J647
$$ -2447 5417 2010 -3690 1044 3451 -889 -1255 -40 -2467 -1260 3291 -1136 -4283 3622 5269
1481E269q340M96O356l064m825M161P54l779L710K707o196L29Q121l454q248N373
$$ 5269 -3071 -2575 3781 717 -4108 53 807 -2972 738 3445 -2751 -2422 5699 2245 -6003 -630
1497f30N298o194k937N954q6k700K620r5l160K433K568n416j472O574p85n281
$$ -630 4668 -1526 -4463 1491 1405 -1295 1325 1230 -1930 503 3071 -2345 -3817 2757 1972 -3309
1513c309K523L788l417j46K406l050q25M611j957n032M484M789n968k795O654
$$ -3309 -786 3002 -415 -561 1845 -1205 -2030 2581 624 -4408 76 4865 -1103 -3898 2756
1528B756O0n386J378K873k875L08L247l363r73N254p09o047J785N123l580l361
$$ 2756 2816 -2570 -1192 1681 -1194 -886 2361 -1002 -1975 3279 2570 -3477 -1692 3431 -149 -3510
1544c510M051O62j866J711K52l267L126K462o324k113P013j29o377K866N888l495
$$ -3510 541 1203 -663 1048 1300 -1967 1159 3621 -2703 -4816 2197 2068 -4309 -1443 4445 950
1560I50j758L984k438l609M213j00o977K631P445l958m556O743L366n754j276
$$ 950 -808 3176 738 -2871 1342 1242 -5735 -3104 4341 383 -4173 2570 5936 182 -1094
1575a094K699k735j351K177k199j895O427K048n890J670O370l409n655K690Q5
$$ -1094 1605 -1130 -2481 -304 -2503 -4398 2029 4077 -1813 -143 6227 2818 -2837 -147 -62
1590f2m256J946K443l155K256O799k902n780N328L908q622l437N566n56m286L314
$$ -62 -4318 -2372 71 -3084 -828 5971 3069 -2711 2617 6525 -2097 -5534 32 -524 -4810 -1496
1606a496L223k053K813K797m874j526M341k455o565K416L878k280o45M232K42
$$ -1496 1727 -326 2487 5284 410 -1116 3225 770 -5795 -3379 499 -1781 -2426 1806 2048
1621B048p34K552j772m318K315K315o246j764O862R39m615L115L908l293p73J674
$$ 2048 1314 3866 2094 -2224 91 2406 -3840 -5604 1258 2197 -2418 697 4605 1312 539 2213
1637B213k846k675L751k2n089K898N761l236k813M314J258m075j5R80k329J081
$$ 2213 -633 -3308 443 421 -4668 -1770 3991 755 -2058 2256 3514 -561 -576 404 -1925 -844
1653h44J675k761n45M974k6n055K048L869l338k163L273o30k814L233L13m268
$$ -844 831 -1930 -2475 2499 2473 -2582 -534 3335 -3 -2166 1107 477 -2337 896 1209 -3059
1669c059K462M410m588l180N705J664n492K79M343j728k732K243q03j925K860
$$ -3059 -597 3813 -775 -3955 1750 3414 -2078 -1799 2544 816 -1916 327 -476 -2401 459
1684D59J178m240J537N208k189l952L744P51m209L7J217k291R73L742k409j699
$$ 459 1637 -2603 -1066 4142 1953 -1999 1745 2496 -1713 -1676 -459 -2750 -1777 1965 -444 -2143
1700b143N627J919o723j34N222l686n232L349J912l130K542L482k645J39N198
$$ -2143 3484 5403 -1320 -1454 3768 82 -5150 -1801 111 -3019 -477 3005 360 499 5697
1715E697l101n756K447K844n505j656M696O30j072K956O12j788K370N85o377j544
$$ 5697 2596 -3160 -713 2131 -3374 -5030 -334 296 -776 2180 2792 1004 3374 3959 -2418 -3962
1731c962N049k573m812M570M798k715J07L901j845k982L009j989o005K597M414
$$ -3962 1087 -1486 -6298 -1728 3070 355 462 4363 2518 -464 2545 556 -5449 -2852 1562
1746A562m449j636O874K164m880J232L343l105k071J037k588j617M286N56l938
$$ 1562 -2887 -4523 2351 4515 -365 867 4210 1105 -966 71 -2517 -4134 152 708 -3230
1761c230L258M924k988k940L246l04l989J103L57k728J680M556l557k139N821
$$ -3230 28 4952 1964 -976 2270 1966 -2023 -920 -563 -3291 -1611 2945 -612 -2751 3070
1776C070J284o401M02N002l217l578K965R20k202K061J563l494P51M602k523m609
$$ 3070 4354 -2047 -1645 3357 140 -3438 -473 447 -1755 306 1869 -1625 -874 3728 1205 -3404
1792c404L735K484m053o05K822j020r36K333j425k038L333J346n064Q54N161k055
$$ -3404 331 2815 -1238 -1843 979 -41 -977 1356 -69 -2107 1226 2572 -2492 -1638 3523 1468
1808A468m402L021K164l568N6K341k049r02M035m28m138L146K916m429k065M121
$$ 1468 -2934 87 2251 -1317 -1261 1080 -969 -1871 2164 1736 -2402 744 3660 -769 -2834 1287
1824A287K3l449Q76J937j584J192J788k168o20L406j589l929J588L086k996j435
$$ 1287 1310 -2139 -1263 674 -910 282 2070 -98 -718 2688 1099 -2830 -1242 1844 -1152 -2587
1840b587L335j24j307K444j45l133J780K408m537j820M590O78m282J344L964j682
$$ -2587 748 624 -683 1761 1616 -1517 263 2671 -1866 -3686 904 1582 -2700 -1356 2608 926
1856I26j418K039p68j952J706N7l394J563L325k110k054L383J006k887P75O73
$$ 926 -492 1547 779 -1173 533 590 -2804 -1241 2084 -26 -2080 1303 2309 -578 197 870
1872H70j874MJ901k260p75L937L47m407J918L836k929k779K720N71k851J419J470
$$ 870 -1004 -1000 901 -1359 -2134 1803 2150 -2257 -339 3497 568 -2211 509 1080 -1771 -352 1118
1889A118k547P51K865j855k764L519J278l835o02L258p02j853J578l3q51J788
$$ 1118 -1429 -678 2187 332 -2432 1087 2365 -1470 -2072 1186 484 -1369 209 176 -675 1113
1905A113M1k587M51L200k287k566L245J152k792L58K187j291q25K350j578k657
$$ 1113 1154 -1433 -982 2218 -69 -2635 610 1762 -1030 -672 1515 224 -601 1749 171 -2486
1921b486L141J514l928l31M404m37l822K225J805k267o38J514j521o91K424r50
$$ -2486 655 2169 -1759 -2090 2314 1877 -1945 280 2085 -182 -820 694 -827 -1518 906 -44
1937d4k386K751K395l100o38K675r92j934J107o9j672J531J663k615J52M294j325
$$ -44 -2430 321 2716 -384 -1022 1653 661 -1273 -166 -235 -1907 -376 1287 -1328 -1176 3118 1793
1954A793m054K275K987l839j642K705j76j894K154J019k331J642K684l370k104
$$ 1793 -2261 14 3001 -838 -2480 225 49 -1845 309 1328 -1003 639 3323 -47 -2151
1969b151L059L3l537R80K363j084j99J897r31l66K539j158l876J641K482l252
$$ -2151 908 941 -2596 -1616 747 -337 -536 1361 430 64 2603 1445 -2431 -790 1692 -1560
1985a560j757L934O55k445J552J749k242L33K322l045k407L365Q22m018J087M065
$$ -1560 -3317 617 1272 -1173 379 2128 -114 219 2541 -504 -2911 454 1276 -2742 -1655 2410
2001B410j384k451K599N96j937M46L59k838Q93K512j659j822L673R51l150L41
$$ 2410 1026 -1425 1174 1770 -167 279 638 -2200 -1307 1205 -454 -2276 1397 2348 -802 -461
2017d61K312j866j097J856j138j767K873R83l982O86M574j694m068K968K424l275
$$ -461 1851 -15 -1112 744 -394 -2161 712 1695 -2287 -1601 2973 1279 -2789 179 2603 -672
2033f72o79K518j014j406K471j111k514K830J808k849j151L736o04k380J147Q13
$$ -672 -1351 1167 153 -1253 1218 107 -2407 423 2231 -618 -1769 1967 1363 -1017 130 943
2049I43j622K49J077k553L27L203j020k942L111K855l909r74K677j011k937J734
$$ 943 -679 -430 647 -1906 -1579 1624 604 -2338 773 3628 -281 -1255 1422 411 -2526 -792
2065g92R37k070J577K721k185j103L807m04m310M94K297k078j682K091L36o4K017
$$ -792 145 -1925 -348 2373 188 -915 2892 2488 -1822 -1328 969 -1109 -2791 -700 -364 -428 1589
2082A589M55k293J364J848l606k207K639K16k886J615K387j181Q20K107j628k120
$$ 1589 2044 -249 1115 2963 -643 -2850 -211 5 -2881 -1266 1121 -60 760 2867 1239 -881
2098h81K423m39m287M15L467j162k199L589J943k083K15J340k205j259J422j919
$$ -881 1542 1103 -3184 -2769 698 -464 -2663 926 2869 786 1001 2341 136 -1123 299 -1620
2114a620k018K696K257k184N50L338j079k095J087n40k313J201M85k520J232L641
$$ -1620 -3638 -942 1315 -869 -319 3019 1940 -155 932 392 -1921 -720 -235 -2755 -1523 2118
2130B118j026k820L596J591l843j173K476j420j711J845M71j605K054K606k897
$$ 2118 1092 -1728 1868 3459 -384 -1557 919 -501 -2212 -367 104 -1501 553 3159 262
2145B62r87L158r50l688R79J942j553k64J651l54m47K314j347k436J661K167l398
$$ 262 -725 2433 1483 -2205 -1226 716 -837 -1101 550 196 -251 2063 716 -1720 -59 2108 -1290
2162a290j422L908l91k220J832J086k116J65J813k073j260L361R4l509J194L428
$$ -1290 -2712 1196 805 -1415 417 1503 -613 -448 1365 -708 -1968 1393 1487 -2022 -828 2600
2178B600k175k165K050N14k068N60Q40j319R20K476k211j115K608j3l022J0K237
$$ 2600 425 -1740 310 824 -1244 -684 156 -1163 -243 2233 22 -1093 1515 1502 -1520 -1510 727
2195G27j602m94K000n62l82K058K28l011N47K684k969k666L220J661k798O64K865
$$ 727 -875 -1369 631 69 -313 1745 1973 -1038 -491 2193 -776 -3442 -222 1439 -1359 -695 2170
2212B170j197o58J540j090k888J789Q06k957M81L230r1j818K066J046j783o09
$$ 2170 973 315 1855 765 -2123 -334 472 -2485 -2004 1226 1135 -683 1383 2429 646 37
2228C7L00k266l30K879j237j707L051K249k544l82K656j811k544J070J69k486
$$ 37 337 -1929 -2259 620 -617 -2324 727 2976 432 50 2706 895 -1649 -579 -410 -2896
2244b896J659K326j818K64L497k58l560Q31J575k649j403J614k01p7J668N03j015
$$ -2896 -1237 1089 -729 -465 3032 2774 -786 45 1620 -1029 -2432 -818 -1019 -1096 572 1075 60
2261F0J560Q60k582j522K246q85k411J125J943j114Q68K216j415j350K378r14
$$ 60 1620 2480 -102 -1624 622 -263 -2674 -1549 394 -720 148 2364 949 -401 1977 1063
2277A063l960J789K143k723r64L287P95j744O69J612j740o01J412j774j789K449
$$ 1063 -2897 -1108 1035 -1688 -2652 635 1430 -314 355 1967 227 -374 1038 -736 -2525 -76
2293g6J026k563Q54K662p13j660J761m83j900R75L79k086N58L071j961j793L161
$$ -76 950 -1613 -759 1903 1190 -470 1291 808 -1092 -117 262 -1824 -1266 1805 -156 -1949 1212
2310A212Q81l039J81J896j010j723K068k67j391J684J178k401k70K378p27k477
$$ 1212 2093 -946 -765 1131 121 -1602 466 199 -1192 492 1670 -731 -1001 1377 650 -1827
2326a827J837J231j246o36J540q93q94J673q73j842K264R13k428L48K602p12j757
$$ -1827 10 1241 -5 -641 899 6 -888 785 -88 -1930 334 1247 -1181 -833 1769 1057 -700
2343g00J195L75j856L50J012j580m37L068n39k246J534K234k463j222J715m48
$$ -700 495 870 -986 -636 376 -1204 -1641 1427 888 -1358 176 2410 -53 -1275 440 -8
2359hj704J136O18r26J088J917j635o72K042m07l193N04J529j623o8J641k52k19
$$ -8 -1712 -576 42 -884 204 2121 486 -186 1856 1449 -1744 -1240 289 -1334 -1402 239 -13 -232
2377b32K207k08k178P85J630k639k065K500Q37k456J296K372j371k67J439j012
$$ -232 1975 1767 -411 374 2004 -635 -2700 -200 637 -1819 -523 1849 478 211 1650 638
2393F38j659J393J34k635M29K372o72j073J839P87q79l9Pj086j48J007j913m57
$$ 638 -1021 372 506 -2129 -1700 672 0 -1073 766 1553 674 635 642 -444 -592 415 -1498 -1955
2411a955K187Q32j789M13K336j453j171J366k81j811J187O53k212M71L123j297
$$ -1955 232 1064 -725 -312 2024 571 -600 766 485 -1326 -139 514 -1698 -1227 1896 599
2427E99j900J955J493k716m35J623q88p15R74l4o88J065R66j844K02K097j203
$$ 599 -1301 654 2147 -569 -1004 619 -269 -984 -10 -44 -732 333 1299 -545 -343 1754 551
2444E51j649J030Q00j294J64J071j181k71J631k72j916J892J049k181n90K055
$$ 551 -1098 -68 732 -562 -398 673 -508 -779 852 580 -1336 556 1605 -576 -1166 889
2460H89M3k227J101P81j152J80J172j110l95J534J94j924Q12J416j441q80J055
$$ 889 932 -1295 -194 587 -565 -385 787 -323 -718 816 1010 -914 -102 1314 -127 -1007 48
2477D8P8n32O27j05q14J147J065j750n39J926m13k101P84J304r49o28J706l70
$$ 48 126 -406 221 116 -698 449 1514 -236 -775 1151 738 -1363 -579 725 -224 -852 854 484
2495D84j068J529L4j996P44J715j557j567K057N41j543N24J045r47l20J120r03
$$ 484 -584 945 979 -1017 -273 1442 -115 -1682 375 916 -627 -103 942 -5 -325 795 -108
2512a08r47J536L90k220L96K035o43j476J613J48j353P40N89j607L61J404o38
$$ -108 -1055 481 871 -1349 -953 1082 439 -1037 576 724 -629 111 700 -907 -546 858 220
2529B20j766J751J290k031n33K003k37j466J059L01j231M09P48j420L28J572p86
$$ 220 -1546 205 1495 -536 -1069 934 697 -769 290 591 -640 -231 517 -903 -575 997 211
2546B11j383J226R75j063k22R89q24l48R83o53r91J547J073k431j14K300n56k077
$$ 211 -1172 54 1029 -34 -256 733 -91 -439 544 -109 -1100 447 1520 -911 -1025 1275 719 -1358
2564a358J491N64r09k64J178j118m84J751j00j876Q88J388j470p99J522L78j111
$$ -1358 133 697 -212 -476 702 -416 -900 851 751 -1125 -237 1151 -319 -1118 404 782 -329
2581c29Q91J18j094K90J087j712l12J744J76j927R71J365j194l84J365j126p45
$$ -329 562 680 -414 -124 963 -749 -1061 683 859 -1068 -97 1268 74 -310 1055 -71 -816
2598h16J294k76j105L48J722p50j361J850M96j743m93J314o24q36Q27Km97Q62
$$ -816 478 202 -903 -555 1167 417 -944 906 1402 -341 -834 480 -144 -980 -153 -151 -648 214
2616B14J024j586L16J427j185j209J093J95j307M49J030p89L51J369q41r93J266
$$ 214 1238 -348 -32 1395 210 -999 94 289 -1018 -569 461 -328 23 1392 551 -442 824
2633H24O3k185K00J488n95q97J243R14r56J49J058j273o03J231p13j515R70J287
$$ 824 887 -1298 -1098 390 -205 -1102 141 1055 99 248 1306 33 -570 661 -52 -1567 -597 690
2651F90j422j31J771j71r36P47K53j484P03N32j558N3J595Q3j577J002J002j025
$$ 690 -732 -863 908 737 -199 548 801 -683 20 552 -1006 -953 642 725 -852 150 1152 127
2669A27k93R02q86o16R07M8j148N62J415j224q20J486M78j515Q0R52o34l31P32
$$ 127 -166 736 -150 -766 141 189 -959 -397 1018 -206 -1026 460 938 -577 -497 455 -179 -510 222
2688B22m24o10J249l04j152Q34J298j232n3Q69k09j029O94Rp78L8J153j131m60
$$ 222 -202 -812 437 133 -1019 -185 1113 -119 -172 697 488 -541 153 162 -616 -578 575 -556 -1016
2707a016J781M70j704K34J354n30j243P94j40j265P14O42q57M15J728p02r99R43
$$ -1016 765 1235 -469 -235 1119 589 -654 140 0 -1265 -551 91 -766 -351 1377 675 -324 619
2725F19O7j376k29Q21n45k19J003n5k54J198M77j981L49J043j023j276R29M16
$$ 619 686 -690 -919 -98 -643 -862 141 86 -168 1030 1507 -474 -125 918 -105 -1381 -452 -36
2743c6p80L68J349p82J7J300p32j079M02K71j277l08J250L74p26P65M37k45kM80
$$ -36 -816 -448 901 119 136 1436 704 -375 27 298 -979 -1287 -37 337 -389 376 813 568 566 1046
2763A046j356p49J339p26r03J069J018q56K79R06l28p06L2L74j203K39J014j390
$$ 1046 -310 -1059 280 -446 -1349 -280 738 -118 161 1067 739 33 65 439 -764 -525 489 -901
2781i01n0J910J9j473O12R41j107l42M78o87j92P86L84q73K92J660j371m32Q19
$$ -901 -951 959 978 -495 117 1058 -49 -391 87 -600 -792 -6 378 -495 -203 1457 86 -346 473
2800D73k02j062N80N06o02k7J057r86l03J345m26j287M99J291j001n01R14N4p34
$$ 473 271 -791 -211 295 -307 -334 723 -263 -566 779 353 -934 -435 856 -145 -646 268 322 -412
2819d12M50P2m96j01J177n76q62J104K47r10J5P96k79q01L37r2l09R42L23p79
$$ -412 38 110 -386 -487 690 114 -748 356 603 -307 -292 504 225 -576 -239 -331 -640 302 625 -154
2839a54J48P67l23r80N47M44j292J13O48l97Q4J050j98j018J355J8j002n68P66
$$ -154 -6 761 438 -542 5 449 -843 -730 -82 -479 -395 655 457 -561 794 812 -190 -758 8
2858Hj04q64M79Q66k92R6P98n58n66P25p87q89Q17N23r50n5J317L39q98P75L3
$$ 8 -96 -960 -481 385 93 189 987 429 -137 588 -199 -1088 -271 252 -698 -753 564 903 5 780 813
2879H13j038JN19r19o52J277J82p98P92N29n21k60P36j32j084L64o4p56P65R30
$$ 813 -225 -224 295 -624 -1276 1 183 -615 177 706 185 -75 661 529 -555 -191 -255 -1011 -246 684
2899F84m44m15P70K30j123K44K51r05N55M46n95k45J135j38r74R03P95j343m07
$$ 684 240 -175 595 825 -298 -54 197 -708 -153 293 -302 -547 588 450 -524 379 1174 -169 -576
2918e76R33l20r46P42P51p21K97N94n35q80R49L66j295L6J052k03o12P51O2m38
$$ -576 357 37 -909 -167 584 -137 160 754 219 -661 288 654 -641 -605 447 244 -368 383 445 7
2938GL09j99l98j01P56m91q18J068M35q28K5P47n83j97M88m54m75N47N03p26j68
$$ 7 316 117 -281 -382 374 -117 -935 133 568 -260 -235 512 -71 -268 220 -234 -709 -162 341 -385 -553
2959e53J471l20j037O11O20j044k16P44j85m58Q04Q1j093R36K89q23k48O08J70
$$ -553 918 598 -439 172 792 -252 -468 276 91 -367 437 518 -575 361 650 -173 -421 187 357
2978C57q60M02N04p15K67K77o51j75R82m05o98M94J121q37l64P32m12n42Q02K
$$ 357 -503 -101 403 -312 -45 232 -419 -594 388 -17 -715 -221 900 63 -301 431 19 -523 279 281
2998B81n90K15N00m82o95J284M45j633O17N64n84j72K65k75j59N26K19q42R32
$$ 281 -309 -94 406 -76 -771 513 958 -675 -58 506 -78 -250 15 -260 -419 107 326 -516 416
3017D16K64o67m99R43l35j011O68N97m41j10R17o46m26P59J51j322K70R32m51
$$ 416 680 13 -486 457 122 -889 -221 376 -65 -175 742 96 -330 429 580 -742 -472 460 9
3036Ip01Q36K84o71K84N71m75k38M40o62n2M23k25l37L99J65P0k72P76l47m34
$$ 9 -692 144 428 -243 41 612 137 -101 339 -323 -375 48 -177 -514 -115 50 120 -152 624 277 -157
3057a57K88J48j165J88R75n47l19J069K07q97K32Q19o43m62M17j9o74K71P43p06
$$ -157 131 279 -886 -698 277 -270 -589 480 687 -210 22 841 198 -264 153 134 -540 -269 474 -232
3077b32k71J354l60p03N75q2n09l2O28o07l03R30J20j043P34N61r31r4P84p38
$$ -232 -503 851 491 -212 363 281 -228 -260 368 -239 -542 388 508 -535 199 760 -171 -265 519 -219
3097b19o87P23L68n36K34O50n35j84P61l7j124O34J67j46n39L85K34o73O53J20
$$ -219 -906 -183 185 -351 -117 533 -2 -186 575 538 -586 48 215 69 -470 -85 149 -524 129 249
3117B49m96K88L16k40q68Q23N9q54L15Q24n50j96P31k31m11M10R1r26L95Q22o51
$$ 249 -247 41 357 117 -751 72 131 -723 -408 416 -134 -330 401 170 -241 169 260 -666 -271 551 -100
3138a00l93P28o3l29J87M81o75O6N04j66m05L65L45r43M25J93k7m16J64L99m36
$$ -100 -493 235 172 -157 30 511 -164 -98 406 240 -165 200 545 -398 27 220 193 -223 -59 340 -96
3159i6J46K02n25L41L75n09j25P03j68o84P7O02k79n82Q75n6n75N13K72o23n09
$$ -96 50 252 -273 68 443 -66 -191 512 344 -340 -263 339 60 -522 353 297 -278 235 507 -116 -625
3180f25J375p87o19M28L96l85j63N31o2q1J55j16l88K58K93l67M0M04j25q50O79
$$ -625 750 -37 -656 -228 168 -217 -380 151 89 8 163 47 -341 -83 210 -157 -117 287 162 -688 -9
3201iM04n70p7L32j20k95P51k12m40J33O23n57l99R85m80m93L79N33q01O3J015
$$ -9 395 -175 -252 80 -40 -335 416 204 -236 -103 520 -37 -436 549 69 -424 -45 488 -313 -250 765
3222G65p09m83M63K46q58J96O04m08J76L13P5l22N3L26j238P48L62p35j03Q24
$$ 765 56 -427 36 282 -576 -380 224 -184 -8 305 380 58 111 437 -801 -53 309 -426 -529 295
3242B95Q6p03K34O34o14N7L74k56p29M65M37q45O02J56N7n86P59J39n44k22K61
$$ 295 381 -322 -88 546 -68 -11 363 107 -622 -157 280 -565 37 193 250 -336 423 562 18 -204 57
3263E7j43l1Q3j96K73N67p2p92L47J39l26j88K04m4k26L98J94n05J09J027m89
$$ 57 -86 -117 -34 -230 43 610 538 -254 93 232 -94 -282 -78 -122 -348 50 244 -261 -152 875 386
3284C86j002P01J63r69M48L27R0m40L63L15l04L2M90o47j89K52m57k49M76K62
$$ 386 -616 85 248 -721 -273 54 144 -296 67 382 78 110 600 -47 -236 16 -441 -690 -214 48
3304D8j35K38K07k18m14R18o74m26J18M86o43j46R18J93q46O32J75o76J34N52
$$ 48 -87 151 358 140 -274 644 -30 -456 -338 148 -495 -641 277 470 -376 256 431 -245 -111 441
3324D41o07k28M35j20m09N64L09m26J81q6P6k82K58j02k98R4M84o60p1N86J18
$$ 441 -166 -394 41 -79 -488 76 385 -41 140 54 130 -152 106 4 -294 -200 284 -376 -447 139 257
3345B57n27L98J73m87l46Q04k10k80L10l2m34K41N83m31k14L28J25j20j87M35
$$ 257 -270 128 301 -186 -532 272 62 -218 92 60 -374 -133 450 19 -195 133 258 138 -49 386
3365C86k08n07K28M17m31P4M19o08M55K78j70o50L23r3k47L10l0l29M94M16l81
$$ 386 178 -329 -101 316 -115 -41 378 -230 225 503 333 -317 6 -87 -334 -24 -54 -383 111 527 146
3386A46l40N28J9o43N6P14o69j55K14J39J11k7M22j6m43J40l51j81r5L37j98j54
$$ 146 -194 334 353 -290 -234 480 -189 -344 -130 9 120 93 515 499 56 196 -155 -336 -431 -94 -292 -446
3408d46K86J40j12N48k56l80L41k8n9o42R34o00k84J026p4o18L67K85j33n93L08
$$ -446 -160 -20 -132 416 160 -220 121 93 34 -608 326 -274 -558 468 394 -224 143 428 295 -298 10
3429A0K03o09n7P46n59j53P35k22k43J42N09m64l52N08k49l17N75j23j89J21J82
$$ 10 213 -396 -453 293 -266 -419 316 94 -149 -7 502 38 -314 194 -55 -372 203 80 -109 12 194
3450A94k74K4M18l43m18J61L57k04O6L34m15j63N03K21o61Q1L57r0l59M30j48
$$ 194 -80 -56 362 19 -399 -238 119 -85 -19 315 -100 -263 240 461 -200 -119 238 148 -211 219 71
3471G1m36O87o1n28K78K75l88n8J09L62n45J11L27k02m68N45j84j59M64J29m17
$$ 71 -365 322 261 -267 11 286 -102 -160 -51 311 -234 -123 204 2 -466 79 -105 -264 200 329 -88
3492h8J72M99n53k39N26n3n52J95L97m86O7N51j91q33M79L85l00k61P17j93n42
$$ -88 84 583 30 -209 317 264 -288 -93 304 -182 -115 436 245 -588 -109 276 -24 -285 432 239 -303
3513c03K50L08l45Q7P09o69j50N96l51j71j62K18o06M36L41k70J94o0j2l85N30
$$ -303 -53 255 -90 -3 706 37 -113 483 132 -39 -201 17 -589 -153 188 -82 112 52 40 -345 185
3534A85J45l02l85P61n6n94J22M16m38K63L58k62j18R5M6m72r3O29k85n13N66
$$ 185 330 28 -357 404 348 -246 -124 292 -146 117 475 213 95 190 236 -236 -329 300 15 -498 68
3555F8P5k07rL59j00P6Q9o00k62Q46R8p64P4N12j16n61N71L3k80pN85l82m5K24
$$ 68 143 -64 -73 286 186 262 351 -249 -511 335 433 -331 -257 255 139 -422 149 182 -98 -105 480 98 53 277
3579B77m74n0K50L52l56K56j07k12j11N55j43n7R3k66j54j94L58l44R2M58J0l34
$$ 277 -197 -247 3 355 -1 255 148 -64 -175 380 237 180 273 7 -147 -341 17 -327 -235 223 233 -101
3601a01p4L47m85J84M94n00m37M29L26r4l02N40r3l08K82k40l02L61r8k68N0N87
$$ -101 -175 172 -313 -129 365 -135 -572 -143 183 89 -213 327 234 -74 208 -32 -334 27 -71 -339 -289 298
3623B98J7k74R6J23m43j46K20J76n57N72p1m57N59J79k13j11M31j00l35J05l36
$$ 298 315 41 137 260 -183 -329 -109 67 -490 82 11 -446 113 292 79 -32 399 299 -36 69 -267
3644b67K03l70K61K85l24J56N08l69J10J76m12j9Q1N8k86J42K32L6j00M56o31
$$ -267 -64 -434 -173 112 -212 -56 452 83 193 369 -43 -62 19 77 -209 -67 165 201 101 557 -74
3665g4j41M72k38j60K12J61l14R0K75j19j14K17j16n13N4N44n01k85P20n1l89
$$ -74 -215 257 19 -141 71 232 -82 8 283 164 50 267 151 -362 -308 236 -265 -550 170 119 -270
3686b70M53M2p9m7K09m38L9P1J36m83L35L03n13J26L90p5l50J7R2q3o8K58K26
$$ -270 183 225 146 99 308 -130 -91 -20 116 -367 -32 271 -242 -116 274 199 -151 -134 -42 -125 -193 65 291
3709B91n64N24k16J29k37J71N4J10jk55Q1j92N22n12l1L21r8l73K26K29m27K35
$$ 291 -273 251 35 164 -73 98 152 262 261 6 87 -105 417 -95 -126 195 97 -276 -50 179 -248 -13
3731a3L47m99o7K14P0o8Q5N2l47j56L57M42l72L52j17m62j90N41l20m73O48l6
$$ -13 334 -165 -232 -18 52 -16 69 121 -226 -382 -25 417 45 397 280 -182 -372 169 -151 -624 24 -12
3753a2j21K55J03L50n30R9Q5o22j30N44n9j42K32J11q6j33L22l56O7K63o83K01
$$ -12 -133 122 225 575 45 144 229 -393 -523 21 -38 -180 52 163 77 -56 266 -90 -23 240 -443 -242
3775b42k55N94m3p1N46o12QL81j18k75o5K64l35k7O5J46q0M56R6l91J10k45l5
$$ -242 -497 97 54 -17 529 -83 -75 306 188 -87 -152 112 -223 -250 -185 -39 -119 337 433 42 152 -93 -128
3798a28j53J69k49K10K88lk52J53L78n35K64K31n13p8K53J56o33N63J20qk95N6
$$ -128 -281 -112 -361 -151 137 134 -118 35 413 -122 142 373 -140 -218 35 191 -442 121 241 233 -62 -6
3820fJ42j82Q5K10j74N9J46j34j46K7J87m80K56J38j24j70R9L48j55j24K53m59
$$ -6 136 -46 39 249 75 134 280 146 0 27 214 -266 -10 128 4 -166 -67 281 126 2 255 -204
3842b04J95j08j84J58J44N0j09l6M34l3n94L38L4j82m66P27j12l43L84p5k89K37
$$ -204 -9 -117 -301 -143 1 51 -58 -94 340 307 -287 51 85 -97 -563 164 52 -291 93 18 -271 -34
3864c4J7J12l77L66k61j80L16J06k29K35q8J1oJ13k5m5l89M87j35M2L02l68o5
$$ -34 -17 95 -282 84 -177 -357 -41 65 -164 71 -17 -6 -12 101 76 31 -358 129 -6 36 338 -30 -95
3887i5J80Q4l90j47O93k52k70L23r5P7k97K36N0k10J27r7p6K98l29o1M76k57L47
$$ -95 85 169 -221 -368 325 73 -197 126 31 108 -189 47 97 -113 14 -83 -159 139 -190 -251 225 -32 315
3910C15n56kL21p7J56m4P2l05K51l46J77R2K86n28R3K76m99j14L63Q1L9Q7K0q6
$$ 315 -241 -243 78 1 157 113 185 -120 131 -215 -38 54 340 -188 -95 181 -318 -432 -69 12 51 138 158 72
3934G2k3L1l6j25j21L88m42J16K28k30J08K4K71j00j26r0J06k6K0L5l55K57K26
$$ 72 49 80 44 -81 -202 186 -256 -140 88 -142 -34 -10 261 161 35 -55 51 25 45 80 -275 -18 208
3957B08j47q4M32n72j31K15K53j63K6o3j62M15j5J35n49K85M9l35L98l68j86J39
$$ 208 61 -23 409 -163 -294 -79 174 11 37 -26 -188 227 212 347 -202 83 132 -203 195 -173 -359 -220
3979b20L43m19Q0L22m8j36n3L62q4m81M05P7o21J62M53m63M2M52j6l08K83j73
$$ -220 123 -296 -216 106 58 -78 -131 231 147 -334 71 148 -473 -311 142 -321 -279 173 157 -151 132 -41
4001d1j88K02K83j61l43P7L13k5k00N59o28j62M29p5j32K04j82L62n59L66j30
$$ -41 -229 -27 256 95 -248 -171 142 117 -83 476 -152 -314 115 40 -92 112 -70 292 -267 99 -31
4022c1J33Q5p5l65L63m0p9k66K99J0l23L38j48l3k4L75ll83j07J30K50k03M52
$$ -31 102 187 112 -253 110 70 -9 -275 24 34 -289 49 -99 -132 -156 219 216 -167 -274 -144 106 -97 355
4045C55l52j67O45l07j23R7j56l78J99L53j95J4L32l83J31J10k45R7j16K03l2
$$ 355 3 -164 481 174 51 148 -8 -386 -187 166 -29 -15 317 -66 65 175 -70 27 -89 114 82
4066H2m48K55K63j63j52J32j03N6L63l15j5J06k4k38J02J15J79m67L26N8l27L66
$$ 82 -366 -111 152 -11 -163 -31 -134 -78 285 -30 -45 61 37 -201 -99 16 195 -272 54 112 -215 151
4088A51k98N79o86J94o3P0p6J99j03k34K52j18P3l1L16k17k0L20l40k11K47j61
$$ 151 -147 432 -254 -60 -123 -53 -129 70 -33 -267 -15 -133 -60 -91 225 8 -12 308 -32 -243 4 -157
4110a57L75l04K16k95K82m1J70k67Q8r1R1j80M23l55k57Q01m16j65N5J61j04N4
$$ -157 218 -86 130 -165 117 76 246 -21 67 -24 67 -113 310 -45 -302 499 83 -82 -27 134 30 84
4132H4k7k4l35K74l6K25M5p0R1k06k8J03o4j3jl17j80N49J37l51k3L77j37j57
$$ 84 57 33 -302 -28 -64 161 206 136 227 21 -7 96 32 19 18 -299 -479 70 207 -144 -167 210 73 -84
4156h4K41rn2J42j73m2k8K72r3j69p6L7koO4l13O41k43J59j29l06M8L2oK67j88
$$ -84 157 148 96 238 65 23 -5 267 174 5 -71 -34 -36 -42 22 -291 350 107 266 137 -169 -121 -89 -95 172 -16
4182a6j92J18K13q3j81J43L03k70p1J92m77O34l64J02J90k20N4K55k50j26j41
$$ -16 -208 -90 123 40 -141 2 305 35 -36 156 -321 313 -51 51 241 21 75 330 80 -46 -187
4203a87K53J42l04Q8J98j88m54L44J61J35j09K14n34K26r2J64l9j67K80m4p7J21
$$ -187 66 208 -96 -8 190 2 -452 -108 53 188 79 293 -241 -15 -107 57 18 -149 131 87 10 131
4225A31j15J15k4j6r8k28l6L3L54k68LK57K6k82J15P9j75K29j27j19J24k02J17
$$ 131 16 131 107 91 -7 -235 -271 -238 116 -152 -149 108 134 -148 -33 46 -129 100 -27 -146 -22 -224 -107
4248a07L38k45j28L37J48m99M22k32j13O1J15k27N0J34J12J22k67k08L07j04J53
$$ -107 231 -14 -142 195 343 -156 266 34 -79 -18 97 -130 -80 54 166 288 21 -187 120 16 169
4269A69l16J1jJ21J21l74N48n15k26M99L53l77q1l4k47L1K34K75j81J18J78k06
$$ 169 -147 -136 -137 -16 105 -269 279 -236 -462 37 390 13 -68 -102 -349 -318 -84 191 10 128 306 100
4291A00j24K65o9m10m6M76q7j04j63L24j49J75m5j33j45K93l31j3J07j11l0K76
$$ 100 -24 241 172 -238 -284 192 105 1 -162 162 13 188 143 10 -135 158 -173 -186 -79 -190 -220 56
4313E6J91j58K5J8j07k88J03L28l49K35k03j01nL82j51k67M78ok14k67Q1J15l25
$$ 56 247 89 114 132 25 -263 -160 168 -181 54 -149 -250 -255 127 -24 -291 187 181 -33 -300 -219 -104 -429
4336d29L93r6MP2L0l1l3K9J03m13M96j28l8k04L30n4m98O93j94J16r3L7k07R1
$$ -429 -36 -132 -128 -56 -26 -57 -90 -61 42 -371 125 -3 -41 -245 85 31 -467 226 32 148 55 92 -115 -24
4360b4j99L89m84O7L56L2k65J07K01j96j27r%K10jk5m00P8K89L00k04j40KJ35
$$ -24 -223 166 -318 -251 105 137 -128 -21 180 -16 -143 -152 -152 58 57 32 -368 -290 -1 299 95 -45 -43 92
4384I2q5j35j04L83n00P8J03K77J09k02L68j41k95K75n33J04L59j53J71J5m9n0
$$ 92 7 -128 -232 151 -349 -271 -168 109 218 16 384 243 -52 223 -310 -206 153 0 171 186 137 87
4406H7k68M32P9n04J55k94K79m4K07k5j24j77J27L4j08J80K06l4j24k39q9N3J01
$$ 87 -181 251 330 -174 -19 -313 -34 -78 129 104 -20 -197 -70 -36 -144 36 242 208 84 -155 -244 -191 -90
4429i0J25j00J53j59K22K5q5k88J35j61J87m7M9N5om0j7K26M5k81O6j37M4K54
$$ -90 35 -65 88 -71 151 176 91 -197 -62 -223 -36 -83 -34 21 15 -25 -42 184 229 -52 14 -123 -79 175
4453A75k76J1L11j64l85N31n38M23j00j01j7O6M16j82o0k37L22k83k27K40j41
$$ 175 -101 -90 221 57 -328 203 -335 88 -12 -113 -130 -64 352 170 110 -127 195 -88 -315 -75 -216
4474b16K07Mj69J52p5k1J74Q8o2l23L87k4j17O1o8N6l25J18K11j16r0j08K23L13
$$ -216 -9 -5 -174 -22 -97 -118 56 144 82 -241 146 122 5 66 -2 54 -271 -153 58 -58 -148 -256 -33 280
4498B80n61K02J55p4l0J99l40J72r8J17J02n4j68JJ78k31O7J44j14o0k67J26Q8
$$ 280 -281 -79 76 2 -28 171 -169 3 -95 22 124 70 -98 -97 81 -150 -83 61 -53 -113 -380 -254 -166
4521a66p7k7K34J68j2M9P5j05k81J04l18j07N69N4k56n9K52n2k70L66m18K80j44
$$ -166 -243 -270 -36 132 120 169 244 139 -142 -38 -356 -463 106 160 -96 -155 97 45 -225 141 -277 3 -141
4544a41L1L5j39K54rK9k4o3J6L3n6J14k69P4p4J48j64M05m11K29J48QO4q0l48
$$ -141 -110 -75 -214 40 31 60 36 -27 -11 22 -34 80 -189 -115 -189 -41 -205 200 -211 18 166 174 238 158 -190
4569a90K75J84j60r3j15j07J25J72k00J95j17N1j11K37k04J72j08J1oj53M3j03
$$ -190 85 269 109 16 -99 -206 -81 91 -109 86 -31 20 -91 146 -58 114 6 17 11 -142 -99 -202
4591b02L3k9K27k81M44m13L02l16K14j42k28P43j89n8J9j1K9j5j27j37N31r5k40
$$ -202 -169 -198 29 -252 192 -221 81 -235 -21 -163 -391 352 163 105 124 113 142 127 0 -137 394 299 59
4614E9k17j77L96q0N8q3K02k59M37L8n30P2K78k86R8J45j01J73J16j73n2o5J6
$$ 59 -158 -335 61 -19 39 -44 158 -101 336 374 -156 -84 194 -92 6 151 50 223 339 166 114 49 65
4637F5k80J99K18m76K44Pk16K15OK29k61k19K11K12l60J57K92l14j15K86n9j96
$$ 65 -215 -16 202 -274 -30 -23 -239 -24 -18 211 -50 -269 -58 154 -206 -49 243 -71 -186 100 41 -155
4659a55L31l33l3OR8j46jK26m0q9M16K43q45M97l63J85n15N08K33k34m9o4P2o2
$$ -155 176 -157 -190 -184 -86 -232 -233 -7 -47 -136 280 523 -322 175 -188 -3 -518 -10 223 -11 -60 -124 -52 -114
4683a14Q6k06M31M4j76j12p1o4J49P0J44k66j49N62m35J19L56l58N9r0Q2JJ44
$$ -114 -28 -234 197 241 65 -47 -118 -182 -33 37 181 -85 -234 328 -107 12 368 10 69 -21 61 62 206
4706B06l32K17k76J31J54J1n1Q9k62K48j38J96k96k27L06J92l90K42j7k25J80
$$ 206 -126 91 -185 -54 100 111 60 149 -113 135 -3 193 -103 -330 -24 168 -222 20 3 -222 -42
4727d2L16k04j23%j52K61K9K01m18J36K07j74m1o0L01O6k86J26j23j4Q0j73J82
$$ -42 274 70 -53 -53 -205 56 85 286 -132 4 211 37 -4 -64 237 303 17 143 20 6 86 -87 95
4750I5k38L07k3n7j47R5o3k53J95L6j54LL08j95q1K07m9k9J30K4m00O9L0J27j09
$$ 95 -143 164 141 84 -63 32 -31 -284 -89 -53 -207 -204 104 -91 -172 35 -14 -43 87 111 -289 -220 -190 -63 -172
4775a72K26N4q7K5J08l80Q9Q7j83PN51k66J52m5N0r7K6j2k30Q5l4n6O3J32j39
$$ -172 54 108 21 46 154 -226 -137 -50 -233 -226 325 59 211 166 216 119 145 133 -97 -12 -46 -102 -39 93 -46
4800d6K58j81j77M02l05Q3k00M2j7K04q8j47L35k71O2o4J42J39k69J83Q9l01m7
$$ -46 212 31 -146 256 -49 34 -166 -124 -141 63 -25 -172 163 -108 -46 -110 32 171 -98 85 174 -127 -174
4823a74K20L27l61R9j77R4L7n9J28k10p6J76P5l73J12N73m59O0L01k79j2k09L65
$$ -174 46 373 12 111 -66 28 65 6 134 -76 -152 24 99 -274 -162 411 -48 12 313 34 22 -187 178
4846A78l01J80k38n9N3L91j81j6N7J5j42K42j54k65K40K21l58O9K21k99K37p7
$$ 178 -123 57 -181 -240 -187 204 23 7 64 79 -63 179 25 -240 0 221 -137 -68 153 -146 91 14
4868A4j84L95l3J53m19K37J55k03l95R3R2j4NK57n9O4p9p4JL09k12j33k16L63
$$ 14 -170 225 192 345 -74 163 318 115 -280 -187 -95 -109 -104 153 94 158 79 5 6 315 103 -30 -246 117
4892A17p9k02J73l1L8n2j6K56q6m5l34J26J40L9P5l7J50k53K0M2m7Qj14k9n2j
$$ 117 38 -164 9 -22 16 -36 -52 204 118 73 -261 -135 5 44 119 82 232 -21 -1 41 -6 2 -112 -141 -193 -194
4918a94L17N9l62J97M8l04K95j71N4K08J7j59j99J94Ok14L52Mj26l34M44k05r8
$$ -194 123 182 -180 17 65 -239 56 -115 -61 147 164 5 -194 0 6 -208 144 148 22 -312 132 -73 -171
4941a71K77j94j58L39j92j18K09r0J02J28j18m2J11O4J77o76N01lm60J41J49L62
$$ -171 106 -88 -246 93 -99 -217 -8 -98 4 132 14 -28 83 147 324 -352 149 146 -314 -173 -24 338
4963C38m37M7J6l8J2j23j90M01j02m5q5L78r5Jj61J09m1j46M0J20o7R9J79mm89
$$ 338 -99 -52 -36 -74 -62 -185 -375 26 -76 -121 -206 172 77 78 -83 26 -15 -161 -121 -1 -68 31 210 206 -283
4988b83J35M90o60J58L20l21O3Q7k99j01M17M0O7k90K68J26o8j17r0J5lj54J15
$$ -283 -148 342 -318 -160 160 -161 -98 -11 -310 -411 6 46 113 -177 91 217 149 32 -58 -43 -46 -200 -85
5011h5J78j62R8r0K60j33m6j10K73j33p7J14k26J32q2L25k39j41k15M23k8RK20
$$ -85 93 -69 29 -61 199 66 20 -90 183 50 -27 87 -139 -7 -89 236 -3 -144 -359 64 36 45 265
5034B65k75n7m1J31k6l48K41R5J26m32O54k23Q8j23mj75Q9Km23K38K64j18K7M6
$$ 265 -10 -67 -108 23 -3 -351 -110 -15 111 -321 333 110 198 75 71 -104 -15 -13 -436 -198 66 -52 -25 21
5058B1j49J90j11k3J57l4QN0J06l23L30k5r7K3j54j76J47L1K2NJ08k88L49j85
$$ 21 -128 62 -49 -72 85 51 59 109 215 -108 222 197 100 123 -31 -207 -60 -29 -7 -2 106 -182 167 -18
5082a8m11N05L3J33n25K30L3J45j45l0j05K04J9N3k9k90J28J4J67m3k39J67M5
$$ -18 -429 76 109 242 -283 -53 -20 125 -20 -50 -155 49 68 121 92 -198 -70 -56 111 68 -171 -4 41
5105D1o0J40j67J12m3j40P8J17k99N75m26J76l8l11N47m86J0J56J00q5q0L49j12
$$ 41 -19 121 -46 66 23 -117 -39 78 -221 354 -72 104 66 -245 302 -184 -174 -18 82 -3 -83 266 154
5128A54j99j55L00j35N4k68K33N39n26NO6Q6k33ok1m8r7N04O2o13K34J62j90J5
$$ 154 -45 -200 100 -35 19 -249 -16 523 -3 2 68 154 -79 -85 -106 -154 -251 253 315 -298 -64 98 -92 -77
5152g7J92j97k2k50J56K16J89J02l33j01k5J70J89j76j6R4Kj47J13o6J54k92M46
$$ -77 115 -82 -104 -354 -198 18 207 309 -24 -125 -150 20 209 33 17 111 113 -34 79 13 167 -125 321
5175C21j38j39J72j46k69MK81k08J82j3k46J07j6m5K72j85J38j32K05j41l9Q5
$$ 321 183 44 216 70 -199 -195 86 -122 60 47 -199 -92 -108 -153 119 -66 72 -60 145 4 -35 50
5197E0j16l1K12k87K17j74J6J51p3J74mj05K2k0j44r5J36J7p5l2R3k2j32M69j7
$$ 50 -66 -97 115 -172 45 -129 -113 38 -35 139 135 30 52 32 -112 -207 -71 -54 -129 -161 -68 -90 -222 247 230
$$ [...]
8191E0
##END NTUPLES=NMR FID
##END=
