##TITLE=1H_Ser 2188-ox'
 CDCl3
 8 sc, 
 4.7.2024
##JCAMPDX= 6.0         $$ Bruker NMR JCAMP-DX V2.0
##DATA TYPE= NMR FID
##DATA CLASS= NTUPLES
##ORIGIN= UXNMR, Bruker Analytische Messtechnik GmbH
##OWNER= root
$$ XWIN-NMR		Version 3.5
$$ Thu Jul  4 14:38:59 2024 Russian Standard Time (UT+4h)  she@DPX200
##.OBSERVE FREQUENCY= 200.1314
##.OBSERVE NUCLEUS= ^1H
##.DELAY= (6, 6)
##.ACQUISITION MODE= SIMULTANEOUS
##.ACQUISITION SCHEME= undefined
##.AVERAGES= 8
##.DIGITISER RES= 18
##SPECTROMETER/DATA SYSTEM= spect
##.PULSE SEQUENCE= zg30
##.SOLVENT NAME= DMSO
##.SHIFT REFERENCE= (INTERNAL, DMSO, 0, 15.7039)
##AUDIT TRAIL= $$ (NUMBER, WHEN, WHO, WHERE, WHAT)
$$ ##TITLE= Audit trail, XWIN-NMR		Version 3.5
$$ ##JCAMPDX= 5.01
$$ ##ORIGIN= Bruker BioSpin GmbH
$$ ##OWNER= she
$$ F:/spectra/data/she/nmr/H-F/1/audita.txt
$$ ##AUDIT TRAIL=  $$ (NUMBER, WHEN, WHO, WHERE, WHAT)
(   1,<2024-07-04 14:36:55.18 +0400>,<she>,<DPX200>,
      <created by zg, POWCHK disabled, PULCHK disabled
       configuration hash MD5:
       00 E9 B6 7A A2 85 ED C7 34 08 36 98 17 FE 4E 26
       data hash MD5: 16K
       94 BD F4 33 55 45 DC 6F BB 26 8F 70 1D 59 9B BC>)
$$ ##END=
$$ 
$$ hash MD5
$$ FA 2D 92 E7 32 C8 42 57 E0 66 07 5A 7E FF 42 8F
##$RELAX= 
##$RELAX= 
##$RELAX= 
##$RELAX= 
##$RELAX= 
##$RELAX= 
$$ Bruker specific parameters
$$ --------------------------
##$DU= <F:/spectra>
##$EXPNO= 1
##$NAME= <H-F>
##$PROCNO= 1
##$TYPE= <nmr>
##$USER= <she>
##$AMP= (0..31)
100 100 100 100 100 100 100 100 100 100 100 100 100 100 100 100 100 100 
100 100 100 100 100 100 100 100 100 100 100 100 100 100 
##$AQSEQ= 0
##$AQ_mod= 1
##$AUNM= <au_zg>
##$AUTOPOS= <>
##$BF1= 200.13
##$BF2= 200.13
##$BF3= 200.13
##$BF4= 200.13
##$BF5= 200.13
##$BF6= 200.13
##$BF7= 200.13
##$BF8= 200.13
##$BYTORDA= 1
##$CFDGTYP= 0
##$CFRGTYP= 5
##$CHEMSTR= <none>
##$CNST= (0..31)
1 1 145 1 1 1 1 1 1 1 1 1 1 1 1 1 1 1 1 1 1 1 1 1 1 1 1 1 1 1 1 1 
##$CPDPRG= <>
##$CPDPRG1= <>
##$CPDPRG2= <>
##$CPDPRG3= <>
##$CPDPRG4= <mlev>
##$CPDPRG5= <mlev>
##$CPDPRG6= <mlev>
##$CPDPRG7= <mlev>
##$CPDPRG8= <mlev>
##$CPDPRGB= <>
##$CPDPRGT= <>
##$D= (0..31)
0 1.2 0 0 0 0 0 0 0 0.06 0 0.03 0 0 0 0 0.0002 0 0 0 0 0 0 0 0 0 0 0 0 
0 0 0 
##$DATE= 1720089414
##$DBL= (0..7)
120 120 120 120 120 120 120 120 
##$DBP= (0..7)
150 150 150 150 150 150 150 150 
##$DBP07= 0
##$DBPNAM0= <>
##$DBPNAM1= <>
##$DBPNAM2= <>
##$DBPNAM3= <>
##$DBPNAM4= <>
##$DBPNAM5= <>
##$DBPNAM6= <>
##$DBPNAM7= <>
##$DBPOAL= (0..7)
0.5 0.5 0.5 0.5 0.5 0.5 0.5 0.5 
##$DBPOFFS= (0..7)
0 0 0 0 0 0 0 0 
##$DE= 6
##$DECBNUC= <off>
##$DECIM= 24
##$DECNUC= <off>
##$DECSTAT= 4
##$DIGMOD= 1
##$DIGTYP= 9
##$DL= (0..7)
0 120 120 120 120 120 120 120 
##$DP= (0..7)
150 150 150 150 150 150 150 150 
##$DP07= 0
##$DPNAME0= <>
##$DPNAME1= <>
##$DPNAME2= <>
##$DPNAME3= <>
##$DPNAME4= <>
##$DPNAME5= <>
##$DPNAME6= <>
##$DPNAME7= <>
##$DPOAL= (0..7)
0.5 0.5 0.5 0.5 0.5 0.5 0.5 0.5 
##$DPOFFS= (0..7)
0 0 0 0 0 0 0 0 
##$DQDMODE= 0
##$DR= 18
##$DS= 0
##$DSLIST= <SSSSSSSSSSSSSSS>
$$ [...]
##$SUBNAM2= <"">
##$SUBNAM3= <"">
##$SUBNAM4= <"">
##$SUBNAM5= <"">
##$SUBNAM6= <"">
##$SUBNAM7= <"">
##$SUBNAM8= <"">
##$SUBNAM9= <"">
##$SW= 24.0689651099613
##$SWIBOX= (0..15)
0 0 2 0 0 0 0 0 0 0 0 0 0 0 0 0 
##$SW_h= 4816.95568400771
##$TD= 16384
##$TD0= 1
##$TE= 0
##$TE2= 300
##$TE3= 300
##$TEG= 300
##$TL= (0..7)
0 120 120 120 120 120 120 120 
##$TP= (0..7)
150 150 150 150 150 150 150 150 
##$TP07= 0
##$TPNAME0= <>
##$TPNAME1= <>
##$TPNAME2= <>
##$TPNAME3= <>
##$TPNAME4= <>
##$TPNAME5= <>
##$TPNAME6= <>
##$TPNAME7= <>
##$TPOAL= (0..7)
0.5 0.5 0.5 0.5 0.5 0.5 0.5 0.5 
##$TPOFFS= (0..7)
0 0 0 0 0 0 0 0 
##$TUNHIN= 0
##$TUNHOUT= 0
##$TUNXOUT= 0
##$USERA1= <user>
##$USERA2= <user>
##$USERA3= <user>
##$USERA4= <user>
##$USERA5= <user>
##$V9= 5
##$VALIST= <valist>
##$VCLIST= <CCCCCCCCCCCCCCC>
##$VD= 0
##$VDLIST= <DDDDDDDDDDDDDDD>
##$VPLIST= <PPPPPPPPPPPPPPP>
##$VTLIST= <TTTTTTTTTTTTTTT>
##$WBST= 1024
##$WBSW= 4
##$XGAIN= (0..3)
0 0 0 0 
##$XL= 0
##$YL= 0
##$YMAX_a= 58030
##$YMIN_a= -88039
##$ZGOPTNS= <>
##$ZL1= 120
##$ZL2= 120
##$ZL3= 120
##$ZL4= 120
##$ABSF1= 10
##$ABSF2= 0
##$ABSG= 5
##$ABSL= 3
##$ALPHA= 0
##$AQORDER= 0
##$ASSFAC= 0
##$ASSFACI= 0
##$ASSFACX= 0
##$ASSWID= 0
##$AUNMP= <proc_1d>
##$AZFE= 0.1
##$AZFW= 0.1
##$BCFW= 1
##$BC_mod= 2
##$BYTORDP= 1
##$COROFFS= 0
##$CY= 11.3945322036743
##$DATMOD= 1
##$DC= 2
##$DFILT= <>
##$DTYPP= 0
##$F1P= 15.6554695791079
##$F2P= 12.8336369535428
##$FCOR= 0.5
##$FTSIZE= 0
##$FT_mod= 4
##$GAMMA= 1
##$GB= 0.15
##$INTBC= 1
##$INTSCL= 1
##$ISEN= 128
##$LB= 0.24
##$LEV0= 0
##$LPBIN= 0
##$MAXI= 10000
##$MC2= 0
##$MEAN= 0
##$ME_mod= 0
##$MI= 1.114404
##$NCOEF= 0
##$NC_proc= 0
##$NLEV= 6
##$NOISF1= 3.799351
##$NOISF2= 2.8
##$NSP= 1
##$NTH_PI= 0
##$NZP= 0
##$OFFSET= 15.70392
##$PC= 1
##$PHC0= -25505.36
##$PHC1= 10.38748
##$PH_mod= 1
##$PKNL= yes
##$PPARMOD= 0
##$PSCAL= 0
##$PSIGN= 0
##$REVERSE= no
##$SF= 200.130013532006
##$SI= 16384
##$SIGF1= 3
##$SIGF2= 2
##$SINO= 400
##$SIOLD= 16384
##$SREGLST= <1H.CDCl3>
##$SSB= 0
##$STSI= 0
##$STSR= 0
##$SW_p= 3612.71676300578
##$SYMM= 0
##$S_DEV= 0
##$TDeff= 0
##$TDoff= 0
##$TI= <>
##$TILT= no
##$TM1= 0
##$TM2= 0
##$TOPLEV= 0
##$USERP1= <user>
##$USERP2= <user>
##$USERP3= <user>
##$USERP4= <user>
##$USERP5= <user>
##$WDW= 1
##$XDIM= 8192
##$YMAX_p= 0
##$YMIN_p= 0
$$ End of Bruker specific parameters
$$ ---------------------------------
##NTUPLES= NMR FID
##VAR_NAME=  TIME,          FID/REAL,        FID/IMAG
##SYMBOL=    X,             R,               I
##VAR_TYPE=  INDEPENDENT,   DEPENDENT,       DEPENDENT
##VAR_FORM=  AFFN,          ASDF,            ASDF
##VAR_DIM=   8192,          8192,            8192
##UNITS=     SECONDS,       ARBITRARY UNITS, ARBITRARY UNITS
##FACTOR=    0.0002076,     1,               1
##FIRST=     0,             0,               0
##LAST=      1.7004516,     0,               0
##MIN=       0,             -88039,          0
##MAX=       1.7004516,     58030,           0
$$ Real data points
##PAGE= N=1
##DATA TABLE= (X++(R..R)), XYDATA
0@%%%%%%%%%%%Pj4J4j4J4j5K2k8K9l6M3n0N8o5P6q5R5j09J23j38J57j77J98k21
$$ 0 0 0 0 0 0 0 0 0 0 0 0 7 -7 7 -7 7 -8 14 -14 15 -21 22 -28 30 -35 41 -44 51 -58 65 -73 84 -93 105 -116
35a16K44k69L00l35L70m10M56n05N60o21O88p63Q51r52J066j202J367j571J826
$$ -116 128 -141 159 -176 194 -216 240 -265 295 -326 362 -401 450 -502 564 -638 729 -842 984
54I84k157K610l269M318o254J0975m5285m9961Q2008N101m1898L2996N5930j6669
$$ 984 -1173 1437 -1832 2486 -3768 7207 -38078 -88039 -6031 -930 -42828 -9832 46098 29429
68B9429o170K7818j9667m1433Q127j3685m5290R071M5883m581j0708M3247K2978
$$ 29429 23259 51077 31410 -10023 -1896 -15581 -60871 -51800 -5917 -10498 -21206 22041 45019
81D5019k4766P288P494l8882j5389J6864j8820k2547L4976K9014k6816j573L6643
$$ 45019 20253 27541 35035 -3847 -19236 -2372 -21192 -43739 -8763 20251 -6565 -8138 28505
94B8505l630k6793L68R69j5637Q24J3814q159K740K9596m127k3681J3927J3966
$$ 28505 24875 -1918 -1550 -581 -16218 -15394 -1580 -9739 -6999 22597 18470 -5211 8716 22682
108B2682k4558j7572J2400j414q236J5256L306j0182J6167J2281j9615r051K2591
$$ 22682 -1876 -19448 -7048 -8462 -16698 -1442 1864 -8318 7849 20130 515 -8536 14055
121A4055L31k8551L037K1686q655p623J0537n912r780J2567K267k0841P135K5682
$$ 14055 14386 -14165 -11128 10558 1903 -5720 4817 -1095 -10875 1692 3959 -16882 -9747 15935
135A5935j3587j5136K3666J1307j9307o722Q242p883p193J0121o088r553J8747
$$ 15935 2348 -12788 10878 22185 2878 -3844 4398 -3485 -10678 -557 -6645 -16198 2549
148B549R914j5630J202J8644m567k0699J005P353n283J056J984l699Q551J1266
$$ 2549 12463 -3167 -1965 16679 12112 -8587 -7582 -229 -5512 -4456 -2472 -6171 2380 13646
162A3646o070q239O950K379j6264m904O705PK103J855k428P289J3584l590j5397
$$ 13646 7576 -663 6287 8666 -7598 -12502 -5797 -5790 -3687 -1832 -4260 3029 16613 13023 -2374
177b374L806Q194j5153q842R978K333m188M909L753l049Q143Q927j7307j1356
$$ -2374 1432 9626 -5527 -14369 -4391 -2058 -6246 -1337 2416 -633 7510 16437 -870 -12226
191a2226J6750M36j8913L717J6709l783p558J1595K798q658N702j535j7639J518
$$ -12226 4524 4960 -13953 -10236 6473 2690 -4868 6727 9525 867 6569 5034 -12605 -11087
205a1087J6579p059j5185J4138J6415j2260l612J4077l375j0722K601j916r827
$$ -11087 5492 -1567 -16752 -2614 13801 1541 -2071 12006 8631 -2091 510 -1406 -11233
218a1233P751J0655j3986m732K1375K326j6754L218R672r334q156Q038j041m478
$$ -11233 -3482 7173 -6813 -11545 9830 12156 -4598 -1380 8292 -1042 -9198 -1160 -2201 -6679
232f679J2354J59j2996J0263J4174j4140j3861J2053K257j5566L608J0273p117
$$ -6679 5675 5834 -7162 3101 17275 3135 -10726 1327 3584 -11982 -8374 1899 -5218
245e218L275J1304p434n696J5672J975k3582Q45J8406j0310j2883J4084L867j0466
$$ -5218 -1943 9361 1927 -3769 11903 13878 -9704 -8859 9547 -763 -13646 438 4305 -6161
259f161N993R247j2147j156J6121j0856j7008J7693J1887j9250m637J8864j847
$$ -6161 -168 9079 -3068 -4224 11897 1041 -15967 1726 13613 -5637 -10274 8590 6743
272F743j4241R692N012j4459M717J0219j3835m897J9745J61k0762O625J7866j0541
$$ 6743 -7498 2194 7206 -7253 -2536 7683 -6152 -11049 8696 8857 -11905 -5280 12586 2045
286B045r932J1489J244q779M244N781j0056K00J2733r552j3097J3832Q970j4270
$$ 2045 -7887 3602 4846 -3933 311 6092 -3964 -3764 8969 -583 -13680 152 9122 -5148
300e148l509J3597L83q029O711J735q008M214K558j0958j384J2192j892j2707
$$ -5148 -8657 4940 5323 -2706 4005 5740 -2268 1946 4504 -6454 -7838 4354 2462 -10245
314a0245O346J2483o140m442O167j922m355M039j515q211O355Q034j0550l893
$$ -10245 -3899 8584 2444 -1998 4169 2247 -2108 1931 416 -7795 -1440 6594 -3956 -7849
328g849J5045R92j0576O30M884l884k245L515m310k763J0117qr201O356J0637
$$ -7849 7196 8188 -2388 -1758 3126 -758 -3003 512 -3798 -6561 3556 3548 -5653 703 11340
343A1340p320r700O714L935q420J80K325m760L023O354m495l056Q982L289j0900
$$ 11340 4020 -5680 1034 4969 -3451 -3271 -946 -5706 -2683 3671 -824 -3880 5102 8391 -2509
358b509j408R032k036o420R3J441Q74K194J91l734J957O144n414n277N702K495
$$ -2509 -3917 5115 3079 -3341 -3248 -1807 -933 1261 1452 -2282 -325 5819 405 -4872 830 3325
374C325m411l183K258L011J322k31l899N11O385k696n964J963L966k747l985K085
$$ 3325 -1086 -4269 -2011 1000 2322 2091 -1808 -1297 5088 2392 -3572 -1609 2357 -390 -4375 -2290
390b290L562l42R04k130k455N223K779o144m102O330L077p864n39P083j704k668
$$ -2290 1272 930 1834 -296 -2751 2472 5251 -893 -4995 1335 4412 -3452 -3991 3092 1388 -1280
406a280J284o73r54L979L05p501R21R828k610q173N133N908n869m525M489L22
$$ -1280 4 -669 -1623 2356 2661 -4840 -3919 5909 3299 -4874 259 6167 298 -4227 262 584
422E84l747L564p00n440O849O705q142m444R240J645j0522M56O301l916j819L749
$$ 584 -3163 401 -299 -5739 1110 7815 -327 -4771 4469 6114 -4408 -3952 2349 -1567 -3386 363
438C63j715K69O550K4q930K072Q486p497p715O468J967l970J590L927o66J854
$$ 363 -1352 -1083 5467 5491 -3439 -1367 7119 -378 -8093 -1625 342 -3628 -2038 1889 1223 3077
454C077L828n952n226P746k59j0325L58P238m26l948N286L263l007K157O0p093
$$ 3077 6905 953 -4273 3473 3214 -7111 -6753 485 59 -3889 1397 4660 1653 3810 3870 -3223
470c223R46N542n285p500O889Q048n678j943P270r43m038O34l15m355J955L719
$$ -3223 -2277 3265 -2020 -9520 -2631 5417 -261 -2204 5066 4123 85 719 404 -3951 -1996 1723
486A723o093j767J0884J565q544N95O983k702o201K663J396l679L087J609m372
$$ 1723 -4370 -6137 4747 6312 -2232 -1637 5346 2644 -3557 -894 502 -3177 -90 1519 -2853
501b853K293O526m066p838M912O212o828l048O622N18k534J958m8l361J886K097
$$ -2853 -560 5966 1900 -5938 -1026 5186 -1642 -4690 1932 2450 -84 1874 1826 -1535 351 2448
517B448p402j582Q679K41o076L207N733j162k900J054k217l015K521k475m407
$$ 2448 -4954 -6536 2143 2384 -3692 -485 5248 4086 1186 2240 23 -2992 -471 -2946 -7353
532g353N619O556m453k027O648K431o424j653M25l903P03J472k736J581P085J261
$$ -7353 -1734 4822 369 -1658 4990 7421 997 -656 -231 -4134 -3431 -1959 -4695 -3114 3971 5232
548E232n652K542N857n094o623J134j6j864O96K080n47L971N836l631m286M906
$$ 5232 -420 2122 7979 2885 -3738 -2604 -2620 -4484 -3788 -1708 -2255 1716 7552 3921 -365 4541
564D541O68p996l585L833R82k899J705L490L78L269J039m141p98K741k519p035
$$ 4541 5209 -2787 -6372 -2539 -1557 -4456 -2751 739 1117 4386 5425 1284 486 3227 708 -6327
580f327J261N710j773k178L255K634N32Q0j010l185J402J744n222k880N257K519
$$ -6327 -5066 644 -1129 -3307 -52 2582 3114 3194 2184 -1001 401 2145 -3077 -5957 -700 1819
596A819m012J61M338R54j992k2j316j243L149j413m999K717M859k371l812L970
$$ 1819 -2193 -2032 2306 3260 1268 1246 -70 -1313 1836 423 -4576 -1859 3000 629 -3183 787
612G87K904l595m98Q41j922J739K114m077j858N333J128o141K74O136k030l426
$$ 787 3691 96 -402 439 -1483 256 2370 -1707 -3565 1768 2896 -3245 -2971 3165 1135 -2291
628b291K695J262r47P26N41m252L22M975l906n539N520M093l770j484M669J004
$$ -2291 404 1666 719 1445 1986 -2266 -1944 3031 -875 -6414 -894 3199 -571 -2055 2614 3618
644C618k486O49j557l090K431N39m751l61O401J720m408J963M855k603l264K58
$$ 3618 1132 1781 224 -2866 -435 104 -4647 -5008 1393 3113 -1295 668 5523 2920 -344 -86
660h6q66j605R78J40k138K909N916k895l597L778J188m619k699J514L20r10J757
$$ -86 -952 -2557 -1579 -1439 -3577 -668 5248 2353 -1244 2534 3722 -897 -3596 -2082 -1762 -2672 -915
677i15O27R0M722J049n511q95L527k026o359J453L889j352Q38K874m05Q19K279
$$ -915 -288 -198 4524 5573 62 -833 2694 668 -5691 -4238 -349 -1701 -863 2011 1606 2425 4704
694D704l203m241J827K574n404k206N960J841j626J429J359j312l83K06m329j752
$$ 4704 1501 -2740 -913 1661 -3743 -5949 11 1852 226 1655 3014 1702 1319 1525 -2804 -4556
710d556N476j026m880M147N575j546k994J903J53l455L29p34l504L597L486l268
$$ -4556 920 -106 -4986 -839 4736 3190 196 2099 2252 -1203 -874 -1608 -5112 -1515 1971 -1297
726a297o31N591J659n355j012L182k697j915J102j505R33L295j1k503J926M452
$$ -1297 -1928 3663 5322 -33 -1045 2137 -560 -2475 -1373 -2878 -1945 1350 1339 -1164 762 5214
742E214l937m201K608J634k792r14J450O1J102K123j971j913L644O97n190k31
$$ 5214 1277 -2924 -316 1318 -1474 -2388 -938 -877 225 2348 377 -1536 2108 2805 -2385 -2616
758b616M286n39l298J110J887j345J087M75k691P96L528j884l728L216L521m576
$$ -2616 1670 1131 -2167 -1057 830 -515 572 1047 -1644 -848 2680 796 -2932 284 3805 -771
774g71k463M396k83k224J438Q4j669K362K384l906j119N444j214o141J707L922
$$ -771 -3234 1162 879 -1345 93 177 -1492 870 3254 -652 -1771 3673 2459 -3682 -1975 1947
790A947k508l019L479Q96k023M223L58n241K114M013m990m336N098K007n396R60
$$ 1947 -561 -3580 -101 795 -1228 2995 3353 -1888 226 4239 -751 -5087 11 2018 -3378 -2418
806b418M594j539r6K726k086k852L351Q29o496m0O409k551m235M846L209l600
$$ -2418 2176 637 541 3267 1181 -1671 1680 2509 -3987 -4027 2382 -169 -4404 442 3651 51
822E1K98K514l093j111L746k592n165M498L626m690p07N376M98m474J819J604
$$ 51 349 2863 -230 -1341 2405 -187 -5352 -854 2772 -1918 -2625 2751 3249 -1225 594 2198
838B198l083M00J624l863p64M867P77n321K089N441l304k901L569M27l331M34
$$ 2198 -885 -485 1139 -2724 -3488 1379 2156 -3165 -1076 4365 1061 -1840 1729 2156 -1175 -741
854g41M28k045P60M142l359l025N570K051m858n33M367j313l745K020M56k596
$$ -741 -313 -2358 -1598 2544 -815 -3840 1730 3781 -1077 -1610 2757 1444 -2301 -281 175 -2421
870b421K245J717l885M17N569j505m773K761L386m371j546L623j121j749K415
$$ -2421 -176 1541 -2344 -1927 3642 2137 -2636 125 3511 -860 -2406 1217 96 -1653 762
885G62p47k372K856L350m864j764N338k09m816J303K596j883j270K596j051j221
$$ 762 15 -2357 499 3849 -1015 -2779 2559 2350 -2466 -1163 1433 -450 -1720 876 -175 -1396
901a396L659q96m074K436L693l811k308K794R18k548P67J307j795J371J579k359
$$ -1396 2263 1367 -2707 -271 3422 -389 -2697 97 1015 -1533 -766 541 -1254 117 1696 -663
917f63q30L752O86m688R3L668j971j886J477k0q54J393K62j762K066K518l392
$$ -663 -1493 2259 2945 -1743 -1650 2018 47 -1839 -362 -382 -1236 157 419 -1343 723 3241 -151
934a51k177L353O78k671n50J367J52o79J226o24p11K796n51l596J295L080j675
$$ -151 -2328 1025 1703 -968 -1518 -151 1 -678 548 -76 -787 2009 1458 -2138 -843 2237 562
951E62l221J772J762j481L86J556k077Q86J972k059j910K692J384m596m63M113
$$ 562 -2659 -887 875 -606 -220 1336 -741 145 2117 58 -1852 840 2224 -2372 -2835 1278
967A278n95k057J788J91j211J452J396l527j14M075k188m280L734K660l824j030
$$ 1278 683 -1374 414 605 -606 846 2242 -1285 -1399 2676 488 -3792 -58 2602 -1222 -2252
983b252L267j2k081L004k37l714K897K071m467j271M705k92n252K271L769k847
$$ -2252 1015 1003 -1078 1926 1689 -2025 872 2943 -1524 -2795 1910 1618 -3634 -1363 2406 -441
999d41N7K716k306r17L021o71m474J678L831l607k767N406J116l761J065K614
$$ -441 -384 2332 26 -891 2130 1459 -3015 -1337 2494 -1113 -3880 1526 2642 -1119 -54 2560
1015B560k874j00K941l423l176M808P13m858K024M654j853l371L293J651l881
$$ 2560 -314 -414 2527 -896 -4072 736 1449 -3409 -1385 3269 1416 -1955 1338 2989 -892
1030h92J224Q78l964J82M515j754l704M196L438m807q99M775j710l226J554L52
$$ -892 332 1210 -2754 -2572 1943 189 -3515 681 4119 -688 -1587 3188 1478 -1748 -194 158
1046A58k779J547K938l058j757N422P32n173J957L615l365l123K913L99k827K463
$$ 158 -2621 -1074 1864 -1194 -2951 2471 3203 -1970 -13 3602 237 -2886 27 426 -2401 62
1062F2J049l599J884M545k868l469L965J736n182o00L975j945k116K766J51j766
$$ 62 1111 -2488 -604 3941 1073 -2396 1569 3305 -1877 -2477 1498 -447 -2563 203 354 -1412
1078a412K818J626m073q51M670j687m015K611J824k895l59K725q90r36L074j404
$$ -1412 1406 3032 -1041 -1892 2778 1091 -2924 -313 1511 -1384 -1743 982 92 -844 2230 826
1094H26l080K936K181l886j562L066M73k716J204K197j781J46J398j962n87K973
$$ 826 -2254 682 2863 -1023 -2585 481 954 -1762 -558 1639 -142 4 1402 -560 -1147 1826
1110A826o71l361J271K923k038j752K500%j344Q08M34j246J186J603k583j648
$$ 1826 1155 -2206 -935 1988 -50 -1802 698 698 -646 162 596 -650 536 2139 -444 -2092
1126b092L257M04k968J08J411l73o31J219K56q14J574m63k412J302J860k180j990
$$ -2092 1165 1569 -1399 -1291 120 -253 -884 335 591 -223 1351 888 -1524 -222 1638 -542 -2532
1143b532J643J542j092j17J798q90N7P54j480r99K040J39k942J56L599n82k135
$$ -2532 -889 653 -439 -556 1242 352 409 1163 -317 -1316 724 863 -2079 -1923 1676 1094 -1041
1160a041J898J59j175P04N6j992O25J928k040j574L524R96k457j20J703o01j374
$$ -1041 857 1016 -159 545 601 -1391 -766 1162 -878 -2452 1072 2068 -389 -509 1194 593 -781
1177g81J418r20j418K080J136k916J062K951j834k925K436J286k301j50J605j435
$$ -781 637 -283 -1701 379 1515 -1401 -339 2612 778 -2147 289 1575 -726 -876 729 -706
1193g06j61K798j250k437K589J742m176p46M250j234k694J766J332j986J131J814
$$ -706 -867 1931 681 -1756 833 2575 -1601 -2347 1903 669 -2025 -259 1073 -913 218 2032
1209B032k476r25L194q04l872K205K844l120j130L116L55k191J381O01k642Q15
$$ 2032 -444 -1369 1825 1021 -2851 -646 2198 -922 -2052 1064 1419 -772 609 1210 -1432 -617
1225f17K186k076k072L358J004l724O12M129j812j919J930l78j775J205J152k719
$$ -617 1569 -507 -2579 779 1783 -1941 -1329 2800 988 -931 999 621 -1154 51 1203 -1516
1241a516n31L513j164k883L216K175l065j203K901m41j978J584l43k426J629K657
$$ -1516 -2047 1466 302 -2581 635 2810 -255 -1458 1443 1002 -976 608 265 -2161 -532 2125
1257B125k716j077L516K81l512J126K687k639j370J878p66j237K421J32k525R66
$$ 2125 -591 -1668 1848 2129 -1383 -257 2430 -209 -1579 299 -467 -1704 717 849 -1676 -710
1273g10L741k488k315L247L38l234J48J739j199j61J694j010j385K969J027l283
$$ -710 3031 543 -1772 1475 1813 -1421 -1273 466 -733 -894 800 -210 -1595 1374 2401 -882
1289h82L09K578j394k789J446J374j765K50J530j311N20K127j036j832J192J637
$$ -882 -573 2005 611 -2178 -732 642 -1123 -873 657 -654 -134 1993 957 -875 317 1954
1305A954k633r46J803n3j501Q26R44k70O22P07j401p66J873m27k633N88J891j297
$$ 1954 -679 -1625 178 125 -1376 -550 394 124 746 1453 52 -714 1159 732 -1901 -1313 578 -719
1323g19o48J475J229n76K74j39j193O69N72j814q52J119R23j341J37J878m63r3
$$ -719 -1367 108 1337 761 1035 896 -297 372 944 -870 -1722 -603 320 -1021 -884 994 531 438
1341D38L40q51J51M50n92j613O45J589j97j267R97Q78o85L7N5m91O5N87j415m81
$$ 438 778 -73 78 528 -64 -1677 -1032 557 360 -907 90 968 283 320 375 -116 -51 536 -879 -1360
1361a360J720L17j524K84J510j84j037M47M30q97Q32m16j350J081J456j564j321
$$ -1360 360 677 -847 -563 947 763 -274 173 603 -294 538 122 -1228 -147 1309 -255 -1576
1378a576K023J056k190M92R51j293Q9J341j042n89J484Jj945J15K846j173j853
$$ -1576 447 1503 -687 -195 756 -537 -448 893 -149 -738 746 747 -1198 -1083 1763 590 -1263
1395a263J183R30p65R7O31j074k17J407j068j423J639J108k067j64J829L50j702
$$ -1263 -80 850 85 182 813 -261 -478 929 -139 -1562 77 1185 -882 -1046 783 1133 -569
1412e69Q02M65j371N46P12j537k67K256o31j823J467J475j446o58J012l28p81
$$ -569 233 698 -673 -127 585 -952 -1219 1037 406 -1417 50 1525 79 -579 433 105 -676
1429f76O77L70j670M95K046j206j160K064R55k602P8J647o03j342Q37j13j181
$$ -676 1 371 -1299 -804 1242 36 -1124 940 1895 -707 -629 1018 415 -927 -90 -203 -1384
1446a384J072J261j935K28K868j432k248J626J333j907m02J383n82n88J589p83
$$ -1384 -312 949 -986 -758 2110 678 -1570 56 1389 -518 -920 463 -119 -707 882 99
1462I9j179J168J349j552j010K117j91j964Q38P05o83l45R23l58p78J768L67k413
$$ 99 -1080 88 1437 -115 -1125 992 801 -1163 -325 380 -303 -648 275 -83 -861 907 1274 -1139
1480a139R28J808j469j393J220Q80j479mJ121j156L16J430m80j234J213R50k084
$$ -1139 -211 1597 128 -1265 -45 835 -644 -648 473 -683 -367 1063 583 -651 562 1512 -572
1497e72m48J629n66j382L98J124k46J78Q90q55r8J082k82j947O42Q48j254p41
$$ -572 -1020 609 43 -1339 -941 183 -63 115 1005 150 52 1134 852 -1095 -453 395 -859 -1600
1515a600R15J411n01Q8O21o03K42J39j231n30M94L00j014K69J667j62l90P63J64
$$ -1600 -685 726 225 313 934 331 573 712 -519 -1049 -555 -255 -1269 -1000 667 505 115 878 1042
1534A042m24J77j004o29m15J273p26m70J152J053p14j07P44j0j099j35j20j170
$$ 1042 618 795 -209 -838 -1253 20 -706 -1176 -24 1029 315 208 952 942 -157 -292 -412 -1582
1552a582J270N1o45O56J354j59o97J16P32j259k19J10q51P71O74r79J33J190M33
$$ -1582 -312 -261 -906 -250 1104 945 248 364 1096 -163 -382 -272 -1123 -352 322 -657 -524 666 1099
1571A099p28m87R40m63q50q0j8l13R63J89n32L79Q90l09j491P44M18m62o28N66
$$ 1099 371 -116 824 361 -489 -569 -587 -900 63 252 -280 99 989 680 -811 -67 351 -111 -739 -173
1591a73J92l43K85N7m91Q27J15r10KR56J65j161J21N15m46J3M38q02M03M27j75
$$ -173 19 -324 -39 18 -473 354 469 -441 -439 517 682 -479 -358 157 -289 -276 162 -640 -237 190 15
1612A5l48O04J183r35j531R19M26o97j20L07k73K27Q94k76n08R40J46j819RJ164
$$ 15 -333 271 1454 519 -1012 -93 333 -364 -484 -177 -450 -223 671 395 -113 827 973 -846 -837 327
1632C27l81r27N49Q25p33N68O78j369J94R84p84j636J481J108j489o7J442k44
$$ 327 -54 -981 -432 393 -340 228 906 -463 -269 715 -69 -1705 -224 884 -605 -672 770 526
1650E26m45M18n7q60l9R61r40m77J630M40j771R02J083r34q97N61n51l91Q54M67
$$ 526 81 499 442 -418 -457 504 -436 -913 717 1157 -614 288 1371 437 -460 101 -450 -841 13 480
1670D80j271Q79J057q76o97P94K93j098m62R64l89l4O10m8k87M71M80j236l31
$$ 480 -791 88 1145 269 -428 366 659 -439 -901 63 -326 -360 250 202 -85 386 866 -370 -701
1689g01J493l78j647O86P76l42m04Q02l9k19O16k98j130N11R33j210m10J491J18
$$ -701 792 414 -1233 -547 229 -113 -517 285 246 27 643 345 -785 -274 659 -551 -961 530 648
1708F48j061L56P98r49N41J27p66l25J078O5j145r3J665o02p51N09R2j84j99M87
$$ 648 -413 -57 741 -208 333 460 -306 -631 447 512 -633 -726 939 337 -414 95 187 3 -196 291
1728B91n58J73R06o93j241J200M73j348Q2J134j07l64J19M19k72k92L49p32k42
$$ 291 -267 -94 812 119 -1122 78 551 -797 -715 419 312 -52 67 486 214 -78 271 -461 -703
1747g03J115o35r19J030M94j15L3K79k99j54K39q44n67M77O12q08J13J605k48
$$ -703 412 -223 -1142 -112 382 267 300 579 280 126 365 -479 -1046 -569 43 -765 -652 953 705
1766G05o26K06K66k08j99j88n56l62Q86j98p91J304O42o99l28O29J68r59N7K94
$$ 705 79 285 551 343 144 -44 -600 -962 -76 -274 -1065 239 881 182 -146 483 651 -308 -251 43
1786D3p11M08M87r67j38J538M72j264j3J289p61j447J065k84n49L41N80q71P34
$$ 43 -668 -260 227 -740 -878 660 1132 -132 -145 1144 383 -1064 1 -283 -832 -491 89 -782 -48
1805d8J383l84j425J216L93j812l7O88k06n66R21K86r99J111O21j170p4J149p26
$$ -48 1335 951 -474 742 1135 -677 -714 -26 -232 -798 123 409 -590 521 1142 -28 -102 1047 321
1824C21j594N22R64r93L62P84k53oP18o5j240P66O82j569n16J503K7j253Q00O21
$$ 321 -1273 -751 213 -780 -418 366 113 107 825 760 -480 286 968 -601 -1117 386 413 -840 -40 581
1844E81r03J02J054q93l66R81j45j537M53J390q47q20J181J79r40L87R69j069
$$ 581 -322 -220 834 -59 -425 556 411 -1126 -673 717 -130 -950 231 410 -530 -143 826 -243
1862b43J09J002j070n21Q12N28j407J74J298m55n97Q34nn31L36J66p44n26J745
$$ -243 -134 868 -202 -723 89 617 -790 -616 682 227 -370 464 459 -72 264 430 -314 -840 905
1881I05r58j142Q31Q09n56j63P17K56o94N28l95r53O20O96j404M74R27k0j006
$$ 905 -53 -1195 -364 445 -111 -274 443 699 5 533 138 -815 -195 501 -903 -429 498 478 -528
1900e28K86R56m99m80N24o92R8O29j07q37N00R54p53r66J096M25r48K27M62o95
$$ -528 -242 714 215 -265 259 -433 -335 294 187 -650 -150 804 51 -915 181 606 -342 -115 347 -348
1920c48j19O49n28m47N83P58j368N58O25pp94M85N24q84M91J48j163M15J006n46
$$ -348 -467 182 -346 -793 -210 548 -820 -262 363 356 -438 47 571 -313 178 326 -837 -422 584 38
1940C8o55Q89L79o44j2R58q50n12M53j70m65N78K79q22L97Q99r12l44J154or19
$$ 38 -617 272 651 7 -5 953 103 -409 44 -126 -591 -13 266 -556 -159 740 -172 -516 638 632 -287
1961b87J9K25k77j42P94k32r10J182K48o88j64R67m83o07J28M45p31K88Qm6J43
$$ -287 -268 -43 -320 -462 332 100 -810 372 620 -68 -232 735 252 -355 -227 218 -513 -225 -217 -263 -120
1982a20Q69l13r57N39Q15j143k16J089l48p08K28L10n58K08Q77k04j015J285K95
$$ -120 749 436 -521 18 833 -310 -526 563 215 -493 -265 45 -513 -305 572 368 -647 638 933
2001I33j461J77P48p79o37P67L21q46J217L83p68O9R34r68j039J061J78j185J80
$$ 933 -528 -351 397 -382 -1019 -252 69 -777 440 823 55 124 1058 90 -949 112 290 -895 -715
2020g15P90m82K3J017j14n17L48O61j661j00J034p41l65Q24L51p61O92J116q47
$$ -715 75 -407 -384 633 519 2 350 1011 -650 -750 284 -457 -822 2 353 -408 284 1400 553
2039E53j042J164m65j584P31J068r19k86J288k7l42L91j53m63J21M64q02j107
$$ 553 -489 675 210 -1374 -643 425 -494 -780 508 481 139 530 377 -86 35 499 -303 -1410
2057a410J484M74j327O15J137n35n99O47j55o83L28J94p20k0J080n65n32P77N85
$$ -1410 74 548 -779 -164 973 438 -161 486 331 -352 -24 170 -550 -570 510 -55 -587 190 775
2076G75j069k75J030m76q07J084j16o84L16P64q92j58J009j74q97L67J109p97
$$ 775 -294 -569 461 -15 -822 262 146 -538 -222 542 -350 -508 501 327 -570 -203 906 109
2094A09m66P99n08k83M93k29r75P86P67r05J7J348l09j084l9P75n42l38M39l9
$$ 109 -357 442 -66 -349 144 -85 -1060 -274 493 -412 -395 953 644 -440 -479 296 -246 -584 -145 -184
2114a84k50P83M3o80O68O32j417k04M97p2m26K18M14k41Q12K62o36m51J020k80
$$ -184 -434 349 392 -288 380 1012 -405 -609 -112 -184 -610 -392 22 -219 593 855 219 -232 788 508
2134E08j082MP98q71r0J181l22k92Q17o2q02j98P79o56n29J216j11n93P50J97
$$ 508 -574 -570 228 -643 -733 448 126 -166 651 589 -213 -411 368 -288 -817 399 288 -305 445 642
2154F42j79k94K63m70q95O59L99q68K08Q48l1l46Q30j85m40k78m2m75j09O80k06
$$ 642 463 169 432 -38 -933 -274 125 -743 -535 313 282 -64 766 581 141 -137 -179 -654 -763 -83 -289
2175b89l90J022P05p35j23N19o64p27O95m41l17N94J56k51l2J389m34p90M49J79
$$ -289 -679 343 1048 313 190 709 45 -682 13 -428 -745 -151 5 -246 -278 1111 677 -113 336 515
2195E15p71l55N84k35m74R10J67n82N99O03j116m12R68l78n60J22N65m87J40Q94
$$ 515 -256 -611 -27 -262 -736 174 341 -241 358 961 -155 -567 401 23 -537 -415 150 -337 -197 697
2215F97k99o02R14j97j115M52O58n09j163J294j12n90Q99J41n69N8N53l51j023
$$ 697 398 -204 710 513 -602 -150 508 -1 -1164 130 18 -572 327 468 -101 -43 510 159 -864
2234h64Q38N91p13p44J233n18n78O08K24j71J69M08l99k85J006o74o23K79K16
$$ -864 -26 565 -148 -892 341 -177 -755 -147 77 -94 75 483 84 -201 805 131 -492 -213 3
2253Cj58o56R60Om92L86O56n45J80J05o64q05J106k49o29L32J148n78K30M06m8
$$ 3 -155 -811 149 155 -337 49 705 160 340 445 -219 -1024 82 -167 -796 -464 684 106 336 742 694
2274F94n00j10K7j098K70O30m72q3Q03P47m83m58O61k64n77M23n75o12O05N67
$$ 694 194 84 111 -987 -717 -87 -559 -642 161 908 425 -33 628 364 -213 210 -365 -977 -372 195
2294A95o49J20R74j06o99K92M46o81k99N15p15j42R06P2k59Q60Po74m09O47m06
$$ 195 -454 -334 640 534 -165 127 573 -108 -407 108 -607 -749 157 229 -30 830 837 163 -246 401 -5
2315ep01K13N53k71J45M61k18k51L81r1o88M45M89n62j83P44m92k01N93m35k58
$$ -5 -706 -493 60 -211 -66 395 177 -74 307 216 -472 -27 462 -100 -283 461 -31 -232 361 -74 -332
2336c32K47J95m37L43j3L51j81l32J79l2j75L10l18k12P63k07m24N13K32k33k85
$$ -332 -85 110 -327 16 3 354 173 -159 20 -12 -187 123 -195 -407 356 149 -275 238 470 237 -48
2357d8K80j37m80m5M71k33K19N61n19m4O42L24j015m1L42n55l23L04N19p07R07
$$ -48 232 95 -385 -430 41 -192 27 588 69 25 667 991 -24 -65 277 -278 -601 -297 222 -485 422
2378D22L68m78j83O53o64p12M99L8p05M0R93R8p37P88j09l96L17K20n85o9J36
$$ 422 790 312 129 782 118 -594 -95 -57 -762 -722 271 369 -368 420 311 -85 232 452 -133 -202 -66
2399f6K4l41K29O59k20k64M02m87q1L49j51m28N03J34n29l92P81K25n38L31J39
$$ -66 -42 -383 -154 505 285 21 423 -64 -145 204 53 -375 128 262 -267 -659 122 347 -191 140 279
2420B79o67J1O97m63j34O85K67j256L11Q92o04l10O49l3p68J59O09l05J85J79
$$ 279 -388 -377 320 -143 -277 408 675 -581 -270 622 18 -292 357 324 -444 -285 324 19 204 383
2440C83k57m44L84K53p98K2O90k06m64M19J56k43L32O6k00m30N25K2q09N66J57
$$ 383 126 -318 66 319 -479 -457 233 27 -437 -18 138 -105 227 293 93 -337 188 210 -599 -33 124
2461A24J13k78N47l10n31K82K62n66L33L03m04l26L63O55r95K49J035n77o03M90
$$ 124 237 -41 506 196 -335 -53 209 -357 -24 279 -125 -451 -88 567 -428 -179 856 279 -324 166
2481A66j61r1k27J74l70N09M13k99j89M67K3l03j15j30N6j2K32j88k10M20M29
$$ 166 5 -86 -313 -139 -509 0 413 114 -75 392 415 112 -3 -133 -77 -89 143 -45 -255 165 594
2502E94o61M74k25m5l01j0L36k66M8j70K57l3L91m36j50L95j6k74l48M41l8Mk29
$$ 594 -67 407 182 137 -164 -174 162 -104 -56 -226 31 -2 389 -47 -197 198 182 -92 -440 1 -37 -33 -262
2525b62J58J03j61K49J53l32L64J40m99J55L28k24k71J22k6q0k04M69l49N5M55
$$ -262 -104 -1 -162 87 240 -92 272 412 -87 68 396 172 -99 23 -3 -83 -287 182 -167 -112 343
2546C43n6k14k73L81m4l72L60l39J0N25n45K72L70j62j58j18K19k37n20M83l66
$$ 343 287 73 -200 181 137 -235 125 -214 -204 321 -224 48 418 256 98 -20 199 -38 -558 -75 -441
2567d41P48r3J38l80L22l4k30o5J49j23l99R4M99l98k08O27M8j93L13k70m45K7
$$ -441 307 214 352 -28 294 260 30 -35 114 -9 -408 -314 185 -213 -421 206 254 61 374 104 -341 -314
2589c14O54n33k48P5N41j03l98N94M0l39L09k89j45K92M7k96k23M92j35k62M45
$$ -314 340 -193 -441 -366 175 72 -326 268 308 -31 278 -11 -156 136 183 -113 -336 156 21 -241 204
2610B04k54K78k14J80j77k39K72K32m80m2R2R0j16Q5L16k79mK41q9j7n1J14n59
$$ 204 -50 228 14 194 17 -222 50 282 -198 -240 -148 -58 -174 -89 227 -52 -56 185 96 79 28 142 -417
2633d17N59K78k75m04N22O2o46M36R4j41l9o9k2p4K76J7m00J98L97l82l11M14
$$ -417 142 420 145 -259 263 325 -321 115 209 68 29 -40 -62 -136 140 157 -243 -45 352 -30 -341 73
2655G3P4k24l5N13l19k73M46l95n07O71L94p91j1O96k04m59N20N8m51L09m0n97
$$ 73 147 -77 -112 401 82 -191 255 -140 -647 24 418 -373 -384 312 108 -351 169 227 -224 85 45 -552
2677e52J72M09j83k80M83M93m67R6J64jo38N2j71J87j36N06j75j14P51k4p31K51
$$ -552 -380 29 -154 -434 49 542 75 171 335 334 -304 -252 -423 -236 -372 134 -41 -155 596 572 -159 92
2699I2K83k40j94l82Q19n21M43l13j19M41r3m7l06M9q5p6J71O7O2P3k58M2K06
$$ 92 375 135 -59 -441 378 -143 300 -13 -132 309 216 169 -137 -88 -173 -249 -78 -11 51 124 -134 -92 114
2722A14J95n58K78K9L35k20k11r0L32l16o4L70n26K3Q48n59J92PJ61N4n36L58
$$ 114 309 -249 29 58 393 173 -38 -128 204 -112 -176 194 -332 -309 539 -20 172 179 340 394 -142 216
2744B16l40k5j54M05l60J51N34m25j74M09p8n50N1O05m12j85L12o5K86L33k49
$$ 216 -124 -149 -303 102 -258 -107 427 2 -172 237 159 -391 -340 265 -147 -332 -20 -85 201 534 285
2765B85j11J68J29o81K31k18R9o1r7K49k5M88J96m58r9M5n25k14J25N57n54O01
$$ 285 174 342 471 -210 21 -197 -98 -159 -256 -7 -32 456 652 194 95 140 -385 -599 -474 83 -471 130
2787A30L13m76K47Q4n8m5n4m82j10j92N46J02l10K69O22m71j57M07j89l35q8M51
$$ 130 443 -33 214 298 240 195 141 -341 -451 -643 -97 5 -305 -36 586 115 -42 365 176 -159 -247 204
2809B04k75j36L69j46j67J50L30m17R3O4P6o31L62J81k18K9J64M7k46O44m52l53
$$ 204 -71 -207 162 16 -151 -1 329 -88 5 69 145 -486 -124 57 -161 -132 32 79 -167 477 25 -328
2831c28N04N6m95J80K01j15n6L36n41M9r8P90l99m12P27k61n78L97O0j09j68K62
$$ -328 176 232 -263 -83 118 3 -53 283 -258 -209 -307 483 84 -328 399 138 -440 -43 17 -92 -260 2
2853Bm55L56K78M2l15J48Q06o48l80j10J68m61N37L25n58J24L94j72k08P23j58
$$ 2 -453 -97 181 223 -92 56 862 214 -166 -276 -108 -569 -32 293 -265 -141 253 81 -127 596 438
2874D38m82q9J3q4l42L97M00l14K77O4n14K40K35mp71K16P51o57l61O44l4j74
$$ 438 -44 -133 -120 -204 -546 -149 251 -63 214 278 -236 4 239 235 -536 -320 431 -226 -587 57 23 -151
2896a51K89M24m71k17J51j60l1O8M34m89k1L36o1k87K67J44l76K77j6k08K03l8
$$ -151 138 562 91 -126 25 -135 -166 -98 336 -153 -174 162 101 -186 81 225 -151 126 110 -98 105 67
2918F7M9k34K19J82j37p4k36R6n9J26k54J86j19L39m28K66M18o81J55K12l20M82
$$ 67 116 -118 101 283 146 72 -164 -68 -127 -1 -255 -69 -188 151 -277 -11 407 -274 -119 93 -227 255
2940B55k69J65j35K93L2Q1j080P33k50j61j39N37j49R3P2l8OR3P6q66L46N59j98
$$ 255 -14 151 16 309 341 422 -658 75 -175 -336 -475 62 -87 6 78 40 46 139 215 -651 -305 254 56
2963E6m71L40K4n3L75j20n6L5rl25k53M83j27j38j03O00l14J38K89j73j05k31
$$ 56 -415 -75 -51 -104 271 151 95 130 121 -204 -457 26 -101 -239 -342 258 -56 82 371 198 93 -138
2985a38L88k73n4K7J83m15J02M76k79k55M93p3J9O3o4j45j3j38j32M2J98r3n2
$$ -138 250 -23 -77 -50 133 -282 -180 296 17 -238 255 182 201 264 200 55 42 -96 -228 -186 12 -81 -133
3008a33L2M50k61k19L71k93o1J16rk01q2J72J53o02O43J60m18L8M83k58l21K6
$$ -133 -101 349 88 -131 240 -53 -114 2 -7 -208 -290 -118 35 -567 76 236 -182 -144 339 81 -240 -214
3030b14L29k30N6R6k36j5N46L06q10L24J50n54J05M65o27l89O53N00o22P0M37
$$ -214 115 -115 -59 37 -199 -214 332 638 -172 152 302 -252 -147 318 -309 -698 -45 455 -167 -97 340
3051C40m48k60N10k39k17J4L26l72L54P0J8j87M24P5m94J19J33l28j93L75K8k90
$$ 340 -108 -368 142 -97 -314 -300 26 -346 8 78 96 -91 333 408 -86 33 166 -162 -355 20 48 -242
3073b42M6M46m46L83O8j45l37M16l9l20k15M63k54M2J00j44J65J59l3k43J1K37
$$ -242 -196 250 -196 187 255 110 -227 189 150 -170 -385 78 -176 -134 -34 -178 -13 146 113 -130 -119 118
3095A18J3n96N50J16k52k01K99J13k04m01O46l78L62j12j78k64L90L9l16K59J47
$$ 118 131 -465 85 201 -51 -252 47 160 -44 -445 201 -177 185 73 -105 -369 21 60 -256 3 150
3116A50j94m3O1K14j46R7k19k61L22K06m10k7M49mk28j43M71j7m34M77p4m81L88
$$ 150 -44 -87 -26 188 42 139 -80 -341 -19 187 -223 -250 199 195 -33 -176 295 278 -156 321 247 -234 154
3139A54j30j55N1L71j53l74M13j42m2J57K60m28K51m02l9L7J26oj95L1M64k79
$$ 154 24 -131 -80 291 138 -236 177 35 -7 150 410 -18 233 -169 -208 -171 -45 -51 -246 -215 249 -30
3161c0L3L20l21J59m0J59l15j00N4j65J50J10J00jL2P4j40m91J8M07n69O90m5
$$ -30 3 323 2 161 121 280 -35 -135 -81 -246 -96 14 114 113 145 219 79 -412 -394 13 -556 134 89
3184H9k66J53J26j36J51r2j21o2l6K18j99M4K69j11l72K13P15o51j63O07k92q2
$$ 89 -177 -24 102 -34 117 25 -96 -158 -194 24 -175 -131 138 27 -345 -132 583 -68 -231 376 84 2
3206BP3j72k10K40K66j47m88L52M20n22L3L23j66L5m0J46k55J57Mm48K78L03m22
$$ 2 75 -97 -307 -67 199 52 -436 -84 336 -186 -153 170 4 39 -1 145 -110 47 51 -397 -119 184 -238
3229b38K99L5K21m56J91k6k42R9l5M2j22J61L48j82j48L86k86j29J97k36L0m6
$$ -238 61 96 317 -139 52 26 -216 -117 -152 -110 -232 -71 277 95 -53 333 47 -82 115 -121 -91 -137
3251a37n2j38L07J05j3k05K73J74l32l14M11j66o8K47j05m1K25K34m90R8K61o4
$$ -137 -189 -327 -20 85 72 -133 140 314 -18 -332 79 -87 -155 92 -13 -54 171 405 -85 13 274 210
3273B10l28J53k29L60l60O4M39k06j17K41l19L39p2j81k31K87j19l33M10M15n31
$$ 210 -118 35 -194 166 -194 -130 309 103 -14 227 -92 247 175 -6 -237 50 -69 -402 8 423 -108
3294a08k55N86j56R8j14j24k40j21K64q1O8n5L90l4k63N34l22k26K29l9k77K8
$$ -108 -363 223 67 165 51 -73 -313 -434 -170 -251 -183 -238 152 118 -145 389 67 -159 70 31 -246 -218
3316b18J85r3J48J65J22n45K88K60m02J15J09k41j33M00k10m4j04K09j33o1P07
$$ -218 -33 -126 22 187 309 -236 52 312 -90 25 134 -107 -240 160 -50 -94 -198 11 -122 -183 524
3337E24k12n08K01M01m25kJ99l59j67M93lL4k99L93o04K96L21l4m22K55k72j16
$$ 524 312 -196 5 406 -19 -21 178 -181 -348 145 142 176 -123 270 -334 -38 283 249 -173 82 -190 -306
3359c06N33o6j57Q5K61m0n49L35j77J52l01L37j50N5l4L32m79K4P31n47J51j32
$$ -306 227 161 4 89 350 310 -239 96 -81 71 -230 107 -43 12 -22 310 -169 -145 586 39 190 58
3381E8J38o18j8N48k03n9J73j14K01J68N9j30k51J10L8n62M19R7j82Q9J89k59
$$ 58 196 -422 -440 108 -95 -154 19 -95 106 274 333 203 -48 62 100 -462 -43 54 -128 -39 150 -109
3403a09j12M56k59p3j00K56Pk2K84j40n95K81L8K4k8K87m91J81L44J76m87J32
$$ -109 -221 235 -24 -97 -197 59 66 44 328 188 -407 -126 -88 -64 -92 195 -296 -115 229 405 -82 50
3425E0O0Q4k56k0n4j09M09j89R0K35M1j84l93J18J11K02j57o9j89nM06mm40K24
$$ 50 110 194 -62 -82 -136 -245 164 -25 65 300 341 157 -236 -118 -7 195 38 -31 -220 -225 181 177 -263 -39
3449c9K69k65N3K93j95n67J89K03J5l90Q04l82K36j44J62k85m1K11k88k78L59
$$ -39 230 -35 18 311 116 -451 -262 -59 -44 -434 370 -12 224 80 242 -43 -84 127 -161 -439 -80
3470h0o1K80k36J90J88k21L9j26j73%N90n96P8j41J95k4J09M50l55Q1J21j65j70
$$ -80 -141 139 -97 93 281 60 99 -27 -200 -200 390 -206 -128 -269 -74 -98 11 461 106 187 308 143 -27
3493b7M11m62l42L29K40j32k56M88j50l32N75k94p9J34K09N1j60Q0k33J84k16
$$ -27 384 -78 -420 -91 149 17 -239 249 99 -233 342 48 -31 103 312 363 203 283 50 234 18
3514A8j4K4nj13R4j92K05J28m73K2L22J15j96J01m0L12m37K03k39k36P29l84J22
$$ 18 4 28 23 -90 4 -188 17 145 -328 -306 16 131 -65 36 -4 308 -129 74 -165 -401 328 -56 66
3537F6O2J9k44N4L04j68j31K24j35K02o89L28J71K4l60P4j7L84o8J3j09J38J3
$$ 66 128 147 -97 -43 261 93 -38 186 51 253 -436 -108 63 87 -273 -199 -216 168 100 113 4 142 155
3560A55k57N1j90J69l6L71k44j54K19K40k77%j81J34k27K00j01K73j94o8J60n5
$$ 155 -102 -51 -241 -72 -108 263 19 -135 84 324 47 47 -134 0 -227 -27 -128 145 -49 -117 43 -12
3582a2J59j19j41M39p4l55J78l4M0m59L09j10J73j24K55l56J48J94j04k3o4O9
$$ -12 147 28 -113 326 252 -103 75 41 81 -378 -69 -179 -6 -130 125 -231 -83 111 7 -16 -80 -11
3604a1J04k02J08MKN2J07l74k0L15k06n0j95L44k5J66j00l08L58k71K53l56J47
$$ -11 93 -109 -1 3 5 57 164 -210 -230 85 -121 -171 -366 -22 -47 119 19 -289 69 -202 51 -305 -158
3627a58K27l56L74J34r5J9K5n59L71q4j67J21M34l6l57M3J52P9m17NO9j05J50
$$ -158 69 -287 87 221 126 145 170 -389 -18 -102 -269 -148 286 250 -107 -64 88 167 -250 -245 -176 -281 -131
3650a31J30o1N4K2J76J78k72k19m3m1M26k59m3N9J64j63J42L3N0l30J82J17l26
$$ -131 -1 -62 -8 14 190 368 96 -123 -166 -207 219 -40 -83 -24 140 -23 119 152 202 -128 54 171 -155
3673a55M3l3j14L15L4k19l5J62j19J04L06n6J95n96J62K0j45k2L0L12l03J54P9
$$ -155 -112 -145 -259 56 90 -129 -164 -2 -121 -17 289 233 428 -168 -6 14 -131 -153 -123 189 -114 40 119
3696A19m05j24O02l06m9Q3L94m30j50K2J61K11k18N15n43J76j45K72l09P0p4n5
$$ 119 -286 -410 192 -114 -163 -80 314 -116 -266 -244 -83 128 -90 425 -118 58 -87 185 -124 -54 -128 -183
3718a83K03j56J09K17m1j16q9J34k10K19J08m68O7J75K18k37J67J91l27j92J10
$$ -183 20 -136 -27 190 149 33 -56 78 -132 87 195 -273 -206 -31 187 -50 117 308 -19 -211 -101
3739a01L93k24l94K29K41k63J13L34j01q6j8M3j0k30n5n7J46J8p6J82j79J55J95
$$ -101 292 68 -326 -97 144 -119 -6 328 227 141 123 166 156 -74 -129 -186 -40 -22 -98 84 -95 60 255
3762B55m28K01n2K04m5j12m14K35K10o4J52K6J21m0j37j44l0R8k0k26J45k78J56
$$ 255 -173 28 -24 180 135 23 -391 -156 54 -10 142 168 289 249 112 -32 -62 36 16 -210 -65 -343 -187
3785a87J48J26J7m63J39O6k35L7N23j71k12J65K08j36O2Q6k66j50L33J6m44K59
$$ -187 -39 87 104 -359 -220 -154 -389 -352 171 0 -212 -47 161 25 87 173 -93 -243 90 106 -338 -79
3807g9K55k2l41J42K81j52J11mJ21n05K45Ok03K83m8j45J6M04l22n1n2N1J96m40
$$ -79 176 154 -187 -45 236 84 195 191 312 -193 52 58 -145 138 90 -55 -39 365 43 -8 -60 -9 187 -253
3831b53L35k23R7M6J8l26J84j18L71l37L70J3r6k6K54n86R7k2J79j32K11l38P4
$$ -253 82 -141 -44 2 20 -306 -122 -240 131 -206 164 177 81 55 309 -277 -180 -202 -23 -155 56 -282 -208
3854b08L26j07K61k25L7NK30n28L07j07n3j49L02J30m22K01j79K25J50j85k36
$$ -208 118 11 272 47 84 89 319 -209 98 -9 -62 -211 91 221 -201 0 -179 46 196 11 -225
3875b25K30L58k82j65m7L1L67j55q2P7k78J24n0J33P3P5j70J92j42p1r5l6K14
$$ -225 5 363 81 -84 -131 -100 267 112 30 107 -171 -47 -97 36 109 184 14 206 64 -7 -102 -138 76
3898G6l00J68K59k85K31j10rj76M1j32J52J13k17K62j71K96M6k51n9L31m77K52
$$ 76 -224 -56 203 -82 149 39 30 -146 -105 -237 -85 28 -189 73 -98 198 244 -7 -66 265 -212 40
3920D0J15o5j31J02k3M3N9m23K89QK01j73o4Q4j75j62J90k45O07l83Q2j06J81
$$ 40 155 90 -41 61 38 81 140 -283 6 14 215 42 -22 62 -113 -275 -85 -330 277 -106 -24 -130 51
3943E1J03l03M72k99m9l3m7K25J00k10L16r3k56j20r9K80m57N35m95K91l2R3n
$$ 51 154 -149 323 24 -25 -58 -105 120 220 10 326 233 -23 -143 -242 38 -419 116 -379 -88 -120 -27 -32
3966c2j4o6J23l7q3L57j09l51J03l0J22L8J99P4k04k96o3M67j10j82k58L79j76
$$ -32 -46 -112 11 -26 -109 248 139 -212 -109 -139 -17 21 220 294 90 -206 -269 198 88 -94 -352 27 -149
3989a49J74j93J76m4k84O66m87mP5L28j56k74K52N0j78r6K4J1K17J61p7r8l6J65
$$ -149 25 -168 8 -36 -320 346 -141 -145 -70 258 102 -172 80 130 -48 -144 -120 -109 108 269 192 94 58 223
4013B23j42P3l22M30m87K02R6j56N40j77k1j04j04J6o7l4K5k74J46L62J01j39
$$ 223 81 154 -168 262 -225 -23 73 -83 457 280 259 155 51 67 0 -34 -9 -283 -137 225 326 187
4035A87k17qN7J19k9Jj94p5J56K12n96M76j81J39K25k68p4J76J77l94J3R5K09
$$ 187 -30 -38 19 138 109 110 -84 -159 -3 209 -387 89 -92 47 272 4 -70 106 283 -111 -98 -3 206
4058B06k95L23o7p2j73m5J19M0lJ85j27j41Q1J0M3P8l18K02M6j07n8P2j46J50
$$ 206 -89 234 167 95 -78 -123 -4 36 33 218 91 -50 31 41 84 162 -156 46 92 -15 -73 -1 -147 3
4082Cq3k22K53j0q8kj0J57L39q2k74j07J65j95J8J77j19J27P2L7m68K32K54l80
$$ 3 -80 -302 -49 -59 -147 -149 -159 -2 337 255 -19 -126 39 -156 -138 39 -80 47 119 156 -312 -80 174 -206
4106b06J31J02r9Kp0JL2N5l5Lj04J6K06n6K13m5k3J93l18L27l01j35k28J82J74
$$ -206 -75 27 -72 -70 -140 -139 -107 -52 -87 -84 -188 -172 34 -22 191 146 123 316 -2 325 24 -111 -339 -157 17
4131A7m7OJ85K83l18j75Q8m2p4K48k55j03O7rM19m04L88r3j40k39K76m1k41K24
$$ 17 -30 -24 161 444 126 -49 39 -3 -77 171 -84 -187 -120 -129 290 -114 274 181 41 -198 78 37 -204 20
4155B0O0j88o6L21qj15n7k7j27K20j76J12l32L56j33L77l73J70K64l98K75m17
$$ 20 80 -108 -174 147 139 24 -33 -60 -187 33 -143 -31 -363 -7 -140 237 -136 34 298 -100 175 -242
4177b42Q1K93j75j84L44k54L0M9K32l50j2L87o05K92J42j22P7K05k00j37K79m3
$$ -242 -161 132 -43 -227 117 -137 -107 -58 174 -176 -188 199 -406 -114 28 -94 -17 188 -12 -149 130 87
4199H7J31m97J76R5j01k54L19j23Q0o9O7L03l13n0M28m39k0K91l3J35k94J53l01
$$ 87 218 -279 -103 -8 -109 -363 -44 -167 -87 -156 -89 214 -99 -149 279 -160 -180 111 78 213 -81 72 -229
4222b29J15L60o3k03Q0M0q1m3L24j29m24N34k83j75m2J04M5K48p0j8K7r2m3j60
$$ -229 -114 246 183 -20 60 100 19 -24 300 171 -253 281 -2 -177 -219 -115 -70 178 108 90 117 25 -18 -178
4246a78L9M2K58l95N16l90L9M0K32k08j9K42k71j60K26Jj30J58j64q8J80J95p4
$$ -178 -139 -97 161 -234 282 -108 -69 -29 203 -5 -24 218 -53 -213 13 14 -116 42 -122 -210 -30 165 91
4269I1k15J48P5k68K82k29K33k66J15M27l07P5kR9j70j62Q8l01J58K14K34j76
$$ 91 -124 24 99 -169 113 -116 117 -149 -34 393 86 161 159 258 88 -74 14 -287 -129 85 319 143
4291A43k78N8N9L08k78O3j63NK16l53L76J77k99P5j36K06Pk97J02j20N1K31l9
$$ 143 -135 -77 -18 290 12 75 -88 -83 133 -220 156 333 34 109 -27 179 186 -111 -9 -129 -78 153 114
4314A14m08K81J07R5k59Lj08L12N0q1l04L5K35j06k60M4K99l3J06k20K88j00j18
$$ 114 -294 -13 94 189 -70 -67 -175 137 187 106 -198 -163 72 -34 -294 -250 49 16 122 -98 190 90 -28
4337b8J48J30j00j95j54J30k10J58J96j27q1M92k46k26j67M81j00l89j50M05l25
$$ -28 120 250 150 -45 -199 -69 -279 -121 75 -52 -133 359 113 -113 -280 201 101 -288 -438 -33 -358
4358c58O02K3k13J07j30J65m19L52p9k85L7L28m7o1j53K4R0r1N48m85J43l60L60
$$ -358 244 267 54 161 31 196 -223 129 50 -235 -198 130 83 22 -131 -107 -17 -108 440 -45 98 -262 98
4381I8j15K48P2n96J44N3K95j51M5P5J1l29L12m03L53n48O40j46k20J60J97k91
$$ 98 -17 231 303 -293 -149 -96 199 48 93 168 179 -150 162 -241 112 -436 204 58 -162 -2 195 -96
4403i6MK99l95j6J42PK7J94k30m01O69m17R6l2L34K87l86q7o3P7K5O2j93K13j43
$$ -96 -92 207 -188 -204 -62 -55 -28 166 -64 -465 204 -213 -117 -149 185 472 86 -1 -64 13 38 100 -93 120 -23
4428b3R2k87n2K67l6L6L04K4l47J36j78k96K95J26J8j0j10L42n44J02J0K64l10
$$ -23 69 -218 -270 -3 -39 -3 301 325 -22 114 -64 -360 -65 61 79 69 -41 301 -243 -141 -131 133 -177
4451a77J46J36m1k24R5nJK38l16M31j5k58J90q6l27M09P2k66J83l07q3L5J39j00
$$ -177 -31 105 64 -160 -65 -70 -69 169 -147 284 269 11 201 115 -212 197 269 3 186 -121 -204 -169 -30 -130
4475a30N06k10m3K69k88m72K88n6J28K6K49m90K09J19k42L03m31K60K67j11j82
$$ -130 376 166 123 392 104 -368 -80 -136 -8 18 267 -223 -14 105 -137 166 -265 -5 262 151 -31
4496c1j54J46k12NM75k26J07M8k38J86q8K00l37P4j01L04k39J93k19L40m4j13
$$ -31 -185 -39 -251 -246 229 3 110 158 -80 106 18 218 -119 -45 -146 158 -81 112 -107 233 189 76
4518G6p8j63j13J4M64j49K29l28j19o6L92K03l63r3k43K5L99J3L3J19k45J53J02
$$ 76 -2 -165 -278 -264 200 51 280 -48 -167 -233 159 362 -1 -94 -337 -312 87 100 133 252 7 160 262
4541B62j08J9j5Q1j29k9k61J17O9m0J5k58K35qk7K55n0k59P4J19l51J82J11O6
$$ 262 154 173 158 239 110 81 -180 -63 6 -34 -19 -277 -42 -50 -77 178 128 -131 -57 62 -289 -107 4 70
4565G0l42K38k9K99k15M9m4J5q5K78k34j22J41J18m30L50k24J19L51n61M28m57
$$ 70 -272 -34 -63 236 21 70 26 41 -44 234 0 -122 19 137 -293 57 -167 -48 303 -258 170 -287
4587b87N19l31J11j99R7K40K7j55M88k55j51L83l85Qj65L35m89N5K88m65N81J15
$$ -287 232 -99 12 -187 -90 150 177 22 510 255 104 487 102 110 -55 280 -209 -154 134 -331 250 365
4609C65n57K95M8k71J23j12J74J54j79j54j28N18j83l6R3j85J07pkJj2j41j2N
$$ 365 -192 103 151 -120 3 -109 65 219 40 -114 -242 276 93 57 150 -35 72 65 63 64 52 -89 -101 -96
4633i6j26R6L69j72k68K86l74N41J0k65K9m4p6j25J19l94N70l8O6lK43o38M83
$$ -96 -222 -126 243 71 -197 89 -285 256 266 1 30 -14 -90 -215 -96 -490 80 42 108 105 348 -290 193
4656A93k72q7oL99k05j69K38k38J27r2J5K95J44n26Q1K32m7p5q0K92j61j28r3
$$ 193 -79 -166 -172 227 22 -147 91 -147 -20 -112 -97 198 342 -184 -103 129 82 7 -73 219 58 -70 -163
4679a63M19j15k62K13j78L07r3k88J1K21j81J31p3P6J13j95Q9k79J21P9l7J51
$$ -163 256 141 -121 92 -86 221 128 -160 -149 72 -109 22 -51 25 138 -57 32 -247 -126 -47 -84 67
4701F7j78j60L35l8p2K77Q0l17J88j19j24o2J68J41p1K7j58J43o1Q9n2j9k94J96
$$ 67 -111 -271 64 26 -46 231 311 -6 182 63 -61 -123 45 186 115 142 -16 127 66 155 103 84 -210 -14
4725a4J02k44P6J01k8q3kJ33O2p1M06m73K76l73K80q7N8k87J28j05L71j01K6j67
$$ -14 88 -156 -80 21 -7 -90 -92 41 103 32 438 -35 241 -132 148 61 119 -168 -40 -145 226 125 151 -16
4749a6M9k23K49J11o19L82K04j07K6N3J74l73K52p2k30J14R7j58K01J05m53N40
$$ -16 33 -190 59 170 -449 -67 137 30 56 109 283 -90 162 90 -140 -26 71 -87 114 219 -234 306
4771C06m24K30J4k39P7J49j60j17K06j07Q7j65R0Q5L9Q5j53k05J29P6Q2j39Q0
$$ 306 -118 112 126 -113 -36 113 -47 -164 42 -65 22 -143 -53 32 71 156 3 -202 -73 3 85 -54 26
4794B6K31l38J04k0m01L17J9L46n88M02q5K64k30j82P2l33K49J37lK03j10K1j05
$$ 26 257 -81 23 3 -398 -81 -62 284 -304 98 13 277 47 -135 -63 -396 -147 -10 -13 190 80 101 -4
4817dK62N7l67m7L65k67J49j98j0p5LJ10J0Q8J63k74K9j88O0L58Q9l59K5J29K48
$$ -4 258 315 -52 -99 266 -1 148 -50 -60 -135 -132 -22 -12 76 239 -35 -6 -194 -134 224 313 -46 -21 108 356
4842C56k97k1j02K7l2J49j33J67QJ05J46k28j74p9m9J50pJ11k36K93k26j07O6
$$ 356 59 38 -64 -37 -69 80 -53 114 122 227 373 145 -29 -108 -157 -7 -14 97 -139 154 -72 -179 -113
4865a13K77r0k53L63k44K27k85p1J15o5K36J9l43M61k23R4K4l24L00j25J00J69
$$ -113 164 74 -179 184 -60 167 -118 -189 -74 -139 97 116 -227 234 11 105 129 -195 105 -20 80 249
4887B49l29j87M72M7k76l7q3M08m19L32Rj56r4K46j53r9J34o2lk49N0k1L47Ok27
$$ 249 -80 -267 205 252 -24 -61 -144 264 -155 177 186 30 -64 182 29 -70 64 2 -1 -250 -200 -221 126 132 -95
4912i5k44M23j78m4K43k47j15K47J70l00R9L46r4J24r5l05j6O9l06J97N9L03m32
$$ -95 -339 84 -94 -138 105 -142 -257 -10 160 -140 -41 305 211 335 240 -65 -81 -12 -318 -121 -62 241 -191
4935a91K13J52K3j63P6j03J45j12l21j80N24P5k37J41R8N5J27j42l0l25K45J76
$$ -191 22 174 197 34 110 7 152 40 -281 -461 63 138 -99 42 140 195 322 180 150 -175 70 246
4957B46k64L2K0P2j22Q2J48l11R0J39j91J14j49N9k30J73J78O4n1r0P7j37R2J49
$$ 246 -18 14 34 106 -16 66 214 -97 -7 132 -59 55 -94 -35 -265 -92 86 150 99 9 86 -51 41 190
4981A90Om01K25K7J09m52J59N03m12K50j50m84Q9J71J43J02m79O28J5m05J77o8
$$ 190 196 -205 20 47 156 -296 -137 366 -46 204 54 -430 -341 -170 -27 75 -404 224 239 -166 11 -57
5003e7J11L82p36L73k17L60k85P8M6q1l7j18K66k21R9J09j62j32L87J39k74J22
$$ -57 54 436 -300 73 -144 216 -69 9 55 -26 -63 -181 85 -136 -37 72 -90 -222 165 304 30 152
5025A52k16m1M2k82M33L4l9J00J46o72N20p7M9o5k06K83l77K70k89L58J45k69
$$ 152 -64 -105 -63 -345 88 122 83 183 329 -343 177 100 149 84 -122 161 -216 54 -235 123 268 -1
5047aJ2k63L24j29n7J16J80l68L82r0r3j21J34J10p6J02J99l40O9M1Lj90nr1j09
$$ -1 11 -252 72 -57 -114 2 182 -186 196 106 13 -108 26 136 60 162 361 21 90 131 134 -56 -61 -152 -261
5072b61K94l3L44l56L86k99j57R6J07q6qJ22k48k29O29k37J37j52l7K7m6K71k31
$$ -261 33 0 344 -12 374 75 -82 14 121 35 27 149 -99 -328 301 64 201 49 12 39 -7 264 33
5095C3m5o5J29k18K25J2k36J71j82L46m4P8l17K81J26m84L55j10J02m27K58P0
$$ 33 -12 -77 52 -166 59 71 -165 6 -176 170 126 204 -113 168 294 -190 165 55 157 -270 -12 58
5117E8j62J29j75J38m2K30M6j08J32k13j84L85k36L9j90J12N5l0J21l03K72K70
$$ 58 -104 25 -150 -12 -54 176 222 114 246 33 -151 234 -2 37 -153 -41 14 -16 105 -198 74 344
5139C44l29k14K55k00K34l68M94l45J22%J23k54L09o6j92L08r8p4j14L5r2L58
$$ 344 15 -199 56 -144 90 -278 216 -129 -7 -7 116 -138 171 105 -87 221 123 49 -65 -30 -122 236
5161B36j57j82L0K19l28oJ34J49nJ74m2l49K14K4J01q6p1J07M5n08N36k1J4j57
$$ 236 79 -103 -73 146 -182 -188 -54 95 90 264 222 -127 87 111 212 126 55 162 207 -301 235 214 228 71
5185G1j2k99L18K74o00M30m45K40K34j03J21J6k21j15j6o7n5M60l06lr2O5J20
$$ 71 59 -240 78 352 -248 182 -263 -23 211 108 229 245 24 -91 -107 -174 -229 231 -75 -78 -170 -105 15
5208A5m2K25j97j44M1j03j63J50M94l45pj37L04q2M2L82l72J1j20L13l27r8J68
$$ 15 -27 198 1 -143 -102 -205 -368 -218 276 -69 -76 -213 91 9 51 433 61 72 -48 265 -62 -160 8
5231HL4O5J04O2m84J79L07j64j71r8L36l55K14j98K05m7k35K38k94K89K08j89
$$ 8 42 107 211 273 -211 -32 275 111 -60 -158 178 -177 37 -161 44 -3 -238 0 -294 -5 203 14
5253A4r5m5lj00M42k03k2m3L49m98J13K27j43j16M83l63l2J04N0k33N1J35k59
$$ 14 -81 -126 -129 -229 213 10 -12 -55 294 -204 -91 136 -7 -123 360 -3 -35 69 119 -114 -63 72 -187
5276a87R1o6k3L27m9k00m9J57n9L45m77J68k3P6j8n4J66j17K89l89J07K00j13
$$ -187 -96 -162 -185 142 93 -107 -156 1 -58 287 -190 -22 -45 31 13 -41 125 8 297 -92 15 215 102
5299A02j06j6J25r9l8j65K1J88j57r9M52n9j35m2k7J2M5j24M78j48m20K86l06
$$ 102 -4 -20 105 6 -32 -197 -176 12 -145 -244 208 149 14 -28 -55 -43 2 -122 356 208 -212 74 -232
5322b32K75k97J7K37M2j88O4R8J1rk93L26J23k74o4O7K18K1M1j73j31K05l20l2
$$ -232 43 -254 -237 0 42 -146 -82 16 27 18 -275 51 174 -100 -164 -97 121 142 183 10 -121 84 -236 -268
5346b68Q1M48n11N26M6m33j15O6K07j71J20J51p2j88RJ05j0K2J0L9m5k7k4J78
$$ -268 -187 261 -250 276 322 -111 -226 -160 47 -124 -4 147 75 -113 -104 1 -9 13 23 62 17 -10 -34 144
5370A44q8R4l17J95J35o0j75J37q0j89J21j97RK50J80k47J29K60l2p0m27K61l4
$$ 144 56 150 -167 28 163 103 -72 65 -15 -204 -83 -280 -271 -21 159 -88 41 301 269 199 -228 33 -1
5393aJ40k62o0K08J81J7l19M8K90l18L69k48L7k68K54r5L99k02K4n1j66K51k54
$$ -1 139 -123 -183 25 206 223 -96 -48 242 -76 293 45 82 -186 68 -27 372 170 194 143 -23 228 -26
5416b6K24k03q8L62K5k10n0j56J64k3J9k04J70Q0O1j03N4k50K51R7r6k02lJ64
$$ -26 198 -5 -93 269 294 84 34 -122 42 19 38 -166 4 84 145 42 96 -154 97 194 98 -104 -107 57
5440E7J58k46k3l05M87O0n53J76K55n7m6L19k50J10R5l25j77M55l92N3R4J78k59
$$ 57 215 -31 -54 -359 128 188 -365 -189 66 9 -37 282 32 142 237 -88 -265 190 -202 -149 -55 123 -136
5463a36K40l3j10O8K5J13k19K3L55l93J08j5L4M5j47K17j30r1j68L27k85L82l03
$$ -136 104 71 -39 29 54 167 -52 -29 326 -67 41 26 60 105 -42 175 45 -46 -214 113 -172 210 -93
5486i3M53n22N38l22n55O14M7j97K70j66L0K01n28L66N5o1l03J76j39J98j85J29
$$ -93 360 -162 376 54 -501 113 160 -37 233 67 97 298 -230 136 191 130 -173 3 -136 62 -123 6
5508FJ01q5nj16kK74j39M3j77J63m74J81K28rO5o72M70K37J25n82N88j62l55K39
$$ 6 107 22 17 -99 -101 173 34 77 -100 63 -411 -230 -2 -11 54 -618 -148 89 214 -368 220 58 -297 -58
5532e8j59K05L14k83k4q4J09J79k22o1J07k09J29l6l6K20p5Mj1M17k73J02j87
$$ -58 -217 -12 302 19 -5 -89 20 199 -23 -84 23 -186 -57 -93 -129 91 16 20 9 426 153 255 68
5555F8k24J45j94N02j30j05q6L58j17Q3L4m89J33K05j44m31N10J04k66J93n75
$$ 68 -156 -11 -205 297 167 62 -24 334 217 300 334 -155 -22 183 39 -392 118 222 -44 149 -426
5576d26M64l53K09K89j37R6j68R9k45J19j92L21l78K68m3j45J2L70k25J3P4J47
$$ -426 38 -315 -106 183 46 142 -26 73 -172 -53 -245 76 -302 -34 -77 -222 -210 160 -65 -52 22 169
5598A69k05j2K77k65n8M28K6j33l05K60q5K43m04l0l33j3M72j64l0K58l40k5M72
$$ 169 -36 -48 229 -36 -94 334 360 227 -78 182 97 340 -64 -94 -427 -440 32 -132 -162 96 -244 -269 203
5621B03o9k62J93J46k67J09J72m41K30N3j37J87n06M09o6j13K13j42j03J32l1
$$ 203 134 -128 65 211 -56 53 225 -216 14 67 -70 117 -389 20 -46 -159 54 -88 -191 -59 -90
5642i0o4j06N34j83n5j1J83m15J56Pk92L17J55j39n7n1M74k73j34K58m83J83K57
$$ -90 -154 -260 274 91 36 25 208 -207 -51 -44 -336 -19 136 -3 -60 -111 363 90 -44 214 -269 -86 171
5665A71K4J49k69o9l00M97l50MN8j72L93j76k30M43l34J84n5J3j14J14J70j44
$$ 171 195 344 75 6 -294 203 -147 -143 -85 -257 136 -40 -270 173 -161 23 -32 -19 -133 -19 151 7
5687GL7J49l19L99m81lJ81r5p6L23p2k36L36k99K7L37k32J58R2k49Qj22m2M71
$$ 7 44 193 -126 273 -208 -211 -30 -125 -201 122 50 -186 150 -149 -122 215 -17 141 233 -16 -8 -130 -172 299
5711B99m34J76m4o4J39j31J37J59l15p8J72l75Q5K02j70K20j99k44L59K07M4p0
$$ 299 -135 41 -3 -67 72 -59 78 237 -78 -156 16 -359 -274 -72 -242 -22 -221 -465 -106 101 145 75
5733G5N5j05j9j40K87p6j74m2J98L8k37M29l70L6J73j48L44m41j77K33M0K9K63
$$ 75 130 25 6 -134 153 77 -97 -139 59 97 -140 289 -81 -45 128 -20 324 -117 -294 -61 -21 8 271
5756B71n23K09L36n39K5K29J9Q0l5m1J02J17j81k48O7L9L51j81r1q0J39R1j26
$$ 271 -252 -43 293 -246 -221 8 27 107 72 31 133 250 69 -179 -112 -73 278 97 6 -74 65 156 30
5779C0L74n80K90l1n2o3K6L43n93K16K1J57l2m0J68j55J1j85N62m66K8j61k8K97
$$ 30 404 -176 114 83 31 -32 -6 337 -256 -40 -19 138 106 66 234 79 90 -95 467 1 29 -132 -160 137
5803A37k18J29J72p1K28m66J96J4J1k24K03J36l6o9k96J08Qj47J84R2j13l32M45
$$ 137 -81 48 220 149 377 -89 107 121 132 -92 111 247 211 142 -154 -46 -38 -185 -1 91 -22 -354 91
5826I1n5j05j55K90j46J1J42q8N02n03Q2M1j02k23K36L71j84o5k52RJ56j49q3
$$ 91 36 -69 -224 66 -80 -69 73 -15 487 -16 66 107 5 -218 18 389 205 140 -112 -103 53 -96 -179
5849a79oL08n3j49L98l98Q1m17M36N5R7o22Q0N25k2k42J32J78j74M0K25j82J74
$$ -179 -185 123 70 -79 319 -79 2 -415 21 76 173 -449 -369 156 134 -108 24 202 28 68 293 111 285
5872B85j39n64N13k37k7K10N6k2Nk9K24k10L4k27q3L40p9j12J8J85Lj97q6M11
$$ 285 146 -418 95 -142 -169 41 97 75 80 51 275 65 99 -128 -211 129 50 -62 -44 141 144 -53 -139 272
5896B72k97k8J61rk15k4o6Q6J36K40l46l0K64K8l2J02p4M1l6l19L08q0J25l60
$$ 272 -25 -53 108 99 -116 -140 -206 -120 16 256 -90 -120 144 172 140 242 168 209 173 -146 162 82 207 -153
5920a53J76K1M7O4R6m37N1k5K64r2p4Q3M1K60k11j10K25J01j40k91J58k06J79
$$ -153 23 44 91 155 251 -186 -135 -160 104 12 -62 21 62 322 111 1 226 327 187 -104 54 -152 27
5943B7K8k40M10n1l54L00j84J04J29K22m36l37M37K07j40j03M3j48L76j68j97
$$ 27 55 -185 225 174 -180 120 -64 40 169 391 -45 -382 55 262 122 19 62 -86 290 122 -75
5964g5J38l5j31M65j73k31J28j96J67K9k44J12J44j57J98n9J16j90j55K37J20
$$ -75 63 28 -103 362 189 -42 86 -110 57 86 -158 -46 98 -59 139 80 196 6 -149 88 208
5985B08k91J67o9J4P8r2Lp6K25J97m72M53q4j58n5k95J30p0K24p0q2J70L07m09
$$ 208 -83 84 15 29 107 15 18 -58 167 364 -108 345 261 103 48 -247 -117 -187 37 -33 -115 55 362 -47
6009d7j7J28Mk17j20L23j05P1p5K98p0k10P8l3O7K75m75K04Q3m39K89p0j5J32
$$ -47 -64 64 68 -149 -269 54 -51 20 -55 243 173 -37 41 8 75 350 -125 79 162 -277 12 -58 -73 59
6033E9J24k27L06k39J2R3k33K35r5j8L01j82n8K85k38J06r9j38J06Jr4m9m9k80
$$ 59 183 -44 262 23 35 128 -105 130 35 17 318 136 78 363 125 231 132 -6 100 101 7 -42 -91 -371
6057c71K27K18j20l2j0K50j33q7k5J65J74k38K05m93m1K90m9l49M43j18J03R0
$$ -371 -144 74 -46 -78 -88 162 29 -58 -83 82 256 18 223 -270 -311 -21 -70 -419 24 -94 9 99
6079I9k5N9p6J51r4l39K62L80n12L04k17k9N2l15L37j46No5J60k85J20K7p7L84
$$ 99 74 133 57 208 114 -225 37 417 -95 209 -8 -37 15 -300 37 -109 -104 -169 -9 -294 -174 -147 -224 160
6103A60m1Ok02K00k70L30k14k77J72N22k02j92K24m55L56j85L10J9m58J84J16
$$ 160 119 125 -77 123 -147 183 -31 -308 -136 386 184 -8 216 -239 117 -68 242 261 -197 -13 103
6124A03k00M3m8J34j96J88j02J79l08J03k78K30M7K05p4k1j33J10J13j92j65q0
$$ 103 -97 -54 -102 32 -164 24 -78 101 -207 -104 -382 -152 -105 100 26 5 -128 -18 95 -97 -262 -342
6146c42L16m9K36k08J59j92J28K61k33l01K08J16l7k18K41j36J07j81n4J82L8
$$ -342 -26 -75 161 -47 112 -80 48 309 76 -225 -17 99 62 -156 85 -51 56 -125 -179 3 41
6167D1j26J9K77j51j94J74L5mm5l5j21L74l15K97j57o7p0j81N98p32K22L11j17
$$ 41 -85 -66 211 60 -134 40 75 71 26 -9 -130 244 -71 226 69 2 -68 -249 349 -383 -161 150 33
6190C3N4k27J94M5j06mj14J86O7n6K44m78L12j67M6K7j01K12m0j69L8J25k84K00
$$ 33 87 -140 54 99 -7 -11 -125 61 128 72 316 -162 150 -17 29 56 -45 167 127 -42 -4 121 -163 37
6214C7q9k2j4j19J87j64J64j46M0P7O1J30k96O7L95k51P0L4l7j27mJ3J75k14K82
$$ 37 -52 -74 -88 -207 -20 -184 -20 -166 -126 -49 12 142 -154 -87 308 57 127 161 124 -3 -7 6 181 -33 249
6239B49j54pj19j33K07J44l65K93k49K69r7j03J40j15R7k13K91j74k53M64k11
$$ 249 95 88 -31 -164 43 187 -178 115 -134 135 38 -65 75 -40 57 -156 135 -39 -292 172 -39
6260c9R5j63K11q3j83J85L0j63K10l50M90k94M3p2j75N51j86j96N7k38J23J58
$$ -39 56 -107 104 21 -162 23 53 -110 100 -250 240 -54 -11 -83 -258 293 107 -89 -32 -270 -147 11
6282A1j28K82k56J98j72L1J2K26j02j09J01q3j24J97j82J09K04k81O3n3M52l67
$$ 11 -117 165 -91 107 -65 -34 -22 204 102 -7 94 11 -113 84 -98 11 215 -66 -3 -56 396 29
6304B9k33J75J03R9k19K5P5jJ5l5j61J43L38m29J05m94N29M2k85K72O0o03J17
$$ 29 -204 -29 74 173 -46 -21 54 53 68 33 -128 15 353 -76 29 -465 64 106 -179 93 153 -450 -333
6327c33N20J02l69J83j83M9K24l9j46l8J61r5K80m04J03j11j9J42Q5l18N0j17
$$ -333 187 289 -80 103 -80 -31 193 154 8 -30 131 36 316 -88 15 -96 -115 27 112 -206 -156 -273
6349b73K69k3Q6l1q2J83J7p3K61j83K00l40q7L0k18M53l09K77P6j11k03L9L9Q1
$$ -273 -4 -27 59 28 -54 129 146 73 334 151 351 11 -76 -46 -264 189 -120 157 233 122 -81 -42 -3 78
6373G8Q7L8m0j85K21j91J3J64m20K86j10J70k10J74k00K64k58mL90k46q1j9J8
$$ 78 165 203 163 -22 199 8 21 185 -235 51 -59 111 -99 75 -125 139 -119 -123 267 21 -60 -79 -61
6396f1%J53j80L57k76k98J37J95l9Q2N4j01k12L01K8J32o19N45j40J62l1j14k52
$$ -61 -61 92 -88 269 -7 -305 -168 27 -12 70 124 23 -189 112 140 272 -347 198 58 220 189 75 -177
6419a77K00k83J8J85J01K83k3m43K49M7J36k38p2M2K29j95k91O0K21j51R6K59
$$ -177 23 -260 -242 -57 44 327 304 -139 110 157 293 55 -17 25 254 59 -232 -172 49 -102 -6 253
6441B53m31j4L03j49Qj55J15j30K94l12P5J38rk24R3M5%P6mJ56j66k33L08j26
$$ 253 -178 -192 111 -38 -30 -185 -70 -200 94 -218 -143 -5 -14 -238 -145 -100 -100 -24 -28 128 -38 -271 37 -89
6465h9K79j86J11o5j13J67q4K6L8k69K50J45mk52%K7K3r7J29k6j46J8J43l05q0
$$ -89 190 4 115 50 -63 104 20 46 84 -185 65 210 206 -46 -46 -19 4 -93 36 10 -136 -118 25 -280 -360
6490c60L42Kk62L32j68P7M12k18k98K37p5k72J45j6j75K92K10pk5n5l8j12q3J45
$$ -360 -18 -16 -278 54 -114 -37 375 157 -141 96 21 -251 -106 -122 -297 -5 205 198 173 118 80 -32 -115 30
6514C0J70j51O3q2MJ04k1l74K18j84K52o0m3lK30N5j68j0k22R5L47k96L15k00
$$ 30 200 49 112 30 34 138 117 -257 -39 -223 29 -31 -74 -77 153 208 40 30 -192 -97 250 -46 269 69
6538F9L4k24j10K40K15j50j41K78k57k31J79j09J02M0j0m4K27o2m9j08K92j42
$$ 69 103 -121 -231 9 224 74 -67 211 -46 -277 -98 -207 -105 -65 -75 -119 108 46 -3 -111 181 39
6560C9k38K42K27j56Q7j59J5L5k56m0K16j7k83J78M34n48J17K63n3l06k8L99K8
$$ 39 -199 43 270 114 201 42 57 92 -164 -204 12 -5 -288 -110 324 -224 -107 156 103 -203 -231 168 196
6583A96p4P0n19L41j19LO0L2o9Q7J67l83K27J44k52Q2J10j04j8o0M91m62J49L9
$$ 196 122 192 -327 14 -105 -102 -42 -10 -79 8 175 -208 19 163 -89 -7 103 -1 -19 -79 412 -50 99 138
6607A38o44K14N33l19J17mQ8r9p8J55L52n75Ro5L00J7j37M6R3M6k29j89%O07n38
$$ 138 -506 -292 241 -78 39 35 123 24 -54 101 453 -122 -113 -178 122 139 2 48 141 187 -42 -231 -231 376 -162
6632a62L62k77J54j65J72k52l2L8K79R2m25M8K26k17J99l6m6K42j69J09l66K29
$$ -162 200 -77 77 -88 84 -168 -200 -162 117 209 -216 -168 58 -159 40 4 -42 200 31 140 -226 3
6654Cp9J12p4J60j33J49n7j32J77l6P6j79L5J48m47J88l8j28K67k63l4N08K2m33
$$ 3 -76 36 -38 122 -11 138 81 -51 126 90 166 -13 22 170 -277 -89 -127 -255 12 -251 -285 223 245 -188
6678a88J69Q1k57J14k85M64K0kL4o32L22L8K48k54m0K37Q2o6l56N46l82m24N71
$$ -188 -19 62 -195 -81 -366 98 118 116 150 -482 -160 -122 126 -128 -168 69 151 85 -271 275 -107 -531 40
6701D0j22Q9J29k81j14R4P7j97K12K62k97L53q3N6j37j50j89L45j70J80k60K37
$$ 40 -82 7 136 -145 -259 -165 -88 -285 -73 189 -108 245 162 218 81 -69 -258 87 -83 97 -163 74
6723G4l36J24K87j25J33n4k05RK3J91j75K25l60J06J80k23J46q0k8k53J54L64
$$ 74 -262 -138 149 24 157 103 -102 -93 -70 121 -54 171 -189 -83 97 -126 20 -60 -88 -341 -187 177
6745A77m1m21K33j47K31n3Q7k46l6K97k72m9N79l78P5k44L26k74J96P0K4j70L
$$ 177 136 -285 -52 -199 32 -21 66 -180 -216 81 -191 -240 339 -39 36 -208 118 -156 40 110 134 -36 -33
6768c3o0M11j57r1j38m2K7K09K63o00J09j23L11o4o5k67L37k4K30l09m6O9r1J08
$$ -33 -93 318 161 70 -68 -110 -83 126 389 -211 -102 -225 86 22 -43 -310 27 3 233 -76 -122 -53 -144 -36
6792c6L07k84j95L47j92J21m80K29K54j67O2O1l7l26L83j60j38J42K65k61p2K75
$$ -36 271 -13 -208 139 -53 68 -412 -183 71 -96 -34 27 -10 -336 47 -113 -251 -109 156 -105 -177 98
6814I8lK99m95J57PP0L25l22l47L12j81n0K69L5m29M67n7j44p1K87j87l20K87
$$ 98 95 394 -101 56 63 133 458 136 -211 101 -80 -130 139 174 -255 212 155 11 -60 227 40 -280 7
6837GJ05J22k86K4o1j30K75P4j28P8o8Q2k38K15j51J7J44r9L43n8k72j75J00K45
$$ 7 112 234 -52 -28 -89 -219 56 130 2 80 12 94 -144 71 -80 -63 81 -18 325 267 -5 -180 -80 165
6861A65j83j88J91O7KKj80N49k12l01j6J21j52O7J78l69M37o36L82K06j93K03
$$ 165 -18 -206 -15 52 54 56 -124 425 213 -88 -104 17 -135 -68 110 -259 178 -458 -76 130 -63 140
6883A40J7j05JL0L6m1J35k75j56N02k40L02n19j9K42J32m05lJ65J19k05K6N35
$$ 140 157 52 53 83 119 78 213 -62 -218 284 44 346 -173 -192 50 182 -223 -226 -61 58 -147 -121 414
6906D14m18J71m57L71L4j02K0J23k07npJ09q6j04K37K32k75j55K48J21n59L44
$$ 414 -4 167 -290 81 115 13 33 156 -51 -56 -63 46 -40 -144 93 325 50 -105 143 264 -295 49
6928D9J92j69K7j24J41k00q2K17k17L12o9J52m08M85k27K7L18n02N3J01j71J53
$$ 49 241 72 99 -25 116 -84 -166 51 -166 146 77 229 -179 306 79 106 424 -78 -25 76 -95 58
6950E8j92j78L51M5m7j11K9J3o6j48J68L15J7l14nO3k19M54k44J46M70n51j43
$$ 58 -134 -312 39 84 37 -74 -45 -32 -98 -246 -78 237 254 -60 -65 -2 -221 233 -11 135 605 54 -89
6973h9j05J24rJ48k55K45j69K15J01r3m0j05n1J35j10J67k29K49M4k7m9K9l4k22
$$ -89 -194 -70 -79 69 -186 59 -110 105 206 113 73 -32 -83 52 -58 109 -120 129 173 146 97 126 92 -130
6997a30K79k4q0Q3j56q8L85n42L34J3l32L43q6k56J26J24P0k27j04M76R6k04j33
$$ -130 149 125 45 128 -28 -116 269 -273 61 74 -258 85 -1 -257 -131 -7 63 -164 -268 208 304 100 -33
7020c3L07k90N7lk5J90k57N7O0k47P5L2P8q6K43l83J85J14q9L2j38K67j98M2k34
$$ -33 274 -16 41 38 13 203 -54 3 63 -184 -109 -77 1 -85 158 -225 -40 74 -15 17 -121 146 -52 -10 -244
7045b44L57j80j60K19L17k18K86k36l2j37nR5k78k9J45N63n14j28K8k51P7K57
$$ -244 113 -67 -227 -8 309 91 377 141 109 -28 -33 62 -216 -245 -100 463 -51 -179 -151 -402 -325 -68
7067f8J10N6k9J86j04J04j71m5Q3k17J19J07j00o9K87j01K9K3l28M3J04k9J99
$$ -68 42 98 69 255 151 255 84 39 122 -95 24 131 31 -38 249 148 177 200 -128 -85 19 -10 189
7090A89j45Q2j20O0jQ4j36m9J94k63J2p0K29k12j8M67l45J9J02J23o8l24R7J35
$$ 189 44 126 6 66 65 149 13 -36 158 -105 -93 -163 66 -146 -164 303 -42 -23 79 202 134 -190 -93 42
7114D2k20m5K61j90k83N52m9m4j57K11L1k03L09m5k02o8q3K45k17M97l32J73j37
$$ 42 -178 -223 38 -152 -435 117 68 24 -133 78 109 -94 215 170 -32 -100 -183 62 -155 342 10 183 46
7137D6O3r8j92L44l10K18j17j61K83l09K13J1r9M11m60K46k89j22M77k89J50l7
$$ 46 109 11 -181 163 -147 71 -46 -207 76 -233 -20 -9 -108 303 -157 89 -200 -322 155 -134 16 -21
7159b1k0Q7pj69L21k69L63l92R5r5m2QJ73K0k6k6l1K96k04j99KJ72K31j2l15o0
$$ -21 -41 46 39 -130 191 -78 285 -107 -12 -107 -149 -141 32 52 26 0 -31 265 61 -138 -136 36 267 255 -60 -120
7185a20L1L6r1R5j4J04j83P8J89j91r9j1J18J6K65k96Q0j84K2J26J64k78J98L9
$$ -120 -89 -53 -144 -49 -63 41 -142 -64 125 -66 -165 -176 -58 -42 223 -73 7 -177 -155 -29 135 -143 55 94
7209I4k31M2P5o8J36k31n8K6J21j60oQ8R6J28k20k39N64J78n14j04N24n4k73K40
$$ 94 -137 -95 -20 -88 48 -183 -241 -215 -94 -254 -260 -172 -76 52 -168 -407 157 335 -179 -283 241 187 -86 154
7233A54k69J80j25j83N34k84j00L01m3k29K44k54Q2L49l11m1J41R2l27p1J72o5
$$ 154 -115 65 -60 -243 291 7 -93 208 165 -64 180 -74 8 357 46 5 146 238 -89 -160 12 -53
7255e3k22L25j72J12O9Q6j88J1j90K19K26l47K63j47k43j7K86P0j35J71R9l05
$$ -53 -275 50 -122 -10 59 145 -43 -32 -222 -3 223 -124 139 -8 -251 -268 18 88 -47 124 223 -82
7277h2j11J39N4J50p4M1m6J79j51k93K36J31n58L45N6J42j75n0K5N7k28J20J66
$$ -82 -193 -54 0 150 76 117 71 250 99 -194 42 173 -385 -40 16 158 -17 -67 -42 15 -213 -93 73
7300G3L0J02m50K77j60K61m02K73J30k12k2j30j4J66m1L21k78J04l17M51l26J68
$$ 73 103 205 -245 32 -128 133 -269 4 134 -78 -100 -230 -244 -78 -119 202 -76 28 -289 162 -164 4
7322Dj15J58P8j52J22j58L66m54K31k36N7L5K62J75n53O7O6K96k90K9mO4j09K9
$$ 4 -111 47 125 -27 95 -63 303 -151 80 -156 -99 -64 198 373 -180 -113 -47 249 -41 -12 -16 48 -61 -32
7346c2N3k12K60P8j32j45J12j64r2J54K03L29n14r9K76k74K1L62n48N38jk55K05
$$ -32 21 -191 69 147 15 -130 -18 -182 -274 -120 83 412 -102 -201 75 -199 -178 184 -364 174 173 -82 123
7369A23L3l91L18j51J41P0k44N0pj33K15K14l80J16k9j55K92J62k4j81oJ31j5
$$ 123 156 -235 83 -68 73 143 -101 -51 -58 -191 24 238 -142 -26 -55 -210 82 244 220 39 33 164 149
7392A49r8K38k09m58M80P9j20j52J38k25J27M5L62pm16R7L0k57K76K76n91j72
$$ 149 51 289 80 -378 102 181 61 -91 47 -178 -51 -6 356 349 -67 30 60 -197 79 355 -236 -408
7414d08N33L1k14J87p9j69j45K92j49K41j36Q4K12lj80k14J86p3O7p5K60P1m82
$$ -408 125 156 -58 129 50 -119 -264 28 -121 120 -16 68 280 277 97 -117 69 -4 63 -12 248 319 -163
7437a63r1K79l36J31L8J83k6j0J07K44m92J80q5N6j89K25J30k18K46l85M68N7
$$ -163 -254 25 -311 -180 -142 41 15 5 112 356 -136 44 -41 15 -174 51 181 -37 209 -176 292 349
7459C49l73J89n38M68j96J97m6k1k8K02O3k78K0j01K42J67m46K12M6k46J46J72
$$ 349 -24 165 -373 95 -101 96 50 29 1 203 266 -12 8 -93 149 316 -130 82 128 -118 28 200
7481B00k24M3j1K4k91L14K42o90N01j53J55j95J59l81O7N20q8n40J59l8L66O4
$$ 200 -24 19 8 32 -259 55 297 -393 108 -45 110 -85 74 -307 -240 280 192 -348 -189 -227 139 203
7503B03k39Q3j84J91K22n40k5L79j34K21l19q6j49J51K31J54O4j70LJ36k38m03
$$ 203 -36 47 -137 54 276 -264 -289 90 -44 177 -142 -228 -377 -226 5 159 223 53 56 192 -46 -449
7525d49L63L90l03P7n7p6J07J39R0p1j97jn2L6L20k23p1q2K33j35l60L80kn1j70
$$ -449 -86 304 1 78 21 -55 52 191 281 210 13 12 -40 -4 316 93 22 -60 173 38 -322 58 56 5 -165
7550a65J41j57P4P8L23o00N26j37kj45m0K51k49K67j99k31J70K06j44l3L55j58
$$ -165 -24 -181 -107 -29 294 -306 220 83 81 -64 -104 147 -102 165 -34 -265 -95 111 -33 -66 289 131
7572A31k81q3J83m7j11O6J16Q0k89j06L92k32j87K56Lm3O0j3J82r8p6N0K19l5
$$ 131 -150 -233 -50 -97 -208 -142 -26 54 -235 -341 51 -181 -368 -112 -109 -152 -92 -105 77 -21 -97 -47 172 137
7596A37j85k74M94r5j06O7k2n8N9L3L78l16j19L39m01j64J37k38K65L69m83L73
$$ 137 -48 -322 172 77 -29 38 16 -42 17 50 428 112 -7 332 -69 -233 -96 -334 -69 300 -183 190
7618A90j32O5j24j47j06K59K31j15q8j89r9K64J32j23J82l18M94l39j52N8M0J62
$$ 190 58 123 -1 -148 -254 5 236 121 33 -156 -255 9 141 18 200 -118 376 37 -115 -57 -17 145
7640A45o1j36Q5K43j77l15K05k04Q5j8J86K21j35l48K46j04N6R9J27m5j94j56
$$ 145 84 -52 33 276 99 -216 -11 -215 -130 -148 38 259 124 -224 22 -82 -26 73 200 155 -39 -195
7662a95K95J05j18k02J01J7r8O2p5J56J3Q9L3l62J63k57K60N5J3l0k01L99r7m0
$$ -195 100 205 87 -115 -14 3 -95 -33 -108 48 61 150 183 -179 -16 -273 -13 42 55 25 -176 223 126 86
7686H6n7m2j81J83J66J39k73J97m07K90J72J5n50J89J28Q4j57n1K0K69r1Q0k62
$$ 86 29 -13 -194 -11 155 294 21 218 -189 101 273 288 -262 -73 55 139 -18 -69 -49 220 129 209 -53
7709e3j50K36q8J39j26J35k81K39j14L00n8k23l7K13J2N1l76L61l4j52J27J6j60
$$ -53 -203 33 -55 84 -42 93 -188 51 -63 237 179 -44 -81 132 144 195 -181 180 146 -6 121 137 -23
7732b3R4J49j23j32j72J07n1Q9J73M8J14k2m16K30nj83m7k2L50k04r3M05q3l05
$$ -23 71 220 97 -35 -207 -100 -151 -62 111 159 273 251 -165 65 60 -123 -170 -192 158 -46 -139 266 183 -122
7756a22J55k56R6j01J95K96l52J21p0K1k7n8N9K5K79n00N31m12N91n01l45N25
$$ -122 33 -223 -127 -228 -33 263 -89 32 -38 -17 -44 -102 -43 -18 261 -239 292 -120 471 -30 -375 150
7778A50j71J05J3k20J84J30l56M23m96K54kNk75J64r2J88k06J58l46K22M59q7
$$ 150 -21 84 97 -123 61 191 -165 258 -238 16 14 19 -256 -92 -184 4 -202 -44 -390 -168 291 204
7800B04L4r2l29K64l24M03j54M1K22m06m35M50L60m81L87p8j2J31k34k39J28P0
$$ 204 238 146 -183 81 -243 160 6 47 269 -137 -572 -122 238 -243 144 66 54 185 -49 -288 -160 -90
7822i0qK7K65j04K19l02J17k26M5J77m80L88k59L55j26j82j47O92k28k19L07q0
$$ -90 -98 -71 194 90 309 7 124 -102 -57 120 -360 28 -231 124 -2 -184 -331 361 133 -86 221 141
7844A41n4O8j55K28l42K79m35J91mk08L6M13n18K12J21j69J25j42k0P9K13M2J36
$$ 141 87 155 0 228 -114 165 -270 -79 -83 -291 -255 158 -360 -148 -27 -196 -71 -213 -233 -154 59 101 237
7867B37l03j56M20m74K81N2j44P8J31l84K89j28Q4p5K98j93M07m70j67L94O4l62
$$ 237 -66 -222 198 -276 5 57 -87 -9 122 -262 27 -101 -17 -92 206 13 420 -50 -217 177 241 -121
7889a21l3M03m91L54k13J68l01J06J88K24l78J25LJ33j35j60J17J45j61K09Pl
$$ -121 -154 249 -242 112 -101 67 -234 -128 60 284 -94 31 34 167 32 -128 -11 134 -27 182 189 186
7911A86%j67K0k97R2Q3K41j68P9J82q2l27J32r1r6M04l35NJ21k5pj70K10L5l06
$$ 186 186 19 39 -258 -166 -83 158 -10 69 251 169 -158 -26 -117 -213 191 -144 -139 -18 -43 -50 -220 -10 25 -281
7936b81L18J72j59j78P5j82K93l31J43N8J63R8k58K32k37j14M4J32NL2R6j55o3
$$ -281 37 209 50 -128 -53 -235 58 -273 -130 -72 91 189 -69 163 -74 -188 -144 -12 -7 25 121 -34 -97
7959i7L37j80l06K76J90k90J6J71k2r1j47j30K87j32Q5K8k4r3J13j31M15k39q7
$$ -97 240 60 -246 30 220 -70 -54 117 95 4 -143 -273 14 -118 -33 -5 -29 -122 -9 -140 275 36 -51
7982e1Q7k20J0K93J29l59J0j14K27n9k1l02L46K74k62j90J25J54j22K9j10J93
$$ -51 36 -184 -174 119 248 -111 -101 -215 12 -47 -68 -370 -24 250 -12 -202 -77 77 -45 -16 -126 67
8004F7N0O0j83J49k93P3j16K97l3j74j1K36k08L45l94J97J79r3k77j01L20l62
$$ 67 117 177 -6 143 -150 -77 -193 104 71 -103 -114 122 -86 259 -135 62 241 148 -129 -230 90 -272
8026b72O38n82R4R8K52k02j98K04M6K0k28K23l17J59J36k7j02L8J88l79L30J73
$$ -272 366 -216 -122 -24 228 26 -172 32 78 98 -130 93 -224 -65 71 44 -58 -20 168 -211 119 292
8048B92m76L68j47j92K48q0j96K23j31L40m22K57k28J9M9r6l5J78q0Q4J40k04
$$ 292 -184 184 37 -155 93 13 -183 40 -91 249 -173 84 -144 -125 -76 -172 -207 -29 -109 -25 115 -89
8070h9J10n2j20J51L34m35M5k66M37j35j29J66j88L31k79J52j00o1K31L1k05K08
$$ -89 21 -31 -151 0 334 -101 -56 -322 115 -20 -149 17 -171 160 -119 33 -67 -128 103 134 -71 137
8092A37j96J96Jr6J53j98K59l64Q0K13j35j22K33j57J02k2j47N9m6K65j98J51
$$ 137 -59 137 138 42 195 -3 256 -108 -28 185 50 -72 161 4 106 84 -63 -4 -50 215 17 168
8114A68k56lJ84J20k43K82k59l74jN8N76m24j8N16l46N8j3P1J07l80J00q0J91
$$ 168 -88 -91 93 213 -30 252 -7 -381 -382 -324 252 -172 -190 326 -20 38 25 96 203 -177 -77 -157 34
8137C4P3n07K49K57O4j29j65N52m57kk9l4K12q4qN0j09K93j47k92Q1N6k48K07
$$ 34 107 -400 -151 106 170 41 -124 428 -29 -31 -60 -94 118 34 26 76 -33 260 113 -179 -98 -42 -290 -83
8161h3N2K80j26j61J80m4k40M18k08j12J24j36m8J64k43Q1J86k31j27M71n0k14
$$ -83 -31 249 123 -38 142 98 -142 276 68 -44 80 -56 -104 60 -183 -102 84 -147 -274 197 147 -67
8183f7j41M37j6j67J8m00K54Q9
$$ -67 -208 229 213 46 64 -336 -82 7
8191G
$$ Imaginary data points
##PAGE= N=2
##DATA TABLE= (X++(I..I)), XYDATA
0@%%%%%%%%%Pj4J4j4J9k6K8l5M2m9N8o5P7r1J06j21J40j61J84k11K38k67L01l38
$$ 0 0 0 0 0 0 0 0 0 0 7 -7 7 -7 12 -14 14 -21 21 -28 30 -35 42 -49 57 -64 76 -85 99 -112 126 -141 160 -178
33a78L77m23M72n24N84o48P17p96Q81r74J078j196J326j470J636j825K041k293
$$ -178 199 -224 248 -276 308 -340 377 -419 462 -512 566 -630 696 -774 862 -963 1078 -1215
51a215K597k962L413l992M759n840P483j0319J6596n7752K6734N5796o1269L2955
$$ -1215 1382 -1580 1833 -2159 2600 -3240 4243 -6076 10520 -47232 -20498 35298 -25971 6984
65F984N1046j8051l5607K1594j7278m0505P030J4563k8634J7821M9969j948k8339
$$ 6984 58030 39979 4372 25966 8688 -31817 -24787 -10224 -38858 -21037 28932 26984 -1355
78a355K4406J3822m0042j4081J3757k6942r073L2804N813j2295L3707K9332l1085
$$ -1355 23051 36873 -3169 -17250 -3493 -30435 -39508 -6704 -891 -13186 20521 49853 18768
91A8768j9932K7293r950l9678k882J0821p845L464K0817J981j024K3029j491k7912
$$ 18768 -1164 26129 16179 -23499 -26381 -15560 -23405 -19941 876 2857 1833 24862 23371 -4541
105d541P612J6409k2959j8625J7209P309j0179R026O339j4263O550J1948j9131
$$ -4541 3071 19480 -3479 -22104 -4895 2414 -7765 1261 7600 -6663 -113 11835 -7296
118g296r756K2420O104k4136K724K7866n898j5788R485j934j2431P392N743j7475
$$ -7296 -17052 5368 11472 -12664 -9940 17926 12028 -3760 5725 3791 -8640 -1248 4495 -12980
132a2980K037K5351r730k0278K0374J3194k2234r157J3315l5p090J0097K180j0150
$$ -12980 -10943 14408 4678 -15600 4774 17968 -4266 -13423 -108 -143 -7233 2864 5044 -5106
146e106J3744R480j9168o033J4997m914k1618K724J5639j818r35O879n12M552
$$ -5106 8638 18118 -1050 -7083 7914 3000 -18618 -15894 -255 -2073 -3008 3871 3359 7911
160G911P843q886j1688M068L458j3681m245J3025L718j088K885j340K864P615
$$ 7911 15754 6868 -4820 -752 2706 -10975 -15220 -2195 1523 435 3320 1980 4844 12459
174A2459o419j6089K271J0863r344p941J4787P035n776K458L611m644L95M387
$$ 12459 6040 -10049 -7778 3085 -6259 -14200 587 7622 1846 4304 7915 3271 3666 8053
188H053j4912j2338J7197O694j7087L586K0127k315j1492Q613M845j2154L96K296
$$ 8053 -6859 -19197 -2000 4694 -12393 -8807 11320 9005 -2487 6126 10971 -1183 -787 1509
202A509j3615K053J7337l500j5315J1316J7194j4222j1062J3439j317j3649L642
$$ 1509 -12106 -10053 7284 3784 -11531 -215 16979 2757 -8305 5134 3817 -9832 -6190
215f190M966n240O501J2166j0079q218J8248K281k1084j513J1874p573r587R991
$$ -6190 -1224 -6464 37 12203 2124 -6094 12154 14435 -6649 -8162 3712 -3861 -13448 -3457
229c457N355n507Q906M068j2890N311J3351j3873j5424J2358P970j3969L31J4238
$$ -3457 1898 -3609 5297 9365 -3525 1786 15137 1264 -14160 -1802 6168 -7801 -7470 6768
243F768n169l484R332n160r327J1070L979k0361n50K2595m771j5392J3486Q726
$$ 6768 1599 -1885 7447 2287 -7040 4030 8009 -12352 -12902 9693 4922 -10470 3016 11742
257A1742j2577j37R278j0322o714J3916n400j7220J5835J5527j7758p496J9909
$$ 11742 -835 -972 8306 -2016 -8730 5186 -214 -17434 -1599 13928 -3830 -11326 8583
270H583K194j6781N757R543j3117p40J2031r922p850J6750K677k0824L018K0329
$$ 8583 10777 -6004 -247 9296 -3821 -4561 7470 -2452 -10302 6448 9125 -11699 -8681 11648
284A1648q899j3313J2089N208r756K260P385p322l387J1078n182j3937J1787J0996
$$ 11648 2749 -10564 1525 6733 -3023 -763 6622 -700 -4087 6991 1809 -12128 -341 10655
298A0655j4287o238J4598K406j1042K787N442q091J774N414q150o88J1850N7j2394
$$ 10655 -3632 -9870 4728 7134 -3908 -1121 4321 -3770 -1996 3418 -4732 -5420 6430 6487 -5907
313e907L624J3360p414r486O043j57n299K900K076n189M434R774q136n954J3685
$$ -5907 -2283 11077 3663 -5823 220 63 -5236 -2336 -260 -5449 -1015 8759 623 -5331 8354
328H354J888j3976r08O426k656l988L676p21l184Q308K604r680L411J0167p062
$$ 8354 10242 -3734 -4642 1784 -872 -4860 -1184 -1905 -5089 3219 5823 -3857 -446 9721 2659
343B659j1177O605P296q442j750N910k117R74N931m517m767O789K153j0737k192
$$ 2659 -8518 -1913 5383 -3059 -4809 1101 -1016 -42 5889 1372 -3395 3394 5547 -5190 -7382
358g382R959n59p205J950M514J035R38m49k739r6M781m436o685N270L615m882
$$ -7382 2577 2018 -5187 -3237 1277 2312 3250 2801 62 -34 4747 311 -6374 -1104 2511 -2371
374b371k570L903L862j83j213k438qN327j866p045K630M249k149l603J666M637
$$ -2371 -4941 -1038 2824 2641 1428 -1010 -1018 4309 2443 -4602 -1972 2277 128 -3475 -1809 2828
390B828j368j626n10j884L895K786o084l182O591L655p335j705Q293j651m871
$$ 2828 1460 -166 -676 -2560 1335 4121 -1963 -5145 1446 5101 -2234 -3939 4354 2703 -2168
405b168J359O84o99J563R85n638lR758j666r465M399O775o103n020M925K577m148
$$ -2168 -809 -125 -824 739 1724 -3914 -3917 5841 4175 -5290 -891 5884 -219 -5239 -314 2263 -1885
422a885J848J491m614M475O328q227n747P875K872j0064o18R115j888l847M602
$$ -1885 -37 1454 -3160 1315 7643 -584 -6331 1544 4416 -5648 -6266 2849 961 -2886 1716
437A716N54j545L964o97q288J47Q341m965q592P704N534m513L21M566q53j631
$$ 1716 2270 725 4689 3992 -4296 -4149 4192 -773 -9365 -1661 3873 -640 -319 4247 3394 1763
453A763J584m502n608O470K883r389R47R999M15n706L607L187m945j155P89n493
$$ 1763 3347 -1155 -6763 -293 2590 -6799 -5852 4147 4562 -1144 2463 5650 705 -450 339 -5154
469e154J73O230k212n885P184Q608n948n032O263j3o624K80J233k812J319M716
$$ -5154 -4981 1249 -963 -6848 336 8944 2996 -2036 4227 4214 -2410 -2130 -897 -3709 -2390 2326
485B326l459k843R192K330j0481p30P723k573o291K796M319l550J370L119m369
$$ 2326 -1133 -3976 5216 7546 -2935 -3665 4058 1485 -4806 -2010 2309 -1241 129 3248 -1121
500a121L99N380l901p705M546P650n991m636P639J908m940J514Q10l480P90K421
$$ -1121 -722 4658 757 -6948 -2402 5248 -743 -5379 2260 4168 -772 742 1552 -1928 -1138 1283
516A283m805j606R049J333p758J676O312k879n133J054k48k680L208R63k917M865
$$ 1283 -3522 -5128 3921 5254 -2504 -828 5484 2605 -2528 -1474 -1722 -4402 -1194 -231 -3148 1717
532A717O284n232m172M984J173q063k885L321j309P61M183j084J151N938K23p299
$$ 1717 8001 2769 -1403 3581 4754 -3309 -6194 -2873 -4182 -3421 762 -322 829 6767 6990 -309
548c09m31M603m663p059K927L229m18J350L121K61P55L366l880o258L256J476
$$ -309 -740 3863 -800 -7859 -4932 -1703 -2121 -771 2350 2611 3366 6732 2852 -3406 -150 1326
564A326p191k011O752K981k414R91L726o61N8k98n001j828K965p00n296K594P422
$$ 1326 -5865 -7876 -1124 1857 -557 434 4160 3499 3557 3259 -1742 -3570 -605 -1305 -6601 -4007 3415
581C415r65l726L462K586k047j817j723j965P00J849k599j569N738L090m298r71
$$ 3415 2450 -1276 2186 4772 2725 908 -815 -2780 -2080 -231 -2830 -4399 1339 4429 131 -840
597h40M379M10m172j341P12j809K455M05l971K483N115k202m073K971L551l920
$$ -840 3539 3949 -223 -1564 -852 -2661 -206 199 -3772 -1289 3826 1624 -2449 522 4073 153
613A53k067K339q37L60J725l080j934M669J470n518m80O501r66m535K387K393
$$ 153 -1914 425 -412 -52 1673 -1407 -3341 1328 2798 -2720 -3200 3301 2335 -2200 187 2580
629B580k022n0L9k589n03M814k221n314N006N331m738k208M433R55m366k79M57
$$ 2580 558 508 547 -2042 -2545 2269 48 -5266 -260 5071 333 -1875 2558 3513 -853 -1132 -675
646f75k675K181K328l565M59N647J372n534o70M568k657n042J387J072o64K001
$$ -675 -3350 -1169 1159 -2406 -1947 3700 5072 -462 -1132 3436 779 -4263 -2876 -1804 -2468 -467
662d67J587j090K421L863l209n804K786J346m656k029K742K640o06J395J515o36
$$ -467 1120 30 2451 6314 3105 -2699 87 1433 -3223 -5252 -2510 130 -476 919 2434 1798
678A798J773O7n509j692L996o11m772J889N896j239r51K519j182q77J91k765l200
$$ 1798 3571 3638 -1871 -3563 433 -178 -4950 -3061 2835 1596 645 3164 1982 1105 1296 -1469 -4669
695d669K170M080l087k437P057K231l750n14J257k465k236O11j662j319N851J024
$$ -4669 -2499 1581 -1506 -3943 3114 5345 1595 1081 2338 -127 -2363 -1752 -3414 -4733 1118 2142
711B142m550L342N364l189m622J242J214l599J95J437j471K680L583k744j756
$$ 2142 -2408 934 6298 3109 -1513 -271 943 -2656 -2461 -1024 -2495 185 3768 1024 -732
726g32M297O22o320j784L976j190j964K479L74M30K618M1l008K98L148l710m736
$$ -732 3565 4187 -2133 -3917 59 -1131 -3095 -616 -242 188 2806 2847 -161 137 3285 -425 -5161
743e161L578K511k328l93K400N55r0J243j440k681K938P55m564j5M539k49l646
$$ -5161 -1583 928 -1400 -1793 607 1162 1072 2315 875 -1806 1132 1887 -2677 -2692 1847 1598 -2048
760b048Q91K941j091o25R05j961J3L102j557l188K230L890m218l341M610J394
$$ -2048 -1157 1784 693 68 973 -988 -975 2127 570 -2618 -388 3502 -716 -4057 553 1947
776A947l481J092J432j627J145K391l029k510M591M9o287J576N247k111k959L159
$$ 1947 -1534 -442 990 -637 508 2899 -130 -2640 1951 2000 -4287 -2711 2536 425 -2534 625
792F25K102k118R36J213n169M85M816l828m560N561L443m981k98N482j513k671
$$ 625 2727 609 1545 2758 -2411 -1926 2890 -938 -5498 63 3506 -1475 -1773 3709 2196 -475
808d75K198j483l269K823J652m946m04O835p95n242M477L726m564k057K695k196
$$ -475 1723 240 -3029 -206 1446 -3500 -3904 2931 2136 -3106 1371 5097 533 -1524 1171 -1025
824a025j608L320q95m452M160M996m555j799N109L42n228J61K844k457j452K836
$$ -1025 -2633 687 -208 -4660 -500 4496 -59 -1858 3251 3593 -1635 -1474 1370 -1087 -2539 297
840B97k290p40N007P04m756Q47N374l035m530L623J211l845K76K029j346J96L715
$$ 297 -1993 -2733 2274 2978 -1778 -931 4443 1408 -3122 501 1712 -2133 -1857 172 -1174 -978 2737
857B737j673l989M465K457n343j351M372q03l895J667K518k105J233K097l504
$$ 2737 1064 -2925 1540 3997 -1346 -2697 1675 872 -3023 -1356 1162 -943 290 2387 -1117
872a117m75M890j086n501J616M716m088k616M589K43k820K167Q53k659J714L248
$$ -1117 -1592 3298 2212 -3289 -1673 3043 -1045 -3661 928 1171 -1649 518 1371 -1288 426 3674
888C674m078k964M929P90n145Q72L515j866j405K507J78j990K835Pm460J957M145
$$ 3674 -404 -3368 1561 2351 -2794 -1922 1593 -273 -1678 829 1007 -983 1852 1859 -2601 -644 3501
905C501l177l567L236J907l001O9K450j444%J610j926p44K560O98m029m69L975
$$ 3501 324 -3243 -7 1900 -1101 -1032 1418 -26 -26 1584 -342 -1086 1474 2172 -1857 -2326 1649
922A649r38k594J723J082j329R78L27j704J037J874k466k734L323J452l250l77
$$ 1649 711 -1883 -160 922 -407 571 898 -806 231 2105 -361 -3095 228 1680 -1570 -1947
938a947K037R08q01Q06j06j174J216K99l405L79L314j507k878K202K540k074O3
$$ -1947 90 998 197 1003 897 -277 939 1238 -2167 -1788 1526 19 -2859 -657 1883 -191 -128
955a28J675j630j39J682j699j806K502J481l944p85M520N4l204J302J446j824
$$ -128 1547 -83 -222 1460 -239 -2045 457 1938 -2006 -2791 1729 1783 -1421 -119 1327 -497
971d97O52J245k378j246L805p87m303L007L526l472j454K907P43k228J039Q99
$$ -497 155 1400 -978 -2224 1581 794 -3509 -502 3024 -448 -1902 1005 1748 -480 559 1458
987A458l501J230L107l674j866M651N07m760J613M668k685j820K621j126k236
$$ 1458 -2043 -813 2294 -1380 -3246 1405 1912 -2848 -1235 3433 748 -1072 1549 423 -1813
1002a813K548J46m219J323N137l125l026M980K087m943K26K705k651j328K715
$$ -1813 735 881 -3338 -2015 3122 -3 -3029 1951 4038 -905 -679 2026 -625 -1953 762
1017G62j697l154M365K486m432L32N205j711m374K702J944m283j36K749k412q65
$$ 762 -935 -4089 276 2762 -1670 -1338 3867 2156 -2218 484 2428 -1855 -1991 758 -1654 -2519
1033b519M563m38l892L071L613m597k392M622n54m792J679K068k372J046L501
$$ -2519 2044 1606 -2286 785 4398 -199 -2591 2031 1477 -3315 -1636 432 -1940 -894 2607
1048B607k196k360M542P47n638P87M261l086l299L585J133k800J206K617l150
$$ 2607 411 -1949 2593 3340 -2298 -1511 2750 -336 -3635 -50 1083 -1717 -511 2106 -1044
1063a044K91M161k526m142L371K294m547j351N220r78k604K515J391k789J539
$$ -1044 -753 3408 882 -3260 111 2405 -2142 -3493 1727 749 -1855 660 2051 -738 801
1078H01K077l955j689M915j032m469K197L614k841j199K944o2j719J385J72l349
$$ 801 2878 -1077 -2766 2149 1117 -3352 -1155 2459 -382 -1581 1363 1301 -418 967 1139 -2210
1094b210J604K908l378j861L992O17l093Q50K451j823p14J691j509o48K429j42
$$ -2210 -606 2302 -1076 -2937 1055 1672 -1421 -571 1880 57 -657 1034 -475 -1123 1306 1164
1110A164l380Q53L253j768k060K227P65j947O19Q71j010O20Q82j707j615L071
$$ 1164 -2216 -1363 1890 122 -1938 289 1054 -893 -274 597 -413 207 1089 -618 -2233 838
1126H38R55l688O16K338p6j535J251K59j167O71k1k369R56K142j724j674K297
$$ 838 1793 -1895 -1279 1059 983 -552 699 958 -209 462 441 -1928 -972 1170 -554 -2228 69
1143F9J951j619l83J389n75j337R26j316o68J668N83k218J91L497o54k241R98
$$ 69 2020 401 18 1407 832 -505 421 -895 -1563 105 688 -1530 -1339 2158 1504 -737 261
1160B61Q27j332q4M58j346n5K379r90k005L052J519l440m85K174m36j718J192
$$ 261 1088 -244 -328 130 -1216 -1271 1108 118 -1887 1165 2684 -756 -1241 933 497 -1221 -29
1177b9K84j664J623J893k888L32L152j881l275J582K575k985j19K428q22j250
$$ -29 255 -1409 214 2107 -781 -449 2703 822 -2453 -871 1704 -1281 -1400 1028 206 -1044
1193a044K942q02k537J727J749l241j419M202M5m067J922K179j656j20J449j510
$$ -1044 1898 1096 -1441 286 2035 -1206 -2625 1577 1622 -2445 -523 1656 0 -120 1329 -181
1209a81j870L199k30l634K006L002k391k003L101J597l254L14J699k592j05K895
$$ -181 -2051 1148 918 -2716 -710 2292 -99 -2102 999 2596 -658 -344 1355 -1237 -1342 1553
1225A553j863k031K916J630l364m7L920j296l064J786R45k046L53J576k150m08
$$ 1553 -310 -2341 575 2205 -1159 -1206 2714 1418 -1646 140 1085 -961 -608 968 -1182 -1590
1241a590L239l6l177J850K615l279j580K902k43k159P21J179k076J392K490k005
$$ -1590 1649 1613 -1564 286 2901 -378 -1958 944 701 -1458 -737 442 -1634 -242 2248 243
1257B43j734L172M89l762L03L128j896k274K302L77j622J750J157k413R2L276
$$ 243 -1491 1681 2170 -1592 -1289 1839 -57 -2331 -29 348 -1274 476 1633 -780 -688 2588
1273B588j738l264K816J238l457RK658q46p58J729l30j929K275J588l455o51K562
$$ 2588 850 -2414 402 1640 -1817 -1808 850 4 -754 975 645 -1284 991 2579 -876 -1527 1035
1290A035o38k726J465J844j212j78J670q22m39J633p83k569Q90J880j714j483
$$ 1035 397 -2329 -864 980 -232 -410 1260 438 -1 1632 849 -1720 -830 1050 -664 -2147
1306b147K263O16j752P05J469k95o2r7j098p23J150J79j940L19K600p39j076J012
$$ -2147 116 732 -1020 -315 1154 859 797 700 -398 -1121 29 208 -1732 -1413 1187 448 -628 384
1324C84J023n72m72k8j105L29J001j548j109J926J408j103n08J723k85j331l9
$$ 384 1407 835 363 335 -770 -441 560 -988 -2097 -171 1237 134 -374 1349 1064 -267 -306
1341c06K33n95O11k15j182R38J662n84j260J077R55j156m99N76l48m80O96o61
$$ -306 -73 -668 -57 -272 -1454 -516 1146 562 -698 379 1334 178 -321 255 -93 -573 123 -538
1359e38q80K224P19j915j89J730o13j070M06L59p17M90L13j056L41J622j025j450
$$ -538 -1418 806 1525 -390 -579 1151 538 -532 -126 233 -484 6 319 -737 -396 1226 201 -1249
1377a249J590J041j585o20J522o06n87Q29n06o61J052N81j685l69K624m95j906
$$ -1249 341 1382 -203 -823 699 93 -494 335 -171 -832 220 801 -884 -1253 1371 876 -1030
1394a030J223P59j169L0O08o77m80J244m69j233J533J344j986m12J742K59j964
$$ -1030 193 952 -217 -187 421 -256 -736 508 39 -1194 339 1683 -303 -715 1027 1286 -678
1411f78L25P65r93l1J136j073k46J510L17j873R07J849j619j641J347M44j320
$$ -678 -353 412 -581 -612 524 -549 -795 715 1032 -841 66 1915 296 -1345 2 446 -874
1428h74O27N53j347O91J701p91j764J973Q70k762k7J739n43j063P42R09j192R20
$$ -874 -247 306 -1041 -350 1351 560 -1204 769 1639 -1123 -1150 589 46 -1017 -275 634 -558 362
1446C62J203j634o31K165q99k160J096J756j790j095J986J28r97J075J89j494
$$ 362 1565 -69 -700 1465 566 -1594 -498 1258 -532 -1627 359 487 -510 565 754 -740
1462g40P34J430j436j540K504Q8k333L27J666p55p59Q88j27p90J469M96j803K91
$$ -740 -6 1424 -12 -1552 952 1040 -1293 -966 700 -55 -814 74 -53 -843 626 1122 -681 -390
1480c90J519r03j913J250J348j420l36J472m91l84J413q96j031Q84Q66j770o63
$$ -390 1129 226 -1687 -437 911 -509 -845 627 136 -248 1165 269 -762 122 988 -782 -1445
1497a445J860k54j011O83P67oj80M95o92p55J147l99k165J093J332o76q04J307
$$ -1445 415 161 -850 -167 600 594 414 909 217 -538 609 210 -1955 -862 470 -206 -1010 297
1515B97J237p51n94N15l56m99J39r85o14J204R35j145K50K017n23j161M23K54
$$ 297 1534 783 189 704 348 -151 -12 -997 -1611 -407 528 -617 -367 1650 1127 -34 389 643
1533F43n34n29n56n33O34J200n2o16J445N12j015q67K42K83j358M03k7j98J319
$$ 643 109 -420 -976 -1509 -875 325 273 -343 1102 1614 599 -268 -26 257 -1101 -698 -725 -923 396
1552C96J83q55M61J351n48j136j19M53q40o26Q30l98N53J294q05k29Q35O61j411
$$ 396 579 -276 185 1536 988 -148 -267 186 -654 -1280 -450 -848 -295 999 194 -35 800 1461 50
1571E0p90R93m44o73Q47l2k89Q45m9o39L91Q10o67j501J008N98n11m28L05L68
$$ 50 -740 253 -191 -864 -17 -49 -338 507 458 -181 210 1020 353 -1148 -140 458 -53 -481 -176 192
1591A92Lk74K38n81P17N18j496J4J382l28n80n34J063l07J5j97r9K36O13k90p02
$$ 192 195 -79 159 -422 295 813 -683 -669 713 385 -195 -729 334 27 42 -155 -254 -18 595 305 -397
1612c97M36Q86o98j432J227L76q86j09Q58P8k86M51J82j039O96K29j455L4J357
$$ -397 39 925 227 -1205 22 398 -488 -597 261 339 53 504 686 -353 343 572 -883 -849 508
1631E08l29p32O14R05m48m72O00p47l70Q78n02j400J112J474j189p94J383M73
$$ 508 179 -553 61 966 518 46 646 -101 -471 407 -95 -1495 -383 1091 -98 -892 491 964
1649I64j261K97k4q11O47M82m15p94J534M65j784Q21R21p52j348Q71j14m3K37
$$ 964 -297 0 -24 -835 -188 294 -121 -915 619 1084 -700 121 1042 290 -1058 -187 -301 -344 -107
1668a07R10j142R2J717j307p97L42N93j058l56J220M12q18P42J59l74L34k37q89
$$ -107 803 -339 -247 1470 163 -634 -292 301 -757 -1113 107 519 -299 443 602 228 562 325 -564
1687e64m82J274j36j372R15J165k90p56M05L0k42M30m28q37O85P30q89k19R38
$$ -564 -1046 228 92 -1280 -365 800 510 -246 159 189 -53 377 -51 -888 -203 527 -362 -581 357
1706C57L72r39j81Q88m33m25N33n49l99J073K34r49j50J246k35j399J026M84r20
$$ 357 729 -210 -391 497 64 -361 172 -377 -776 297 531 -418 -568 678 443 -956 70 554 -366
1725c66L90J58l07j50O65j87j172J041O77j415M43J127k83q26K38K01k53j27K93
$$ -366 24 182 -125 -275 390 203 -969 72 749 -666 -223 904 621 -205 33 234 -19 -146 147
1744A47p82J30R01j77q32R40P91p81n39K01J65q86O25l95l39O97M31n61L1R37
$$ 147 -635 -505 396 219 -613 327 1118 337 -202 -1 164 -722 -97 -492 -831 -134 297 -264 -233 704
1764G04J70j182K66N25m59n47j07M4j61J128l01k65N75J080j004o00L65j99q79
$$ 704 874 -308 -42 483 24 -523 -630 -586 -747 381 80 -185 390 1470 466 -134 231 32 -847
1783h47J05N03m55M07O85k71k12J140M07j560m7N25p49r59R42M08m12M94M21k94
$$ -847 -742 -239 -694 -287 398 127 -85 1055 1462 -98 -145 380 -369 -1328 -386 22 -390 104 525 231
1803B31L31O36o48j160N06N68j349j73J020M67o73O37M01m12J63M40j665k78J231
$$ 231 562 1198 550 -610 -104 464 -885 -1058 -38 429 -244 393 794 382 545 985 -680 -958 273
1822B73l1j690R18J029o40j63R04k69k52K84Nj171N53P36r66q10J606K74q71K92
$$ 273 242 -1448 -530 499 -141 -304 600 331 79 363 368 -803 -250 486 -480 -1290 316 590 -281 11
1842A1O81o93K19L98n35o63Q84L44j399N17J234r07j038J051R48r26k35M50n63
$$ 11 692 -1 218 616 81 -582 302 646 -753 -236 998 91 -947 104 1052 126 -109 341 -222
1861b22Q6P42r43q77J123Q81j288m9J257j93r93P63p1l38j48M97n39n34J278n9
$$ -222 -136 606 -337 -1214 -91 790 -498 -547 710 517 -476 287 216 -122 -270 227 -312 -846 432 373
1881C73j189J105R05j182o55J259l41q13N30K65q26P7R17n40n17J031M73j191
$$ 373 -816 289 1194 12 -643 616 275 -538 -8 257 -569 -492 425 -115 -632 399 872 -319
1899c19K24Q23n86p01Q86k32p48R05J35r42N64J005q07o17O63N26r83L9O91n84
$$ -319 -95 728 142 -559 327 95 -653 252 387 -555 9 1014 207 -410 253 779 -204 -165 526 -58
1919e8l96O92k68p95J004P15j429N0J012j03j163N52M19o11J29L47p15J88J151
$$ -58 -454 238 -30 -825 179 894 -535 -485 527 424 -739 -187 232 -379 -250 97 -618 -430 721
1938G21o85n88Q84K3m21l20R67m54n09K48K9l83M12L71n34K45P69l54j040O07
$$ 721 36 -552 332 355 -66 -386 581 127 -382 -134 -105 -488 -76 295 -239 6 775 421 -619 -12
1958a2M19q39p9P14m95j15O23l30n11J149L65j276n31J023jn65N10L86o85k70
$$ -12 407 -432 -511 203 -292 -407 216 -114 -625 524 889 -387 -918 105 104 -461 49 435 -250 -520
1978e20J165q37Q4R62j85j154M76Q93j045p12R89K70j080O15L98l23jP01p48j26
$$ -520 645 -192 -108 854 669 -485 -9 884 -161 -873 116 386 -694 -79 319 -4 -5 696 -52 -178
1998a78O49K22j369l01J134m06n56Q41L72o19O37L15j043j95J326j177q47Q47
$$ -178 471 693 -676 -977 157 -249 -805 36 408 -211 426 741 -302 -497 829 -348 -1195 -348
2016c48P62r68K48J018l0q86J127m08j112P66J21j012o66J618J02j141J195Q05
$$ -348 414 -554 -306 712 682 -204 923 515 -597 169 290 -722 -1388 230 332 -809 386 1191
2034A191q76j20M90o04q85O86O2j555P79J522j067k79J370L89j155k3O50j143
$$ 1191 315 195 685 81 -804 -118 -56 -1611 -832 690 -377 -656 714 1103 -52 -75 575 -568
2052e68k91Q23m45n11J351J08r47M27J188o54j137M74N55j016J06Q97m25n32J116
$$ -568 -859 -36 -481 -992 359 467 -480 -53 1135 481 -656 -182 373 -643 -537 360 -65 -597 519
2071E19N2j175J073L94j181L1N40k5r10M27P54r26j18J172p57j47O17k52l12K39
$$ 519 571 -604 469 863 -318 -287 253 228 -682 -255 499 -427 -545 627 -130 -277 340 88 -224 15
2091A5O84m93q80P36l26l90Q19j31n73M34Q36l41p15J057J17j291m5R02o80j78
$$ 15 699 206 -674 62 -264 -654 165 34 -539 -105 731 390 -325 732 849 -442 -487 415 -265 -443
2111d43M01P8k00O69j55p03N96J94q64l27N59K30m61M04M54J1Q0L07p66o06O45
$$ -443 -42 36 -164 505 350 -353 243 437 -427 -754 -195 35 -426 -22 432 443 523 830 64 -542 103
2132A03r7p23j40Q90K7l61O18j90q8J97l5q13J54P67n47m97J322k8p08O39J54
$$ 103 6 -717 -857 33 60 -301 317 127 39 236 201 -612 -458 309 -238 -735 587 559 -149 490 644
2153F44o21j93J59k13r51R12P52o75j42J274k82m54j29M87q83m92P22m37L76N23
$$ 644 23 -170 -11 -224 -1175 -263 489 -186 -328 946 664 210 81 568 -315 -807 -85 -522 -146 377
2173C77k03l47O80L17n95n50P09q16o97O07M13l02P54K29m67p4Q30m04q98QN51
$$ 377 174 -173 507 824 229 -321 388 -428 -1125 -518 -105 -407 347 576 109 35 865 461 -437 -429 122
2194A22j226L07P55K39j61N32L41r90Q6P73j053l45Q05j99l53M8R35p11RQ78k54
$$ 122 -1104 -797 -42 197 36 568 909 -81 5 778 -275 -620 185 -14 -367 -319 616 -95 -86 792 538
2215E38j041P49N74j884L08Q34j47r31J146N34j099M59N43m37n77O31J39r79M96
$$ 538 -503 246 820 -1064 -756 78 -69 -1000 146 680 -419 40 583 146 -431 200 339 -640 -144
2234a44J031j248m50J105J28r45K06P94m44m97J103m33o04O19J62q67J21J258
$$ -144 887 -361 -811 294 422 -523 -317 477 33 -464 639 206 -398 221 383 -484 -363 895
2252H95r81l66P12J34m18K04J78n12J79o3k19n51P87N30q29K99J128n13m39M41
$$ 895 -86 -452 260 394 -24 180 358 -154 25 -38 -257 -808 -21 509 -320 -21 1107 594 155 596
2272E96j66r30j43L57n35J42R84j67J31N56K42o65m78L57j47r80M84Qo21J038
$$ 596 430 -500 -643 -286 -821 -679 305 138 269 825 1067 402 -76 281 134 -846 -362 -354 -975 63
2292F3N64l97k40O93j16r10J28J84k38l74P46k96RQ63k46l78K13O40j182n56Q51
$$ 63 627 230 -10 683 567 -343 -215 -31 -269 -643 103 -193 -184 679 433 55 268 908 -274 -830 21
2313B1q9n48M64M00k97R5N68j11l05J51k96l83N5O32m92k58O35K39l06j63N7j07
$$ 21 -68 -616 -152 248 -49 46 614 503 198 349 53 -330 -275 357 -135 -393 242 481 175 12 69 -38
2335c8J20J10j49j07K34M47p56O6L4o7j79M11j17k74P71m9o88K81N32n98m39K52
$$ -38 82 192 43 -64 170 617 -139 -73 -39 -106 -285 126 9 -265 506 457 -231 50 582 -16 -455 -203
2357b03K87m47M85J79n72J29N47l70k50N46k17o18J25N51l24k92O29N35m18J68
$$ -203 84 -363 122 301 -271 -142 405 35 -215 331 114 -504 -379 172 -152 -444 185 720 302 470
2377D70M1o61q3M14j45j099Q58K76k72j96Q23J82m83K80K55p26m51O16n00k30
$$ 470 511 -150 -233 181 36 -1063 -205 71 -201 -397 426 608 125 405 660 -66 -517 99 -401 -631
2397f31J032l99l40L18P58m71n69M02L69p04K80r3n39N92O38q37l60Q69Ln47K91
$$ -631 401 2 -338 -20 738 267 -302 100 469 -235 45 -48 -587 5 643 -194 -554 315 318 -229 62
2418F2K98n64R7M8J85j20L01J01n81p6O14m80l67O46J55n67J43K10j62p4N90o26
$$ 62 360 -204 -107 -59 126 6 307 408 -173 -249 365 -115 -482 164 319 -248 -105 105 -57 -131 459 -167
2440a67l9L79Q7l44k82R04l66l20K91R3j99j52J73j88n70Q37K01r29N22M56j76
$$ -167 -206 173 260 -84 -366 538 172 -148 143 236 37 -115 58 -130 -700 137 338 -591 -69 387 211
2461B11q50R54jo90L4N10o05l5O00j71j33N31K45m57o41R84l31m20J0L36l12J57
$$ 211 -639 315 314 -376 -342 168 -437 -472 128 -43 -176 355 600 143 -498 486 155 -265 -255 81 -231 -74
2483g4K76m29K25O51k46n38J50M57m57m21M52m94L62K03J35n55M59L14n60j43
$$ -74 202 -227 -2 649 403 -135 15 472 15 -406 46 -448 -86 117 252 -303 156 470 -90 -233
2503b33P14l72k89J3L07l92o2M72l83K46M01m53r6K66K72m57j29j94L48k8J96
$$ -233 481 109 -180 -167 140 -252 -314 158 -225 21 422 -31 -127 139 411 -46 -175 -369 -21 -49 147
2524A47o0n2J14O9j14J29j69K70o93K18N70l10l55J32K80r5L33m34q2J81L57o03
$$ 147 87 35 149 218 104 233 64 334 -359 -141 429 119 -236 -104 176 81 414 -20 -102 79 436 -167
2546a67J41j3L16l65j73N75m22k5M19m05K59Q1Q4l00k63J58o9j66L67J92k30O7
$$ -167 -26 -39 277 -88 -261 314 -108 -133 286 -119 140 221 305 5 -258 -100 -169 -335 32 224 -6 61
2568F1j34q1K23K9j38M2k1K09o07K77O12m99j73L77P3l70r2K45l54P6L69%l97
$$ 61 -73 -154 69 98 -40 2 -19 190 -417 -140 472 -27 -200 177 250 -120 -212 33 -321 -245 124 124 -273
2591b73N48Jj15m75P25k94k40M74m83j78J78M09p05M03m7M89n85L65J53m56L3
$$ -273 275 276 161 -314 411 117 -123 351 -132 -310 -132 277 -428 -25 -72 417 -168 197 350 -106 -73
2612g3J7M90o96m0K79l60K98O31n33j27L54j28l52K0KJj16M69k37l0J17L25k58
$$ -73 -56 434 -262 -302 -23 -383 -85 546 13 -114 240 112 -240 -220 -218 -217 -333 136 -101 -131 -14 311 53
2635E3p2J12J11o51L36L05l17p6L28k34m3J49K63m75Q7M28m30l03N36P7k94K9
$$ 53 -19 93 204 -447 -111 194 -123 -199 129 -105 -148 1 264 -211 -124 304 -126 -429 107 184 -110 -81
2657h1K27l60L8L05k62q5O2M24m44J09M40np60M52l3l76K7K94j87J72K07J29p85
$$ -81 146 -214 -176 129 -133 -218 -156 268 -176 -67 373 368 -392 60 27 -349 -322 -28 -215 -43 164 293 -492
2680d92O48M57m53L7k00nk82K95J68j45j26N65k1j99M37k66k78m69K35J45l45
$$ -492 156 613 160 197 -3 -8 -290 5 173 28 -98 467 446 247 684 418 140 -329 -94 51 -294
2701b94L09J0J10j06L30k72j30K8m67R0L02J24O1j88K12o2j29j8M43m45L66l10
$$ -294 15 25 135 29 359 87 -43 -15 -482 -392 -90 34 95 -93 119 57 -72 -90 353 -92 274 -36
2723c6J34K66n61J76l14M27j88K04k09L21P6l64J72J1l06M88J38n25m13M93Oo3
$$ -36 98 364 -197 -21 -335 92 -96 108 -101 220 296 -68 104 115 -191 297 435 -90 -503 -10 -4 -67
2745f7j10L55P0J0N91p63l20K67K23q82pP93J47o21J000k21k03K57k05n68L1J89
$$ -67 -177 178 248 258 849 86 -234 33 256 -626 -633 160 307 -314 686 465 262 519 314 -254 -223 -34
2767c4p62J32J59M45j81M79M68l24l58M90p46r0L08o78J98L36K52L5L5L21j30
$$ -34 -796 -664 -505 -60 -241 238 706 382 24 514 -232 -322 -14 -692 -494 -158 94 129 164 485 355
2788C55k3m11L33p47N85n59K70J58L40N7l68J44L47m03k14J65j70l29L55j19O8
$$ 355 332 -79 254 -493 92 -467 -197 -39 301 358 -10 134 481 78 -136 29 -141 -470 -115 -234 -166
2809a66Q7J71j7k27K38L07l81k21M38l70j23J92K87k13J87P7m85J89J09P0l26
$$ -166 -79 92 75 -152 86 393 12 -209 229 -141 -264 -72 215 2 189 266 -219 -30 79 149 -177
2830a77J12K75k80j16N45l00l03m7K61r3l67R20m00r1M53j09n04J95o3j47k44
$$ -177 -65 210 -70 -186 359 59 -244 -291 -30 -123 -490 430 30 -61 392 283 -221 -26 -89 -236 -480
2851d80O00j3k87N38j75k13J49Q7j92j85m1K18m45N57J94l37ML24k10j37J04J98
$$ -480 120 107 -180 358 183 -30 119 206 14 -171 -212 6 -439 118 312 -25 -21 303 93 -44 60 258
2873B58l61j06K7o0P7J36M50k39l0L76k92m54L38j37m02J37L14P0j99N00k57o7
$$ 258 -103 -209 -182 -242 -165 -29 421 182 152 528 236 -218 120 -17 -419 -282 32 102 -97 403 146 79
2895G9k00K08k57J49R9k05k87J38O74m26k31P08m23j8k84K67j86J17J40k12RL86
$$ 79 -121 87 -170 -21 78 -127 -414 -276 398 -28 -259 449 26 8 -276 -9 -195 -78 62 -150 -141 245
2917B45M5k37J99j66k11m16O87ro8k00N98n78P4L52n46k99O87k88J1mP6k28M87
$$ 245 290 53 252 86 -125 -541 146 137 69 -131 467 -111 -37 315 -231 -530 157 -131 -120 -124 -48 -276 211
2940B11R4l67K37k24J45o29L95L56o58J86L79N0k38J94J39k55j55M08o58J8L32
$$ 211 305 -62 175 -49 96 -533 -138 218 -440 -254 125 175 -63 131 270 15 -140 268 -390 -372 -40
2961d0K3p2J07O3l13L62O8n9l94K18j05km5K25m72L20N54k10k42K15O1l80L18
$$ -40 -17 -89 18 81 -232 130 198 139 -255 -37 -142 -144 -189 36 -436 -116 438 228 -14 201 262 -118 200
2984B00j83p3l95Q36m05j06R2M66k37m56L62q2k56J7K34m59J98M92m27m3J53J37
$$ 200 17 -56 -451 385 -20 -126 -34 432 195 -261 101 19 -237 -220 14 -445 -247 245 -182 -225 -72 65
3006F5j67l24P79j65m88N74l5n29J42N7m6p9M68L9m18J44M38m22k35L08l32k11
$$ 65 -102 -426 353 188 -300 274 239 -290 -148 -91 -137 -216 252 291 -127 17 455 33 -202 106 -226 -437
3028d37N21J14n34M2R78q62o4L97j14l66K92K01l23j26M09Jl55L67J46k82J71
$$ -437 84 198 -336 -294 684 -178 -242 155 41 -325 -33 168 -155 -281 128 129 -226 141 287 5 176
3049A76L90l66l92P1L16o74K2N46J02j86K83j21n43K12N85m93k95O05k09k43O7
$$ 176 566 200 -192 -121 195 -479 -457 89 191 5 288 167 -376 -164 421 -72 -367 238 29 -214 -147
3070a47K68l5n7J58j25l27L92n4k23j4K68j61l42L11L59k33J91j79K53l05j11
$$ -147 121 86 29 187 62 -265 127 73 -150 -164 104 -57 -399 -88 271 38 229 50 303 -2 -113
3091a13Ok93N42J6j97R4J85j30l87L18J9j64m5M38m04j31L45j96j73J45J89k44
$$ -113 -107 -400 142 158 -39 55 240 110 -277 41 60 -104 -149 289 -115 -246 99 -97 -270 -125 64 -180
3113a80P0L16j32k01m9J79l88N84j95j5R0j78J96l19L06K17n87r0K81p7K19P1
$$ -180 -110 206 74 -127 -176 3 -385 199 4 -11 79 -99 97 -222 84 301 -286 -376 -95 -172 47 118
3135A18k31J17k32L21k8k23O4R9R6K93k02n56J89L58m32J6K60j31J23L6L87m60
$$ 118 -113 4 -228 93 65 -158 -94 5 101 394 192 -364 -175 183 -249 -233 27 -104 19 55 442 -18
3157a8J07l1J86l40J75j55l47L35L03l12n8J47K21k94J7Q1J6n11O45n01L57L06
$$ -18 89 58 244 -96 79 -76 -423 -88 215 -97 -155 -8 213 -81 -64 17 33 -478 167 -334 23 329
$$ [...]
8191B
##END NTUPLES=NMR FID
##END=
