##TITLE=1H_Ser 2066-NH2
 DMSO
 8 sc, 
 2.4.2024
##JCAMPDX= 6.0         $$ Bruker NMR JCAMP-DX V2.0
##DATA TYPE= NMR FID
##DATA CLASS= NTUPLES
##ORIGIN= UXNMR, Bruker Analytische Messtechnik GmbH
##OWNER= root
$$ XWIN-NMR		Version 3.5
$$ Tue Apr  2 16:04:01 2024 Russian Standard Time (UT+4h)  she@DPX200
##.OBSERVE FREQUENCY= 200.1309
##.OBSERVE NUCLEUS= ^1H
##.DELAY= (6, 6)
##.ACQUISITION MODE= SIMULTANEOUS
##.ACQUISITION SCHEME= undefined
##.AVERAGES= 8
##.DIGITISER RES= 18
##SPECTROMETER/DATA SYSTEM= spect
##.PULSE SEQUENCE= zg30
##.SOLVENT NAME= MeOD
##.SHIFT REFERENCE= (INTERNAL, MeOD, 0, 15.7039)
##AUDIT TRAIL= $$ (NUMBER, WHEN, WHO, WHERE, WHAT)
$$ ##TITLE= Audit trail, XWIN-NMR		Version 3.5
$$ ##JCAMPDX= 5.01
$$ ##ORIGIN= Bruker BioSpin GmbH
$$ ##OWNER= she
$$ F:/spectra/data/she/nmr/H-F/1/audita.txt
$$ ##AUDIT TRAIL=  $$ (NUMBER, WHEN, WHO, WHERE, WHAT)
(   1,<2024-04-02 16:02:50.87 +0400>,<she>,<DPX200>,
      <created by zg, POWCHK disabled, PULCHK disabled
       configuration hash MD5:
       00 E9 B6 7A A2 85 ED C7 34 08 36 98 17 FE 4E 26
       data hash MD5: 16K
       A6 2E 1D 73 3B 0D 1C 78 7F 40 1B D2 C9 81 1E 1E>)
$$ ##END=
$$ 
$$ hash MD5
$$ F7 A8 48 63 0F 7D AD 54 52 2B BF AA E4 0A EE E2
##$RELAX= 
##$RELAX= 
##$RELAX= 
##$RELAX= 
##$RELAX= 
##$RELAX= 
$$ Bruker specific parameters
$$ --------------------------
##$DU= <F:/spectra>
##$EXPNO= 1
##$NAME= <H-F>
##$PROCNO= 1
##$TYPE= <nmr>
##$USER= <she>
##$AMP= (0..31)
100 100 100 100 100 100 100 100 100 100 100 100 100 100 100 100 100 100 
100 100 100 100 100 100 100 100 100 100 100 100 100 100 
##$AQSEQ= 0
##$AQ_mod= 1
##$AUNM= <au_zg>
##$AUTOPOS= <>
##$BF1= 200.13
##$BF2= 200.13
##$BF3= 200.13
##$BF4= 200.13
##$BF5= 200.13
##$BF6= 200.13
##$BF7= 200.13
##$BF8= 200.13
##$BYTORDA= 1
##$CFDGTYP= 0
##$CFRGTYP= 5
##$CHEMSTR= <none>
##$CNST= (0..31)
1 1 145 1 1 1 1 1 1 1 1 1 1 1 1 1 1 1 1 1 1 1 1 1 1 1 1 1 1 1 1 1 
##$CPDPRG= <>
##$CPDPRG1= <>
##$CPDPRG2= <>
##$CPDPRG3= <>
##$CPDPRG4= <mlev>
##$CPDPRG5= <mlev>
##$CPDPRG6= <mlev>
##$CPDPRG7= <mlev>
##$CPDPRG8= <mlev>
##$CPDPRGB= <>
##$CPDPRGT= <>
##$D= (0..31)
0 1.2 0 0 0 0 0 0 0 0.06 0 0.03 0 0 0 0 0.0002 0 0 0 0 0 0 0 0 0 0 0 0 
0 0 0 
##$DATE= 1712059370
##$DBL= (0..7)
120 120 120 120 120 120 120 120 
##$DBP= (0..7)
150 150 150 150 150 150 150 150 
##$DBP07= 0
##$DBPNAM0= <>
##$DBPNAM1= <>
##$DBPNAM2= <>
##$DBPNAM3= <>
##$DBPNAM4= <>
##$DBPNAM5= <>
##$DBPNAM6= <>
##$DBPNAM7= <>
##$DBPOAL= (0..7)
0.5 0.5 0.5 0.5 0.5 0.5 0.5 0.5 
##$DBPOFFS= (0..7)
0 0 0 0 0 0 0 0 
##$DE= 6
##$DECBNUC= <off>
##$DECIM= 32
##$DECNUC= <off>
##$DECSTAT= 4
##$DIGMOD= 1
##$DIGTYP= 9
##$DL= (0..7)
0 120 120 120 120 120 120 120 
##$DP= (0..7)
150 150 150 150 150 150 150 150 
##$DP07= 0
##$DPNAME0= <>
##$DPNAME1= <>
##$DPNAME2= <>
##$DPNAME3= <>
##$DPNAME4= <>
##$DPNAME5= <>
##$DPNAME6= <>
##$DPNAME7= <>
##$DPOAL= (0..7)
0.5 0.5 0.5 0.5 0.5 0.5 0.5 0.5 
##$DPOFFS= (0..7)
0 0 0 0 0 0 0 0 
##$DQDMODE= 0
##$DR= 18
##$DS= 0
##$DSLIST= <SSSSSSSSSSSSSSS>
$$ [...]
##$SUBNAM2= <"">
##$SUBNAM3= <"">
##$SUBNAM4= <"">
##$SUBNAM5= <"">
##$SUBNAM6= <"">
##$SUBNAM7= <"">
##$SUBNAM8= <"">
##$SUBNAM9= <"">
##$SW= 18.0517689322627
##$SWIBOX= (0..15)
0 0 2 0 0 0 0 0 0 0 0 0 0 0 0 0 
##$SW_h= 3612.71676300578
##$TD= 16384
##$TD0= 1
##$TE= 0
##$TE2= 300
##$TE3= 300
##$TEG= 300
##$TL= (0..7)
0 120 120 120 120 120 120 120 
##$TP= (0..7)
150 150 150 150 150 150 150 150 
##$TP07= 0
##$TPNAME0= <>
##$TPNAME1= <>
##$TPNAME2= <>
##$TPNAME3= <>
##$TPNAME4= <>
##$TPNAME5= <>
##$TPNAME6= <>
##$TPNAME7= <>
##$TPOAL= (0..7)
0.5 0.5 0.5 0.5 0.5 0.5 0.5 0.5 
##$TPOFFS= (0..7)
0 0 0 0 0 0 0 0 
##$TUNHIN= 0
##$TUNHOUT= 0
##$TUNXOUT= 0
##$USERA1= <user>
##$USERA2= <user>
##$USERA3= <user>
##$USERA4= <user>
##$USERA5= <user>
##$V9= 5
##$VALIST= <valist>
##$VCLIST= <CCCCCCCCCCCCCCC>
##$VD= 0
##$VDLIST= <DDDDDDDDDDDDDDD>
##$VPLIST= <PPPPPPPPPPPPPPP>
##$VTLIST= <TTTTTTTTTTTTTTT>
##$WBST= 1024
##$WBSW= 4
##$XGAIN= (0..3)
0 0 0 0 
##$XL= 0
##$YL= 0
##$YMAX_a= 131025
##$YMIN_a= -138478
##$ZGOPTNS= <>
##$ZL1= 120
##$ZL2= 120
##$ZL3= 120
##$ZL4= 120
##$ABSF1= 10
##$ABSF2= 0
##$ABSG= 5
##$ABSL= 3
##$ALPHA= 0
##$AQORDER= 0
##$ASSFAC= 0
##$ASSFACI= 0
##$ASSFACX= 0
##$ASSWID= 0
##$AUNMP= <proc_1d>
##$AZFE= 0.1
##$AZFW= 0.1
##$BCFW= 1
##$BC_mod= 2
##$BYTORDP= 1
##$COROFFS= 0
##$CY= 11.3945322036743
##$DATMOD= 1
##$DC= 2
##$DFILT= <>
##$DTYPP= 0
##$F1P= 15.7292609196834
##$F2P= 12.9074282941183
##$FCOR= 0.5
##$FTSIZE= 0
##$FT_mod= 4
##$GAMMA= 1
##$GB= 0.15
##$INTBC= 1
##$INTSCL= 1
##$ISEN= 128
##$LB= 0.24
##$LEV0= 0
##$LPBIN= 0
##$MAXI= 10000
##$MC2= 0
##$MEAN= 0
##$ME_mod= 0
##$MI= 1.114404
##$NCOEF= 0
##$NC_proc= 0
##$NLEV= 6
##$NOISF1= 3.799351
##$NOISF2= 2.8
##$NSP= 1
##$NTH_PI= 0
##$NZP= 0
##$OFFSET= 15.70392
##$PC= 1
##$PHC0= -25303.25
##$PHC1= 17.38731
##$PH_mod= 1
##$PKNL= yes
##$PPARMOD= 0
##$PSCAL= 0
##$PSIGN= 0
##$REVERSE= no
##$SF= 200.130013532006
##$SI= 16384
##$SIGF1= 3
##$SIGF2= 2
##$SINO= 400
##$SIOLD= 16384
##$SREGLST= <1H.CDCl3>
##$SSB= 0
##$STSI= 0
##$STSR= 0
##$SW_p= 3612.71676300578
##$SYMM= 0
##$S_DEV= 0
##$TDeff= 0
##$TDoff= 0
##$TI= <>
##$TILT= no
##$TM1= 0
##$TM2= 0
##$TOPLEV= 0
##$USERP1= <user>
##$USERP2= <user>
##$USERP3= <user>
##$USERP4= <user>
##$USERP5= <user>
##$WDW= 1
##$XDIM= 8192
##$YMAX_p= 0
##$YMIN_p= 0
$$ End of Bruker specific parameters
$$ ---------------------------------
##NTUPLES= NMR FID
##VAR_NAME=  TIME,          FID/REAL,        FID/IMAG
##SYMBOL=    X,             R,               I
##VAR_TYPE=  INDEPENDENT,   DEPENDENT,       DEPENDENT
##VAR_FORM=  AFFN,          ASDF,            ASDF
##VAR_DIM=   8192,          8192,            8192
##UNITS=     SECONDS,       ARBITRARY UNITS, ARBITRARY UNITS
##FACTOR=    0.0002768,     1,               1
##FIRST=     0,             0,               0
##LAST=      2.2672688,     0,               0
##MIN=       0,             -138478,         0
##MAX=       2.2672688,     131025,          0
$$ Real data points
##PAGE= N=1
##DATA TABLE= (X++(R..R)), XYDATA
$$ plain form
0 0 0 0 0 0 0 0 0 0 0 0 0 0 0 0 0 0 0 0 0 0 0 0 0 0 0 0 0 -1 5 -6 6 -6 6 -6 7 -7 8 -10 13 -14 14 -15 16 -19 21 -22 26
47 26 -28 29 -33 35 -40 45 -50 55 -61 69 -78 90 -104 121 -143 173 -219 288 -401 610 -1080 2538
69 2538 -13980 -73887 22556 131025 96866 30948 32238 47486 29960 13780 23210 30356 11133
82 11133 5254 39610 49290 4475 -22038 -19972 -42786 -53267 -24737 -29277 -58874 -21504 47751
95 47751 47699 8247 12944 42806 33177 -6470 -15151 8784 4063 -18153 11852 52990 25068 -10114
109 -10114 14788 26122 -18077 -43471 -28101 -27265 -39340 -22818 8972 15056 86 2656 21844
122 21844 9915 -27311 -32462 -21397 -38758 -41038 -2303 9352 -15071 -3060 32900 21107
134 21107 -16724 -20335 -3510 -8505 -23872 -6790 30148 31213 11231 34421 65374 32983 -13596
$$ packed form
0@%%%%%%%%%%%%%%%%%%%%%%%%%%%jOj1J2j2J2j2J3j4J5j8K3k7K8k9L1l5M0m3M8
47B6n4N7o2O8p5Q5r5J05j16J30j47J68j94K25k64L16l92N07o89J011j690L618
69B538j6518n9907R6443J08469l4159o5918J290J5248j7526j6180R430P146j9223
82A1133n879L4356R680m4815k6513K066k2814j0481K8530m540k9597L7370O9255
95D7751n2l9452M697K9862r629l9647q681K3935m721k2216L0005M1138k7922l5182
109a0114K4902J1334m4199k5394J5370Q36j2075J6522L1790O084j4970K570J9188
122B1844j1929l7226n151J1065j7361k280L8735J1655k4423J2011L5960j1793
134B1107l7831l611J6825m995j5367J7082L6938J065j9982K3190L0953l2391m6579
$$ plain form
147 -13596 -7303 7059 -11972 -25735 -17673 -10877 -1720 14799 16016 -1198 -14468 -9771 -3531
160 -3531 -17598 -30972 -11854 9315 3203 15037 52681 46099 3554 7088 39822 21094 -27258
173 -27258 -30658 1659 12382 -6504 -9489 11784 12496 -11451 -13663 -2875 -21506 -43380 -28593
186 -28593 -9356 -10618 -5578 7298 8971 12716 23202 16991 -5174 -14508 -3146 4215 -8444
199 -8444 -14938 6544 21908 7055 2611 19709 10363 -22197 -21368 -344 -9111 -28611 -16257
212 -16257 10974 16465 6734 9199 19135 10514 -6746 -5171 157 -13644 -18366 2625 13067 5811
226 5811 12017 21286 9698 -1997 1513 -1694 -19939 -25687 -7263 8624 2544 -1834 17204 28125
240 28125 8306 -5421 4253 -2330 -25328 -20666 1850 3712 -5491 2931 18428 18317 5570 -4525
$$ packed form
147a3596O293J4362j9031j3763Q062O796R157J6519J217j7214j3270M697O240
160c531j4067j3374J9118K1169o112J1834L7644o582m2545L534L2734j8728m8352
173b7258l400L2317J0723j8886k985K1273P12k3947k212J0788j8631k1874J4787
186b8593J9237j262N040J2876J673L745J0486o211k2165r334J1362P361j2659
199h444o494K1482J5364j4853m444J7098r346l2560Q29K1024q767j9500J2354
212a6257K7231N491r731K465R936q621j7260J575N328j3801m722K0991J0442p256
226E811O206R269j1588j1695L510l207j8245n748J8424J5887o080m378J9038J0921
240B8125j9819j3727R674o583k2998M662K2516J862r203Q422J5497j11j2747j0095
$$ plain form
254 -4525 -8335 -14042 -17403 -11109 -6038 -8932 612 20447 20028 6511 7634 8292 -8919 -18447 -6067
269 -6067 -1364 -13719 -11683 13114 26785 11811 -2861 5681 10417 -9147 -21830 -10749 -5713
282 -5713 -13063 -4412 15074 16745 6036 5380 9092 3370 -6443 -12247 -13508 -10732 -1850 8140 8103
297 8103 4020 11154 18687 5658 -10894 -7759 -4100 -15873 -18655 -403 9672 631 -217 15250
311 15250 19166 726 -12622 -5512 -1546 -12056 -13713 -51 6789 4864 10363 17482 10419 -674
325 -674 -2157 -3714 -11231 -13866 -8513 -4020 -1946 6365 15387 10553 -914 198 4744 -5898 -18712
340 -18712 -13369 -1254 -1059 -527 10954 17166 9533 3566 7371 4029 -10110 -16880 -9923 -3812 -3230
355 -3230 516 7545 8618 6984 8408 4707 -7960 -14277 -8864 -5645 -7787 -3022 8339 11422 8222
$$ packed form
254d525l810n707l361O294N071k894R544J9835m19j3517J123O58j7211r528J2380
269f067M703j2355K036K4797J3671j4974j4672Q542M736j9564j2683J1081N036
282e713p350Q651J9486J671j0709o56L712n722r813n804j261K776Q882R990l7
297H103m083P134P533j3029j6552L135L659j1773k782J8252J0075r041q48J5467
311A5250L916j8440j3348P110L966j0510j657J3662O840j925N499P119p063j1093
325f74j483j557p517k635N353M493K074Q311R022m834j1467J112M546j0642j2814
340a8712N343J2115J95N32J1481O212p633n967L805l342j4139o770O957O111N82
355c230L746P029J073j634J424l701j2667o317N413L219k142M765J1361L083l200
$$ plain form
370 8222 12245 14896 1861 -12142 -9882 -2951 -7901 -13946 -4262 8819 9073 5496 8540 8787 -1932
385 -1932 -10096 -6059 -4000 -9732 -8236 3063 10690 12146 12547 10737 4613 -403 -2900 -8235 -15631
400 -15631 -13733 -4284 599 -717 3573 11184 6224 -4010 -3794 -847 -10360 -17372 -7373 5123 5115
415 5115 2930 10867 17616 12192 2101 -528 -1760 -9070 -12360 -5856 -1786 -2043 2361 8958 7878
430 7878 2783 864 -3667 -10689 -11721 -6790 -5074 -5050 1168 11551 15483 9106 6272 8405 2806
445 2806 -7057 -6488 -1877 -4707 -4766 4814 11247 8263 5173 5055 2692 -3101 -8460 -9172 -9195 -9688 -3915
462 -3915 5942 6548 2130 6058 9239 514 -7232 -6404 -7830 -12229 -7789 1152 4898 3648 5054 9896
478 9896 9239 -483 -7031 -4954 -6435 -10807 -4884 3508 2240 2790 10223 11239 3772 -2657 -4993 -7136
$$ packed form
370H222M023K651j3035j4003K260O931m950o045R684J3081K54l577L044K47j0719
385a932q164M037K059n732J496J1299P627J456M01j810o124n016k497n335p396
400a5631J898R449M883j316M290P611m960j0234K16K947r513p012R999J2496q
415E115k185P937O749n424j0091k629j232p310l290O504M070k57M404O597j080
430G878n095j919m531p022j032M931J716K4O218J0383L932o377k834K133n599
445B806r863N69M611k830n9R580O433k984l090j18k363n793n359p12k3m93N773
462c915R857O06m418L928L181q725p746Q28j426m399M440Q941L746j250J406M842
478I896o57r722o548K077j481m372N923Q392j268N50P433J016p467o429k336k143
$$ plain form
494 -7136 -8772 -9904 -6677 -1134 2282 6226 10591 7742 1395 1264 -203 -8133 -9501 -2443 -273
509 -273 -145 7290 14876 13091 7621 5043 5371 620 -8814 -11254 -3076 109 -2509 2380 9377 6603
525 6603 2573 2153 -3452 -10041 -11035 -9738 -8613 -4756 661 5668 8432 7410 6780 6425 -301 -8662
541 -8662 -6209 -2112 -5901 -4755 4083 7213 5265 6441 5333 -765 -6610 -8923 -9410 -8763 -8495 -5355
557 -5355 2374 5254 3969 7458 7799 -1157 -5088 -1091 -3396 -7709 -4682 2280 6172 7916 8420 7975
573 7975 6795 1967 -2753 -2565 -5570 -9499 -3801 3427 2362 3252 9193 7658 2496 1971 186 -5930
589 -5930 -8507 -6850 -2383 1725 1364 2110 7619 8390 2117 -374 -2755 -8184 -8375 -4219 -4675 -4131 3672
606 3672 8812 6177 4820 4559 1670 -2742 -7424 -7799 -4137 -3836 -4358 3043 9024 3773 751 3744
$$ packed form
494g136j636j132L227N543L416L944M365k849o347j31j467p930j368P058K170
509b73J28P435P586j785n470k578L28m751r434k440Q178L185k618M889O997k774
525F603m030m20n605o589r94J297J125L857N417N007K764j022o30l55o726q361
541h662K453M097l789J146Q838L130j948J176j108o098n845k313m87O47K68L140
557e355P729K880j285L489L41q956l931L997k305m313L027O962L892J744N04m45
573G975j180m828m720J88l005l929N698P228j065Q90N941j535n162n25j785o116
589e930k577J657M467M108l61P46N509P71o273k491k381n429j91M156m56N44P803
606C672N140k635j357k61k889m412m682l75L662L01n22P401N981n251l022K993
$$ plain form
622 3744 290 -6707 -8617 -8592 -8339 -3730 1074 3837 6975 7231 6528 7012 1553 -5503 -4682 -2696 -6083
639 -6083 -3623 4997 7095 5171 7254 7137 2450 -1855 -5686 -8330 -7437 -5250 -2924 2558 4922 4584
655 4584 7603 7771 22 -2996 -1636 -5203 -8827 -3782 1595 2079 3886 6813 7600 5293 -384 -4885
671 -4885 -4451 -5306 -8493 -5616 -568 36 3698 9199 5714 139 670 -509 -5043 -6954 -5905 -4048
687 -4048 -496 2629 4698 7308 5802 640 647 297 -5958 -8017 -4644 -3528 -1995 3943 5875 4130
703 4130 5759 5695 1189 -3348 -5548 -5581 -3249 -3121 -2940 3240 8136 5137 3859 5135 612 -4901 -4819
720 -4819 -4457 -6341 -4301 -204 3219 6008 6326 4402 3518 351 -4624 -5043 -4189 -7151 -5051 2285
736 2285 4709 4206 6208 6039 2512 -602 -3210 -6213 -6290 -5180 -3566 1162 4536 4630 5784 5829 1123
$$ packed form
622C744l454o997j910K5K53M609M804K763L138K56p03M84n459p056Q21J986l387
639f083K460Q620K098j924K083j17m687m305l831k644Q93K187K326N482K364l38
655D584L019J68p749l018J360l567l624N045N377M84J807K927P87k307n677m501
671d885M34q55l187K877N048O04L662N501l485n575N31j179m534j911J049J857
687d048L552L125K069K610j506n162Pl50o255k059L373J116J533N938J932j745
703D130J629o4m506m537k200l3K332J28J81O180M896k999j278J276m523n513Q2
720d819L62j884K040M097L423K789L18j924q84l167m975m19Q54k962K100P336
736B285K424n03K002j69l527l114k608l003p7J110J614M728L374R4J154M5m706
$$ plain form
753 1123 -1871 -2517 -6395 -8382 -4009 69 590 3725 6586 6434 4706 1559 -1502 -3660 -5969 -7669
769 -7669 -3731 647 594 2491 6769 6359 2735 1244 -1516 -5710 -6502 -4455 -3122 -1087 1463 3976
785 3976 7058 6182 2411 785 -695 -4907 -6358 -3694 -2887 -2316 2140 5281 5096 4471 3070 -272
801 -272 -2651 -4198 -5923 -5117 -3347 -1249 3065 5834 4259 3715 5138 1499 -3698 -3937 -3634 -4644
817 -4644 -3075 353 2474 4418 4495 4020 3198 100 -4314 -5187 -4319 -5336 -4034 683 2927 3759 5949
834 5949 6343 2464 -406 -2566 -3757 -4420 -4489 -3169 350 3788 4242 4667 4725 1244 -1723 -2714 -4983
851 -4983 -6659 -4254 -1878 91 3201 6050 5706 4410 2183 189 -1781 -4471 -5810 -3533 -351
866 -351 689 2959 5662 4841 2401 1379 -1041 -4497 -6561 -5875 -3955 -1330 1223 3334 5526 5390
$$ packed form
753A123k994o46l878j987M373M078N21L135K861j52j728l147l061k158k309j700
769g669L938M378n3J897M278m10l624j491k760m194p92K047J333K035K550K513
785C976L082q76l771j626j480m212j451K664Q07N71M456L141j85o25j401l342
801b72k379j547j725Q06J770K098M314K769j575n44J423l639n197k39L03j010
817d644J569L428K121J944P7m75q22l098m414q73Q68j017J302M717K244Q32K190
834E949L94l879k870k160j191o63o9J320L519L438M54M25N8l481k967r91k269
851d983j676K405K376J969L110K849l44j296k227j994j970k690j339K277L182
866c51J040K270K703q21k440j022k420l456k064O86J920K625K553K111K192j36
$$ plain form
882 5390 3386 2236 81 -3534 -5264 -3647 -2236 -1073 1720 4223 5078 4535 3040 557 -2677 -4893
898 -4893 -5699 -5213 -3641 -1866 1328 4254 4418 4321 3860 839 -2179 -3548 -3762 -4346 -2568 388 2770
915 2770 4217 4383 4261 2837 298 -2840 -4383 -4289 -4809 -2902 604 2770 3533 4662 5300 3122 9
932 9 -2201 -3671 -4603 -4313 -2573 247 1901 2675 4001 4019 1810 -1538 -2718 -4201 -4708 -3749 -1705 659
950 659 2663 5033 5874 4716 2709 429 -1829 -3743 -4285 -3006 -2150 -664 1771 3969 4006 1889 70
967 70 -1424 -3730 -5712 -5440 -3646 -2111 26 3157 5442 4981 3834 2681 606 -1767 -3477 -3614
983 -3614 -2215 -834 1474 4008 5057 3673 2956 1411 -1657 -4577 -5094 -4877 -4100 -2070 981 3028
999 3028 3947 3940 3211 1721 -1392 -3318 -3636 -3234 -2670 -440 2471 3993 4423 4864 3333 510 -2211 -3007
$$ packed form
882E390k004j150k155l615j730J617J411J163K793K503Q55n43j495k483l234k216
898d893q06M86J572J775L194K926J64r7m61l021l018j369k14n84J778K956K382
915B770J447J66j22j424k539l138j543R4n20J907L506K166P63J129O38k178l113
932Ik210j470r32K90J740K820J654P74J326J8k209l348j180j483n07R59K044K364
950F59K004K370Q41j158k007k280k258j914n42J279Q56J486K435K198L7k117j819
967G0j494k306j982K72J794J535K137L131K285m61j147j153k075k373j710j37
983c614J399J381K308K534J049j384p17j545l068k920n17K17P77K030L051K047
999C028R19pp29j490l113j926l18M02N64K230K911J522M30M41j531k823k721p96
$$ plain form
1017 -3007 -4051 -4214 -2898 -818 1688 3526 4164 3655 2263 -571 -2338 -3182 -4748 -5298 -2459 -51
1033 -51 1729 3265 4557 3712 2193 154 -1932 -3206 -4305 -4130 -1272 1547 2282 3118 4780 3899 1919
1050 1919 302 -2042 -4423 -4222 -3441 -2171 -192 2262 3064 3996 3292 1095 -547 -2550 -4437 -4278
1066 -4278 -2352 -1844 -400 3125 4883 3929 3506 2328 -50 -2259 -3297 -3674 -2644 -959 558 2471
1082 2471 4005 3109 2508 1591 -1219 -3940 -3543 -3415 -3937 -2240 651 2325 3526 3689 2670 1307 -146
1099 -146 -2885 -3629 -2637 -2844 -1265 1707 3165 3389 4193 2913 85 -1218 -2529 -4477 -4266 -2756 -1453
1116 -1453 986 2741 2815 3412 3436 199 -2376 -2196 -3493 -3818 -1786 -176 840 3370 5063 3494 2355
1133 2355 763 -1480 -2875 -3805 -4082 -2446 277 1172 2567 4929 3464 632 188 -1056 -3410 -4414
$$ packed form
1017c007j044j63J316K080K506J838O38n09j392k834j767q44j566n50K839K408
1033e1J780J536J292q45j519k039k086j274j099J75K858K819P35Q36J662q81j980
1050A919j617k344k381K01P81J270J979K454Q02R32p04k197j642k003j887J59
1066d278J926N08J444L525J758r54m23j178k378k209j038l77J030J685J517J913
1082B471J534q96o01r17k810k721L97J28n22J697K891J674J201J63j019j363j453
1099a46k739p44R92k07J579K972J458K24Q04j280k828j303j311j948K11J510J303
1116a453K439J755P4N97K4l237k575J80j297l25K032J610J016K530J693j569j139
1133B355j592k243j395r30k77J636K723Q95J395K362j465k832m44j244k354j004
$$ plain form
1149 -4414 -3315 -1701 555 3131 3281 3822 3830 1970 -67 -1156 -3598 -4377 -2378 -1986 -806 2537 3909
1166 3909 2431 2546 1906 -754 -2345 -3549 -4160 -3020 -1306 189 2232 4150 3395 2570 2077 -528
1182 -528 -3031 -2541 -2695 -3650 -1300 1755 2106 2874 3637 2593 1203 -622 -3156 -3750 -2542 -3066 -1908
1199 -1908 1069 2122 2667 4022 2913 -41 -497 -1494 -3501 -3649 -2007 -700 702 2879 3278 3356 2877
1216 2877 331 -1413 -1167 -3043 -4294 -2021 23 469 2589 3893 2620 2003 1464 -1254 -3353 -3230
1232 -3230 -3141 -2156 -850 201 1913 4191 3442 891 927 -837 -3401 -3294 -1983 -2078 -662 2045 2846
1249 2846 4034 3877 1880 -204 -928 -2894 -3459 -2781 -2421 -1044 2104 3322 2021 2933 2711 -274 -2666
1266 -2666 -2587 -3547 -3164 -1419 -127 1561 3438 3000 2606 2238 -284 -2655 -1836 -2787 -3489 -1136 1423
$$ packed form
1149d414J099J614K256K576J50N41Qj860k037j089k442p79J999L92J180L343J372
1166C909j478J15o40k660j591j204o11J140J714J495K043J918p55q25m93k605
1182e28k503M90j54r55K350L055L51P68P63j044j390j825k534n94J208n24J158
1199a908K977J053N45J355j109k954m56r97k007j48J642J307J402K177L99P8m79
1216B877k546j744K46j876j251K273K044M46K120J304j273o17n39k718k099J23
1232c230Q9R85J306J051J712K278p49k551L6j764k564J07J311r5J416K707Q01
1249B846J188j57j997k084p24j966n65O78L60J377L148J218j301R12k22k985k392
1266b666P9r60L83J745J292J688J877m38l94l68k522k371Q19r51p02K353K559
$$ plain form
1283 1423 1318 2318 4074 2769 763 -333 -2160 -2999 -2872 -3160 -1473 1182 1775 2388 3600 2946 847
1300 847 -429 -1504 -3485 -3324 -1443 -1131 -17 2314 2934 3030 2496 552 -965 -1639 -3103 -3680 -1540
1317 -1540 28 98 2400 3596 2560 1855 1421 -985 -2452 -2597 -2932 -2188 -260 584 2129 3328 2541
1334 2541 1110 1579 -389 -3463 -3422 -2190 -2297 -1162 1350 2086 2650 3190 2070 790 -744 -2561 -3185
1351 -3185 -1762 -1446 -768 1960 3216 2172 3254 2949 -216 -1997 -1942 -2969 -3603 -2056 -486 999
1367 999 2422 2526 2658 2034 -75 -2150 -1940 -2724 -3040 -943 1002 1344 2488 4040 3099 1155 -164
1384 -164 -1270 -2503 -3099 -2894 -1400 447 1479 1694 3165 2528 319 -655 -1566 -3175 -3501 -2023 -1337
1401 -1337 -200 1838 2915 2999 2238 1016 -263 -1607 -2876 -2928 -1696 -297 -73 2276 3622 2461
$$ packed form
1283A423j05J000J756j305k006j096j827q39J27k88J687K655N93O13J212o54k099
1300H47j276j075j981J61J881L12J114K331O20R6n34j944j517o74j464n77K140
1317a540J568P0K302J196j036p05m34k406j467j45l35P44J928Q44J545J199p87
1334B541j431M69j968l074M1J232j07J135K512P36N64N40j120j280j534j817o24
1351c185J423L16O78K728J256j044J082l05l165j781N5j027o34J547J570J485
1367I99J423J04J32o24k109k075K10p84l16K097J945L42J144J552r41j944j319
1384a64j106j233n96K05J494J847J032K15J471o37k209r74r11j609l26J478O86
1401a337J137K038J077Q4p61j222j279j344j269n2J232J399K24K349J346j161
$$ plain form
1417 2461 1699 1133 -231 -2345 -2533 -2294 -2266 -911 481 1850 2989 2469 1162 999 -757 -2676 -2749
1434 -2749 -2229 -2434 -1185 1457 2372 2414 2772 2383 783 -704 -1710 -2315 -2126 -1446 -179 1766 2300 2337
1452 2337 2602 2211 -95 -1512 -1924 -3136 -3354 -1954 -189 783 1534 2277 2350 1917 -161 -1151 -1881 -2626
1470 -2626 -2670 -1226 647 1008 2111 3343 2993 1162 171 -849 -2375 -3086 -2449 -1287 211 877 1926
1487 1926 3125 2025 646 -50 -1179 -2702 -3165 -2211 -947 -290 1596 2765 2760 2332 1330 181 -1217
1504 -1217 -2473 -2292 -1910 -844 43 1629 2909 2381 1561 1397 -296 -2395 -2529 -2480 -1924 -1291 629 1910
1522 1910 2367 2108 2109 1328 -449 -2151 -2361 -2120 -2303 -1180 985 1952 2120 2570 2207 621 -1321 -1959
1540 -1959 -2120 -2537 -2255 -469 1118 1585 2224 2395 1532 135 -1167 -1532 -2447 -2838 -1717 39 1077
$$ packed form
1417B461p62n66j364k114j88K39K8J355J392J369J139n20j307j63j756j919p3
1434b749N20k05J249K642R15M2L58l89j600j487j006o05J89O80J267J945N34L7
1452B337K65l91k306j417m12j212k18J400J765R72P51P43P3m33k078r90p30p45
1470b626m4J444J873L61J103J232l50j831r91j020j526p11O37J162J498O66J049
1487A926J199j100j379o96j129j523m63R54J264O57J886J169nm28j002j149j398
1504a217j256J81L82J066Q87J586J280n28q20j64j693k099j34M9N56O33J920J281
1522A910M57k59Jp81j777j702k10K41j83J123K165R67J68M50l63j586j942o38
1540a959j61m17K82J786J587M67O39J71q63j397j302l65r15l91J121J756J038
$$ plain form
1557 1077 1523 2499 2873 1468 -171 -505 -1372 -2748 -2466 -1210 24 1025 1967 2684 2302 1203 441
1574 441 -492 -2132 -2781 -2064 -779 -217 771 2655 2967 1875 1151 406 -1081 -1919 -2515 -2012 -772 -6
1592 -6 931 2584 2759 1856 974 429 -1441 -2308 -2267 -2083 -1655 -42 1553 1977 1883 1696 1261 -208 -1609
1611 -1609 -2309 -1997 -1883 -1137 625 2421 2236 1831 2385 1055 -552 -1541 -1863 -2427 -2030 -731 470 1650
1629 1650 1752 1958 2319 1009 -909 -1873 -1979 -2553 -2269 -274 453 1233 2411 2660 1655 737 -521 -1420
1647 -1420 -2305 -2128 -1535 113 791 1237 2523 3015 1510 -34 -541 -1495 -2800 -2451 -1497 -625 609 1352
1665 1352 2152 2398 1529 5 -733 -1662 -2339 -2168 -1292 -327 916 2580 2188 1440 1028 722 -1328 -1881
1683 -1881 -1897 -1658 -1042 -554 780 2294 2250 1103 1106 421 -1313 -2535 -1928 -2055 -1362 96 1263 1991 2505
$$ packed form
1557A077M46R76L74j405j639l34q67j376K82J256J234J001R42P17l82j099p62
1574D41r33j640o49P17J285N62R88J884L12j092p24p45j487q38n96N03J240P66
1592fR37J653J75r03q82n45j870q67M1J84M28J613J595M24r4j87m35j469j401
1611a609p00L12J14P46J762J796j85m05N54j330j607r89l22n64L97J299J201J180
1629A650J02K06L61j310j918r64j06n74K84J995P27P80J178K49j005r18j258q99
1647a420q85J77N93J648O78M46J286M92j505j544n07r54j305L49R54Q72J234P43
1665A352Q00K46q69j524p38r29o77J71Q76R65J243J664l92p48m12l06k050n53
1683a881j6K39O16M88J334J514m4j147Lo85j734j222O07j27O93J458J167P28N14
$$ plain form
1702 2505 2211 862 -317 -866 -2114 -2059 -1516 -1333 231 1889 1625 1919 2225 998 -815 -1065 -1460 -2611
1720 -2611 -2098 -638 268 1354 2047 1814 2232 1072 -910 -1428 -1325 -2497 -2298 -570 550 1022 2057
1737 2057 2243 1102 912 -591 -1832 -2218 -1865 -1579 -606 762 1550 1998 2409 969 204 234 -1628 -3182
1755 -3182 -1940 -859 -712 220 1308 2332 2121 1027 -122 -534 -1231 -2718 -2313 -541 -174 676 1926
1772 1926 2164 1787 1779 422 -1601 -1465 -1311 -2175 -1619 -104 840 1997 1987 1498 1241 754 -1409 -2242 -1512
1791 -1512 -1765 -1660 166 1351 1361 1935 2116 1061 73 -831 -2091 -2138 -1147 -1198 -171 1319 1481 1767 2004
1810 2004 662 -721 -950 -1548 -2518 -1477 -398 -179 1216 1854 2161 1735 864 -681 -1021 -1360 -2379
1827 -2379 -2165 -115 458 478 1902 2185 1422 648 -213 -1301 -1693 -1722 -1767 -652 814 1276 1763 2206 1409
$$ packed form
1702B505k94j349j179n49j248N5N43J83J564J658k64K94L06j227j813k50l95j151
1720b611N13J460R06J086O93k33M18j160j982n18J03j172J99J728J120M72J035
1737B057J86j141j90j503j241l86L53K86R73J368P88M48M11j440p65L0j862j554
1755c182J242J081J47R32J088J024k11j094j149m12o97j487M05J772L67Q50J250
1772A926K38l77qj357k023J36J54q64N56J515R44J157j0m89k57m87k163q33P30
1791a512k53J05J826J185J0N74J81j055r88r04j260m7R91n1J027J490J62K86K37
1810B004j342j383k29n98r70J041J079K19J395O38L07m26q71j545l40l39j019
1827b379K14K050N73K0J424K83p63p74q61j088l92k9m5J115J466M62M87M43p97
$$ plain form
1846 1409 960 295 -1462 -2440 -1152 -1384 -1350 432 2093 1829 1511 1230 526 -64 -1124 -2222 -1888 -424
1864 -424 -609 37 2012 2436 1411 1331 251 -651 -1019 -1856 -2373 -1214 131 511 1211 2195 1539 1028 263
1883 263 -1004 -1640 -1346 -1848 -1841 341 1454 1164 1519 2379 1125 263 -863 -1455 -1644 -1754 -1701 -170 1149
1902 1149 1102 1260 1953 895 -319 -719 -1689 -2314 -1449 -486 -255 1058 2357 1699 1465 1145 -31 -934
1920 -934 -1719 -2195 -1444 -439 94 434 2472 2226 1028 412 325 -823 -1865 -1846 -1315 -455 702 723 1513
1939 1513 2459 1494 463 -353 -1320 -1989 -1511 -1517 -1058 837 1660 1549 1712 1550 766 -605 -1298 -1788 -1345
1958 -1345 -1243 -1100 432 1833 1708 1183 1363 1118 -1010 -1724 -1788 -1747 -1168 -642 433 1509 2012 1584 894
1977 894 595 -355 -1475 -1608 -1876 -1032 161 617 879 1997 2340 783 28 -257 -1273 -1960 -1922 -1107 -191
$$ packed form
1846A409m49o65j757r78J288k32L4J782J661k64l18k81p04n90j060j098L34J464
1864d24j85O46J975M24j025q0j080r02l68q37n17J159J345L80P00R84o56n11p65
1883B63j267o36K94n02PK182J113k90L55Q60j254q62j126n92j89j10N3J531J319
1902A149m7J58O93j058j214m00r70o25Q65R63K31J313J299o58k34l20j176r03
1920i34p85m76P51J005N33L40K038k46j198o16q7j148j042J9N31Q60J157K1P90
1939A513R46r65j031q16r67o69M78oM59J895Q23j11J63j62p84j371o93m90M43
1958a345J02J43J532J401j25n25J80k45k128p14o4M1N79N26J075J076N03m28o90
1977H94k99r50j120j33k68Q44J193M56K62J118L43j557p55k85j016o87L8Q15R16
$$ plain form
1996 -191 879 985 1446 2055 1162 -181 -461 -825 -1821 -1538 -1029 64 945 1451 1335 1159 1045 250 -1445
2015 -1445 -1438 -1792 -1426 -713 -439 872 1715 1753 1066 970 599 -1027 -1870 -1277 -1064 -550 -111 777 1567 2045
2035 2045 1042 444 265 -842 -2003 -1476 -1258 -556 236 1142 1532 1689 1590 261 -751 -1096 -1417 -2026
2053 -2026 -1110 -192 561 1128 1142 1638 1715 720 -554 -1204 -1335 -1617 -1266 -142 797 1019 1576 1714 1441 815
2073 815 -264 -1751 -1189 -1420 -1427 -619 364 1420 2023 1427 531 234 -303 -1236 -2068 -1148 -698 -285 550 1205
2093 1205 2105 1665 716 180 -375 -1218 -2077 -1494 -572 -256 310 1061 1534 1606 712 -342 -812 -1453 -1534 -1649
2113 -1649 -952 44 887 1368 1407 1680 1082 185 -903 -1117 -1027 -980 -1102 55 1439 1402 1342 1108 1027 168 -1074
2134 -1074 -1538 -1320 -1149 -938 52 840 1768 1478 1115 799 105 -908 -1695 -1642 -1214 -548 499 1044 1511
$$ packed form
1996a91J070J06M61O09q93j343k80l64r96K83N09J093Q81N06j16j76j14p95j695
2015a445Pl54L66P13K74J311Q43L8o87r6l71j626q43N93K13N14M39Q88P90M78
2035B045j003n98j79j107j161N27K18P02P92R06L90J57r9j329j012l45l21o09
2053b026R16R18P53N67J4M96P7r95j274o50j31k82L51J124R39K22N57J38k73o26
2073H15j079j487N62k31pQ08R83J056O03n96q96k97n37r33q32R20M50M13Q35O55
2093A205R00m40r49n36n55q43q59N83R22L16N66P51M73P2q94j054m70o41q1j15
2113a649O97R96Q43M81L9K73n98q97j088k14R0M7j22J157J384l7o0k34q1q59j242
2134a074m64K18J71K11R90P88R28k90l63l16o94j013p87N3M28O66J047N45M67
$$ plain form
2153 1511 2045 1212 368 -387 -725 -1476 -1774 -1349 -524 437 625 1138 1608 1214 216 -556 -892 -1445 -1802 -1371
2173 -1371 -228 410 1091 1571 1305 1332 601 -541 -1333 -1426 -1483 -1052 -786 623 1331 1608 1247 960 618 -208
2193 -208 -1148 -1362 -1274 -1266 -427 133 1312 1559 1083 635 126 -596 -1517 -1711 -1196 -771 -507 741 1400 1592
2213 1592 1689 977 -60 -767 -652 -1453 -1176 -756 -54 701 1124 1388 1551 1054 -205 -1046 -1160 -1708 -1473
2232 -1473 -1111 19 1063 1090 1430 1466 972 -309 -892 -1316 -1194 -1332 -604 149 834 1416 1817 1176 522
2251 522 -426 -1081 -1584 -1493 -961 -510 146 871 1583 1630 1023 162 -158 -617 -1487 -1534 -975 -305 262 945 1382
2272 1382 1166 1192 59 -563 -897 -1322 -1771 -1223 -410 293 783 1537 1395 1155 500 -361 -1181 -924 -1271 -1202
2292 -1202 -195 585 1037 1281 1326 652 155 -475 -1437 -1485 -805 -1214 -535 551 1120 1311 1157 898 -69 -313
$$ packed form
2153A511N34q33q44p55l38p51k98M25Q25R61J88N13M70l94r98p72l36n53l57M31
2173a371J143O38O81M80k66K7p31j142p92r3n7M31K66J409P08K77l61k87l42q26
2193b08r40k14Q8QQ39N60J179K47m76m48n09p22r21j94N15M25K64J248O59J92
2213A592R7p12j037p07J15q01K77M20P02P55M23K64J63m97j259q41j14n48K35
2232a473L62J130J044K7L40L6m94j281n83m24J22j38P28P53O85N82M01o41o54
2251E22r48o55n03R1N32M51O56P25P12M7o07q61l20m59q70m7N59O70N67O83M37
2272A382k16K6j133o22l34m25m49N48Q13P03M90P54j42k40o55q61q20K57l47O9
2292a202J007P80M52K44M5o74m97o30r62m8O80m09O79J086N69J91j54k59r67k44
$$ plain form
2312 -313 -1037 -1515 -1065 -605 -509 532 1366 1152 1049 845 -167 -516 -646 -1481 -1610 -400 -71 628 1040
2331 1040 1559 1282 610 36 -728 -1205 -1272 -1370 -1106 53 390 1167 1517 1534 755 158 -823 -1405 -1321 -1238 -673
2352 -673 315 1142 1128 1478 1296 388 -84 -587 -1576 -1310 -999 -877 -199 1009 1336 1090 1008 643 -170 -794
2372 -794 -1851 -1503 -856 -76 155 920 1586 1204 1067 602 -160 -1059 -1042 -1386 -1253 -405 224 831 1228 1111
2392 1111 708 321 -508 -1043 -1216 -1087 -1248 -718 546 998 1085 1520 955 169 -222 -1102 -1558 -965 -694 -619
2412 -619 498 1474 1281 1282 1066 149 -584 -1152 -1278 -1525 -556 -78 278 1172 1618 976 773 220 -750 -877
2432 -877 -1021 -1454 -1032 419 718 942 1248 1101 595 198 -531 -1137 -1081 -1020 -1132 -186 736 972 1483 1372
2452 1372 219 -373 -275 -1368 -1446 -948 -942 -142 1111 1224 1103 1189 448 -310 -805 -955 -1473 -795 -265 -71
$$ packed form
2312c13p24m78M50M60R6J041Q34k14j03k04j012l49j30q35j29J210L29O99M12
2331A040N19k77o72n74p64m77o7r8K64J159L37P77L50J7p79n97r81n82Q4Q3N65
2352f73R88Q27j4L50j82r08m72n03r89K66L11J22O78J208L27k46q2l65q13o24
2372g94j057L48O47P80K31P65O66l82j37m65p62q99J7l44J33Q48O29O07L97j17
2392A111m03l87q29n35j73J29j61N30J264M52Q7M35n65p86l91q80m56N93K71P5
2412f19J117R76j93Jk16r17p33n68j26k47R69M78L56Q94M46o42k03n53r70j27
2432h77j44m33M22J451K99K24L06j47n06l97p29o06N6O1j12R46R22K36N11j11
2452A372j153n92R8j093p8M98OQ00J253J13j21Q6p41p58m95j50n18O78N30J94
$$ plain form
2472 -71 966 1320 1215 1030 979 -364 -1190 -994 -1185 -1177 -469 679 461 1462 1573 883 542 -112 -952 -1266
2492 -1266 -860 -1153 -454 691 980 870 1608 983 124 -406 -655 -1345 -1310 -899 -684 152 791 901 1025 930
2512 930 -119 -407 -845 -1233 -1596 -486 -111 364 1194 1644 951 970 297 -786 -939 -942 -1448 -1193 -96 470
2532 470 714 1322 939 422 268 -381 -1163 -1089 -924 -865 -35 672 997 1313 1186 493 -126 -473 -1177 -1513 -828
2553 -828 -760 -265 879 1207 973 1176 636 -200 -532 -762 -1446 -1026 -392 -176 598 1253 988 966 818 -312
2573 -312 -1140 -1367 -1488 -1149 -339 212 487 1279 1394 948 457 92 -1055 -1078 -1191 -914 -386 233 870 903
2593 903 1213 790 91 -100 -653 -1477 -1195 -806 -451 407 711 1368 1180 1147 371 -408 -660 -1180 -1299 -789
2613 -789 63 280 864 1273 1319 692 95 -386 -820 -1019 -1299 -615 392 272 886 1163 1211 762 542 -103
$$ packed form
2472g1J037L54j05j85n1j343q26J96j91QP08J148k18J001J11o90l41o54q40l14
2492a266M06k93O99J145K89j10P38o25q59n30k49o90L5M11K15Q36O39J10J24r5
2512I30j049k88m38l88l63J110L75M75Q30M50o93J9o73j083j53ln06K55J097N66
2532D70K44O08l83n17j54o49p82P4J65N9Q30P07L25L16j27o93o19l47p04l36O85
2553h28O8M95J144L28k34K03n40q36l32k30o84M20O34K16P74O55k65k2j48j130
2573c12q28k27j21L39Q10N51K75P92J15m46m91l65j147k3j13K77N28O19O37L3
2593I03L10m23o99j91n53q24K82L89L55Q58L04O57j88l3p76p79k52n20j19N10
2613g89Q52K17N84M09M6o27n97m81m34j99k80O84J007j20O14K77M8m49k20o45
$$ plain form
2633 -103 -1043 -1167 -948 -862 -375 422 1059 1330 1102 924 65 -715 -947 -1480 -1008 -837 -244 692 1006 992 1183
2654 1183 606 77 -464 -963 -910 -1157 -537 -20 584 1268 1231 852 588 -184 -939 -822 -1047 -1132 -556 -138 689
2675 689 1100 1199 810 495 -80 -887 -852 -1273 -1065 -719 273 768 989 1255 663 479 -265 -493 -1147 -1063 -637
2696 -637 -227 197 785 758 926 1000 295 -458 -561 -1262 -1101 -683 -471 280 719 1229 1088 738 235 -402 -677
2717 -677 -1061 -933 -832 -183 310 583 1215 993 762 -23 -454 -1008 -989 -657 -442 185 531 822 1199 900
2737 900 572 206 -533 -718 -999 -1067 -563 73 676 967 1133 999 751 214 -589 -920 -904 -965 -613 -60 835
2758 835 887 919 1145 199 83 -777 -1313 -1089 -1064 -398 -42 632 1102 1239 836 409 -163 -698 -1060 -1228 -1178
2779 -1178 -331 95 700 1222 855 935 645 -9 -556 -1007 -1080 -1032 -440 157 593 929 1021 756 479 -173 -831
$$ packed form
2633a03r40j24K19Q6M87P97O37K71k28j78q59p80k32n33M72J71N93R36L14j4J91
2654A183n77n29n41m99N3k47O20N17O04O84l7l79k64p72p55J17k25q5N76M18Q27
2675F89M11R9l89l15n75q07L5m21K08L46R92M95K21K66n92j84p44k28o54Q4M26
2696f37M10M24N88k7J68P4p05p53j03p01J61M18K12P51M39N10j41l50n03o37k75
2717f77l84J28J01O49M93K73O32k22k31p85m31n54J9L32K15O27L46K91L77k99
2737I00l28l66p39j85k81o8N04O36O03K91J66j34k48n37q03l31J6o1L52N53Q95
2758H35N2L2K26r46j16q60n36K24K5O66L56O74M70J37m03m27n72n35l62j68N0
2779a178Q47M26O05N22l67Q0k90o54n47m51p3M8N92N97M36L36R2k65k77o52o58
$$ plain form
2800 -831 -941 -1148 -842 -424 267 948 1071 1273 838 302 -284 -973 -965 -1077 -776 -465 362 904 882 886 654 226
2822 226 -529 -790 -944 -1239 -664 -181 154 914 1019 628 630 329 -345 -776 -1189 -963 -644 -184 309 682 996
2843 996 923 614 340 -452 -946 -1263 -1029 -689 18 451 909 818 986 572 116 -6 -877 -965 -471 -579 -233
2864 -233 513 873 1012 728 454 -297 -674 -846 -1094 -998 -197 99 578 1262 843 888 413 -73 -537 -715 -852
2885 -852 -981 -477 331 418 887 1184 719 414 -196 -1025 -1034 -693 -892 -374 196 837 1036 1226 1004 234 -11
2906 -11 -646 -1033 -758 -686 -489 437 977 949 886 1009 -2 -221 -620 -1066 -1257 -602 9 2 1092 1163 738 658
2928 658 531 -712 -366 -622 -1299 -594 37 -18 703 1038 851 401 212 -537 -994 -836 -917 -784 -94 469
2948 469 830 885 964 454 124 -367 -850 -934 -902 -420 -239 417 776 831 1184 511 -85 -480 -680 -1140 -889 -229
$$ packed form
2800h31j10k07L06M18O91O81J23K02m35n36n86o89Qj12L01L11Q27N42k2Mk32m28
2822B26p55k61j54k95N75M83L35P60J05l91Kl01o74m31m13K26L19M60M93L73L14
2843I96p3l09k74p92m94l17K34L40P07M33M58r1J68m14m56j22q71q8M94j08L46
2864b33P46L60J39k84k74p51l77j72k48R6Q01K96M79O84m19M5m75m86m64j78j37
2885h52j29N04Q08Q7M69K97m65l05o10q29rL41j99N18N70O41J99J90k22p70k45
2906a1o35l87K75P2J97R26N40k8o3J23j011k19l99m46j91O55O11pJ090P1m25q0
2928F58j27j243L46k56o77P05O31n5P21L35j87m50j89p49m57J58q1J33O90N63
2948D69L61N5P9n10l30m91m83q4L2M82J81O56L59N5L53o73n96l95k00m60K51O60
$$ plain form
2970 -229 -195 468 1148 923 794 798 -107 -730 -831 -776 -989 -591 410 323 953 1361 450 400 -83 -660 -1048 -715
2992 -715 -760 -561 144 448 688 965 817 227 360 -445 -1043 -698 -552 -565 71 715 794 745 1042 208 -510
3013 -510 -828 -1139 -1187 -645 -432 315 792 820 706 906 794 -295 -383 -949 -1132 -960 -235 315 296 824 750
3034 750 323 292 -475 -693 -759 -908 -818 -360 545 410 858 1290 606 33 46 -708 -983 -671 -480 -22 784
3055 784 863 770 972 366 -145 -60 -694 -1191 -800 -288 -281 97 881 1123 948 678 -77 -291 -830 -765 -1264 -497
3077 -497 -11 148 824 1133 689 262 115 -567 -1089 -700 -873 -777 238 360 751 727 521 290 300 -399 -1011
3098 -1011 -929 -810 -505 -118 814 834 1065 1074 631 -117 -509 -942 -923 -419 -450 216 649 907 857 700 435 -112
3120 -112 -690 -500 -891 -727 -195 13 421 1006 584 654 455 -150 -512 -1039 -733 -741 -249 485 692 928 1075
$$ packed form
2970b29L4O63O80k25j29Mr05o23j01N5k13L98J001q7O30M08r11n0m83n77l88L33
2992g15m5J99P05L04K40K77j48n90J33q05n98L45J46j3O36O44P9m9K97q34p18
3013e10l18l11m8N42K13P47M77K8j14K00j12j089q8n66j83J72P25N50j9N28p4
3034G50m27l1p67k18o6j49R0M58R05j35M48M32o84n73J3p54k75L12J91M58Q06
3055G84P9r3K02o06n11Q5o34m97L91N12PL78P84K42j75k70p55k14n39O5m99P67
3077d97M86J59O76L09m44m27j47o82n22L89j73R6J015J22L91k4k06k31J0o99o12
3098a011Q2J19L05L87R32K0K31Rm43p48l92m33J9N04l1O66M33K58n0j57k65n47
3120a12n78J90l91J64N32K08M08N85m22P0j99o05l62n27L06qM92P34K07K36J47
$$ plain form
3141 1075 590 233 -264 -570 -1012 -950 -631 -188 391 759 706 968 856 76 -372 -612 -1211 -1015 -508 -57
3161 -57 268 874 684 565 438 108 -287 -582 -746 -1074 -432 -232 380 608 826 896 239 206 -548 -622 -799
3182 -799 -652 -515 -60 428 565 815 862 112 143 -483 -937 -653 -504 -482 -223 613 908 705 710 354 -143 -383
3204 -383 -1018 -701 -809 -479 -82 520 688 432 601 368 -467 -381 -602 -861 -827 -603 232 435 934 629 479
3225 479 588 -265 -613 -650 -790 -774 -178 322 812 768 767 805 235 -225 -668 -1059 -699 -632 -251 229 568 721
3247 721 919 480 -121 -43 -689 -901 -859 -655 -238 116 529 957 863 438 237 -186 -552 -566 -848 -496 -338
3268 -338 33 437 785 946 428 -81 -302 -792 -637 -636 -527 65 385 732 1002 799 232 32 -159 -837 -988
3289 -988 -949 -563 -162 231 940 886 869 413 52 -305 -817 -705 -413 -279 50 466 676 766 702 346 -79 -690
$$ packed form
3141A075m85l57m97l06m42O2L19M43N79L68n3K62j12p80m48k40n99J96N07M51
3161e7L25O06j90j19j27l30l95k95j64l28O42K00O12K28K18P0o57l3p54p4j77
3182g99J47J37M55M88J37K50M7p50L1o26m54K84J49K2K59Q36K95k03Nl56m97k40
3204c83o35L17j08L30L97O02J68k56J69k33q35Q6k21k59L4K24Q35K03M99l05j50
3225D79J09q53l48l7j40J6N96N00M90m4jL8n70m60m43l91L60O7L81M80L39J53
3247G21J98m39o01P8o46k12M2K04M17L54M13M28r4m25k01m23l66j4k82L52J58
3268c38L71M04L48J61n18n09k21m90J55JJ09N92L20L47K70k03n67k00j91o78j51
3289i88L9L86M01L93P09n4j7m56l61l57n12J12K92J34L29M16K10R0o4l56m25o11
$$ plain form
3311 -690 -1027 -950 -688 -490 250 366 546 995 744 115 -63 -623 -621 -811 -720 -207 91 606 764 629 674 374
3333 374 -517 -490 -771 -842 -655 -315 -44 409 798 816 588 329 -41 -599 -753 -738 -600 -108 163 779 562
3354 562 833 391 39 -38 -877 -880 -528 -175 -240 103 498 596 753 540 403 -173 -499 -757 -635 -435 -317 257
3376 257 964 634 796 366 -54 -263 -691 -1255 -877 -536 -127 381 528 952 777 449 139 -223 -631 -670
3396 -670 -420 -451 -104 677 685 902 1002 472 -8 -687 -963 -917 -557 -558 -116 49 668 683 706 290 27 -198 -904
3419 -904 -610 -435 -419 320 556 464 897 440 357 -60 -616 -476 -1056 -687 -122 8 389 989 720 411 358
3440 358 -254 -325 -855 -882 -604 -314 158 342 751 883 378 102 -131 -567 -900 -636 -705 -220 297 416 699
3461 699 730 500 310 -36 -660 -620 -450 -304 -53 262 919 578 588 496 130 -177 -574 -677 -1006 -751 -196
$$ packed form
3311f90l37P7K62J98P40J16J80M49k51o29j78n60Kj90R1N13K98N15J58j35M5l00
3333C74q91K7k81p1J87L40K71M53L89J8k28k59l70n58j54J5J38M92K71O16k17
3354E62K71m42l52p7q39lL52L53o5L43L95R8J57k13j37n76l26k58J22K00J18N74
3376B57P07l30J62m30m20k09m28n64L78L41M09N08J47M24j75l28l10l62m08l9
3396f70K50l1L47P81QK17J00n30m80o79k76M6L60jM42J65O19J5K3m16k63k25p06
3419i04K94J75J6P39K36r2M33m57q3m17n56J40n80L69N65J30L81O00k69l09n3
3440C58o12p1n30k7K78K90M72J84M09J32n05k76k33m36l33K64o9M85N17J19K83
3461F99L1k30j90l46o24M0J70J46K51L15O57l41J0r2l66l07l97j03l29K55N55
$$ plain form
3482 -196 193 685 446 919 688 234 -260 -708 -307 -546 -176 -144 243 407 806 482 319 126 -315 -797
3502 -797 -1081 -436 -411 -53 325 366 631 482 179 -154 -39 -501 -749 -491 -122 -52 428 537 281 834 326
3523 326 -10 -522 -656 -663 -683 -82 71 279 714 549 562 401 56 -740 -568 -637 -697 -99 142 347 625 915
3545 915 503 77 36 -281 -885 -518 -578 -397 319 417 759 808 568 -39 -306 -216 -681 -583 -249 -288 113 705
3567 705 509 483 900 265 -401 -404 -715 -952 -423 173 -55 781 767 429 439 -27 -345 -605 -684 -959 -586 183
3589 183 418 160 693 593 138 72 -237 -655 -919 -594 -553 -269 442 644 820 728 300 -20 -175 -538 -948
3610 -948 -313 -251 -345 314 596 646 462 390 -53 -265 -260 -609 -394 -62 17 313 706 348 400 469 200 -546 -623
3633 -623 -655 -649 -321 216 395 525 726 396 269 56 -175 -710 -599 -618 -377 83 329 643 485 272 148
$$ packed form
3482a96L89M92k39M73k31m54m94m48M01k39L70L2L87J64L99l24j63j93m41m82
3502g97k84O45K5L58L78M1K65j49l03l33J15m62k48K58L69P0M80J09k56N53n08
3523C26l36n12j34pk0O01J53K08M35j65J3j61l45p96J72o9o0N98K41K05K78K90
3545I15m12m26m1l17o04L67o0J81P16R8L42M9k40o07k67R0m65R8L34l9M01N92
3567G05j96k6M17o35o66ll11k37N29N96k28Q36j4l38J0m66l18k60p9k75L73P69
3589A83K35k58N33j00m55o6l09m18k64L25M1K84P11K02J76r2m28l20j55l63m10
3610i48O35O2r4O59K82N0j84p2m43k12Nl49K15L32P9K96L93l58N2O9k69p46p7
3633f23l2OL28N37J79J30K01l30j27k13k31n35J11j9K41M60K46L14j58k13j24
$$ plain form
3654 148 -16 -527 -523 -741 -393 -300 199 358 761 762 560 294 -333 -491 -631 -853 -302 -23 35 128 820 685
3676 685 590 511 -160 -780 -457 -611 -594 -270 320 351 778 723 475 212 -50 -303 -780 -490 -610 -211 226 601
3698 601 360 610 295 21 -82 -728 -1006 -551 -193 -322 519 534 376 441 345 -58 -614 -495 -862 -511 -196
3719 -196 -51 377 454 571 487 202 -125 -641 -262 -537 -928 -81 58 350 358 843 519 266 -174 -398 -435 -385
3741 -385 -254 -431 80 343 407 564 577 312 -553 -418 -639 -761 -312 -101 216 383 689 483 455 158 -97
3762 -97 -126 -669 -583 -294 -35 201 464 753 384 324 144 -298 -478 -550 -654 -513 -103 185 445 756 630 293
3784 293 273 -157 -493 -661 -648 -403 -245 226 442 570 860 445 -169 -302 -655 -665 -214 -447 -96 290 319
3805 319 392 348 500 -49 -331 -740 -746 -694 -302 -340 552 831 638 645 356 -30 -389 -643 -799 -636 -419 -210 193
$$ packed form
3654A48j64n11Mk18L48R3M99J59M03Jk02k66o27j58j40k22N51K79N8R3O92j35
3676F85r5p9o71o20L23j54J7L24N90L1M27n5k48k63k62k53m77K90j20L99M37L75
3698F01k41K50l15k74j03o46k78M55L58j29Q41J5j58O5r6m03n56J19l67L51L15
3719a96J45M28P7J17q4k85l27n16L79k75l91Q47J39K92QM85l24k53m40k24l7N0
3741c85J31j77N11K63O4J57J3k65q65J35k21j22M49K11L17J67L06k06k8k97k55
3762i7k9n43Q6K89K59K36K63K89l69o0j80m42j80p2j04J41M10K88K60L11j26l37
3784B93k0m30l36j68J3K45J58M71K16J28K90m15o14j33l53j0M51k33L51L86K9
3805C19P3m4J52n49k82m09oN2L92l8Q92K79j93Pk89l86l59k54j56J63K17K09M03
$$ plain form
3828 193 507 625 645 299 138 -425 -471 -622 -608 -352 133 551 474 724 320 134 11 -563 -658 -821 -609 -203
3850 -203 57 287 622 444 388 331 -277 -448 -465 -550 -303 -142 449 498 531 743 562 112 -245 -590 -745 -799
3872 -799 -596 -484 107 195 434 546 176 -74 -98 -723 -699 -484 -323 -411 298 212 299 689 335 98 -401 -531
3894 -531 -779 -240 -232 21 33 440 652 770 433 105 -307 -614 -768 -780 -389 9 302 221 535 519 348 18
3916 18 -368 -485 -604 -486 -345 152 381 290 287 559 166 -8 -52 -401 -545 -741 -444 39 -46 540 385 589
3938 589 238 -64 -399 -721 -522 -623 -135 -290 274 539 649 281 163 77 -274 -741 -257 -531 -152 -97 340
3959 340 761 458 602 274 -141 -503 -580 -954 -559 -458 117 493 768 332 483 69 -108 -265 -244 -544 -434
3980 -434 -78 44 479 476 573 209 71 -138 -347 -653 -398 -380 -339 92 332 438 358 152 28 -147 -424 -558
$$ packed form
3828A93L14J18K0l46j61n63m6j51J4K56M85M18p7K50m04j86j23n74r5j63K12M06
3850b03K60K30L35j78n6n7o08j71j7q5K47J61N91M9L3K12j81m50l57l45j55n4
3872g99K03J12N91Q8K39J12l70k50k4o25K4K15J61q8P09q6Q7L90l54k37m99j30
3894e31k48N39QK53J2M07K12J18l37l28m12l07j54j2L91L98K93q1L14j6j71l30
3916A8l86j17j19J18J41M97K29r1lK72l93j74m4l49j44j96K97M83q5N86j55K04
3938E89l51l02l35l22J99j01M88j55N64K65J10l68j18q6l51m67M84k74L79N5M37
3959C40M21l03J44l28m15l62p7l74L95J01N75L76K75m36J51m14j77j57K1l00J10
3980d34L56J22M35lR7l64j38k09k09l06K55J8M1M31K40J06q0k06j24j75k77j34
$$ plain form
4002 -558 -685 -190 -176 210 341 703 663 382 -102 -84 -318 -575 -440 -221 -28 55 810 560 548 118 -17 -34
4024 -34 -342 -573 -557 -303 -10 372 536 481 578 372 -7 -322 -292 -420 -303 -373 -92 102 257 776 386 340
4046 340 138 -363 -647 -454 -544 -205 64 316 418 654 746 125 -381 -376 -652 -628 -550 -43 -421 431 495 513 408
4069 408 205 -98 -189 -516 -791 -429 -57 196 290 486 579 425 82 -213 -266 -478 -537 -380 -48 107 674 831
4091 831 491 237 203 -81 -382 -386 -524 -446 116 237 281 541 507 506 262 -140 -438 -597 -620 -204 -185 113 560
4114 560 459 444 399 -356 -294 -427 -928 -676 -91 -216 -4 655 514 473 489 -17 -369 -382 -252 -732 -316 -42
4136 -42 -1 401 580 509 197 -32 -284 -392 -387 -607 -184 -21 280 47 418 715 157 -11 -317 -223 -550 -440
4158 -440 -266 30 354 433 369 571 135 67 -247 -538 -778 -229 95 -181 256 633 473 258 176 -42 -179
$$ packed form
4002e58j27M95J4L86J31L62m0k81m84J8k34k57J35K19J93Q3P55k50j2m30j35j7
4024c4l08k31J6K54K93L82J64n5R7k06l79l15L0j28J17p0K81J94J55N19l90m6
4046C40k02n01k84J93r0L39K69K52J02K36R2o21n06Nk76K4P8N07l78Q52O4J8j05
4069D08k03l03r1l27k75L62L72K53R4J96R3j54l43k95n3k12n9J57L32J55N67J57
4091H31l40k54l4k84l01mj38P8N62J21M4K60l4jk44m02k98j59k3M16J9K98M47
4114E60j01j5m5p55O2j33n01K52N85j25K12O59j41m1J6n06l52j3J30m80M16K74
4136d2M1M02J79p1l12k29k52j08Nk20M23J63L01k33L71K97n58j68l06R4l27J10
4158d40J74K96L24P9o4K02m36o8l14k91k40N49L24k76M37L77j60k15q2k18j37
$$ plain form
4179 -179 -125 -575 -531 -178 -2 289 599 652 407 70 -116 -295 -550 -372 -423 -116 140 461 502 498 328 -258
4201 -258 -213 -387 -836 -626 -620 -245 224 438 645 452 431 -61 -404 -284 -460 -636 -217 -84 61 193 388
4222 388 527 226 -173 -147 -206 -579 -512 -102 132 10 518 645 483 266 178 -67 -324 -122 -452 -144 5
4243 5 501 217 669 373 100 65 -106 -320 -611 -295 -89 18 445 515 350 381 252 -424 -210 -552 -484 -280
4265 -280 -131 -62 329 645 429 133 109 72 -460 -429 -548 -740 33 294 163 330 484 314 122 260 -510
4286 -510 -612 -512 -368 -196 116 170 518 646 267 71 -88 -383 -767 -583 -315 -254 255 418 370 594 454
4307 454 -6 90 -28 -672 -510 -327 -280 288 276 325 433 295 131 -381 -110 -429 -419 -280 -190 -75 413 571
4329 571 546 188 11 -242 -544 -641 -198 -507 -137 104 359 168 429 328 -236 -128 -436 -555 -474 -553 122
$$ packed form
4179a79N4m50M4L53J76K91L10N3k45l37j86j79k55J78n1L07K56L21M1mj70n86
4201b58M5j74m49K10OL75M69K14K07j93k1m92l43J20j76j76M19J33J45J32J95
4222C88J39l01l99K6n9l73O7M10K34j22N08J27j62k17q8k45k57K02l30L08J49
4243EM96k84M52k96k73l5j71k14k91L16K06J07M27P0j65L1j29o76K14l42O8K04
4265b80J49O9L91L16k16k96k4l7n32L1j19j92P73K61j31J67J54j70j92J38p70
4286e10j02J00J44J72L12N4L48J28l79j96j59k95l84J84K68O1N09J63m8K24j40
4307D54m60R6j18o44J62J83M7N68j2M9J08j38j64n12K71l19J0J39R0J15M88J58
4329E71k5l58j77k53l02r7M43l09L70K41K55j91K61j01n64J08l08j19Q1p9O75
$$ plain form
4350 122 341 375 377 603 344 -138 -319 -303 -603 -212 -63 -59 250 577 629 443 300 -109 -342 -389 -263 -453 -120
4373 -120 3 169 373 388 -58 155 -229 -215 -560 -584 -501 -99 67 485 436 450 303 190 90 -43 -411 -197
4395 -197 -255 -261 168 486 343 452 351 -40 -44 -312 -653 -346 -356 -447 -46 580 535 537 448 -57 -111 -413 -386 -153
4419 -153 -351 -4 163 327 598 546 273 75 -142 -549 -395 -319 -537 -49 387 76 754 467 278 98 -60
4440 -60 -349 -372 -513 -125 108 230 250 428 320 271 35 -87 -98 -539 -509 -362 215 282 442 380 315 426 57
4463 57 -329 -289 -850 -304 -150 -89 260 412 487 367 325 -54 -112 -307 -467 -698 -75 133 215 519 587 485 -26
4486 -26 -134 -452 -487 -699 -358 -66 -1 -14 442 445 409 20 -155 -274 -509 -434 -603 -78 120 306 452 469 188
4509 188 236 0 -10 -210 -559 -242 -22 249 329 246 439 269 13 -168 -449 -513 -514 -126 -36 167 295 464 417
$$ packed form
4350A22K19L4KK26k59m82j81J6l00L91J49ML09L27N2j86j43m09k33m7J26j90L33
4373a20J23J66K04J5m46K13l84J4l45k4Q3M02J66M18m9J4j47j13j00j33l68K14
4395a97n8oM29L18j43J09j01l91mk68l41L07j0r1M01O26m5Kq9n05n4l02K7K33
4419a53j98L47J67J64K71n2k73j98k17m07J54P6k18M88M36l11O78k87j89j80j58
4440f0k89k3j41L88K33J22K0J78j08m9k36j22j1m41L0J47N77O7J60o2o5J11l69
4463E7l86M0n61N46J54O1L49J52P5j20m2l79n8j95j60k31O23K08Q2L04O8j02n11
4486b6j08l18l5k12L41K92O5j3M56Ll6l89j75j19k35P5j69N25J98J86J46J7k81
4509A88M8k36j0k00l49L17K20K71Q0q3J93j70k56j81k81o4jL88R0K03J28J69m7
$$ plain form
4532 417 281 148 -94 -268 -349 -641 -567 -11 51 299 346 294 289 164 -228 -294 -478 -493 -318 225 11 239 514
4555 514 353 85 -75 -473 -250 -388 -443 -421 22 301 306 423 243 181 -106 -401 -637 -481 -181 -327 -38 116
4577 116 629 512 256 378 -64 -370 -368 -523 -404 -365 87 276 437 782 339 180 41 -265 -362 -565 -361
4598 -361 -114 -13 299 301 410 231 41 355 -370 -504 -774 -248 -184 106 227 240 674 357 -216 -85 -253
4619 -253 -418 -380 -171 45 61 306 512 477 358 -86 -183 -38 -324 -715 -54 -11 159 409 505 394 335 51
4641 51 -228 -407 -235 -530 -199 -81 482 163 250 119 80 386 -39 -232 -457 -189 -243 -43 264 223 414 554
4663 554 439 -100 -123 -575 -420 -321 -122 -49 26 276 299 540 296 -281 -426 -190 -428 -270 -116 82 94 412
4685 412 543 198 -9 41 -99 -453 -258 -607 -359 74 273 139 475 309 339 -222 -17 -301 -378 -313 -302 372
$$ packed form
4532D17j36j33k42j74q1k92P4N56O2K48M7n2nj25l92o6j84j5J75N43k14K28K75
4555E14j61k68j60l98K23j38n5K2M43K79NJ17j80o2k87k95k36J56L00j46K89J54
4577A16N13j17k56J22m42l06Kj55J19L9M52J89J61L45m43j59j39l06r7k03K04
4598c61K47J01L12KJ09j79j90L14p25j34k70N26O4K90J21J3M34l17n73J31j68
4619b53j65L8K09K16J6K45K06l5j19m44r7J45k86l91O61M3J70K50R6j11n9k84
4641E1k79j79J72k95L31J18N63l19Q7j31l9L06m25j93k25K68n4K00L07m1J91J40
4663E54j15n39k3m52J55R9J99P3P5K50K3K41k44n77j45K36k38J58J54J98J2L18
4685D12J31l45k07N0j40l54J95l49K48M33J99j34L36j66L0n61K05k84p7O5J1O74
$$ plain form
4707 372 213 220 292 503 -29 -174 -187 -316 -438 -344 74 -37 454 439 305 259 -8 -158 -235 -278 -763 -297 58
4730 58 -137 200 456 203 102 54 -340 -560 -441 -487 -176 362 113 250 676 345 -121 98 -81 -523 -445
4751 -445 -232 -190 155 243 302 309 527 418 73 -181 -170 -418 -420 -9 -172 122 370 403 387 331 3 -166 -603 -384
4775 -384 -557 -171 103 132 240 417 277 394 71 -258 -250 -453 -313 -260 543 71 376 492 -28 290 -81
4796 -81 -184 -359 -335 -205 -289 118 543 292 238 404 92 -132 -220 -334 -419 -74 -277 126 256 310 480 376
4818 376 234 -15 -140 -340 -361 -258 -56 -76 342 652 371 342 128 -329 -625 -313 -103 -243 -35 262 463
4839 463 266 500 188 30 90 -595 -433 -231 -368 153 336 361 367 346 507 -98 -78 -145 -334 -345 -281 18 170
4862 170 261 495 182 232 258 -300 -320 -190 -442 -368 -63 122 431 505 301 244 168 -380 -374 -476 -470 -155 29 -141
$$ packed form
4707C72j59PP2K11n32j45j3j29j22R4M18j11M91j5j34m6k67j50p7m3m85M66L55
4730E8j95L37K56k53j01m8l94k20J19m6L11N38k49J37M26l31m66K19j79m42P8
4751d45K13M2L45Q8N9PK18j09l45k54J1k48kM11j63K94K48L3j6n6l28j69m37K19
4775c84j73L86K74K9J08J77j40J17l23l29Qk03J40N3Q03m72L05J16n20L18l71
4796h1j03j75K4J30q4M07M25k51n4J66l12k24q8j14q5L45k03M03J30N4J70j04
4818C76j42k49j25k00k1J03K02k0M18L10k81k9k14m57k96L12K10j40K08K97K01
4839D63j97K34l12j58O0o85J62K02j37N21J83K5Ok1J61o05K0o7j89j1O4K99J52
4862A70R1K34l13N0K6n58k0J30k52P4L05J85L09P4k04n7p6n48Oj02OL15J84j70
$$ plain form
4886 -141 457 512 309 299 -131 -280 -544 -216 -523 -517 117 293 293 239 472 93 209 -77 -382 -551 -222 -116
4908 -116 -85 415 464 317 105 303 110 -341 -425 -446 -448 113 159 323 294 252 186 40 5 -207 34 -117 -339 -170
4932 -170 232 430 390 435 455 224 1 -160 -334 -405 -266 -21 240 295 452 233 358 212 -20 -289 -456 -103
4954 -103 -414 2 349 374 314 298 319 134 -96 -252 -381 -729 -374 77 -45 481 378 89 30 197 -206 -375
4976 -375 -217 -494 25 184 152 253 219 358 229 119 -1 -437 -418 -290 30 -86 260 354 348 333 81 -265
4998 -265 -97 -458 -329 -322 -293 -172 116 159 414 -39 300 -28 -93 -365 -440 -354 -343 -86 51 264 196 334 -108
5021 -108 -103 -366 -332 -498 -104 -197 -15 228 382 410 636 182 -161 -281 -284 -143 -289 -89 343 367 385 330 127
5044 127 118 -109 -173 -360 -198 -111 -221 421 253 392 350 323 172 -274 -386 -347 -239 -332 -174 33 401 631 117
$$ packed form
4886a41N98N5k03j0m30j49k64L28l07OO34J76%n4K33l79J16k86l05j69L29J06
4908a16L1N00M9j47k12J98j93m51q4k1kN61M6J64k9m2o6j46l5k12K41j51k22J69
4932a70M02J98m0M5K0k31k23j61j74p1J39K45K61N5J57k19J25j46k32k69j67L53
4954a03l11M16L47K5o0j6K1j85k30j56j29l48L55M51j22N26j03k89n9J67m03j69
4976c75J58k77N19J59l2J01l4J39j29j10j20m36J9J28L20j16L46R4oj5k52l46
4998b65J68l61J29PK9J21K88M3K55m53L39l28o5k72p5Q6J1K57J37K13o8J38m42
5021a08Nk63L4j66L94r3J82K43J54K8K26m54l43j20lJ41j46K00M32K4J8n5k03
5044A27rk27o4j87J62Q7j10O42j68J39m2k7j51m46j12L9J08r3J58K07L68K30n14
$$ plain form
5067 117 270 -63 -304 -211 -354 -200 -251 -40 434 257 504 240 115 -137 -202 -413 -331 -197 -270 -96 258 391
5089 391 594 196 234 -41 -343 -452 -239 -442 -39 77 -55 332 579 289 134 3 -215 65 -372 -114
5109 -114 -12 212 394 358 332 207 286 -10 -221 -407 -412 -335 -164 291 115 297 143 150 -49 74 -141 -346 -194
5132 -194 -340 -46 57 333 78 220 232 143 -73 -251 -370 -392 -282 -46 27 273 196 426 408 21 -98 -238
5154 -238 -364 -284 2 -45 138 383 602 341 254 182 -88 -37 -258 -190 -180 -240 -149 368 117 311 295 95 -314
5177 -314 -413 -235 -354 -102 -125 16 486 444 319 351 68 -243 -290 -348 -384 -93 69 252 154 765 306 74 198
5200 198 -252 -649 -127 -374 -371 -42 125 239 406 416 16 60 14 -188 -287 -217 -484 38 201 332 469 261
5222 261 362 -164 -216 -376 -416 -408 -1 231 258 290 306 143 362 -286 -265 -350 -310 -248 -80 -17 190 171 415 100
$$ packed form
5067A17J53l33k41R3j43J54n1K11M74j77K47k64j25k52o5k11Q2J34p3J74L54J33
5089C91K03l98L8k75l02j09K13k03M03J16j32L87K47k90j55j31k18K80m37K58
5109a14J02K24J82l6k6j25P9k96k11j86nP7J71M55j76J82j54Pj99J23k15k05J52
5132a94j46K94J03K76k55J42J2q9k16j78j19k2J10K36P3K46p7K30j8l87j19j40
5154b38j26Q0K86m7J83K45K19k61q7p2k70N1k21O8J0o0R1N17k51J94j6k00m09
5177c14r9J78j19K52k3J41M70m2j25L2k83l11m7n8l6K91J62J83r8O11m59k32J24
5200A98m50l97N22k47LL29J67J14J67J0m00M4m6k02r9P0k67N22J63J31J37k08
5222B61J01n26n2j60m0QM07K32K7L2J6j63K19o48K1q5M0O2J68O3K07j9K44l15
$$ plain form
5246 100 126 -88 -146 -361 -497 -125 -34 19 305 404 389 283 -170 -100 -230 -148 -180 -234 -142 193 428 437 446 91 216
5271 216 -117 -346 -612 -195 -93 212 114 152 402 133 226 142 -21 -430 -432 -322 -204 6 403 216 426 438
5293 438 207 -135 -232 -365 -514 -246 -292 228 347 186 360 414 218 -194 -88 -285 -177 -313 -424 -99 -57
5314 -57 583 261 431 162 -102 -172 -361 -221 -588 104 275 249 562 336 392 0 27 -437 -377 -402 -552 32
5336 32 246 104 392 218 351 -1 -216 -266 -178 -408 -209 -210 12 111 -8 514 464 128 -265 -79 -131 -303 -53
5359 -53 -68 7 271 112 524 205 -247 -64 -259 -533 -498 -138 -298 76 357 442 165 218 76 -58 -3 -221
5381 -221 -220 -569 4 358 241 259 331 260 144 138 -493 -341 -365 -432 121 243 309 368 510 145 90 125 -600 -192
5405 -192 -317 -398 145 39 288 -20 565 196 -50 -243 -170 -132 -227 -124 174 69 249 142 -165 338 -30
$$ packed form
5246A00K6k14n8k15j36L72R1N3K86R9j5j06m53P0j30Q2l2n4R2L35K35RRl55J25
5271B16l33k29k66M17J02L05r8L8K50k69R3q4j63m09kJ10J18K10L97j87K10J2
5293D38k31l42r7j33j49K68m6N20J19j61J74N4j96m12J06j97J08j36j11L25M2
5314e7O40l22J70k69k64p0j89J40l67O92J71k6L13k26N6l92K7m64O0k5j50N84
5336C2K14j42K88j74J33l52k15n0Q8k30J99jK22R9j19N22n0l36l93J86n2j72K50
5359e3j5P5K64j59M12l19m52J83j95k74L5L60j60L74K81Q5k77N3j42j34N5k18
5381b21Jl49N73L54j17J8P2p1j16oo31J52k4o7N53J22O6N9J42l65n5L5p25M08
5405a92j25q1N43j06K49l08N85l69k46j93P3L8r5J03K98j05J80j07l07N03l68
$$ plain form
5426 -30 -431 -350 -462 -353 -87 127 165 516 396 299 69 -115 -67 -362 -309 -204 -208 -69 166 2 326 -6 -54
5449 -54 11 -354 -403 -158 -221 -258 -77 422 292 256 469 74 -332 47 -97 -374 -354 -1 -117 237 379 426 92
5472 92 307 173 3 -304 -264 -203 -186 123 7 306 287 106 36 101 -154 -95 -180 -312 -422 518 163 402 369
5495 369 -1 -230 -113 -31 -54 -367 -278 -2 192 -78 150 434 474 -62 -337 -163 -488 -275 -172 -41 232
5516 232 320 217 283 -42 8 -217 29 -338 -326 38 109 243 101 309 130 256 -20 -293 -457 -283 -462 -152
5538 -152 79 465 -13 141 163 291 -233 70 -277 -452 -74 -40 125 317 285 248 303 -135 -135 -179 -58 -436 -321
5561 -321 -467 52 353 301 199 150 -44 -56 -260 -341 -447 -254 156 109 247 399 582 104 363 -199 -393 -383
5583 -383 -436 -352 -84 372 181 312 311 328 162 26 -432 -40 -189 -315 114 451 404 267 320 360 14 -223 0
$$ packed form
5426c0m01Q1j12J09K66K14L8L51j20r7k30j84M8k95N3J05mJ39K35j64L24l32m8
5449e4O5l65m9K45o3l7J81M99j30l6K13l95m06L79j44k77K0L53j16L54J42M7l34
5472I2K15j34j70l07M0O1J7L09j16K99j9j81p0O5k55N9q5j32j10R40l55K39l3
5495C69l70k29J17Q2k3l13Q9K76J94k70K28K84M0n36k75J74l25K13J03J31K73
5516B32Q8j03O6l25N0k25K46l67J2L64P1J34j42K08j79J26k76k73j64J74j79L10
5538a52K31L86m78J54K2J28n24L03l47j75L78L4J65J92l2l7N5m38%m4J21l78J15
5561c21j46N19L01n2j02m9j94j2k04q1j06J93M10m7J38J52J83m78K59n62j94J0
5583c83n3Q4K68M56j91J31jJ7j66j36m58L92j49j26M29L37m7j37N3M0l46k37K23
$$ plain form
5606 0 -359 -604 27 206 175 411 543 221 -212 -63 -220 -453 -172 -189 192 97 357 9 110 147 243 -136
5628 -136 -288 -206 -411 -258 76 75 178 189 282 588 -15 -97 -223 -138 -193 -254 -382 56 237 485 57 191 354
5651 354 -35 -294 -103 -308 -181 -121 -18 282 321 282 -25 -25 -24 -146 -463 -1 -91 126 209 247 450 481 53 263
5675 263 -221 -329 -366 -382 -245 -5 -8 175 208 251 27 -54 -125 -217 -218 -150 -209 -67 261 146 191 186 133 131 -142 -205 -496
5702 -496 -487 41 -143 291 223 248 444 285 -98 76 -245 -392 -100 -169 -38 337 158 171 84 327 10 -199
5724 -199 -380 -332 -227 -331 -88 181 234 206 324 -24 134 -318 -293 -237 -142 -147 -69 418 155 393 256 -96 139
5747 139 -174 -226 -224 -143 53 57 326 365 324 193 -92 -103 -82 -88 -209 -115 -104 126 381 382 211 42 326 -171 22
5772 22 -213 -336 -47 -20 123 309 472 137 342 87 -87 -308 -396 -258 -358 -264 40 33 253 62 -230 82
$$ packed form
5606@l59k45O31J79l1K36J32l22m33J49j57k33K81j7L81r5K60l48J01L7R6l79
5628a36j52Q2k05J53L34jJ03J1R3L06o03q2j26Q5n5o1j28M38J81K48m28J34J63
5651C54l89k59J91k05J27O0J03L00L9l9l07%Jj22l17M62r0K17Q3L8K03L1m28K10
5675B63m84j08l7j6J37K40lJ83L3M3k24q1p1r2jO8n9J42L28j15M5nn3kk73o3k91
5702d96RN28j84M34o8K5J96j59l83J74l21j47K92o9J31L75j79J3q7K43l17k09
5724a99j81M8J05j04K43K69N3k8J18l48J58m52K5N6R5nP8M87k63K38j37l52K35
5747A39l13n2KQ1J96MK69L9m1j31k85j1K1oj21R4J1K30K55Jj71j69K84m97J93
5772B2k35j23K89K7J43J86J63l35K05k55j74k21q8J38j00R4L04pK20j91k92L12
$$ plain form
5794 82 -53 -287 -201 -193 -210 -156 131 22 228 291 207 -152 -119 -489 -204 -345 212 -225 16 594 132 262 95
5817 95 -251 -243 -190 -325 -225 34 261 166 333 227 236 108 -16 -190 -347 -383 -116 31 -82 213 380 223 392
5840 392 263 36 -253 -155 -96 -34 -59 122 -50 310 517 161 -114 -383 -193 -97 -466 -71 -14 218 157 389
5862 389 426 46 -17 77 -255 -403 -330 -227 -64 -113 191 131 341 213 177 12 -230 -139 85 -121 -20 51 24
5885 24 448 354 333 143 160 -207 -150 -212 -150 32 244 171 318 257 161 -342 -321 -235 -36 -358 -213 -50 275 57
5909 57 307 205 304 187 20 -256 -307 -352 -352 -125 -71 358 400 99 293 143 -133 -137 -241 -214 1 171 73 391
5933 391 245 188 98 -21 -108 81 -104 -128 -72 187 378 311 265 224 -141 28 11 -437 -347 -256 -83 99 416 361
5957 361 269 116 214 -12 -121 -222 -357 -331 -256 -88 258 82 273 175 112 -261 -103 -163 -233 -169 -128 62 -128
$$ packed form
5794H2j35k34Q6Qj7N4K87j09K06O3q4l59L3l70K85j41N57m37K41N78m62J30j67
5817I5l46QN3j35J00K59K27r5J67j06Rj28j24j74j57l6K67J47j13K95J67j57J69
5840C92j29k27k89R8N9O2k5J81j72L60K07l56k75k69J90R6l69L95N7K32o1K32
5862C89L7l80o3R4l32j48P3J03J63m9L04o0K10j28l6j65k42R1K24k06J01P1k7
5885B4M24r4k1j90J7l67N7o2O2J82K12p3J47o1r6n03K1Q6J99l22J45J63L25k18
5909E7K50j02R9j17j67k76n1m5%K27N4M29M2l01J94j50k76mj04K7K15J70r8L18
5933C91j46n7r0j19q7J89j85k4N6K59J91o7m6m1l65J69j7m48R0R1J73J82L17n5
5957C61r2j53R8k26j09j01j35K6P5J68L46j76J91r8o3l73J58o0p0O4M1J90j90
$$ plain form
5980 -128 349 293 189 38 -7 -294 -267 -262 -341 -20 278 156 261 220 175 -63 34 -209 -366 -221 -103 -171 58
6003 58 307 161 241 79 275 -129 -354 -330 -175 -177 -19 282 176 430 146 -23 7 137 -329 -289 80 -148
6025 -148 284 40 265 581 250 131 109 -459 -222 173 -353 -196 -337 136 257 276 383 84 171 -305 -56
6046 -56 -296 -257 -339 -128 298 58 191 226 158 12 94 -175 -161 45 -160 -108 281 469 377 -75 159 77 -474
6069 -474 19 -139 -240 -341 -79 -45 238 234 143 39 184 -193 -77 -74 -119 128 195 -25 206 463 241 -177 -95
6092 -95 -49 -116 -240 -179 -35 226 172 241 112 170 -22 -212 -442 -452 -94 -285 124 92 183 176 281 5 3 -64 57
6117 57 -277 -255 -313 11 246 -91 493 53 183 -43 -234 -15 -37 -118 -135 45 193 32 430 298 75 101
6139 101 17 -55 65 -87 -52 236 409 340 142 236 -29 -200 27 -246 -443 -48 8 206 287 166 43 154
$$ packed form
5980a28M77n6j04j51m5k87K7Np9L21K98j22J05m1m5k38R7k43j57J45J18o8K29
6003E8K49j46Q0j62J96m04k25K4J55kJ58L01j06K54k84j69L0J30m66M0L69k28
6025a48M32k44K25L16l31j19k2n68K37L95n26J57j41M73J21J9J07k99Q7m76K49
6046e6k40L9q2K11M26k40J33L5o8j46Q2k69J4K06k05N2L89J88r2m52K34q2n51
6069d74M93j58j01j01K62L4K83mr1j04J45l77J16Lm5K47O7k20K31K57k22m18Q2
6092i5M6o7j24O1J44K61n4O9j29N8j92j90k30j0L58j91M09l2R1pJ05k76ko7J21
6117E7l34K2n8L24K35l37N84m40J30k26j91K19k2q1j7J80J48j61L98j32k23K6
6139A01q4p2J20j52L5K88J73o9j98R4k65j71K27k73j97L95N6J98Q1j21j23J11
$$ plain form
6161 154 106 138 -99 -28 -340 -345 -227 280 316 393 200 193 -91 195 -361 -260 142 -246 -54 355 374 300 349 -34
6185 -34 -77 27 -137 -88 -47 37 -46 78 420 432 112 120 115 34 -145 -102 -488 -114 -67 -137 252 330 198 -153 88
6210 88 127 -244 -290 -306 -238 -57 210 82 387 168 -43 114 -7 -341 -195 -348 -350 -58 26 151 373 376 -7
6233 -7 -133 91 -269 -406 -295 133 -46 203 336 -55 312 259 59 -350 -55 -391 -127 -163 -13 94 465
6254 465 214 253 112 117 60 -96 -277 -6 -428 -45 -26 -172 406 209 -66 -342 -260 -199 -8 -136 -179 136 -14
6277 -14 110 350 110 -228 -86 -310 -426 -265 -165 18 -76 148 225 404 237 91 -182 -67 -145 -320 114
6298 114 -175 66 196 220 391 169 97 17 -170 -306 -141 -113 61 241 267 170 352 164 214 -223 -314 -300 -317
6321 -317 -14 148 161 112 139 223 238 85 -313 -31 -184 -352 -99 -25 146 154 74 322 134 -77 116 -125 -206
$$ packed form
6161A54m8L2k37P1l12nJ18N07L6P7j93pk84K86n56J01M02l88J92M09J9p4M9l83
6185c4m3J04j64M9M1Q4q3J24L42J2l20Qnq1j79M3l86L74M7p0L89P8j32l51K41
6210H8L9l71m6j6O8J81K67j28L05k19k11J57j21l34J46j53kK92Q4J25K22Ll83
6233gj26K24l60j37J11M28j79K49J33l91L67n3k00m09K95l36K64l6J50J07L71
6254D65k51L9j41Nn7j56j81K71m22L83J9j46N78j97k75k76Q2O1J91j28m3L15j50
6277a4J24K40k40l38J42k24j16J61J00J83r4K24P7J79j67j46k73J15p8j75M34
6298A14k89K41J30K4J71k22p2q0j87j36J65K8J74J80K6r7J82j88N0m37r1J4j7
6321c17L03J62J3m9K7Q4J5j53l98K82j53j68K53P4J71Qq0K48j88k11J93k41q1
$$ plain form
6344 -206 -157 -59 -161 263 159 334 367 15 82 9 -167 -129 -161 -69 -321 315 404 -16 215 43 -45 -81 -234 -232
6368 -232 -106 185 -47 44 252 -25 159 -153 -131 -50 -224 -298 -224 -134 110 -79 299 466 83 250 -16 -222
6390 -222 -133 -349 -280 99 -62 500 159 238 -16 -18 -15 -19 -298 -328 142 -76 187 29 191 59 322 232 122 -225
6414 -225 -216 -118 31 100 422 360 193 291 271 -118 -222 89 -309 -280 -11 52 17 179 236 -142 279 -100 -98 135
6438 135 -146 -140 -162 44 -16 -97 39 163 24 -156 -52 -344 -389 -110 -297 40 319 280 387 184 86 182 -15
6461 -15 -248 -503 -166 -330 104 216 305 260 236 -135 -107 -90 -210 -149 -292 1 189 198 116 298 12 167 -120
6484 -120 -54 -356 -104 -56 -154 181 261 111 -130 -27 163 86 -38 -221 -113 -391 122 229 216 -62 -56 223 -40
6507 -40 255 -73 -85 -336 -274 66 173 423 217 206 116 0 56 -249 -276 -83 -152 -202 -105 223 132 287 -12 168
$$ packed form
6344b06M9R8j02M24j04J75L3l52O7p3j76L8l2R2k52O36Q9m20K31j72q8l6j53K
6368b32J26K91k32R1K08k77J84l12K2Q1j74p4P4R0K44j89L78J67l83J67k66k06
6390b22Q9k16O9L79j61N62l41P9k54kLmk79l0M70k18K63j58J62j32K63r0j10l47
6414b25RR8J49O9L22o2j67R8k0l89j04L11l98K9K69O3l5J62N7l78M21l79KK33
6438A35k81Ok2K06o0q1J36J24j39j80J04k92m5K79j87L37K79l9J07k03r8R6j97
6461a5k33k55L37j64M34J12Q9m5k4l71K8J7j20O1j43K93J88Rq2J82k86J55k87
6484a20O6l02K52M8r8L35Q0j50k41J03J90p7j24j83J08k78N13J07j3k78OK79k63
6507d0K95l28j2k51O2L40J07K50k06j1r0j16N6l05k7J93o9n0R7L28r1J55k99J80
$$ plain form
6531 168 -101 -429 -92 -277 -94 14 -84 210 -109 108 -28 66 -99 -176 -216 -210 2 -175 152 41 157 275
6553 275 196 94 131 -105 8 -243 -227 256 39 -14 291 124 95 -93 -34 133 -284 38 240 108 196 103 129
6576 129 -56 169 -132 -285 -164 -122 -17 -27 208 394 160 254 -68 34 203 62 -222 -185 -6 17 -287 318
6598 318 211 166 258 46 -78 -50 -196 -191 -301 -113 -99 -53 191 146 119 -125 25 -169 -308 -69 9 -56 59 148
6622 148 173 112 231 0 -66 -498 -146 93 -106 107 133 186 515 288 -37 -3 154 -18 -155 -126 31 191
6644 191 -28 171 264 207 -86 9 53 -61 -428 -50 -111 82 -62 51 217 198 -14 -162 -126 -46 -208 -272 -4
6667 -4 20 -104 258 256 288 120 -196 -187 -467 -212 -257 3 -26 18 249 74 244 216 -165 57 -351 -110 18 -172
6691 -172 -51 186 103 194 -43 -363 42 -200 -205 -206 -189 -61 56 -52 216 192 255 20 -137 191 -55 -186 -411
$$ packed form
6531A68k69l28L37j85J83J08r8K94l19K17j36R4j65p7m0OK12j77L27j11J16J18
6553B75p9j02L7k36J13k51J6M83k17n3L05j67k9j88N9J67m17L22K02j32Q8r3K6
6576A29j85K25l01j53J21M2J05j0K35J86k34R4l22J02J69j41k84L7J79K3l04O05
6598C18j07m5R2k12j24K8j46Nj10J88J4M6K44m5k7k44J50j94j39K39P8o5J15Q9
6622A48K5o1J19k31o6m32L52K39j99K13K6N3L29k27l25L4J57j72j37K9J57J60
6644A91k19J99R3n7k93R5M4j14l67L78o1J93j44J13J66j9k12j48L6Q0j62o4K68
6667dK4j24L62kL2j68l16Rk80K55m5K60k9M4K31j75J70k8l81K22m08K41J28j90
6691a72J21K37q3R1k37l20M05k42njJ7J28J17j08K68k4O3k35j57L28k46j31k25
$$ plain form
6714 -411 -132 -43 -28 231 260 8 5 -52 -97 41 -534 -112 52 232 264 172 71 191 -58 -99 98 -221 30
6737 30 16 174 289 286 -52 316 58 220 -197 -243 -113 -279 -126 -20 -195 84 269 -25 63 8 -290 -230 -91
6760 -91 -15 140 -21 32 157 154 21 101 -243 29 -125 -120 -105 -248 2 218 346 190 196 222 69 150 -101 -48 -176
6785 -176 -336 -44 298 401 208 195 -122 -108 -164 -378 -157 115 27 -96 -19 260 336 115 158 -171 -153 -212 -112
6808 -112 -271 37 49 188 289 41 143 -45 -148 -48 44 -219 159 96 -57 -68 489 -120 132 -8 -270
6829 -270 -74 -69 -192 -298 -84 55 -249 484 159 47 -114 57 -185 -69 -66 -236 -155 -13 168 202 71 348
6851 348 -160 3 -315 -224 30 -134 -167 128 212 73 -28 55 15 -365 -405 -38 137 -329 221 6 -193 82
6873 82 51 -10 28 -208 -7 -228 -249 24 182 87 321 300 141 93 -66 -154 -208 -40 -467 80 72 43 27 120 92
$$ packed form
6714d11K79Q9J5K59K9k52ln7m5J38n75M22J64J80L2r2j01J20k49m1J97l19K51
6737C0j4J58J15ll38L68k58J62m17m6J30j66J53J06j75K79J85k94Q8n5k98O0J39
6760i1P6J55j61N3J25lj33Q0l44K72j54NJ5j43K50K16J28j56OK6j53Q1k51N3j28
6785a76j60K92L42J03j93j3l17J4n6k14K21K72q8j23P7K79P6k21M3l29J8n9J00
6808a12j59L08J2J39J01k48J02j88j03J00R2k63L78o3j53j1N57o09K52j40k62
6829b70J96Nj23j06K14J39l04P33l25j12j61J71k42J16Lj70Q1J42J81L4j31K77
6851C48n08J63l18R1K54j64l3K95Q4j39j01Q3m0l80m0L67J75m66N50k15j99K75
6873H2l1o1L8k36K01k21k1K73J58r5K34k1j59m8j59q8n4J68m27N47qk9j6R3k8
$$ plain form
6898 92 135 147 78 -334 -114 -69 56 -61 207 377 28 318 158 -216 -154 -305 70 158 -139 86 169 325 353
6921 353 29 -8 -140 -326 -125 -138 -80 -221 75 146 93 204 126 -249 -237 -113 -115 -275 -185 37 -21 -37 262 290
6945 290 138 -90 -163 -226 99 -218 -20 -42 19 523 99 59 95 -15 -115 -84 -103 -67 138 260 312 433 342 179
6969 179 211 -138 -9 -204 -309 -123 -14 -5 267 309 94 213 73 99 274 119 -272 -46 20 133 106 350
6991 350 -111 -8 169 151 250 -107 -194 58 129 183 310 -6 21 57 -120 -5 -23 -253 -264 -53 16 114 -85 97
7015 97 349 17 170 -31 -88 -310 -123 -98 -173 -65 -84 89 107 209 -81 26 202 -108 -274 -151 231 154
7037 154 24 89 256 65 -71 81 -20 -92 -338 60 50 377 260 282 21 -22 -41 -11 -204 -134 -135 -45 78 117
7061 117 -14 360 111 -39 -27 -132 -144 -103 -109 101 -92 -20 278 198 375 -216 12 -279 -54 -205 -268 -123 -53
$$ packed form
6898I2M3J2o9m12K20M5J25j17K68J70l49K90j60l74O2j51L75Q8k97K25Q3J56K8
6921C53l24l7j32j86K01j3N8j41K96P1n3J11p8l75J2J24kj60R0K22n8j6K99K8
6945B90j52k28p3o3L25l17J98k2O1N04m24m0L6j10j00L1j9L6K05J22N2J21r1j63
6969A79L2l49J29j95j05J86J09RK72M2k15J19j40K6J75j55l91K26O6J13k7K44
6991C50m61J03J77j8R9l57q7K52P1N4J27l16K7L6j77J15j8k30j1K11O9R8j99J82
7015I7K52l32J53k01n7k22J87K5p5J08j9J73J8J02k90J07J76l10j66J23L82p7
7037A54j30O5J67j91j36J52j01p2k46L98j0L27j17K2k61m3j9L0j93P0jR0J23L9
7061A17j31L74k49j50J2j05j2M1oK10j93P2K98q0J77n91K28k91K25j51o3J45P0
$$ plain form
7084 -53 190 -50 218 146 26 79 -65 -161 -41 -308 202 171 28 227 158 195 118 25 -178 -178 -302 49 -35 -220
7108 -220 169 92 -101 28 158 -135 -90 -67 -242 36 -162 56 24 153 67 -214 5 -147 -360 43 138 -239
7130 -239 -71 14 218 420 -134 262 176 19 -36 12 -290 -173 70 -83 5 76 120 72 189 -49 -178 13 -88
7153 -88 13 -91 -155 92 116 10 123 -34 -139 -144 -149 -295 -96 102 109 338 364 38 199 -19 -206 -41 -159
7176 -159 159 -194 1 -2 301 43 88 -241 -198 -62 -233 -5 -235 -248 109 253 -9 335 70 -82 70 -130
7198 -130 164 -201 210 233 86 164 -188 121 68 252 -31 -103 -227 215 -144 23 -19 38 263 162 78 218
7220 218 52 -325 -540 -335 -336 -56 -72 109 140 202 87 -103 -230 -112 -235 190 -41 -198 143 -54 81 127
7242 127 248 133 -18 -91 -90 -375 -82 -49 -42 120 219 146 -25 -86 -107 -251 -179 -260 -102 -44 -112 65 172 141 129
$$ packed form
7084e3K43k40K68p2j20N3j44r6J20k67N10l1j43J99o9L7p7r3k03%j24L51q4j85
7108b20L89p7j93J29J30k93M5K3j75K78j98K18l2J29q6k81K19j52k13M03R5l77
7130b39J68Q5K04K02n54L96q6j57n5M8l02J17K43j53Q8P1M4m8J17k38j29J91j01
7153h8J01j04o4K47K4j06J13j57j05nnj46J99J98PK29K6l26J61k18j87J65j18
7176a59L18l53J95lL03k58M5l29M3J36j71K28k30j3L57J44k62L44k65j52J52k00
7198a30K94l65M11K3j47P8l52L09n3J84k83p2j24M42l59J67m2N7K25j01q4J40
7220B18j66l77k15K05jK80j6J81L1O2j15j90j27J18j23M25k31j57L41j97J35M6
7242A27J21j15j51p3Jk85K93L3PJ62R9p3j71o1k1j44P2q1J58N8o8J77J07l1j2
$$ plain form
7267 129 91 80 -189 -404 -217 -16 -189 25 196 -33 105 145 -57 43 -201 -27 0 -373 41 -54 41 -84
7289 -84 -49 50 -105 -188 -85 -268 50 -157 36 -54 323 318 453 82 48 -24 -352 -101 -246 60 81 -32 567
7312 567 264 -122 339 -3 -174 -164 -56 -196 165 156 -150 231 62 81 -50 -14 -124 -99 -101 -195 -19 256 221
7335 221 261 65 -11 177 21 -174 66 21 63 -179 31 80 182 381 64 113 55 1 30 -192 105 62 100 61
7359 61 403 -24 105 -28 39 -187 -207 -83 -33 -87 -109 192 -73 8 -254 -34 -80 -215 -43 -261 -104 8 175
7382 175 168 132 18 187 -224 -42 -371 -162 -65 -118 -91 13 66 217 -76 43 -152 -175 -61 17 199 -13 118
7405 118 -136 -67 13 197 -9 -144 -191 61 -296 -40 47 -15 216 226 61 -14 195 -160 206 -50 -79 -63 -90
7428 -90 254 185 63 352 -49 43 78 -95 -72 -115 -40 36 -65 165 237 -148 47 189 13 -287 68 -160 -256
$$ packed form
7267A29l8j1k69k15J87K01j73K14J71k29J38M0k02J00k44J74K7l73M14r5R5j25
7289h4L5R9j55q3J03j83L18k07J93r0L77nJ35l71l4p2l28K51j45L06K1j13N99
7312E67l03l86M61l42j71J0J08j40L61rl06L81j69J9j31L6j10K5kr4J76K75l5
7335B21M0j96p6J88j56j95K40m5M2k42K10M9J02J99l17M9n8n4K9k22K97m3L8l9
7359F1L42m27J29j33O7k26k0J24N0n4k2L01k65Q1k62K20m6j35J72k18J57J12J67
7382A75pl6j14J69m11J82l29K09R7n3K7J04N3J51k93J19j95k3J14P8J82k12J31
7405A18k54O9Q0J84k06j35m7K52l57K56Q7o2K31J0j65p5K09l55L66k56k9J6k7
7428i0L44o9j22K89m01R2L5j73K3m3P5P6j01K30P2l85J95J42j76l00L55k28r6
$$ plain form
7451 -256 123 -144 254 -2 17 107 80 -139 -23 -65 -134 -36 -244 -34 -58 125 -27 128 -11 19 106 -372 99
7474 99 21 -71 -96 7 171 -47 154 -33 -166 -107 -296 -184 316 -171 28 173 367 162 278 18 260 -62
7496 -62 -306 -202 82 -274 -47 412 255 236 -148 54 6 -100 -70 -30 172 89 98 259 28 175 32 215 -120
7519 -120 -302 -466 -107 24 36 -193 120 98 181 24 -107 -120 -287 -154 -14 -79 -84 80 173 142 -56 195 -62
7542 -62 -233 -262 -196 89 129 -182 104 319 -170 87 -71 -154 -93 -33 -145 -27 19 166 345 23 -27 5 139
7565 139 -106 128 118 -328 358 -150 -227 -22 214 219 293 -47 -222 -69 262 -201 -206 -206 128 290 44 40 93 20
7589 20 -80 -60 -306 286 -169 -406 138 285 -76 229 147 -17 -70 -56 271 232 2 58 221 -127 -114 184 184
7612 184 -348 -133 -226 54 142 -135 -162 49 35 183 186 -29 -113 -259 -115 -219 -267 -141 104 45 98 16 191 181
$$ packed form
7451b56L79k67L98k56J9R0k7k19J16m2o9R8k08K10k4J83j52J55j39L0Q7m78M71
7474I9p8r2k5J03J64k18K01j87j33N9j89J12N00m87J99J45J94k05J16k60K42l22
7496f2k44J04K84l56K27M59j57j9l84K02m8j06L0M0K02q3RJ61k31J47j43J83l35
7519a20j82j64L59J31J2k29L13k2Q3j57j31j3j67J33J40o5nJ64R3l1j98K51k57
7542f2j71k9O6K85M0l11K86K15m89K57j58q3O1O0j12J18M6J47J79l22n0L2J34
7565A39k45K34j0m46O86n08p7K05K36NP4l40j75J53L31m63n%L34J62k46mN3p3
7589B0j00K0k46N92m55k37N44J47l61L05q2j64n3J4L27l9k30N6J63l48J3K98%
7612A84n32K15r3K80Q8k77k7K11j4J48Lk15q4j46J44j04m8J26K45n9N3q2J75j0
$$ plain form
7636 181 182 -103 -179 -84 88 -149 134 149 301 379 122 49 -161 -79 -276 -243 -181 -200 110 268 166 130 287 -195
7660 -195 -36 97 -95 -231 -260 26 105 -15 32 271 196 8 -185 70 -404 -234 -251 17 6 -89 18 165
7682 165 -69 24 -94 -279 -243 3 -183 -89 210 -117 -94 -48 -49 -4 -39 -319 -241 -129 -183 -105 301 12 40 130 155
7707 155 67 -160 -22 38 75 303 -32 25 45 162 -125 -65 163 -217 -229 -296 -118 50 160 158 353 306 241 93
7731 93 324 -11 -37 -180 -105 49 -199 68 49 119 212 181 86 4 -161 -361 31 -329 -182 38 213 211 129 99
7755 99 -456 147 -51 -346 -187 -79 162 152 101 307 73 -86 -132 -87 107 -129 -239 -3 96 232 197 234 77
7778 77 -193 178 40 -204 -313 -98 -92 -23 -41 -49 374 -7 -235 -33 -147 17 162 81 30 27 81 -29 14 168
7802 168 233 139 24 -186 -197 -105 -30 177 65 114 11 -101 -60 -89 46 -128 -231 -188 235 -83 103 146 196 184
$$ packed form
7636A81Jk85p6R5J72k37K83J5J52P8k57p3k10Q2j97L3O2j9L10J58j02l6J57m82
7660a95J59J33j92j36k9K86P9j20M7K39p5j88j93K55m74J70j7K68j1r5J07J47
7682A65k34R3j18j85L6K46j86R4K99l27K3M6jM5l5k80P8J12n4P8M06k89K8R0K5
7707A55q8k27J38O0L7K28l35N7K0J17k87O0K28l80j2o7J78J68J10kJ95m7o5j48
7731I3K31l35k6j43P5J54k48K67j9P0R3l1r5q2j65k00L92l60J47K20J75kq2l0
7755I9n55O03j98k95J59J08K41j0n1K06k34j59m6M5J94k36j10K36R9J36l5L7j57
7778G7k70L71j38k44j09K15OO9j8qM23l81k28K02j14J64J45q1n1lN4j10M3J54
7802A68O5r4j15k10j1R2P5K07j12M9j03j12M1k9J35j74j03M3M23l18J86M3N0j2
$$ plain form
7826 184 -118 -156 -200 68 -5 -51 -35 18 110 -89 179 -114 192 -110 -1 47 19 133 90 117 -99 -77 37 17
7850 17 -125 -159 -179 -104 -129 325 53 -126 352 337 323 -82 -163 -26 47 -86 -158 306 19 12 152 162 78 122 211
7875 211 -75 -56 -125 65 -89 -112 -56 137 202 46 -106 -41 -120 200 85 121 -3 -133 224 230 245 63 -3 -15
7899 -15 -27 -109 -350 37 188 69 -14 18 9 56 195 -226 -155 0 19 -281 -106 -51 25 206 150 14 -43 254 -180
7924 -180 -248 6 -115 3 -75 -7 -376 162 -44 -330 178 -109 -370 -95 239 -37 317 24 -172 226 119
7945 119 -39 75 -133 -10 312 283 -58 159 158 359 101 -83 -49 -208 -78 24 -49 -28 210 192 100 1 -12
7968 -12 18 112 -36 -110 22 267 142 -65 -50 159 101 -51 49 75 70 -113 115 -131 174 112 57 262 344 -113
7992 -113 -238 -21 -117 26 -250 -334 72 126 -42 235 102 -152 -7 -146 -223 127 -214 -124 -118 47 -55 -110 -161
$$ packed form
7826A84l02l8m4K68p3m6J6N3R2j99K68k93L06l02J09M8k8J14m3K7k16K2J14k0
7850A7j42l4k0P5k5M54k72j79M78j5j4m05q1J37P3j33p2M64k87pJ40J0q4M4Q9
7875B11k86J9o9J90j54k3N6J93O5j56j52O5p9L20j15L6j24j30L57OJ5j82o6j2
7899a5j2q2k41L87J51j19q3L2rM7J39m21P1J55J9l00J75N5P6J81n6j36n7K97m34
7924a80o8K54j21J18p8O8l69N38k06k86N08k87k61K75L34k76L54k93j96L98j07
7945A19j58J14k08J23L22k9l41K17jK01k58j84L4j59J30J02p3K1K38j8r2r9j3
7968a2L0R4j48p4J32K45j25k07J5K09n8j52J00K6nj83K28k46L05o2n5K05Q2m57
7992a13j25K17r6J43k76q4M06N4j68K77j33k54J45j39p7L50l41R0OJ65j02n5n1
$$ plain form
8015 -161 -115 -40 -115 -334 8 -144 -42 61 -120 -133 18 214 47 -391 -170 -151 -44 -3 27 125 106 -61 111
8038 111 -27 7 145 -33 -144 48 30 14 -140 244 250 121 118 -48 -175 -235 -33 -66 179 100 100 -226 348 -49
8062 -49 123 53 -24 34 273 -132 -27 -172 88 56 36 1 341 34 -170 -229 89 -82 -77 -363 176 13 141
8085 141 229 -50 102 -146 62 -81 -79 -239 11 -12 146 -90 293 -50 6 18 -177 -107 -125 96 -82 229 92
8108 92 252 60 -46 239 19 -143 -40 194 -98 33 87 -43 148 13 69 -98 -248 -50 -147 -96 159 146
8130 146 349 -176 6 374 133 -140 -209 -236 16 -82 -9 -38 233 -56 276 101 -186 38 -186 145 -20 -188
8152 -188 -148 77 169 152 111 108 129 -238 -53 19 110 197 -127 -234 100 56 37 -51 82 -48 -43 79 -431 -32 58
8177 58 73 -156 143 209 -81 -130 -19 -193 -15 -31 138 6 87 325
$$ packed form
8015a61M6P5p5k19L42j52J02J03j81j3J51J96j67m38K21J9J07M1L0R8j9j67J72
8038A11j38L4J38j78j11J92j8j6j54L84Oj29lj66j27o0K02l3K45p9%l26N74l97
8062d9J72p0p7N8K39m05J05j45K60l2k0l5L40l07k04n9L18j71Nk86N39j63J28
8085A41Q8k79J52k48K08j43Kj60K50k3J58k36L83l43N6J2j95P0j8K21j78L11j37
8108I2J60j92j06K85k20j62J03K34k92J31N4j30J91j35N6j67j50J98r7N1K55j3
8130A46K03n25J82L68k41k73o9k7K52r8P3k9K71k89L32j75k87K24k24L31j65j68
8152a88M0K25R2j7m1lK1l67J85P2R1Q7l24j07L34m4j9q8J33j30NJ22n10L99R0
8177E8J5k29K99O6k90m9J11j74J78j6J69j32Q1K38
8191C25
$$ Imaginary data points
##PAGE= N=2
##DATA TABLE= (X++(I..I)), XYDATA
$$ plain form
0 0 0 0 0 0 0 0 0 0 0 0 0 0 0 -8 8 -8 8 -16 16 -16 24 -24 32 -40 41 -49 57 -67 80 -89 104 -118 134 -150 169
35 169 -191 215 -240 270 -301 335 -371 410 -456 504 -557 613 -678 746 -823 906 -998 1101
53 1101 -1216 1344 -1487 1649 -1839 2058 -2316 2627 -3009 3492 -4121 4985 -6249 8274 -12072
68 -12072 21697 -104396 -138478 17984 -30729 -64992 -28010 41778 32926 18710 10881 11502 -15203
81 -15203 -14927 22239 53454 30562 29767 57079 54643 26553 24735 -6970 -62815 -57847 -9527 -20992
95 -20992 -55817 -29918 27704 35472 7002 986 20430 8341 -25719 -13250 23609 6151 -15194
108 -15194 29663 66961 36665 13036 28640 22210 -10896 -18114 -5908 -11061 -24555 -11310 22425
121 22425 29829 7834 8847 24439 3140 -20921 -7287 -9836 -43368 -35828 6840 7094 -19418
$$ packed form
0@%%%%%%%%%%%%%qJ6j6J6k4L2l2M0m8N6p2Q1r0J06j24J47j69J93k22K52k84L19
35A69l60M06m55N10n71O36p06P81q66R60j061J170j291J424j569J729j904K099
53A101k317K560k831L136l488L897m374M943n636O501p613R106j1234J4523k0346
68a2072L3769j26093l4082J56462m8713l4263L6982O9788q852j4216p829O21k6705
81a5203K76L7166L1215k2892p95K7312k436k8090j818l1705n5845M968M8320j1465
95b0992l4825K5899N7622P768k8470o016J9444j2089l4060J2469L6859j7458k1345
108a5194M4857L7298l0296k3629J5604o430l3106p218J2206n153j3494J3245L3735
121B2425P404k1995J013J5592k1299k4061J3634k549l3532P540M2668K54k6512
$$ plain form
134 -19418 -10382 13474 3511 -25624 -29420 -14238 -24545 -46604 -21223 23873 15151 -7808 21523
147 21523 53226 31819 3272 1748 -1599 -7930 -2326 -1300 -8878 -5440 12804 23740 8198
160 8198 -15159 -14538 -10997 -32777 -39146 -10415 -5441 -27463 -2795 50216 45819 3334 3154 31662
174 31662 26808 -7366 -18388 4823 16140 4818 12420 34771 23745 -2072 1192 6266 -16599
187 -16599 -33197 -28137 -24563 -17202 1369 9080 1810 3620 16830 16624 -6072 -23482 -12384 57
201 57 -11884 -11684 16480 23996 3757 8582 28248 11193 -22637 -23265 -6949 -10079 -22611 -14550
215 -14550 6747 12096 4884 10194 16756 -67 -15641 -6851 -4015 -17806 -13623 4845 7049 6392
229 6392 19344 22046 4090 -7089 -75 1046 -16337 -26368 -7546 11317 3568 325 19716
$$ packed form
134a9418R036K3856r963k9135l796J5182j0307k2059K5381M5096q722k2959K9331
147B1523L1703k1407k8547j524l347o331N604J026p578L438J8244J0936j5542
160H198k3357O21L541k1780o369K8731M974k2022K4668N3011m397m2485j80K8508
174C1662m854l4174j1022K3211J1317j1322P602K2351j1026k5817L264N074k2865
187a6599j6598N060L574P361J8571P711p270J810J3210k06k2696j7410J1098J2441
201E7j1941K00K8164P516k0239M825J9666j7055l3830o28J6316l130j2532Q061
215a4550K1297N349p212N310O562j6823j5574Q790K836j3791M183J8468K204o57
229F392J2952K702j7956j1179P014J121j7383j0031J8822J8863p749l243J9391
$$ plain form
242 19716 22970 265 -3447 8717 -1533 -22076 -17253 1714 7119 3565 5581 13213 14021 7322
256 7322 2201 -4619 -18016 -19466 -5884 -3860 -10642 697 16807 11330 4451 12866 9894 -13064
270 -13064 -21404 -5377 2895 -9592 -13661 8013 25061 13308 972 8899 7011 -12015 -17085
283 -17085 -5906 -6793 -14972 -5904 10943 15038 10317 6941 4286 -477 -4478 -7366 -13290 -16717 -5365
298 -5365 10677 10012 3832 12901 19487 3999 -8725 -3289 -2987 -18540 -20192 80 11462 2958
312 2958 -407 13412 17955 1280 -10663 -6788 -7405 -15224 -11468 1553 4273 3601 11983 17291 10342
327 10342 1894 -1474 -6026 -12767 -11158 -3594 -2634 -3991 6571 19099 12578 -1480 -1888 1919 -8343
342 -8343 -17876 -11210 -3544 -4381 -915 12717 17767 8639 1820 4985 2845 -7720 -12782 -9015 -5593
$$ packed form
242A9716L254k2705l712J2164j0250k0543M823J8967N405l554K016P632Q08o699
256G322n121o820j3397j450J3582K024o782J1339J6110n477o879Q415k972k2958
270a3064q340J6027Q272j2487m069K1674J7048j1753j2336P927j888j9026n070
283a7085J1179q87q179R068J6847M095m721l376k655m763m001k888n924l427J1352
298e365J6042o65o180R069O586j5488j2724N436L02j5553j652K0272J1382q504
312B958l365J3819M543j6675j1943L875o17p819L756J3021K720o72Q382N308o949
327A0342q448l368m552o741J609P564R60j357J0562J2528o521j4058m08L807j0262
342h343r533O666P666q37L466J3632N050r128o819L165k140j0565n062L767L422
$$ plain form
357 -5593 -2350 6008 10943 6438 4060 7693 3981 -8292 -13946 -9783 -8960 -9897 -933 10767 9196
372 9196 3952 10353 15843 3784 -11033 -10097 -3406 -6223 -9723 -1185 7703 5940 4249 9350 8712
387 8712 -3806 -11631 -7781 -6097 -8360 -5593 1486 6678 11000 15301 13060 4275 323 558 -3664
402 -3664 -11443 -10575 -1024 1261 -1052 5729 13091 5039 -6249 -3797 -1318 -10994 -18741 -11012 465
417 465 1903 1661 8296 14712 10251 3277 2998 -411 -9030 -10119 -3712 -1420 -471 5363 9136 6596
433 6596 4497 3440 -3496 -12739 -14754 -9581 -6513 -8075 -3328 8234 12345 6890 6563 7878 -1033
448 -1033 -9036 -5696 -2535 -4966 -3215 5132 11625 12125 10107 8125 4104 -3741 -7331 -5421 -7604
463 -7604 -10815 -2522 8518 8072 5510 9166 7731 -1375 -5655 -5363 -8578 -12357 -8620 946 7230
$$ packed form
357e593L243Q358M935m505k378L633l712j2273n654M163Q23r37Q964J1700j571
372I196n244O401N490j2059j4817R36O691k817l500Q538Q888j763j691N101o38
387H712j2518p825L850J684k263K767P079N192M322M301k241q785l952K35m222
402c664p779Q68R551K285k313O781P362q052j1288K452K479r676p747P729J1477
417D65J438k42O635O416m461o974k79l409q619j089O407K292R49N834L773k540
433F596k099j057o936r243k015N173L068j562M747J1562M111n455l27J315q911
448a033q003L340L161k431J751Q347O493N00k018j982m021p845l590J910k183
463g604l211Q293J1040m46k562L656j435r106m280K92l215l779L737R566O284
$$ plain form
478 7230 5064 4370 9156 7311 -2437 -5868 -4436 -9519 -11757 -2713 4135 3428 4633 9174 9472 4934
494 4934 -1592 -6054 -7828 -9677 -9255 -4300 -1358 -434 5289 9324 3299 -1781 -198 -4675 -12488 -10138
510 -10138 -3497 -3039 -2470 4385 12017 12749 6003 2519 5646 2814 -6792 -7023 110 801 688 7473
526 7473 9834 6656 6051 4662 -1594 -6966 -8595 -9481 -7919 -5540 -791 5405 6673 3833 6555 7685
542 7685 -1163 -7781 -4263 -3564 -5700 -1107 5117 6429 7226 8646 7342 3324 -3247 -8312 -7895 -8483
558 -8483 -10609 -5197 1893 813 1624 8239 6143 -3330 -6453 -5296 -7328 -9157 -6991 -2225 3917
573 3917 6963 7962 9728 6917 -773 -2541 -1995 -7555 -9897 -3018 1345 1889 7175 10996 6943 2903
589 2903 1530 -621 -4309 -8171 -8906 -1793 3710 3220 5671 9475 6312 2888 2311 -3754 -9920 -7602
$$ packed form
478G230k166o94M786j845r748l431J432n083k238R044O848p07J205M541K98m538
494D934o526m462j774j849M22M955K942R24N723M035o025n080J583m477p813K350
510a0138O641M58N69O855P632P32o746l484L127k832r606k31P133O91j13O785
526G473K361l178o05j389o256n372j629q86J562K379M749O196J268k840K722J130
542G685q848o618L518O99k136M593O224J312P97J420j304m018o571n065M17n88
558h483k126N412P090j080Q11O615k096r473l123J157k032j829K166M766O142
573C917L046R99J766k811p690j768N46n560k342O879M363N44N286L821m053m040
589B903j373k151l688l862p35P113N503m90K451L804l163l424n77o065o166K318
$$ plain form
605 -7602 -3911 -4755 -1738 4578 7823 7577 5559 3076 2251 -2536 -8233 -5554 -770 -3259 -2697 6103
621 6103 9256 4794 3344 2136 -2358 -5546 -7193 -9339 -8343 -4991 -1385 3850 5142 2856 4391
636 4391 5203 -1869 -6532 -3440 -3723 -6996 -2129 4222 5494 6889 7419 5195 3232 50 -4628 -5679
652 -5679 -6303 -7062 -2681 3109 2016 3683 9044 5970 -996 -1174 -1105 -6636 -8001 -4147 -129 2978
668 2978 4085 5581 9041 8105 1104 -2784 -3580 -6966 -7644 -2447 -1273 -1770 4601 9444 5828 3159
684 3159 828 -2806 -5192 -6500 -6771 -3800 -677 369 5393 9740 5939 1429 1628 -1918 -7204 -6626
700 -6626 -5715 -5968 -1386 4498 5376 5052 5349 3985 1176 -3112 -8268 -6605 -2581 -3569 -1950 5156 7116
717 7116 4657 5710 5068 -1123 -4711 -5397 -5796 -4736 -2395 -366 3489 6290 5371 5391 4518 -1905 -5885
$$ packed form
605g602L691q44L017O316L245k46k018k483q25m787n697K679M784k489N62Q800
621F103L153m462j450j208m494l188j647k146R96L352L606N235J292k286J535
636D391Q12p072m663L092k83l273M867O351J272J395N30k224j963l182m678j051
652e679o24p59M381N790j093J667N361l074o966j78O9n531j365L854M018L107
668B978J107J496L460r36p001l888p96l386o78N197J174m97O371M843l616k669
684C159k331l634k386j308k71K971L123J046N024M347l801m510J99l546n286N78
700f626R11k53M582N884Q78l24K97j364k809m288n156J663M024r88J619P106J960
717G116k459J053o42o191l588o86l99J060K341K029L855K801r19K0q73o423l980
$$ plain form
734 -5885 -3769 -4418 -6628 -3094 2168 3623 5152 6459 4549 1908 -781 -4257 -5341 -4794 -5310 -2583
750 -2583 2569 3261 4476 7010 4386 -426 -1245 -1900 -6259 -7140 -3721 -1529 780 4046 5316 6260
766 6260 4711 816 -812 -1874 -6159 -7802 -3170 -312 561 3951 6304 4606 3247 2470 -1200 -4981
782 -4981 -6452 -6414 -3257 -361 416 3660 7237 5453 2857 2309 -951 -5761 -5764 -3893 -3615 -1265 2710
799 2710 4437 6037 6008 3076 227 -2727 -5677 -5800 -4779 -4805 -1892 4027 5403 3686 4894 4907 271
816 271 -3322 -4213 -5318 -4576 -2818 413 3845 5505 4735 4439 3848 -340 -4760 -4677 -5617 -6145 -2391 1310
834 1310 2304 3549 5870 5115 2831 -784 -3604 -4341 -3929 -4178 -1791 1843 3178 4350 6083 4504
850 4504 488 -1529 -3387 -6229 -6078 -3527 -2353 -263 2777 5211 5494 3763 836 -490 -1727 -4208
$$ packed form
734e885K116o49k210L534N262J455J529J307j910k641k689l476j084N47n16K727
750b583N152O92J215K534k624m812q19o55m359q81L419K192K309L266J270R44
766F260j549l895j628j062m285j643M632K858Q73L390K353j698j359p77l670l781
782d981j471L8L157K896P77L244L577j784k596n48l260m810lJ871K78K350L975
799B710J727J600k9k932k849k954k950j23J021k6K913N919J376j717J208J3m636
816B71l593q91j105P42J758L231L432J660p70k96n91m188m420Q3r40n28L754L701
834A310R94J245K321p55k284l615k820p37M12k49K387L634J335J172J733j579
850D504m016k017j858k842J51K551J174K090L040K434K83j731k927j326j237k481
$$ plain form
866 -4208 -5093 -2604 -430 679 3970 6179 4751 2781 1276 -1243 -3748 -5567 -5969 -4178 -1975 2
882 2 3072 5130 4011 2277 2076 -124 -3628 -4612 -3312 -2380 -646 2279 4445 5412 5077 3594 1438
899 1438 -1340 -4634 -5631 -4477 -4142 -2333 1320 3385 3733 3940 3429 -60 -2481 -3646 -4233 -4439 -2927
916 -2927 -381 2499 4319 4437 4672 3081 -58 -2929 -3677 -4795 -5449 -3209 407 2710 3747 5080
932 5080 4827 3177 250 -1697 -3176 -4236 -4455 -2273 896 2588 3648 4483 3739 1587 -1033 -3222
948 -3222 -5322 -5759 -4209 -1781 342 2270 4668 5336 4826 2711 504 -1795 -3800 -3725 -2105 -713
964 -713 730 2887 4956 4814 2792 534 -1436 -4095 -5928 -5748 -4165 -2808 -733 2332 4311 4072
980 4072 2650 1267 -602 -2885 -3868 -3025 -1980 -626 1840 4590 5495 4105 3257 1671 -1089 -3384
$$ packed form
866d208q85K489K174J109L291K209j428j970j505k519k505j819m02J791K203J977
882BL070K058j119j734k01k200l504r84J300R32J734K925K166R67l35j483k156
899A438k778l294r97J154L35J809L653K065L48K07n11l489k421j165n87k06J512
916b927K546K880J820J18K35j591l139k871p48j118o54K240L616K303J037J333
932E080k53j650k927j947j479j060k19K182L169J692J060Q35p44k152k620k189
948c222k100m37J550K428K123J928K398O68n10k115k207k299k005P5J620J392
964g13J443K157K069j42k022k258j970k659j833J80J583J357K075L065J979k39
980D072j422j383j869k283r83Q43J045J354K466K750R05j390q48j586k760k295
$$ plain form
996 -3384 -4514 -4459 -3989 -1575 438 2774 3406 3124 2201 770 -1863 -3865 -3869 -3663 -2952 -183 2468 3462
1014 3462 4230 4871 3541 301 -1306 -2684 -3577 -3316 -2570 -197 2033 3029 4089 4443 2378 -730 -1715
1031 -1715 -2821 -4704 -4622 -2628 -670 1354 3209 4151 3616 1526 -661 -2048 -2611 -4701 -4726 -1974 845
1048 845 2029 3825 4774 3549 2448 947 -1951 -3526 -3929 -3585 -1955 148 2145 3609 4101 2892
1064 2892 1164 259 -2724 -5184 -4503 -3011 -2754 -513 2522 3790 3678 3585 1744 -28 -2112 -3699
1080 -3699 -3716 -2058 -1042 1012 3971 4336 3352 3561 2209 -1425 -3244 -3541 -4313 -3514 -1491 527 2696
1097 2696 3826 3449 2479 1412 -1326 -3251 -3104 -3079 -3380 -266 2175 2586 4101 4720 2349 302 -872
1114 -872 -2481 -3817 -3456 -3146 -712 2127 2699 2557 3659 2700 -384 -1844 -2731 -4837 -4155 -1280 -503
$$ packed form
996c384j130N5M70K414K013K336O32k82r23j431k633k002mK06P11K769K651R94
1014C462P68O41j330l240j607j378q93K61P46K373K230R96J060L54k065l108r85
1031a715j106j883Q2J994J958K024J855R42n35k090k187j387n63k090k5K752K819
1048H45J184J796R49j225j101j501k898j575m03L44J630K103J997J464M92j209
1064B892j728r05k983k460O81J492K57K241L035J268j12r3j841j772k084j587
1080c699j7J658J016K054K959L65r84K09j352l634j819k97p72P99K023K018K169
1097B696J130l77r70j067k738j925J47K5l01L114K441M11J515O19k371k047j174
1114h72j609j336L61L10K434K839N72j42J102r59l084j460q87k106O82K875P77
$$ plain form
1131 -503 845 3290 3770 3589 2639 262 -1659 -2387 -3875 -3879 -890 -6 304 2781 4789 2802 772
1148 772 -152 -1976 -3136 -3424 -3845 -2390 214 2244 3070 4089 3053 1675 929 -1406 -3624 -2857 -1813
1165 -1813 -2228 -393 3139 3262 3180 3436 1654 -514 -1814 -3986 -4165 -2513 -2310 -735 2513 3599 2847
1182 2847 3199 2161 -1375 -2684 -2057 -3669 -3516 -1036 976 2773 3880 2956 2694 2285 -545 -3094
1198 -3094 -3036 -3230 -3372 -1258 1257 1218 3299 4287 1964 348 -515 -2567 -4000 -3164 -2392 -988 1415
1215 1415 2401 3114 4286 2538 -430 -1196 -1780 -3911 -3556 -1431 -570 1360 3395 3349 2695 2616 1195 -974
1233 -974 -2590 -3928 -3567 -1042 5 -300 2633 3914 2038 1543 1190 -1913 -3630 -2859 -3080 -1537 192
1250 192 1530 2132 3715 3464 1570 744 -1532 -3357 -2567 -1890 -2615 -357 2597 2575 2283 3067 1902 -530
$$ packed form
1131e03J348K445M80j81r50k377j921p28j488mK989Q84L10K477K008j987k030
1148G72r24j824j160k88m21J455K604K030Q26J019j036j378p46k335k218P67J044
1165a813m15J835L532J23q2K56j782k168j300k172j79J652K03J575L248J086p52
1182B847L52j038l536j309O27j612J53K480K012J797J107r24k62m09k830k549
1198c094N8j94j42K114K515l9K081R88k323j616q63k052j433Q36P72J404K403
1215A415R86P13J172j748k968p66n84k131L55K125Q61J930K035m6o54p9j421k169
1233i74j616j338L61K525J047l05K933J281j876m95l53l103j717P71k21J543J729
1250A92J338O02J583k51j894q26k276j825P90O77p25K258K954k2k92P84j165k432
$$ plain form
1268 -530 -1430 -3270 -3553 -2497 -1985 -433 1900 2764 2053 3289 2284 -709 -1820 -1573 -3515 -3105 -394
1285 -394 844 1352 2930 3157 2797 2022 -637 -2380 -2144 -2946 -3746 -1153 1200 1612 2869 3898 2187
1302 2187 549 201 -1936 -3660 -2972 -2149 -1149 818 2085 3004 3680 2609 232 -408 -1696 -4049
1318 -4049 -3464 -1223 -872 316 2983 3268 2532 2396 779 -1069 -2169 -3191 -3154 -1522 -591 790 3065
1335 3065 3905 2382 1593 1357 -1224 -3099 -2609 -2728 -2465 -150 1208 1922 3099 2314 1096 409 -1103
1352 -1103 -2960 -2803 -1898 -2110 69 2549 2540 2675 3639 2211 -335 -1151 -2173 -2923 -2448 -1680 -141 2067
1370 2067 2341 1961 2637 1910 -942 -2039 -2256 -3254 -3174 -835 371 1061 2861 3172 2636 1527 -52 -1407
1388 -1407 -1924 -2549 -2824 -647 931 714 2457 3640 2232 814 10 -1560 -3044 -3205 -2239 -1752 -119
$$ packed form
1268e30r00j840k83J056N12J552K333Q64p11J236j005k993j111K47j942M10K711
1285c94J238N08J578K27l60p75k659j743K36q02q00K593K353M12J257J029j711
1302B187j638l48k137j724O88Q23J000J967J267R19O76j071k377o40j288k353
1318d049N85K241L51J188K667K85p36j36j617j848j100j022L7J632R31J381K275
1335C065Q40j523p89k36k581j875M90j19K63K315J358P14J177p85j218o87j512
1352a103j857J57R05k12K179K480rJ35R64j428k546q16j022p50M75P68J539K208
1370B067K74l80O76p27k852j097k17r98Q0K339J206O90J800L11n36j109j579j355
1388a407n17o25k75K177J578k17J743J183j408j418q04j570j484j61R66M87J633
$$ plain form
1405 -119 1630 2348 2788 2080 718 -250 -1681 -3686 -2758 -1459 -1233 -37 2464 3223 2456 2224 1387 -519
1423 -519 -2182 -2458 -2421 -1557 -873 288 2387 3061 2125 2068 1058 -1220 -2452 -2325 -2450 -2762 -1134 794
1441 794 1870 2495 2470 1698 811 -926 -2326 -2006 -2309 -1918 36 2217 2448 2440 3140 2144 120 -969 -1780
1460 -1780 -2761 -2901 -1956 -431 1184 1993 2421 2161 1442 -642 -1408 -2016 -3244 -2850 -1043 329 863 2490
1478 2490 3338 2336 1332 26 -857 -1977 -2817 -2296 -707 270 1068 2393 2881 1864 814 -167 -1457
1495 -1457 -2824 -3023 -1998 -1165 -16 1438 2428 2464 2055 1204 35 -1399 -2724 -2310 -1387 -1228 227
1512 227 2101 2594 2089 2058 1311 -322 -2156 -2588 -2284 -1943 -1371 509 2044 2455 2238 2116 1011 -625
1530 -625 -2037 -2290 -2116 -2289 -737 1092 2082 2458 2605 2054 670 -1060 -1810 -2402 -2449 -2141 -160 1129
$$ packed form
1405a19J749P18M40p08j362r68j431k005R28J299K26J196K501P59p67k32q37j906
1423e19j663k76L7Q64O84J161K099O74r36n7j010k278j232J27j25l12J628J928
1441G94J076O25k5p72q87j737j400L20l03L91J954K181K31qP00r96k024j089q11
1460a780r81j40R45J525J615Q09M28k60p19k084p66o08j228L94J807J372N34J627
1478B490Q48j002j004j306q83j120q40N21J589R77P98J325M88j017j050r81j290
1495a457j367j99J025Q33J149J454R90L6m09q51j169j434j325M14R23J59J455
1512B27J874M93n05l1p47j633j834m32L04L41N72J880J535M11k17j22j105j636
1530f25j412k53J74j73J552J829R90L76J47n51j384j730p50n92m7L08J981J289
$$ plain form
1548 1129 1675 1888 2619 1804 -80 -1178 -1438 -2217 -2666 -2003 -107 813 1536 2596 2794 1504 15 -818
1566 -818 -1897 -2633 -2604 -1326 -182 776 2108 2755 2365 901 -5 -825 -2466 -3080 -2083 -860 -670 723
1584 723 2467 2723 1878 1210 371 -653 -2103 -2635 -1774 -877 -248 1165 2735 2938 1919 1385 174 -1429
1602 -1429 -2161 -2053 -2137 -1582 149 1568 1865 1902 1660 1002 -432 -1856 -2246 -2251 -2279 -1635 749 2137 1916
1621 1916 2171 2307 1146 -487 -1376 -1958 -2241 -1887 -938 794 1860 1904 2190 1906 464 -993 -1286 -2136
1639 -2136 -2868 -1910 -427 648 1333 2270 1885 1640 153 -773 -1671 -2437 -2541 -1423 283 426 1322 2685
1657 2685 2791 1200 399 -354 -1582 -2106 -2016 -1270 -327 790 1577 1974 2482 1268 33 -768 -2100 -2588
1675 -2588 -1696 -1433 -834 1144 2346 2177 1628 1577 636 -939 -2324 -2248 -1594 -698 -585 847 2729 2279
$$ packed form
1548A129N46K13P31q15j884j098k60p79m49O63J896R20P23J060J98j290j489q33
1566h18j079p36K9J278J144R58J332O47l90j464r06q20j641o14R97J223J90J393
1584G23J744K56q45o68q39j024j450n32Q61Q97O29J413J570K03j019n34j211j603
1602a429p32J08q4N55J731J419K97L7k42o58j434j424l90nk8O44K384J388k21
1621A916K55J36j161j633q89n82k83L54R49J732J066M4K86k84j442j457k93q50
1639b136p32R58J483J075O85R37l85k45j487r26q98p66j04J118J706J43Q96J363
1657B685J06j591q01p53j228n24R0P46R43J117P87L97N08j214j235q01j332m88
1675b588Q92K63N99J978J202j69n49n1r41j575j385P6O54Q96J13J432J882m50
$$ plain form
1693 2279 1159 1435 445 -1791 -2106 -2391 -2119 -1502 210 808 1756 2471 1764 1010 -196 -1432 -1489 -1702
1711 -1702 -2147 -927 1127 1803 1619 2221 2422 328 -730 -1200 -2018 -2283 -1628 -866 652 1653 1475 2172
1729 2172 2691 730 -1007 -1038 -1480 -2358 -1634 -432 387 1438 2138 1701 1319 643 -672 -1708 -2032 -2209
1747 -2209 -1731 -6 216 1448 2786 2142 553 841 570 -1794 -2657 -1989 -1410 -97 719 1100 2345
1764 2345 2335 985 -28 -246 -1670 -2699 -1851 -1400 -847 833 1952 1554 2066 1842 199 -1323 -1508
1781 -1508 -1852 -1854 -1174 -421 1128 2212 2053 960 1765 559 -1639 -1864 -1818 -2333 -1220 223 1093 1727
1799 1727 2389 1541 1284 543 -882 -1900 -1742 -1671 -1145 310 872 1552 2387 1761 118 -32 -683 -2106
1817 -2106 -2787 -1229 -766 252 1096 1570 2265 2248 778 -388 -525 -1362 -2891 -1720 -228 237 937 1722
$$ packed form
1693B279j120K76r90k236l15k85K72O17J712N98R48P15p07p54j206j236n7k13
1711a702m45J220K054O76j84O02K01k094j058m70q18k65O55P62J518J001j78O97
1729B172N19j961j737l1m42q78P24J202Q19J051P00m37l82o76j315j036l24j77
1747b209M78J725K22J232J338o44j589K88k71k364q63O68N79J313Q16L81J245
1764B345j0j350j013k18j424j029Q48M51N53J680J119l98N12k24j643j522j85
1781a508l44kO80P53J549J084j59j093Q05j206k198k25M6n15J113J443Q70O34
1799A727O62q48k57p41j425j018J58P1N26J455N62O80Q35o26j643j50o51j423
1817b106o81J558M63J018Q44M74O95j7j470j166j37q37j529J171J492M65P00P85
$$ plain form
1835 1722 1832 1466 889 -917 -1608 -1629 -1805 -1754 -484 413 1300 2193 2020 1074 1068 17 -1937 -1752 -1228 -1501
1855 -1501 -1018 544 1294 2202 1695 712 444 118 -1497 -2593 -1551 -947 -799 344 1998 1770 1929 1709
1873 1709 200 -441 -997 -1955 -2237 -1104 39 762 1726 1912 1605 1529 -7 -1577 -927 -1317 -2340 -1337
1891 -1337 332 732 1243 2004 1900 1184 402 -1034 -1730 -1475 -2010 -1763 -145 1152 1181 1705 1711 735 -59
1910 -59 -810 -2053 -2078 -1187 -962 -668 1068 2098 1989 1739 650 -6 -182 -1834 -2435 -926 -225 -385 722
1929 722 2338 2330 1394 941 -431 -831 -1375 -2251 -1694 -280 308 864 2018 1992 1280 971 -32 -1329 -1592
1948 -1592 -1408 -2022 -975 885 1392 1273 1484 1450 651 -595 -1587 -1985 -1215 -1324 -1328 705 1605 1555 1394 1412
1968 1412 427 -890 -1339 -1830 -1814 -1352 -650 181 1606 2184 1480 1237 489 -801 -1131 -1673 -2227 -871 412
$$ packed form
1835A722J10l66n77j806o91k1j76N1J270Q97Q87Q93j73r46oj051j954J85N24k73
1855a501M83J562P50R08n07r83k68l26j615j096J042O04J48J143J654k28J59k20
1873A709j509o41n56r58k82J133J143P23R64J86l07p6j536j570O50l90j023J003
1891a337J669M00N11P61j04p16p82j436o96K55n35K47J618J297K9N24Or76p94
1910e9p51j243k5Q91K25K94J736J030j09k50j089o56j76j652o01J509P01j60J107
1929G22J616qr36m53j372m00n44q76N57J414N88N56J154k6p12l09j003j297k63
1948a592J84o14J047J860N07j19K11l4p99j246r92l98P70j09mK033R00n0j61J8
1968A412r85j317m49m91J6M62P02Q31J425N78p04k43p48j290l30n42n54J356J283
$$ plain form
1987 412 346 936 2330 1682 1017 -13 -612 -1190 -1701 -2087 -1163 121 810 792 1805 2181 1009 -116 -582
2006 -582 -1561 -1696 -1211 -871 108 1427 1633 1600 1583 1146 38 -957 -1782 -1999 -1149 -1007 -408 987 2158
2025 2158 1527 970 1086 326 -953 -1690 -1662 -1093 -670 -85 683 1877 2000 1074 737 -101 -1372 -1806 -1951
2044 -1951 -1635 -851 384 1051 1308 1742 1516 384 -378 -1372 -1547 -1548 -1580 -566 1018 1363 1084 1783 1849 556
2064 556 -542 -1020 -1402 -1680 -1180 -252 555 1511 1710 1515 1528 526 -458 -1434 -1503 -1365 -1032 -311 453 1346
2084 1346 1967 1381 874 248 -218 -1157 -2023 -1751 -865 -166 388 1328 1922 1752 719 327 28 -840 -1982
2103 -1982 -1486 -571 76 338 1253 1845 1319 745 -220 -1109 -1515 -1613 -1692 -1169 -333 732 1156 1112 1323 1131
2123 1131 67 -1166 -1329 -1122 -1060 -752 21 1172 1833 1528 1151 1066 199 -1164 -1508 -1518 -1307 -870 41
$$ packed form
1987D12o6N90J394o48o65j030n99n78n11l86R24J284O89j8J013L76j172j125m66
2006e82r79j35M85L40R79J319K06l3j7m37j108r95q25k17Q50J42N99J395J171
2025B158o31n57J16p60j279p37K8N69M23N85P68J194J23r26l37q38j271m34j45
2044a951L16P84J235O67K57M34k26j132p62r94j75jl2J014J584L45k79O99O6j293
2064E56j098m78l82k78N00R28Q07R56J99j95J3j002r84r76o9J38L33P21P64Q93
2084A346O21n86n07o26m66r39q66K72Q86O99N54R40N94j70j033l92k99q68j142
2103a982M96R15O47K62R15N92n26n74r65q89m06r8p9N23Q36J065M24m4K11j92
2123A131j064j233j63K07O2L08P73J151O61l05l77q5q67j363l44j0K11M37R11
$$ plain form
2142 41 854 1452 1525 1019 495 -337 -1079 -1582 -1707 -1430 -102 478 686 1489 2003 1505 569 -306 -665 -1300
2162 -1300 -1537 -1179 -23 510 627 1105 1853 1117 447 -459 -1361 -1755 -1746 -1015 -492 229 893 1236 1456 1118
2182 1118 147 -532 -1303 -1543 -1238 -1037 -592 375 1389 1789 1366 997 835 -413 -1344 -1478 -1312 -812 -339
2201 -339 453 1506 1947 1068 640 220 -715 -1198 -1597 -1525 -1006 3 677 996 1544 1535 909 -36 -599 -1131
2221 -1131 -1328 -1383 -871 196 1005 1167 1348 1505 1013 -311 -969 -1299 -1546 -1103 -654 -89 928 1138 1297
2240 1297 1256 1107 -240 -1057 -1216 -1366 -1366 -658 332 964 1586 1469 942 550 191 -963 -1442 -1529 -1333 -460
2260 -460 18 640 1417 1989 894 267 128 -814 -1443 -1380 -803 -429 246 933 1371 1538 1066 99 -492 -872
2280 -872 -1655 -1807 -879 -691 196 1108 1370 1297 1293 636 -691 -923 -1164 -1474 -982 -141 583 1211 1401 1166 895
$$ packed form
2142D1Q13N98P3n06n24q32p42n03j25K77J328N80K08Q03N14m98r36q75l59o35
2162a300k37L58J156N33J17M78P48p36o70r06r02l94RP31N23P21O64L43K20l38
2182A118r71o79p71k40L05K01M45R67J014M00m23l69j62j248r31j34J66N00M73
2201c39P92J053M41q79m28m20r35m83l99P2N19J009O74L19N48ro26r45n63n32
2221a131j97n5N12J067Q09J62J81J57m92j324o58l30k47M43M49N65J017K10J59
2240A297m1j49j347q17j59j50%P08R90O32O22j17n27l92l59j154m79q7J96Q73
2260d60M78O22P77N72j095o27j39r42o29O3N77L74O75O87M38J67m72r67n91l80
2280h72p83j52R28J88Q87R12K62p3mo57j327k32k41l10M92Q41P24O28J90k35k71
$$ plain form
2301 895 784 -814 -1550 -1328 -1168 -963 -467 653 1109 1348 1268 519 115 -403 -1352 -1684 -1273 -1108 -238 922
2321 922 1047 1256 1492 951 -193 -360 -985 -1677 -1142 -572 76 667 1272 1075 1440 967 -172 -585 -988
2340 -988 -1616 -1420 -738 161 586 1500 1520 900 855 178 -921 -1079 -1319 -1528 -716 495 627 1102 1760 1230
2360 1230 569 328 -884 -1517 -1273 -1113 -830 51 972 1009 1450 1285 599 -488 -956 -1490 -1675 -817 -317
2379 -317 135 1119 1571 1278 1046 542 -282 -908 -1132 -1694 -825 -60 338 930 1505 1127 954 498 -579 -1202
2399 -1202 -787 -1387 -1133 -162 678 734 1619 1619 915 268 -337 -1307 -1398 -997 -964 -308 653 986 1143 1397 729
2420 729 -341 -370 -694 -1655 -1054 -790 -349 468 1527 1445 1181 1127 -34 -636 -900 -1577 -1114 -263 -172 159
2440 159 953 1792 875 575 249 -546 -1131 -1202 -1353 -606 209 482 1108 1739 1090 344 -62 -576 -1472 -1381 -880
$$ packed form
2301H95j11j598p36K22J60K05M96J120M56K39q0p49m04n18r49l32M11J65Q70J160
2321I22J25K09K36n41j144j67o25o92N35N70O48N91O05j97L65m73j139m13m03
2340i88o28J96O82Q99M25R14K0o20m5o77j099j58k40k09Q12J211J32M75O58n30
2360A230o61k41j212o33K44J60K83Q81R21L7M41j65o86j087m68n34j85Q58N00
2379c17M52R84M52k93k32n04q24o26k24n62Q69P65L98N92N75l78j73m56j077o23
2399a202M15o00K54R71Q40N6Q85%p04o47o05r70r1M01L3O56R61L33J57K54o68
2420G29j070k9l24r61O01K64M41Q17J059q2k64n4j161o02k64o77M63Q51R1L31
2440A59P94Q39r17l00l26p95n85p1j51P47Q15K73O26O31o49p46m06n14q96R1N01
$$ plain form
2461 -880 -1043 110 842 890 979 1233 831 -185 -969 -1314 -1509 -674 -444 47 1380 1156 1073 936 426 -307
2481 -307 -737 -1195 -1418 -1139 -312 -128 819 1402 1082 644 135 -400 -1045 -999 -1126 -1093 155 727 961 1385
2501 1385 1584 1001 195 32 -932 -1412 -911 -870 -356 550 731 777 1189 892 227 -478 -787 -1341 -1326 -534 -11
2522 -11 457 1105 1217 849 942 254 -454 -886 -1369 -1350 -692 -132 321 890 1378 817 682 103 -718 -1304 -1269
2543 -1269 -1072 -880 -9 820 882 1433 905 441 206 -784 -1336 -1211 -898 -598 -184 644 920 905 1438 671
2563 671 -130 -472 -1137 -1313 -592 -425 -49 925 1452 1374 998 708 -462 -906 -1191 -1252 -988 -253 20 595
2583 595 1324 1130 1244 543 -215 -698 -1200 -1131 -1052 -270 361 600 998 1315 659 158 -35 -1089 -1615 -1054
2603 -1054 -1161 -581 328 727 844 907 857 240 -95 -595 -1570 -1230 -660 -111 510 1261 1354 1209 991 36 -393
$$ packed form
2461h80j63J153P32M8Q9K54m02j016p84l45j95Q35K30M91J333k24q3j37n10p33
2481c07m30m58k23K79Q27J84R47N83l20m38n09n35o45M6j27L3J248N72K34M24
2501A385J99n83q06j63r64m80N01M1N14R06J81M6M12k97o65p05l09n54J5P92N23
2522a1M68O48J12l68R3o88p08m32m83J9O58N60M53N69M88n61j35n79q21n86L5
2543a269J97J92Q71Q29O2N51n28m64k35r90n52J25L13L00M14Q28K76j5N33p67
2563F71q01l42o65j76P21J67L76R74N27p8l76k90j170m44k85o1K64P35K73N75
2583E95P29j94J14p01p58m83n02O9P9P82O31K39L98L17o56n01j93j054n26N61
2603a054j07N80R09L99J17O3n0o17l35n00r75L40N70N49O21P51R3j45k18r55m29
$$ [...]
8191G8
##END NTUPLES=NMR FID
##END=
