##TITLE=1H_Ser 2066-NEA
 CDCl3
 8 sc, 
 8.2.2024
##JCAMPDX= 6.0         $$ Bruker NMR JCAMP-DX V2.0
##DATA TYPE= NMR FID
##DATA CLASS= NTUPLES
##ORIGIN= UXNMR, Bruker Analytische Messtechnik GmbH
##OWNER= root
$$ XWIN-NMR		Version 3.5
$$ Thu Feb  8 15:58:44 2024 Russian Standard Time (UT+4h)  she@DPX200
##.OBSERVE FREQUENCY= 200.1313
##.OBSERVE NUCLEUS= ^1H
##.DELAY= (6, 6)
##.ACQUISITION MODE= SIMULTANEOUS
##.ACQUISITION SCHEME= undefined
##.AVERAGES= 8
##.DIGITISER RES= 18
##SPECTROMETER/DATA SYSTEM= spect
##.PULSE SEQUENCE= zg30
##.SOLVENT NAME= CDCl3
##.SHIFT REFERENCE= (INTERNAL, CDCl3, 0, 15.7039)
##AUDIT TRAIL= $$ (NUMBER, WHEN, WHO, WHERE, WHAT)
$$ ##TITLE= Audit trail, XWIN-NMR		Version 3.5
$$ ##JCAMPDX= 5.01
$$ ##ORIGIN= Bruker BioSpin GmbH
$$ ##OWNER= she
$$ F:/spectra/data/she/nmr/H-F/1/audita.txt
$$ ##AUDIT TRAIL=  $$ (NUMBER, WHEN, WHO, WHERE, WHAT)
(   1,<2024-02-08 15:57:28.03 +0400>,<she>,<DPX200>,
      <created by zg, POWCHK disabled, PULCHK disabled
       configuration hash MD5:
       00 E9 B6 7A A2 85 ED C7 34 08 36 98 17 FE 4E 26
       data hash MD5: 16K
       67 A4 44 BA AA EB 26 69 E7 39 C6 BA 01 85 2E 67>)
$$ ##END=
$$ 
$$ hash MD5
$$ 75 11 6C E5 B4 7E 30 18 77 A3 59 AB 3C DA 75 2B
##$RELAX= 
##$RELAX= 
##$RELAX= 
##$RELAX= 
##$RELAX= 
##$RELAX= 
$$ Bruker specific parameters
$$ --------------------------
##$DU= <F:/spectra>
##$EXPNO= 1
##$NAME= <H-F>
##$PROCNO= 1
##$TYPE= <nmr>
##$USER= <she>
##$AMP= (0..31)
100 100 100 100 100 100 100 100 100 100 100 100 100 100 100 100 100 100 
100 100 100 100 100 100 100 100 100 100 100 100 100 100 
##$AQSEQ= 0
##$AQ_mod= 1
##$AUNM= <au_zg>
##$AUTOPOS= <>
##$BF1= 200.13
##$BF2= 200.13
##$BF3= 200.13
##$BF4= 200.13
##$BF5= 200.13
##$BF6= 200.13
##$BF7= 200.13
##$BF8= 200.13
##$BYTORDA= 1
##$CFDGTYP= 0
##$CFRGTYP= 5
##$CHEMSTR= <none>
##$CNST= (0..31)
1 1 145 1 1 1 1 1 1 1 1 1 1 1 1 1 1 1 1 1 1 1 1 1 1 1 1 1 1 1 1 1 
##$CPDPRG= <>
##$CPDPRG1= <>
##$CPDPRG2= <>
##$CPDPRG3= <>
##$CPDPRG4= <mlev>
##$CPDPRG5= <mlev>
##$CPDPRG6= <mlev>
##$CPDPRG7= <mlev>
##$CPDPRG8= <mlev>
##$CPDPRGB= <>
##$CPDPRGT= <>
##$D= (0..31)
0 1.2 0 0 0 0 0 0 0 0.06 0 0.03 0 0 0 0 0.0002 0 0 0 0 0 0 0 0 0 0 0 0 
0 0 0 
##$DATE= 1707393447
##$DBL= (0..7)
120 120 120 120 120 120 120 120 
##$DBP= (0..7)
150 150 150 150 150 150 150 150 
##$DBP07= 0
##$DBPNAM0= <>
##$DBPNAM1= <>
##$DBPNAM2= <>
##$DBPNAM3= <>
##$DBPNAM4= <>
##$DBPNAM5= <>
##$DBPNAM6= <>
##$DBPNAM7= <>
##$DBPOAL= (0..7)
0.5 0.5 0.5 0.5 0.5 0.5 0.5 0.5 
##$DBPOFFS= (0..7)
0 0 0 0 0 0 0 0 
##$DE= 6
##$DECBNUC= <off>
##$DECIM= 32
##$DECNUC= <off>
##$DECSTAT= 4
##$DIGMOD= 1
##$DIGTYP= 9
##$DL= (0..7)
0 120 120 120 120 120 120 120 
##$DP= (0..7)
150 150 150 150 150 150 150 150 
##$DP07= 0
##$DPNAME0= <>
##$DPNAME1= <>
##$DPNAME2= <>
##$DPNAME3= <>
##$DPNAME4= <>
##$DPNAME5= <>
##$DPNAME6= <>
##$DPNAME7= <>
##$DPOAL= (0..7)
0.5 0.5 0.5 0.5 0.5 0.5 0.5 0.5 
##$DPOFFS= (0..7)
0 0 0 0 0 0 0 0 
##$DQDMODE= 0
##$DR= 18
##$DS= 0
##$DSLIST= <SSSSSSSSSSSSSSS>
$$ [...]
##$SUBNAM2= <"">
##$SUBNAM3= <"">
##$SUBNAM4= <"">
##$SUBNAM5= <"">
##$SUBNAM6= <"">
##$SUBNAM7= <"">
##$SUBNAM8= <"">
##$SUBNAM9= <"">
##$SW= 18.0517328524113
##$SWIBOX= (0..15)
0 0 2 0 0 0 0 0 0 0 0 0 0 0 0 0 
##$SW_h= 3612.71676300578
##$TD= 16384
##$TD0= 1
##$TE= 0
##$TE2= 300
##$TE3= 300
##$TEG= 300
##$TL= (0..7)
0 120 120 120 120 120 120 120 
##$TP= (0..7)
150 150 150 150 150 150 150 150 
##$TP07= 0
##$TPNAME0= <>
##$TPNAME1= <>
##$TPNAME2= <>
##$TPNAME3= <>
##$TPNAME4= <>
##$TPNAME5= <>
##$TPNAME6= <>
##$TPNAME7= <>
##$TPOAL= (0..7)
0.5 0.5 0.5 0.5 0.5 0.5 0.5 0.5 
##$TPOFFS= (0..7)
0 0 0 0 0 0 0 0 
##$TUNHIN= 0
##$TUNHOUT= 0
##$TUNXOUT= 0
##$USERA1= <user>
##$USERA2= <user>
##$USERA3= <user>
##$USERA4= <user>
##$USERA5= <user>
##$V9= 5
##$VALIST= <valist>
##$VCLIST= <CCCCCCCCCCCCCCC>
##$VD= 0
##$VDLIST= <DDDDDDDDDDDDDDD>
##$VPLIST= <PPPPPPPPPPPPPPP>
##$VTLIST= <TTTTTTTTTTTTTTT>
##$WBST= 1024
##$WBSW= 4
##$XGAIN= (0..3)
0 0 0 0 
##$XL= 0
##$YL= 0
##$YMAX_a= 124279
##$YMIN_a= -167269
##$ZGOPTNS= <>
##$ZL1= 120
##$ZL2= 120
##$ZL3= 120
##$ZL4= 120
##$ABSF1= 10
##$ABSF2= 0
##$ABSG= 5
##$ABSL= 3
##$ALPHA= 0
##$AQORDER= 0
##$ASSFAC= 0
##$ASSFACI= 0
##$ASSFACX= 0
##$ASSWID= 0
##$AUNMP= <proc_1d>
##$AZFE= 0.1
##$AZFW= 0.1
##$BCFW= 1
##$BC_mod= 2
##$BYTORDP= 1
##$COROFFS= 0
##$CY= 11.3945322036743
##$DATMOD= 1
##$DC= 2
##$DFILT= <>
##$DTYPP= 0
##$F1P= 15.7292609196834
##$F2P= 12.9074282941183
##$FCOR= 0.5
##$FTSIZE= 0
##$FT_mod= 4
##$GAMMA= 1
##$GB= 0.15
##$INTBC= 1
##$INTSCL= 1
##$ISEN= 128
##$LB= 0.24
##$LEV0= 0
##$LPBIN= 0
##$MAXI= 10000
##$MC2= 0
##$MEAN= 0
##$ME_mod= 0
##$MI= 1.114404
##$NCOEF= 0
##$NC_proc= 0
##$NLEV= 6
##$NOISF1= 3.799351
##$NOISF2= 2.8
##$NSP= 1
##$NTH_PI= 0
##$NZP= 0
##$OFFSET= 15.70392
##$PC= 1
##$PHC0= -24582.51
##$PHC1= 8.652672
##$PH_mod= 1
##$PKNL= yes
##$PPARMOD= 0
##$PSCAL= 0
##$PSIGN= 0
##$REVERSE= no
##$SF= 200.130013532006
##$SI= 16384
##$SIGF1= 3
##$SIGF2= 2
##$SINO= 400
##$SIOLD= 16384
##$SREGLST= <1H.CDCl3>
##$SSB= 0
##$STSI= 0
##$STSR= 0
##$SW_p= 3612.71676300578
##$SYMM= 0
##$S_DEV= 0
##$TDeff= 0
##$TDoff= 0
##$TI= <>
##$TILT= no
##$TM1= 0
##$TM2= 0
##$TOPLEV= 0
##$USERP1= <user>
##$USERP2= <user>
##$USERP3= <user>
##$USERP4= <user>
##$USERP5= <user>
##$WDW= 1
##$XDIM= 8192
##$YMAX_p= 0
##$YMIN_p= 0
$$ End of Bruker specific parameters
$$ ---------------------------------
##NTUPLES= NMR FID
##VAR_NAME=  TIME,          FID/REAL,        FID/IMAG
##SYMBOL=    X,             R,               I
##VAR_TYPE=  INDEPENDENT,   DEPENDENT,       DEPENDENT
##VAR_FORM=  AFFN,          ASDF,            ASDF
##VAR_DIM=   8192,          8192,            8192
##UNITS=     SECONDS,       ARBITRARY UNITS, ARBITRARY UNITS
##FACTOR=    0.0002768,     1,               1
##FIRST=     0,             0,               0
##LAST=      2.2672688,     0,               0
##MIN=       0,             -167269,         0
##MAX=       2.2672688,     124279,          0
$$ Real data points
##PAGE= N=1
##DATA TABLE= (X++(R..R)), XYDATA
$$ plain form
0 0 0 0 0 0 0 0 0 0 0 0 0 0 0 0 0 0 0 0 0 0 1 -3 8 -8 8 -8 8 -8 11 -16 16 -17 19 -23 25 -27 32 -35 40 -43 49 -53 59
43 59 -67 75 -81 89 -98 108 -117 131 -143 158 -174 193 -214 240 -269 301 -341 390 -453 531 -640
64 -640 793 -1030 1430 -2250 4561 -24896 -81632 2915 80551 67784 43536 82672 124279 73340
78 73340 -4802 16173 53714 5695 -70453 -91098 -61697 -52042 -74781 -44142 10083 -14651
90 -14651 -63122 -40147 28263 66560 49406 44031 69945 53750 13142 14318 16693 -16529 -52406
103 -52406 -45175 6115 27820 1199 -8261 -9012 -32158 -42402 -20089 13875 14837 -19055 -12032
116 -12032 29812 24493 -6314 -9620 -902 -6697 -15194 18518 70575 49073 -15940 -30589 -11828
129 -11828 -9792 -19633 -6817 28325 21147 -24362 -21272 15728 9536 -30897 -45761 -14113 8466
$$ packed form
0@%%%%%%%%%%%%%%%%%%%%JmJ1j6J6j6J6j6J9k7L2l3L6m2M8n2N9o7P5q3R2j02J12
43E9j26J42j56J70j87K06k25K48k74L01l32L67m07M54n09N70o42P31q43R84j171
64f40J433j823K460l680O811k9457n6736Q4547P7636j2767k4248L9136M1607n0939
78G3340p8142K0975L7541m8019p6148k0645K9401R655k2739L0639N4225k4734
90a4651m8471K2975O8410L8297j7154n375K5914j6195m0608J176K375l3222l5877
103e2406P231N1290K1705k6621r460p51k3146j0244K2313L3964R62l3892P023
116a2032M1844n319l0807l306Q718n795q497L3712N2057k1502o5013j4649J8761
129a1828K036r841J2816L5142p178m5509L090L7000o192m0433j4864L1648K2579
$$ plain form
142 8466 -9671 -1464 42171 39262 -6839 -21407 11666 38726 17755 -443 21928 20523 -21523
155 -21523 -40971 -23606 -9969 -27372 -43971 -11756 23584 13467 2254 16359 24777 9828
167 9828 -7079 8512 30666 10864 -11106 61 9358 -1489 -15176 -15457 -8419 -19625 -25921
180 -25921 -899 13981 740 -9844 -5817 4774 5649 4526 22630 30419 7510 -1702 13016
193 13016 18750 2622 -18728 -17843 -12935 -30419 -30748 997 15785 -594 -14346 -1797 17305
206 17305 7589 -4691 15007 26415 5986 -9291 2183 18769 4926 -21519 -11502 9919
218 9919 -1061 -15135 -2811 13858 3304 -23249 -19324 4896 -692 -15771 -2429 20034 20465
231 20465 2548 -995 15204 10190 -11688 -6501 10727 8509 -8471 -14523 -522 2702 -12990
$$ packed form
142H466j8137Q207M3635k909m6101j4568L3073K7060k0971j8198K2371j405m2046
155b1523j9448J7365J3637j7403j6599L2215L5340j0117j1213J4105Q418j4949
167I828j6907J5591K2154j9802k1970J1167R297j0847j3687k81P038j1206o296
180b5921K5022J4880j3241j0584M027J0591Q75j123J8104P789k2909r212J4718
193A3016N734j6128k1350Q85M908j7484l29L1745J4788j6379j3752J2549J9102
206A7305r716j2280J9698J1408k0429j5277J1474J6586j3843k6445J0017K1421
218I919j0980j4074J2324J6669j0554k6553L925K4220n588j5079J3342K2463M31
231B0465j7917l543J6199n014k1878N187J7228k218j6980o052J4001L224j5692
$$ plain form
244 -12990 -10042 6509 4697 -5313 -3536 9082 11591 -4518 -10474 -59 -2631 -7970 2148
257 2148 14618 14708 1887 -3750 5128 1954 -9622 -3345 5029 -2055 -12606 -10331 4091 4510 -8771
272 -8771 -2966 11413 4937 -4976 984 14838 11445 -9554 -10894 5711 932 -13252 -5786 11571
286 11571 12589 -5711 -10827 8150 8292 -11758 -11368 5776 8315 -7747 -14302 6077 15933 -1743
300 -1743 -6687 9410 13147 -1295 -10445 2343 12330 -4299 -16684 -4336 2240 -6060 -9994 1378
314 1378 13800 4828 -7170 2177 9700 755 -4251 550 5656 -607 -9572 -1178 8162 1075 -3258
329 -3258 2684 3359 -3051 -8074 -1395 5234 -4102 -9342 -333 1970 -3448 -2302 7328 13840 4021
344 4021 -4009 5659 8363 -3651 -6825 1053 3986 -6794 -14562 -1648 8294 -2293 -6736 3666
$$ packed form
244a2990K948J6551j812j0010J777J2618K509j6109n956J0415k572n339J0118
257B148J2470R0j2821n637Q878l174j1576O277Q374p084j0551K275J4422M19j3281
272h771N805J4379o476r913N960J3854l393k0999j340J6605m779j4184P466J7357
286A1571J018j8300n116J8977J42k0050L90J7144K539j6062o555K0379R856j7676
300a743m944J6097L737j4442r150J2788R987j6629j2385J2348O576q300l934J1372
314A378J2422q972j1998R347P523q945n006M801N106o263q965Q394R340p087m333
329c258N942O75o410n023O679O629r336n240R009K303n418J146R630O512r819
344D021q030R668K704j2014l174P878K933j0780p768J2914R942j0587m443J0402
$$ plain form
358 3666 8098 -1437 -10205 96 12043 699 -9960 12 8218 1533 -5795 2087 14931 5763
372 5763 -9700 -2941 6740 -586 -10383 -7103 2989 -698 -13550 -6560 8423 6088 -2011 -37
386 -37 7465 6468 -4185 -2966 8943 6022 -4855 -3731 2331 3218 -2534 -2534 6250 3412 -7137 -5938
402 -5938 -822 -2594 -6101 -5441 269 303 -5908 175 9241 6666 2985 5186 7996 3926 -4044 -1177
418 -1177 6174 -933 -9574 -5638 69 -2660 -8202 -3182 8024 2925 -8605 -2972 6205 3380 -4159
433 -4159 -1806 8774 6509 -5658 -2047 10195 7605 -2773 -4604 3076 3042 -10147 -11608 1878
447 1878 2643 -7741 -8057 2526 8042 815 -2334 9562 11723 -324 -4617 2007 5147 -1639 -7822
462 -7822 -1560 2585 -6494 -9018 -316 4806 1951 -2294 544 4597 -1763 -5057 2797 5585 1263
$$ packed form
358C666M432r535q768J0301J1947j1344j0659R972Q206o685p328P882J2844r168
372E763j5463O759R681p326r797L280J0092l687j2852O990J4983k335q099J974
386c7P502r97j0653J219J1909k921j0877J124O062Q87n752%Q784k838j0549J199
402e938N116j772l507O60N710L4o211O083R066k575l681K201K810m070p970K867
418a177P351p107q641L936N707k729n542N020J1206n099j1530N633R177k825p539
433d159K353J0580k265j2167L611J2242k590j0378j831P680l4j3189j461J3486
447A878P65j0384l16J0583N516p227l149J1896K161j2047m293O624L140o786o183
462g822O262M145r079k524Q702N122k855m245K838M053o360l294P854K788m322
$$ plain form
477 1263 -1337 1590 5391 1718 -1564 3650 2722 -5632 -6561 -2326 -113 -2533 -5260 -217 1482 -5398
493 -5398 -3899 6031 8014 3099 -5 4381 5774 -4155 -7238 2255 3881 -3463 -4688 3047 7961
508 7961 -602 -6664 2081 5747 -3932 -8141 -1433 4357 -1430 -9252 -1628 6387 -2073 -8379 110
523 110 9556 8154 -358 2213 8750 713 -8093 -2077 6543 4520 -3535 -3781 2943 1510 -6721 -3832
539 -3832 1222 -2963 -9172 -7699 1205 4851 -558 40 4626 2289 656 4414 9916 9357 2066 -794
555 -794 1940 -2104 -6491 -4156 -3052 -4946 -7843 -4826 2852 1532 -3393 75 3211 -309 -2309
570 -2309 1274 6826 4556 -2231 1894 8523 2779 -3702 -2166 2775 1349 -5236 -2422 4820 -811
585 -811 -9854 -6671 1768 2743 -3023 -3123 5588 5741 -1586 502 6701 3713 -6510 -9694 -341 5725
$$ packed form
477A263k600K927L801l673l282N214r28q354r29M235K213k420k727N043J699o880
493e398J499R930J983m915l104M386J393r929l083R493J626p344j225P735M914
508G961q563o062Q745L666r679m209O708N790n787p822P624Q015q460o306Q489
523A10R446j402q512K571O537q037q806O016Q620k023q055k46O724j433q231K889
539c832N054m185o209J473Q904L646n409N98M586k337j633L758N502n59p291k860
555g94K734m044m387K335J104j894k897L017P678j320m925L468L136l520k000
570b309L583N552k270o787M125O629n744o481J536M941j426o585K814P242n631
585h11r043L183Q439R75n766j00Q711J53p327K088O199k988j0223l184R353O066
$$ plain form
601 5725 128 -539 5248 3321 -3761 -5111 2359 7537 197 -4644 138 2229 -2140 -3633 -1548
616 -1548 -21 -4912 -7228 1681 7568 4211 658 548 -361 -2402 -3475 1691 4858 898 541 4120
632 4120 3433 54 -2571 -2282 -1346 -4262 -2780 3451 1916 -4161 -4999 -1906 841 -1333 -442 5858
648 5858 6170 -75 1065 6046 4129 -4023 -8901 -3173 1980 -1171 200 5813 3827 -4252 -7931
663 -7931 -984 5565 829 -3991 608 3196 -737 -2552 1334 5286 -1244 -7935 -1161 7035 4775
678 4775 621 -70 1104 -2917 -8024 -2832 4516 2337 -1819 52 3662 3604 -1220 -2017 1085 -1722
694 -1722 -4767 -768 3215 2524 -978 -2212 943 443 -2004 797 2959 847 -160 887 2789 541
710 541 -4867 -3853 -993 -1740 61 4121 4600 1069 -3300 -1821 2658 -165 -2955 -428 1292 -552
$$ packed form
601E725n597o67N787j927p082j350P470N178p340m841M782K091m369j493K085
616a548J527m891k316Q909N887l357l553j10r09k041j073N166L167l960l57L579
632D120o87l379k625K89R36k916J482O231j535o077q38L093K747k174Q91O300
648E858L12o245J140M981j917q152m878N728N153l151J371N613j986q079l679
663g931O947O549m736m820M599K588l933j815L886L952o530o691O774Q196k260
678D775m154o91J174m021n107N192P348k179m156J871L610n8m824p97L102k807
694a722l045L999L983o91l502j234L155n00k447K801K162k112j007J047J902k248
710E41n408J014K860p47J801M060M79l531m369J479M479k823k790K527J720j844
$$ plain form
726 -552 -1720 2210 6266 992 -6043 -3069 2111 1812 23 1192 3473 -442 -7436 -4303 3165 2056
742 2056 -2082 -626 4174 4940 -739 -1474 3116 456 -6186 -5175 1345 4392 466 -1880 1958 2261
758 2261 -3388 -3438 721 2797 -69 -2050 1781 3861 -1458 -3633 -892 370 -72 520 2779 4437
774 4437 67 -2680 -305 -116 -2262 -2807 -1486 -44 -139 644 4197 2809 -2063 -2672 -511 322 118
791 118 637 3387 1717 -3574 -3775 852 1111 -1093 -1129 2147 3043 -1259 -1695 3171 1284 -4344 -4672
808 -4672 -251 2823 209 -893 3964 4054 -1816 -3827 61 2372 -779 -3619 550 4269 -863 -3660
824 -3660 -67 2266 250 -2945 512 4651 1010 -2723 48 1973 -441 -3385 -2642 1391 1281 -1244
840 -1244 1453 3838 962 -2649 -2572 24 313 -1860 -503 2367 58 -1604 203 1291 1392 -451
$$ packed form
726e52j168L930M056n274p035K974N180k99j789J169K281l915o994L133P468j109
742B056m138J456M800P66n679p35M590k660o642J011O520L047l926k346L838L03
758B261n649n0M159K076k866j981L831K080n319k175K741J262m42N92K259J658
774D437m370k747K375J89k146n45J321J442r5P83L553j388m872o09K161Q33k04
791A18N19K750j670n291k01M627K59k204l6L276Q96m302m36M866j887n628l28
808d672M421L074k614j102M857R0n870k011L888K311l151k840M169L719n132k797
824c660L593K333k016l195L457M139l641l733K771J925k414k944P43M033j10k525
840a244K697K385k876l611P7K596K89k173J357K870k309j662J807J088J01j843
$$ plain form
856 -451 -382 1892 -77 -1360 961 826 -1863 -3212 -2389 561 -196 -812 3020 3895 16 -1428 -69
873 -69 2004 -101 -2365 533 3226 -453 -2735 245 2036 379 -3588 -1699 2415 -326 -3467 -314
889 -314 2644 1112 -3012 -2274 3030 2706 -852 1104 4667 2595 -1907 -2813 666 936 -3643 -3111 679
906 679 322 -1848 -1759 1313 2950 -234 -1934 1904 1956 -465 -273 1019 1828 -522 -2297 27 1241
923 1241 -584 -41 1169 774 -860 -2072 -393 281 -1230 -958 969 -73 -817 -95 1509 2001 -604
940 -604 -800 1304 44 -1978 -167 1683 1325 -1193 -1637 1846 1909 -1051 117 2456 1216 -1886 -3306
957 -3306 -237 1171 -2775 -2777 678 1115 -1375 -1623 2157 4489 965 -1414 1960 2823 -516 -1632 419
974 419 2566 -753 -3921 -1176 1181 -715 -2230 -756 1548 276 -2491 -793 2560 1227 -342
$$ packed form
856d51O9K274j969j283K321j35k689j349Q23K950p57o16L832Q75l879j444J359
873f9K073k105k264K898K693l679k282K980J791j657l967J889M114k741l141L153
889c14K958j532m124P38N304l24l558J956L563k072m502r06L479K70m579N32L790
906F79l57k170Q9L072J637l184j700L838N2k421J92J292Q09k350j775K324J214
923A241j825N43J210l95j634j212J679O74j511K72J927j042p44P22J604M92k605
940f04j96K104j260k022J811J850l58k518m44L483O3k960J168K339j240l102j420
957c306L069J408l946kL455M37k490k48L780K332l524k379L374Q63l339j116K051
974D19K147l319l168K745K357j896j515J474K304j272k767J698L353j333j569
$$ plain form
989 -342 623 1757 1766 -15 43 2589 784 -1880 -1451 -1221 -1598 -1969 -1414 295 53 -1518 537 1366 627
1008 627 1357 1693 1754 736 -1154 -239 1194 -1001 -1496 -35 -223 -1277 -1957 -18 2251 -91 -1923
1025 -1923 217 1141 -224 -951 833 3159 841 -2064 186 2351 201 -1555 -544 1364 59
1040 59 -3174 -1785 1496 198 -1761 -927 1619 1585 -982 -767 2834 2161 -1110 -1187 720 965 -1085
1057 -1085 -1515 1539 1816 -1252 -1440 599 1065 253 -1026 474 1029 -1765 -1826 258 305 -106 -383 -264
1075 -264 719 80 -54 1582 1398 -213 -170 41 -25 -107 -185 976 429 -1416 -483 822 -166 -740 -923 373
1095 373 123 -2095 -756 1567 626 -483 -56 1592 1659 -437 -473 2329 1362 -1200 -1080 -36 148 -2115
1113 -2115 -2582 620 1135 -1514 -1449 570 1453 104 -1424 786 2222 -556 -1346 958 1953 862 -714
$$ packed form
989c42R65J134Rj781N8K546j805k664M29K30l77l71N55J709k42j571K055Q29p39
1008F27P30L36O1j018j890R15J433k195m95J461j88j054o80J939K269k342j832
1025a923K140R24j365p27J784K326k318k905K250K165k150j756J011J908j305
1040E9l233J389L281j298j959Q34K546l4k567K15L601o73l271p7J907K45k050
1057a085m30L054K77l068j88K039M66q12j279J500N55k794o1K084M7m11k77J19
1075b64R83o39j34J636j84j611M3K11o6q2p8J161n47j845R33J305r88n74j83J296
1095C73k50k218J339K323r41j109M27J648O7k096l6K802r67k562J20J044J84k263
1113b115m67L202N15k649O5K019Q83j349j528K210J436k778p90K304R95j091j576
$$ plain form
1130 -714 -353 862 -564 -1603 238 1152 167 -1247 -1531 171 -51 -1591 434 1314 391 202 260 1202
1148 1202 1108 -401 -144 90 -867 -800 502 512 -110 -673 -635 200 -583 -641 892 693 -430 -233 460 881
1168 881 -179 -1048 758 1179 -88 -22 729 781 -502 -1592 -153 845 -1242 -1916 -143 1322 455 -647
1186 -647 372 1704 -327 -1401 552 1921 1069 -718 -805 726 56 -1744 -226 1120 388 -1424
1202 -1424 -581 768 1414 -673 -941 649 -231 -835 -179 1437 1988 -124 -1037 410 194 -572 -204 489
1220 489 131 -600 -790 470 64 -759 -488 -199 176 277 617 834 976 -538 -536 544 -238 -438 53 362
1240 362 599 1 506 1098 -360 -1686 -798 115 352 -273 -252 576 171 -1396 -24 1113 513 -716
1258 -716 -587 1509 1806 -368 -451 471 -359 -1497 -1144 812 1697 -374 -953 359 -15 -1097 -1121 -81
$$ packed form
1130g14L61J215j426j039J841R14r85j414k84J702k22j540K025Q80r23j89N8R42
1148A202r4j509K57K34r57O7J302J0o22n63L8Q35p83n8J533j99j123J97O93M21
1168H81j060q69J806M21j267O6P51N2j283j090J439R98k087o74J773J465q67j102
1186f47J019J332k031j074J953J369q52j787q7J531o70j800J518J346p32j812
1202a424Q43J349O46k087k68J590q80o04O56J616N51k112r13J447k16p66L68O93
1220D89l58p31j90J260m06q23K71K89L75J01L40K17J42j514KJ080p82k00M91L09
1240C62K37n98N05N92j458j326Q88R13K37o25K1Q28m05j567J372J137o00j229
1258g16J29K096K97k174q3R22q30j138L53J956Q85k071n79J312l74j082k4J040
$$ plain form
1276 -81 667 -337 -1099 638 1806 417 -479 63 637 301 -310 539 1358 5 -1204 -681 -796 -514
1294 -514 -727 -880 690 287 -356 462 434 -288 -328 -568 244 599 408 676 558 -251 112 210 -279 -434 -796
1315 -796 -227 288 -461 -364 560 -332 -929 -1135 485 1663 705 460 1196 476 -895 -374 -1 400 -386
1334 -386 -1249 156 1069 -97 -943 -393 -140 -546 -1432 -178 1371 412 -163 131 738 581 -509 -83
1352 -83 1113 694 -393 72 698 62 -1206 -1588 -602 -273 -841 -546 581 408 93 -362 261 721 -315
1371 -315 106 658 691 609 558 169 -1 -942 -692 124 -243 -219 -242 -57 -556 -481 -269 -32 67 -555 307 779
1393 779 698 896 773 698 -52 -964 -231 658 -103 -298 -342 245 -137 -1165 -615 768 87 -840 264 497
1413 497 555 -249 -365 563 162 -894 20 1089 927 165 -260 508 183 -1021 -1212 91 220 -315 -412
$$ packed form
1276h1P48j004p62J737J168j389q96N42N74l36o11Q49Q19j353j209N23j15K82
1294e14k13j53J570m03o43Q18k8p22m0k40Q12L55j91K68j18q09L63R8m89j55l62
1315g96N69N15p49R7R24q92n97k06J620J178r58k45P36p20j371N21L73M01p86
1334c86q63J405R13j166q46N50K53m06q86J254J549r59n75K94O07j57j090M26
1352h3J196m19j087M65O26o36j268l82R86L29n68K95J127j73l15m55O23M60j036
1371c15M21N52L3q2n1l89j70r41K50Q16l67K4k3J85m99P5K12K37R9o22Q62M72
1393G79q1J98j23p5p50r12P33Q89p61j95m4N87l82j028N50J383o81r27J104K33
1413D97N8q04j16R28m01j056R14J069j62p62m25P68l25j204j91J303J29n35r7
$$ plain form
1432 -412 -62 382 -315 -872 24 456 -192 -201 -67 247 376 -264 -58 403 40 -106 -235 295 356 142 -138
1453 -138 -250 -370 -482 -246 -250 19 74 -43 265 -49 26 468 241 -44 500 643 386 -73 -18 244 45 -544
1475 -544 -588 -216 380 -235 -119 20 366 -551 -405 598 415 108 -215 501 737 149 -561 568 431 -117
1495 -117 -398 -282 270 121 -532 38 121 -320 -392 42 458 403 187 158 489 -66 -199 -356 284 233 -189 -140
1517 -140 81 -52 -326 29 -43 16 -162 15 59 238 -43 213 156 -132 66 149 434 -85 123 114 -17 -298
1539 -298 -159 -140 -200 161 -279 -2 -57 -199 -330 275 -86 -97 -255 3 448 17 -124 305 339 -184 -156 -12
1561 -12 30 -238 -266 -118 105 -142 -384 71 172 255 -13 44 272 371 -60 -102 476 171 -107 -282 267 -4
1583 -4 -415 50 -31 215 -179 -181 315 250 -84 -45 352 -20 22 -156 69 172 -84 -172 189 77 89 9 47 162
$$ packed form
1432d12L50M44o97n57Q96M32o48rJ34L14J29o40K06M61l63j46j29N30O1k14k80
1453a38j12j20j12K36mK69N5j17L08l14P5M42k27k85N44J43k57m59N5K62j99n89
1475e44m4L72N96o15J16J39L46r17J46J003j83l07l23P16K36n88p10J129j37n48
1495a17k81J16N52j49o53N70Q3m41p2M34M16n5k16k9L31n55j33j57O40n1m22M9
1517a40K21j33k74L55p2N9j78J77M4J79k81K56n7k88J98Q3K85n19K08rj31k81
1539b98J39J9o0L61m40K77n5j42j31O05l61j1j58K58M45m31j41M29L4n23K8J44
1561a2M2k68k8J48K23k47k42M55J01Q3k68N7K28R9m31m2N78l05k78j75N49k71
1583dm11M65q1K46l94kM96o5l34L9L97l72M2j78K25J03k56q8L61j12J2q0L8J15
$$ plain form
1607 162 -184 -406 108 -189 115 413 -19 194 28 -148 171 -306 -305 73 220 -148 -166 221 164 178 -376 56
1629 56 248 280 -257 13 278 12 -98 -284 292 26 -554 -1 23 62 -137 -232 180 353 -347 32 288 247
1651 247 144 -336 117 329 -288 -153 38 -378 67 -370 -79 184 -423 -449 257 340 30 256 -8 97 221
1672 221 -312 -170 208 -180 -99 -307 -147 -85 -250 -37 -30 -300 -70 -116 120 37 249 -149 154 -118 194 199 -57
1695 -57 -2 -5 63 -156 -302 -306 117 -43 -444 -214 -77 32 -170 -113 456 379 -88 -276 274 94 -22 -324 -7
1718 -7 161 -528 -556 135 304 -324 -165 -66 388 -225 -413 10 242 -28 -2 -112 164 24 -332 84 217 -187
1740 -187 -225 -107 39 52 1 114 186 -42 -42 242 50 191 172 59 -140 -157 -138 218 -76 -321 -66 -243 77
1763 77 140 -13 329 146 0 231 42 -31 -39 -73 185 385 -363 -208 166 2 -107 -203 35 337 -329 -339 236
$$ packed form
1607A62l46k22N14k97L04K98m32K13j66j76L19m77JL78J47l68j8L87n7J4n54M32
1629E6J92L2n37K70K65k66j10j86N76k66n80N53K4L9j99r5M12J73p00L79K56m1
1651B47j03m80M53K12o17J35J91m16M45m37K91K63o07k6P06Q3l10K26k64J05J24
1672B21n33J42L78l88Q1k08J60O2j65K13Pk70K30m6K36q3K12l98L03k72L12Nk56
1695e7N5lO8k19j46mM23j60m01K30J37J09k02N7N69p7m67j88N50j80j16l02L17
1718gJ68o89k8O91J69o28J59R9M54o13j88M23K32k70K6j10K76j40l56M16J33m04
1740a87l8J18J46J3n1J13P2k28%K84j92J41j9j13j99j7J9L56k94k45K55j77L20
1763G7O3j53L42j83j46K31j89p3ql4K58K00p48J55L74j64j09r6K38L02o66j0N75
$$ plain form
1786 236 535 129 -16 89 192 178 -292 72 471 9 -287 -220 99 484 -299 258 233 27 -339 -361 -81
1807 -81 244 48 -257 97 -55 -42 -58 21 -8 85 -308 274 462 51 195 490 18 113 -213 -130 20 -83 91
1830 91 69 -6 236 -79 -266 120 -206 -30 97 -182 -43 94 166 -20 115 -152 419 -21 -201 316 380 49
1852 49 -149 -236 -35 119 -272 -44 487 -39 -452 -227 -110 178 -167 -240 462 73 -227 212 247 465 -55
1873 -55 -301 52 227 -271 -117 -354 145 -89 -564 -126 301 -299 -239 203 229 272 15 -35 133 54 -13 46 229
1896 229 310 145 -210 -19 -328 -555 -301 -219 -102 196 299 107 150 62 -98 67 -174 275 258 -43 -40 -93 -9
1919 -9 -151 -221 -282 82 95 -202 176 191 61 106 -324 32 356 65 433 408 410 -49 -412 21 -45 -398 -485 -43
1943 -43 -61 -104 -245 -80 216 -195 -288 88 466 272 120 -25 658 254 -349 11 126 -316 -182 -182 155 130
$$ packed form
1786B36K99m06j45J05J03j4m70L64L99m62k96O7L19L85p83N57k5k06l66k2K80
1807h1L25j96l05L54j52J3j6P9k9R3l93N82J88m11J44K95m72R5l26Q3J50j03J74
1830I1k2p5K42l15j87L86l26J76J27k79J39J37P2j86J35k67N71m40j80N17O4l31
1852D9j98q7K01J54l91K28N31n26m13K25J17K88l45p3P02l89l00M39L5K18n20
1873e5k46L53J75m98J54k37M99k34m75M38M27o00O0M42K6M3k57n0J68p9o7N9J83
1896B29Q1j65l55J91l09k27K54Q2J17K98J03j92M3q8j60J65k41M49j7l01Ln3Q4
1919ij42p0o1L64J3k97L78J5j30M5m30L56L24k91L68k5Km59l63M33o6l53q7M42
1943d3j8m3j41J65K96m11r3L76L78j94j52j45O83m04o03L60J15m42J34%L37k5
$$ plain form
1965 130 -177 -304 -246 -273 -137 -24 -265 422 -59 201 396 63 -12 81 102 62 231 33 132 85 -274 -331 -247
1988 -247 -282 -105 -116 -199 219 -255 85 310 -473 -124 365 80 218 54 270 626 82 -531 -55 -254 -170
2009 -170 99 -52 514 270 -533 -93 142 -289 -86 -115 534 377 9 20 290 203 -47 -254 -125 254 -63
2030 -63 -109 452 187 -528 -393 4 -336 158 -298 206 60 136 -293 -243 223 214 -15 207 354 165 -37 52
2052 52 -82 -47 -10 -122 -129 -104 153 -89 -56 -251 234 -225 -145 -146 238 699 605 -94 254 10 25 -17 -12 -68 -42 -472
2078 -472 -316 124 -341 -348 -279 -293 -105 -138 119 719 283 339 95 211 324 229 25 80 335 -155 -360 -210 -133
2101 -133 -252 -448 -592 188 -170 -158 -24 274 134 142 -146 526 500 317 289 232 178 119 -324 -282 70 -505 -179
2124 -179 -322 -226 195 -56 -321 -112 27 55 73 237 344 46 -82 521 116 -130 96 -173 -29 630 -60
$$ packed form
1965A30l07j27N8k7J36J13k41O87m81K60J95l33p5R3K1m0J69j98R9m7l59n7Q4
1988b47l5J77j1q3M18m74L40K25p83L49M89k85J38j64K16L56n44o13M76j99Q4
2009a70K69j51N66k44q03M40K35m31K03k9O49j57l68J1K70q7k50k07J29L79l17
2030f3m6N61k65p15J35L97l40M94m56N04j46P6m29N0M66rk29K22J47j89k02Q9
2052E2j34L5L7j12pK5K57k42L3j95M85m59Q0jL84M61r4o99L48k44J5m2Nn6K6m30
2078d72J56M40m65pO9j4J88l3K57O00m36N6k44J16J13r5k04N5K55m90k05J50P7
2101a33j19j96j44P80l58J2J34K98j40Qk88O72k6j83k8n7n4n9m43M2L52n75L26
2124a79j43R6M21k51k65K09J39K8J8J64J07k98j28O03m05k46K26k69J44O59o90
$$ plain form
2145 -60 -181 -234 -257 -238 -94 -123 202 266 -14 -2 69 141 134 -166 241 321 73 44 262 311 186 -19 -164 117 -99
2170 -99 -213 -53 -19 -32 -213 -417 -159 34 -195 26 -54 77 62 40 146 598 249 -30 52 81 -151 61 -109
2193 -109 107 -173 -339 -305 -319 -127 71 -175 -17 351 42 23 43 197 355 104 -110 179 -180 -139 -1 -228
2215 -228 -280 107 -717 -79 -26 -50 48 -200 4 108 -3 -131 176 347 62 76 -93 349 58 -255 -21 -231
2237 -231 -127 22 -414 -32 253 -266 -142 88 255 242 -93 218 380 -235 -17 39 233 -47 -66 -55 -230
2258 -230 86 -261 -68 19 -29 4 -300 187 232 -265 -114 304 156 308 259 -93 -70 -4 65 12 51 -159 149
2281 149 -225 -17 14 59 -144 -367 -27 -80 168 -281 306 94 -62 1 -56 233 223 -46 -100 154 -2 -52 -115
2304 -115 -53 172 -337 -244 -190 -151 -166 -173 147 164 131 -233 260 182 8 51 98 68 67 19 -158 175 4 -176 -265 -124
$$ packed form
2145f0j21n3k3J9J44k9L25O4k80J2P1P2pl00M07Q0k48k9K18M9j25k05j45K81k16
2170i9j14J60L4j3j81k04K58J93k29K21q0J31j5k2J06M52l49k79Q2K9k32K12j70
2193a09K16k80j66L4j4J92J98k46J58L68l09j9K0J54J58k51k14K89l59M1J38k27
2215b28n2L87q24O38N3k4R8k48K04J04j11j28L07J71k85J4j69M42k91l13K34k10
2237b31J04J49m36L82K85n19J24K30J67j3l35L11J62o15K18N6J94k80j9J1j75
2258b30L16l47J93Q7m8L3l04M87M5m97J51M18j48J52m9l52K3O6O9n3L9k10L08
2281A49l74K08L1M5k03k23L40n3K48m49N87k12j56O3n7K89j0k69n4K54j56n0o3
2304a15O2K25n09R3N4L9j5pL20J7l3l64M93p8j74M3M7l0jm8j77L33j71j80q9J41
$$ plain form
2330 -124 91 -156 -288 140 226 -75 -7 8 434 62 -62 471 27 -27 -42 110 1 227 -207 -243 -80 -106
2352 -106 -158 -43 -257 66 -17 -288 201 119 79 30 266 403 345 -60 -177 24 35 108 -259 -509 44 7 -337
2375 -337 -161 73 198 -18 -291 147 412 236 15 110 84 112 -45 -98 131 60 47 -56 -274 -249 -232 -145 11
2398 11 37 -210 62 53 153 211 -14 208 381 53 -216 66 -84 -57 -171 -125 -175 -206 -430 -176 -20 57 125 -367
2422 -367 29 243 -120 232 139 56 215 -61 161 190 -75 24 -49 -99 28 -93 -393 17 121 -118 -229 -243
2444 -243 -118 -55 25 -130 310 227 110 249 527 424 100 -110 49 142 251 225 -193 -205 163 -527 -482 162
2466 162 -227 -133 1 -261 277 26 -127 122 209 349 156 71 54 104 -238 31 -16 -542 -134 -107 -27 122 -56
2489 -56 -251 -232 -100 50 23 93 156 323 156 146 74 -26 -111 -44 49 -51 -308 -56 11 -214 -24 -45 -191 -50
$$ packed form
2330a24K15k47j32M28Q6l01O8J5M26l72j24N33m44n4j5J52j09K26m34l6J63k6
2352a06n2J15k14L23q3k71M89q2m0m9K36J37n8m05j17K01J1P3l67k50N53l7l44
2375c37J76K34J25k16k73M38K65j76k21R5k6K8j57n3K29p1j3j03k18K5J7Q7J56
2398A1K6k47K72rJ00N8k25K22J73l28k69K82j50K7j14M6n0l1k24K54J56P7O8m92
2422c67L96K14l63L52r3q3J59k76K22K9k65R9p3n0J27j21l00M10J04k39j11j4
2444b43J25O3Q0j55M40q3j17J39K78j03l24k10J59R3J09k6m18j2L68o90M5O44
2466A62l89R4J34k62N38k51j53K49Q7J40j93q5j7N0l42K69m7n26M08K7Q0J49j78
2489e6j95J9J32J50k7P0O3J67j67j0p2j00q5O7R3j00k57K52O7k25J90k1j46J41
$$ plain form
2513 -50 62 189 259 141 443 164 -63 -245 2 144 41 -48 -110 -34 -201 -69 100 -47 -159 -35 -440 82
2535 82 83 -382 390 364 179 154 157 26 86 -16 289 -8 34 -8 -233 -46 -149 -209 -351 -132 -58 -443 -98 -58
2559 -58 -6 187 56 228 547 401 270 10 87 277 -89 -318 -206 108 -47 -157 -379 -68 -226 -467 -45
2580 -45 145 16 67 -82 236 179 -185 237 336 121 173 97 36 360 45 -211 -302 -300 76 -313 -329 -257 109 -285
2604 -285 -194 241 -79 328 -56 -26 320 352 457 -23 437 29 148 -99 -39 66 75 143 -47 -436 -73 -406
2626 -406 -392 187 -23 192 240 116 200 353 -147 68 43 94 -91 -95 282 15 -246 115 10 -73 -63 -160 -66 275
2650 275 -38 -76 87 242 36 -231 72 21 71 -156 103 95 -8 -86 44 167 -63 -150 -3 351 -34 76
2672 76 -35 -66 202 17 -185 110 55 1 20 -85 162 163 -251 143 -139 -182 125 -13 105 225 -151 -305 -75
$$ packed form
2513e0J12J27P0j18L02k79k27j82K47J42j03q9o2P6j67J32J69j47j12J24m05N22
2535H2Jm65P72k6j85k5Lj31O0j02L05k97M2m2k25J87j03o0j42K19P4l85L45M0
2559e8N2J93j31J72L19j46j31k60P7J90l66k29J12L14j55j10k22L11j58k41M22
2580d5J90j29N1j49L18n7l64M22R9k15N2p6o1L24l15k56r1KL76l89j6P2L66l94
2604b85R1M35l20M07l84L0L46L2J05m80M60m08J19k47O0J05RO8j90l89L63l33
2626d06J4N79k10K15M8j24Q4J53n00K15k5N1j85mL77k67k61L61j05q3J0r7R4L41
2650B75l13l8J63J55k06k67L03n1N0k27K59qj03p8J30J23k30q7J47L54l85J10
2672G6j11l1K68j85k02K95n5n4J9j05K47Jm14L94k82m3L07j38J18J20l76j54K30
$$ plain form
2695 -75 105 92 254 -33 -101 -3 -136 90 -3 187 79 -228 -163 -56 -176 -218 -371 -179 -15 13 62 129 -74
2718 -74 -78 176 -90 55 9 -431 -190 245 151 191 128 52 122 -415 -400 176 -193 108 -30 36 79 254 -95 27
2742 27 136 -97 -203 43 -30 119 -257 -83 -17 -135 -296 140 -2 450 -95 -225 70 -178 95 -40 365
2763 365 76 280 49 209 144 103 113 -37 -296 -20 3 -146 -222 -99 -18 112 -350 75 194 177 66 -188
2785 -188 386 -22 0 -252 116 86 -31 -177 -130 13 -142 -238 168 -203 -236 110 226 -35 80 -159 -368 236
2807 236 -123 -64 161 377 461 60 -118 251 -47 -69 -29 -6 151 -141 -89 -94 48 -152 -272 -146 93 81 -436
2830 -436 -155 192 164 362 180 29 32 339 -97 8 313 145 -52 -216 -45 -216 -231 208 -196 -285 -44 51
2852 51 78 191 30 279 179 74 193 61 -182 221 35 -287 -276 37 -182 44 -73 -102 7 -81 -199 -22
$$ packed form
2695g5J80j3J62k87o8R8j33K26r3J90j08l07O5J07j20m2j53J92J64K8M9O7k03
2718g4mK54k66J45m6m40K41M35r4M0o3p6P0n37J5N76l69L01j38O6M3J75l49J22
2742B7J09k33j06K46p3J49l76J74O6j18j61M36j42M52n45j30K95k48K73j35M05
2763C65k89K04k31J60o5m1J0j50k59K76K3j49p6J23Q1J30m62M25J19j7j11k54
2785a88N74m08K2k52L68l0j17j46M7J43j55r6M06l71l3L46J16k61J15k39k09O04
2807B36l59N9K25K16Q4m01j78L69k98k2M0K3J57k92N2nJ42k00j20J26K39j2n17
2830d36K81L47k8J98j82j51LL07m36J05L05j68j97j64J71j71j5M39m04q9K41R5
2852E1K7J13j61K49j00j05J19j32k43M03j86l22J1L13k19K26j17k9J09q8j18J77
$$ plain form
2874 -22 17 61 51 169 91 11 -105 -223 96 -162 120 -304 3 154 -106 -80 102 -127 -417 -63 -93 -124 156
2897 156 -215 -214 -22 199 -64 -117 -159 59 -205 -95 243 -13 90 -151 -148 57 88 -279 65 -79 82 39 -158
2920 -158 -64 -52 6 178 36 -121 37 -183 -61 139 532 -137 75 -51 -79 -42 -114 -124 -186 179 -106 30 8
2943 8 -143 -303 170 153 111 48 109 13 35 52 -91 46 335 47 -50 -149 -160 -23 -125 24 32 -114 43 -16 -201
2968 -201 437 -253 -16 33 -2 163 -143 79 304 -147 -167 -67 -149 -140 34 39 -28 177 -36 -57 92 -145 172
2991 172 95 -185 -77 263 -172 54 -124 16 15 -62 -200 46 -39 -152 -16 -86 501 50 -7 101 401 -68
3013 -68 84 233 217 71 -219 73 472 -156 22 353 69 11 -20 18 226 237 114 221 172 290 -84 -198
3035 -198 92 -66 -185 -25 -120 -171 -22 -16 -185 40 -151 161 -94 -118 56 -21 2 79 29 64 262 40 -46 162
$$ packed form
2874b2L9M4j0J18p8q0j16j18L19k58K82m24L07J51k60K6J82k29k90L54l0l1K80
2897A56l71JJ92K21k63n3m2K18k64J10L38k56J03k41LK05L1l67L44j44J61m3j97
2920a58R4J2N8J72j42j57J58k20J22K00L93o69K12j26k8L7p2j0o2L65k85J36k2
2943Hj51j60M73j7m2o3O1r6K2J7j43J37K89k88r7r9j1J37j02J49Qj46J57n9j85
2968b01O38o90K37M9l5J65l06K22K25m51k0J00q2RJ74No7K05k13k1J49k37L17
2991A72p7k80J08L40m35K26j78J40jp7j38K46q5j13J36p0N87m51n7J08L00m69
3013f8J52J49j6j46k90K92L99o28J78L31k84n8l1L8K08J1j23J07m9J18l74j14
3035a98K90j58j19J60r5n1J49Oj69K25j91L12k55k4J74p7K3P7n0L5J98k22q6K08
$$ plain form
3059 162 -159 187 89 205 183 116 -16 51 109 -130 54 41 -57 110 138 38 124 3 73 1 -53 -8 -454 -320
3083 -320 -4 -132 -4 142 15 88 298 -69 -58 -81 86 138 -259 -77 321 -41 242 94 -232 19 -52 -124
3105 -124 -47 -20 -371 69 -225 -69 233 37 -176 341 95 30 -214 -160 -24 120 17 139 -63 125 31 -107
3127 -107 -12 -44 217 -44 -188 -206 172 -70 247 -53 -233 90 38 -204 265 73 29 209 -41 -92 390 -152
3149 -152 52 -106 -291 281 -88 -180 46 284 169 -71 -109 -44 -180 -63 -36 443 33 -200 -122 293 -3 -268
3171 -268 -273 139 185 -234 57 160 -167 -63 -134 -55 327 26 88 176 38 176 -49 -112 87 -224 -39 211 -12
3194 -12 28 -49 -98 -271 20 -3 45 -2 34 -148 60 371 129 -22 -47 190 10 -113 204 -239 -34 114 -159
3217 -159 228 -169 -66 -5 92 -134 52 -8 179 129 -127 79 -32 -13 260 -12 -9 96 -205 -51 228 112
$$ packed form
3059A62l21L46r8J16k2o7j32O7N8k39J84j3r8J67K8j00Q6j21P0p2n4M5m46J34
3083c20L16j28J28J46j27P3K10l67J1k3J67N2l97J82L98l62K83j48l26K51p1p2
3105a24P7K7l51M40k94J56L02j96k13N17k46o5k44N4J36J44j03J22k02J88r4j38
3127a07R5l2K61k61j44j8L78k42L17l00j80L23n2k42M69j92m4J80k50n1M82n42
3149a52K04j58j85N72l69r2K26K38j15k40l8O5j36J17K7M79m10k33P8M15k96k65
3171b68nM12M6m19K91J03l27J04p1P9L82l01O2Q8j38J38k25o3J99l11J85K50k23
3194a2M0p7m9j73K91k3M8m7L6j82K08L11k42j51k5K37j80j23L17m43K05J48k73
3217a59L87l97J03O1R7k26J86o0J87n0k56K06j11J9K73k72LJ05l01J54K79j16
$$ plain form
3239 112 33 -128 -126 12 65 29 37 -37 -170 -88 141 198 -59 -165 148 -72 -99 153 55 19 191 -145 -15 40 14
3264 14 -187 -111 288 -16 -175 43 -85 115 -9 107 -112 112 29 -242 191 55 -31 185 44 -226 4
3285 4 -104 -55 41 60 -81 200 -70 36 565 169 177 -19 80 -181 12 0 82 -161 -91 172 -89 -50 86 55
3309 55 81 -157 -9 -154 236 -116 190 71 227 12 -48 109 -188 -133 -191 -288 -100 11 -151 -244 62 116 78
3332 78 -60 259 61 173 212 20 152 -61 -81 239 -90 -237 50 79 124 -316 1 86 -63 149 -203 -119
3354 -119 39 -109 -30 255 -26 96 -183 28 56 29 -143 66 -135 -77 57 -234 227 -71 -299 0 -229
3375 -229 -75 -56 -76 104 22 -182 135 176 28 154 -58 35 50 -147 -43 -8 -142 107 -124 -26 -42 -188 -38
3398 -38 -226 -85 72 134 -52 108 90 21 -75 320 21 27 130 -185 9 55 220 -118 -6 -20 0 -148 -151 171
$$ packed form
3239A12p9j61KJ38N3l6Qp4j33Q2K29N7k57j06L13k20k7K52r8l6J72l36J30N5k6
3264A4k01P6L99l04j59K18j28K00j24J16k19K24q3k71M33j36q6K16j41k70K30
3285Dj08M9R6J9j41K81k70J06N29l96Qj96R9k61J93j2Q2k43P0K63k61L9J36l1
3309E5K6k38J48j45L90l52L06j19J56k15o0J57k97N5n8r7J88J11j62r3L06N4l8
3332G8j38L19j98J12L9j92J32k13k0L20l29j47K87K9M5m40L17Q5j49K12l52Q4
3354a19J58j48P9K85k81J22k79K11K8k7j72K09k01N8J34k91M61k98k28K99k29
3375b29J54J9k0J80q2k04L17M1j48J26k12R3J5j97J04L5j34K49k31R8j6j46J50
3398c8j88J41J57O2j86J60j8o9r6L95k99OJ03l15J94M6J65l38J12j4K0j48lL22
$$ plain form
3422 171 41 47 -183 -133 113 130 64 -134 11 79 -98 -22 -19 -72 -60 -233 -41 -169 -88 95 -169 -79 -45 -250 -195
3447 -195 -145 -89 -82 -45 224 225 -229 145 41 57 67 -130 36 -16 256 14 -100 -90 -171 86 -78 -127 84 -33
3471 -33 39 176 3 -38 17 141 5 22 -115 122 5 -2 20 -102 -41 86 -66 158 66 -90 102 -32 -123 -60
3495 -60 -107 -420 -3 -94 -152 91 172 284 -286 9 253 63 127 6 -58 62 -28 35 82 -103 113 27 99 2
3519 2 -140 -89 -130 276 42 116 201 -205 -77 247 -164 59 220 41 -166 137 -118 -109 -38 76 27 120 1 -90
3543 -90 -76 334 0 -40 119 16 -110 -10 59 143 -1 -72 99 76 153 -57 -25 -105 113 -118 331 71 -386
3566 -386 -153 -122 165 71 -44 -104 -30 -12 52 -99 60 -9 168 153 -83 120 -125 60 -136 139 -159 -74 -97
3589 -97 198 -3 -59 136 -13 -30 -26 -1 134 -118 -121 -1 7 18 -88 -8 43 313 -89 -6 218 -29 249 103 -21
$$ packed form
3422A71j30Ok30N0K46J7o6j98J45O8j77P6Ln3J2j73J92j28Q1J83k64R0L4k05N5
3447a95N0N6PL7K69Jm54L74j04J6J0j97J66n2K72k42j14J0q1K57j64m9K11j17
3471c3P2J37j73m1N5J24j36J7j37K37j17pK2j22O1J27j52K24r2j56J92j34r1O3
3495f0m7l13M17r1n8K43Q1J12n70K95K44j90O4j21o4J20r0O3M7j85K16q6P2r7
3519Bj42N1m1M06k34P4Q5m06J28L24m11K23J61j79k07L03k55RP1J14m9R3j19r1
3543i0J4M10l34m0J59j03j26J00O9Q4j44p1J71k3P7k10L2q0K18k31M49k60m57
3566c86K33L1K87r4j15o0P4J8O4j51J59o9J77j5k36K03k45J85j96K75k98Q5k3
3589i7K95k01n6J95j49j7MK5J35k52lJ20QJ1j06Q0N1K70m02Q3K24k47K78j46j24
$$ plain form
3614 -21 -22 141 11 104 -44 17 253 -316 10 176 -51 118 135 150 31 -107 272 -35 27 176 135 -34 -210
3637 -210 262 -14 400 32 53 -23 -114 -62 -385 -76 16 6 -147 -30 -108 -185 165 -106 188 -197 -28 -7 107
3660 107 -232 -77 -88 -141 -171 199 -59 192 208 -60 9 -97 -72 -134 -22 31 0 50 -178 22 17 23 -82 -135 69
3685 69 182 40 273 113 -26 119 55 205 -101 -219 84 -4 90 185 -21 -48 41 79 -67 142 -62 -83 465
3708 465 -399 -66 349 -88 223 85 267 82 -41 -104 14 -33 243 31 -28 -121 -66 83 -70 152 248 22
3730 22 -64 45 -129 250 -106 -183 -120 136 203 54 -147 7 45 -183 12 -3 -83 -163 52 -89 235 211 140 99
3754 99 -3 -73 2 60 56 187 -71 107 -44 -22 -29 144 15 -35 2 106 45 -102 51 241 -11 -4 98 -38 86
3779 86 54 -104 -34 13 75 74 -53 180 -27 275 113 -50 -56 -274 48 27 -91 253 -48 2 -21 71 84 147 -126
$$ packed form
3614b1jJ63j30R3j48O1K36n69L26J66k27J69J7J5j19j38L79l07O2J49m1j69j76
3637b10M72k76M14l68K1p6r1N2l23L09R2j0j53J17p8p7L50k71K94l85J69K1J14
3660A07l39J55j1n3l0L70k58K51J6k68O9j06K5o2J12N3l1N0k28K00nOj05n3K04
3685F9J13j42K33j60j39J45o4J50l06j18L03q8R4R5k06k7Q9L8j46K09k04k1N48
3708D65q64L33M15m37L11j38J82j85j23o3J18m7K76k12n9r3N5J49j53K22R6k26
3730B2q6J09j74L79l56p7O3K56O7j49k01J54L8k28J95j5q0q0K15j41L24k4p1m1
3754I9j02p0P5N8mJ31k58J78j51K2pJ73j29n0L7J04o1j47J53J90k52PJ02j36J24
3779H6l2j58P0M7O2jj27K33k07L02j62j63ok18L22k1j18L44l01N0k3R2J3O3k73
$$ plain form
3804 -126 -107 -70 7 -7 229 -79 27 343 -198 72 -57 74 52 121 -8 -136 -12 -28 8 102 62 -201 -86
3827 -86 150 114 -85 13 -57 -156 16 -74 97 29 277 233 3 60 131 -78 -141 -91 66 21 -189 15 5 138 -159
3852 -159 19 -76 23 -85 29 -114 -93 -125 55 -94 -111 -64 42 86 -15 -20 -147 -58 -29 -200 -128 195 -170 -92
3876 -92 190 -106 270 -19 -147 -26 -13 21 -65 96 -256 39 -244 33 -168 80 237 -319 -75 -32 -230 -9
3898 -9 64 -42 25 122 -45 56 -28 -15 -176 -43 52 226 324 4 54 39 114 -95 160 -101 71 -27 29 -50 -208
3923 -208 -187 39 -131 49 306 134 -100 13 119 2 -75 -185 30 -192 -350 49 -283 -193 -51 35 1 -125
3945 -125 123 58 -70 58 -64 -69 -108 -93 59 105 -43 -111 -111 140 109 187 -52 -106 -137 -318 -34 51 -136 4 28
3970 28 131 -157 150 -79 103 -4 -74 -52 100 -14 109 81 167 134 -119 -240 -236 -79 -76 -116 31 107 138 -93
$$ packed form
3804a26J9L7P7j4K36l08J06L16n41K70j29J31k2O9j29j28J24j6L6R4m0k63J15
3827h6K36l6j99R8p0r9J72r0J71o8K48m4k30N7P1k09o3N0J57m5k10K04j0J33k97
3852a59J78r5R9j08J14j43K1l2J80j49j7M7J06M4j01nj27Q9K9j71P2L23l65P8
3876i2K82k96L76k89j28J21J3L4q6J61l52K95k83K77k01K48J57n56K44M3j98K21
3898iP3j06O7R7j67J01q4J3j61J33R5J74R8l20N0j5P5k09K55k61J72r8N6p9j58
3923b08K1K26j70J80K57j72k34J13J06j17p7j10K15k22j58L99l32R0J42Q6l4j26
3945a25K48o5j28J28j22nl9J5J52M6j48o8%K51l1P8k39n4l1j81K84Q5j87J40K4
3970B8J03k88L07k29J82j07p0K2J52j14J23k8Q6l3k53j21MJ57Lm0J47P6L1k31
$$ plain form
3994 -93 -276 -157 -150 31 92 -103 -12 121 5 39 -4 94 125 186 61 -14 88 -8 216 -114 -199 34 3 67 109
4019 109 149 186 366 -6 41 135 146 22 -7 212 -37 -132 -50 16 -58 242 108 23 29 -57 125 44 102 -80 68
4044 68 15 -224 42 -166 206 -30 -148 94 -151 219 18 -170 155 -76 -129 -166 86 211 -189 375 -118
4065 -118 -154 -8 -113 41 157 239 -42 6 -138 104 -27 270 -38 140 190 -17 -111 -102 21 -54 -77 99 39
4088 39 -34 17 -17 71 28 115 120 187 -209 237 -84 -28 19 -1 -235 -54 -192 -135 86 292 190 -79 -93 42 165
4113 165 -131 -86 0 72 107 88 56 -211 -158 53 115 -32 -77 91 188 -309 -170 115 91 112 196 -98 38 286
4137 286 -206 74 72 -6 35 33 9 178 -227 128 47 170 -128 -91 -203 -35 12 9 -61 70 -244 -300 -97 -69 24
4162 24 156 -48 89 -138 -158 204 -216 121 40 -219 -140 191 182 55 86 115 77 255 -19 112 11 273 205
$$ packed form
3994i3j83J19PJ81O1j95R1J33j16L4m3R8L1O1j25p5J02r6K24l30q5K33l1O4M2
4019A09M0L7J80l72M7R4J1j24k9K19k49r5Q2O6p4L00j34q5Oq6J82q1N8j82J48
4044F8n3k39K66k08L72k36j18K42k45L70k01j88L25k31n3l7K52J25m00N64m93
4065a18l6J46j05J54J16Q2k81M8j44K42j31K97l08J78N0k07r4RJ23p5k3J76o0
4088C9p3N1l4Q8m3Q7NO7l96M46l21N6M7k0k34J81j38N7K21K06j02k69j4J35J23
4113A65k96M5Q6P2L5j9l2k67N3K11O2j47m5J68R7m97J39K85k4K1Q4k94J36K48
4137B86m92K80kp8M1kk4J69m05L55q1J23k98L7j12J68M7lp0J31l14n6K03K8R3
4162B4J32k04J37k27k0L62m20L37q1k59P9L31rj27L1K9l8J78k74J31j01K62o8
$$ plain form
4185 205 -106 147 43 -139 13 -183 -15 205 -21 -160 -24 -79 317 102 -102 38 -118 -193 -47 -49 68
4206 68 114 -147 103 -108 29 -44 12 -32 -22 -41 -14 -5 35 -91 -179 128 -79 171 -154 -38 97 -76 -84 -251 47
4231 47 -176 -209 -110 246 165 -20 95 95 -180 -97 205 223 171 -59 14 -262 105 -82 143 -137 233 72 201
4254 201 -218 72 99 -183 102 238 61 -105 95 -14 -289 50 72 110 103 -49 -48 34 85 65 51 -28 172 -40
4278 -40 -41 42 -132 -95 208 57 97 -143 -40 -18 -251 -160 101 31 -149 61 -77 -132 70 -86 -79 -42 -159 -26
4302 -26 70 32 112 192 37 38 69 -21 295 -9 -189 15 122 32 -274 -175 21 64 -217 223 -102 -116 -133 -218 -72
4327 -72 3 -31 92 68 -145 45 79 -15 36 -53 52 -51 -36 -213 148 164 -93 -221 -57 64 74 115 -161 -51
4351 -51 -190 -50 -59 -124 172 200 -101 -116 146 101 167 -126 -57 -99 79 -169 -207 -157 -39 -291 9 77 -377 5
$$ packed form
4185B05l11K53j04j82J52j96J68K20k26j39J36n5L96k15k04J40j56p5J46kJ17
4206F8M6k61K50k11J37p3N6m4J0j9K7RM0j26q8L07k07K50l25J16J35j73qj67K98
4231D7k23l3R9L56q1j85J15%k75Q3L02J8n2k30P3k76L67j87K25k80L70j61J29
4254B01m19K90K7k82K85J36j77j66K00j09k75L39K2L8pj52JQ2N1k0j4p9K00k12
4278d0jQ3j74L7L03j51M0k40J03K2k33R1K61p0j80K10j38n5K02j56PL7j17J33
4302b6R6l8Q0Q0j55JL1r0L16l04j80K04J07r0l06R9J96M3k81M40l25j4j7q5J46
4327g2P5l4J23k4k13J90L4r4N1q9J05j03J5j77L61J6k57j28J64J21J0M1k76J10
4351e1j39J40ro5K96K8l01j5K62m5O6k93O9m2J78k48l8N0J18k52L00O8m54L82
$$ plain form
4375 5 47 -8 -175 -155 -39 144 -73 -143 -109 103 -219 111 193 -34 -300 -67 23 -286 18 182 46 -270 -103
4398 -103 125 279 -74 -35 55 -97 -40 88 52 -139 -41 -55 -235 325 152 133 18 -34 40 -12 126 -140 311
4421 311 42 -54 -20 127 -75 36 -232 -34 17 225 4 7 169 140 66 -125 31 112 -72 179 -54 -137 67
4444 67 78 -106 -196 47 56 -94 -86 -220 -25 -2 164 -117 -76 -101 34 -1 -135 -25 82 104 -168 -27 216 270
4468 270 -111 -48 1 -75 108 107 -212 108 -3 134 -62 50 299 66 -192 -46 19 -44 172 23 -138 -107 -37
4491 -37 -263 209 131 9 -85 -99 82 13 -23 -21 -69 -90 88 11 -31 103 -102 -71 153 -40 152 -21 -180 -83 35
4516 35 137 123 -93 152 -33 -100 80 -44 140 87 137 164 36 -119 39 -5 -265 107 92 0 37 127 -139 10
4540 10 35 -248 -187 18 -31 9 -19 131 -60 -64 -165 -83 101 -66 38 36 -11 -14 -53 -168 -40 -91 93 -129 -199 28
$$ packed form
4375EM2n5j67K0J16J83k17p0L4K12l22L30Q2k27k66K33R0l09L04J64j36l16J67
4398a03K28J54l53L9R0j52N7J28l6j91R8j4j80N60j73j9j15n2P4n2J38k66M51
4421C11k69r6L4J47k02J11k68J98N1K08k21LJ62k9p4j91J56Q1j84K51k33q3K04
4444F7J1j84r0K43Rj50Qj34J95K3J66k81M1k5J35l5j34J10J07K2k72J41K43N4
4468B70l81O3M9p6J83jl19L20j11J37j96J12K49k33k58J46O5o3K16j49j61L1P0
4491c7k26M72p8j22r4j4J81o9l6Km8k1J78p7m2J34k05L1K24j93J92j73j59R7J18
4516C5J02j4k16K45j85o7J80j24J84n3N0K7j28j55J58m4k60L72j5r2L7R0k66J49
4540A0K5k83O1K05m9M0k8J50j91mj01Q2J84j67J04km7ll9j15J28n1J84k22p0K27
$$ plain form
4566 28 32 -21 -56 74 33 -186 -202 -89 -10 169 177 -231 -15 169 -165 -1 -234 -124 133 49 16 84 -20 42 -85
4591 -85 -31 48 100 -24 140 -40 111 -20 -374 5 151 36 25 5 171 37 84 -33 15 -46 -85 187 15
4614 15 118 37 -230 -247 8 25 -468 83 -136 -82 -113 236 -83 25 -164 -100 5 177 -188 -216 31 54 154
4637 154 55 -257 -158 51 -157 9 -46 -6 -60 202 -26 -131 -128 -13 -40 -131 -136 50 -63 65 -147 -94 -140 -46 -289
4662 -289 -30 -32 -18 7 -51 184 20 -58 0 -43 -118 -71 56 23 0 -130 -99 -78 -167 78 120 -206 163 53 -56
4687 -56 -178 -24 117 27 89 -99 -14 -9 14 -54 -74 97 126 24 101 8 -44 142 62 -328 -54 40 -158 -120 -16
4712 -16 -24 116 -86 -35 76 55 -116 -85 -20 263 354 -104 50 34 -30 -51 11 -37 -11 -209 109 205 -16 -88 89
4737 89 -104 55 -12 170 114 55 112 43 27 -42 44 86 62 91 182 -13 114 -153 36 -150 -139 -197 -44 -195 -26
$$ packed form
4566B8Mn3l5J30m1k19j6J13P9J79Qm08K16J84l34J64k33J10K57q4l3O8j04O2j27
4591h5N4P9N2j24J64j80J51j31l54L79J46j15j1k0J66j34M7j17M8o1l9K72j72
4614A5J03q1k67j7K55J7m93N51k19N4l1L49l19J08j89O4J05J72l65k8K47K3J00
4637A54r9l12R9K09k08J66n5M0n4K62k28j05LJ15k7r1nJ86j13J28k12N3m6R4k43
4662b89K59kJ4K5n8K35j64p8N8m3p5M7J27l3k3j30L1K1q9K45M2l26L69j10j09
4687e6j22J54J41r0O2j88Q5NK3o8k0J71K9j02P7r3n2J86q0l90K74R4j98L8J04
4712a6qJ40k02N1J11k1j71L1O5K83R1m58J54j6o4k1O2m8K6j98L18R6k21p2J77
4737H9j93J59o7J82n6n9N7o9j6o9Q6M2k4K9R1j95J27k67J89j86J1n8J53j51J69
$$ plain form
4762 -26 131 243 173 -15 -102 -53 24 42 -77 -177 -245 111 1 25 31 127 -250 -207 10 -164 -74 -165 85 251 27
4787 27 84 -166 -2 -181 172 -174 249 80 15 -23 78 -72 -109 -197 110 175 -201 -13 -113 99 -282 94
4809 94 -13 52 161 73 29 101 124 7 82 21 -33 -165 -75 62 -64 143 171 165 346 -102 -117 -25 59 -139 78
4834 78 102 -58 51 161 -305 76 75 181 -124 79 90 -73 146 -124 -92 244 -15 55 133 141 96 33 -65 -296
4858 -296 15 -154 2 -193 -68 -188 43 -213 179 -53 -112 -98 39 -219 -205 16 122 -229 -55 123 128 -119
4880 -119 -74 190 -178 -122 -26 41 34 49 -76 -33 -16 -40 28 -212 51 53 -37 134 -71 -42 -163 307 -45 -18 -281
4905 -281 -138 -33 58 -418 -124 113 -97 -85 122 -80 143 -35 80 112 48 67 106 27 -264 -120 -22 -12 3
4928 3 149 -287 102 -61 -100 65 50 -451 -81 -63 -218 113 227 202 98 -82 -12 -372 58 -118 -64 -187 62
$$ packed form
4762b6J57J12p0j88q7M9P7J8j19j00o8L56j10K4OR6l77M3K17j74R0r1K50J66k24
4787B7N7k50J64j79L53l46M23j69o5l8J01j50l7q8L07O5l76J88j00K12l81L76
4809I4j07O5J09q8m4P2K3j17P5o1n4j32R0J37j26K07K8oJ81m48j5R2Q4j98K17
4834G8K4j60J09J10m66L81jJ06l05K03J1j63K19k70L2L36k59P0P8Qm5o3r8k31
4858b96L11j69J56j95J25j20K31k56L92k32n9J4J37k58J4K21J06l51J74J78Nk47
4880a19M5K64l68N6R6O7pJ5j25M3J7k4O8k40K63Kr0J71k05K9j21M70l52K7k63
4905b81J43J05R1m76K94K37k10J2K07k02K23j78J15L2o4J9L9p9k91J44R8J0J5
4928CJ46m36L89j63l9J65j5n01L70J8j55L31J14k5j04j80P0l60M30j76N4j23K49
$$ plain form
4951 62 119 -15 113 367 80 -60 116 60 -20 31 302 69 39 -86 306 109 327 254 -17 133 37 -301 -19
4974 -19 -54 -265 163 150 98 260 -60 -135 -123 290 92 78 -335 170 10 -188 -120 98 -118 220 -174 -2 412
4997 412 757 231 -516 298 648 392 390 253 -150 221 618 39 -241 -111 141 244 152 272 -305 325 -132
5018 -132 275 219 -28 -102 -75 -121 -504 230 381 186 -6 512 -230 -420 266 -188 81 307 -393 -248 0
5039 0 -477 -287 112 173 3 -463 161 229 103 -306 -29 462 401 320 600 165 117 202 -174 473 536 -23 -1036
5062 -1036 215 393 -8 -295 -402 831 250 441 -709 394 355 -79 235 580 651 -303 505 -630 -17
5081 -17 94 -312 233 -350 82 134 7 141 379 -183 371 36 151 -59 -1146 -103 31 530 283 252
5101 252 -312 -367 107 183 -608 258 64 515 -79 -573 366 -251 355 -135 -770 497 44 251 -67 -239
$$ packed form
4951F2N7j34J28K54k87j40J76n6q0N1K71k33l0j25L92j97K18p3k71J50r6l38K82
4974a9l5k11M28j3n2J62l20p5J2M13j98j4m13N05j60j98O8K18k16L38l94J72M14
4997D12L45n26p47Q14L50k56kj37m03L71L97n79k80J30K52J03r2J20n77O30m57
5018a32M07n6k47p4K7m6l83P34J51j95j92N18p42j90O86m54K69K26p00J45K48
5039@m77J90L99O1j70m66O24O8j26m09K77M91o1q1K80m35m8Q5l76O47O3n59j013
5062a036J251J78m01k87j07J233n81J91j150J103l9m34L14L45P1r54Q08j135O13
5081a7J11m06N45n83M32N2j27J34K38n62N54l35J15k10j087J043J34M99k47l1
5101B52n64n5M74P6p91Q66j94M51n94m94R39o17O06m90o35J267m53K07l18j72
$$ plain form
5121 -239 -205 1 477 -85 504 232 -716 -163 -308 456 -271 107 564 492 283 -150 969 527 769 158
5141 158 -263 -549 -192 -453 -209 -398 -455 115 222 458 235 112 53 260 -444 172 205 -446 -228 -19 247
5162 247 358 -107 -140 -475 -103 603 27 128 -619 334 70 626 -588 440 -480 -43 469 -136 918
5181 918 -181 199 895 -233 137 3 236 -105 175 283 -470 -201 -197 -323 160 575 -323 -97 497 171
5201 171 654 329 -167 142 185 102 586 419 93 -24 -61 -28 35 67 36 25 80 301 -266 -28 403 33 89
5224 89 479 -38 193 520 -114 -360 28 369 -343 -451 66 -94 -1 -228 -78 -159 -329 176 415 2 -229
5245 -229 25 -95 -74 -224 -142 -163 127 8 -412 154 -268 124 -36 137 222 -244 -46 -108 -10 -91 -294 114
5267 114 -220 -117 131 231 49 299 -111 -232 -155 445 -92 68 -242 31 29 117 4 -74 19 -305 -219 -264 97
$$ packed form
5121b39L4K06M76n62N89k72r48N53j45P64p27L78M57p2k09m33J119m42K42o11
5141A58m21k86L57k61K44j89n7N70J07K36k23j23n9K07p04O16L3o51K18K09K66
5162B47J11m65l3l35L72P06n76J01p47R53k64N56j214J028r20M37N12o05J054
5181I18j099L80O96j128L70j34K33l41K80J08p53K69Mj26M83M15q98K26N94l26
5201A71M83l25m96L09M3q3M84j67l26j17l7L3O3L2l1j1N5K21n67K38M31l70N6
5224H9L90n17K31L27o34k46L88L41p12j08N17j60R3k27J50q1j70N05K39m13k31
5245b29K54j20K1j50Q2k1K90j19m20N66m22L92j60J73Q5m66J98o2R8q1k03M08
5267A14l34J03K48J00j82K50m10j21P7O00n37J60l10K73kQ8j13p8R3l24Q6m5L61
$$ plain form
5290 97 124 123 224 61 -470 -154 186 39 272 -142 120 246 53 108 31 -163 156 10 -161 222 134 -61
5312 -61 15 -90 -10 -203 116 71 61 -192 -110 114 -8 -184 15 -55 172 -156 -167 -141 -76 201 82 -53 63
5335 63 -174 -46 24 -63 99 -204 18 -233 -46 210 -41 106 140 73 196 143 77 -238 204 68 217 80
5357 80 106 -3 -22 19 -192 34 15 205 -100 -55 144 -96 -55 -38 -89 -100 139 -71 -167 131 37 68 -14 -199 13
5382 13 79 -218 74 -83 76 164 156 99 -19 71 166 252 -45 86 -124 172 -2 37 -6 -142 -140 -25 72 243 61
5407 61 -122 -5 -32 -109 -129 55 4 151 -62 240 -84 254 -113 99 -91 -102 -66 -194 82 -111 4 114
5429 114 66 155 55 62 250 45 -11 -22 -44 -278 93 -143 70 79 -36 -58 355 -65 135 205 58 80 107 -17
5453 -17 50 -175 -91 -173 -46 6 -48 -25 80 106 -125 -14 95 127 -140 -149 291 -25 -212 -140 165 29 -7 -244
$$ packed form
5290I7K7jJ01j63n31L16L40j47K33m14K62J26j93N5p7j94L19j46j71L83q8j95
5312f1P6j05Q0j93L19m5j0k53Q2K24j22j76J99p0K27l28j1K6O5K77j19j35J16
5335F3k37J28P0q7J62l03K22k51J87K56k51J47L4o7J23n3o6l15M42j36J49j37
5357H0K6j09j9M1k11K26j9J90l05M5J99k40M1J7n1j1K39k10r6K98r4L1q2j85K12
5382A3O6k97K92j57J59Q8qn7j18R0R5Q6k97J31k10K96j74L9m3j36KJ15R7J71j82
5407F1j83J17k7p7k0J84n1J47k13L02l24L38l67K12j90j1L6j28K76j93J15J10
5429A14m8Q9j00PJ88k05n6j1k2k34L71k36K13Rj15k2M13m20K00P0j47K2K7j24
5453a7O7k25Q4q2J27N2n4K3J05K6k31J11J09L2k67rM40l16j87P2L05j36l6k37
$$ plain form
5477 -244 -67 199 -5 65 -78 -23 48 70 -55 -204 -6 45 -112 -8 -112 -121 -68 -74 -292 -71 114 -25 111
5500 111 -6 130 68 61 -152 109 145 75 32 0 104 -137 -210 20 41 7 206 -105 96 -91 -102 -120 -133 -42 60
5525 60 183 93 120 -281 -178 -75 -168 35 92 -83 86 -126 -107 -15 68 19 -140 -108 -138 -25 93 -44 -107 -122
5549 -122 26 178 105 -168 139 -1 87 -232 -58 -59 207 -56 -157 -107 -22 -39 -39 -10 -205 65 291 -136 163
5572 163 146 -44 33 -89 -125 65 -16 168 118 176 104 -228 -101 53 -121 26 -285 -56 -88 30 175 -56 -175
5595 -175 -64 -9 86 39 31 51 48 91 -134 -55 -74 91 -168 82 100 43 -168 -30 -35 147 332 -173 231 -53 -349
5620 -349 -112 10 31 95 -70 16 59 -164 -118 -248 -69 -8 171 -89 13 -198 -51 166 -70 5 180 288
5642 288 203 -80 114 224 228 -23 31 17 -98 -193 -137 10 88 240 4 119 40 23 170 -172 -148 9 -71 -231
$$ packed form
5477b44J77K66k04P0j43N5P1K2j25j49J98N1j57J04j04rN3ok18K21J85j39J36
5500A11j17J36o2pk13K61L6p0m3l2J04k41p3K30K1l4J99l11K01j87j1j8j3R1J02
5525F0J23r0K7m01J03J03r3K03N7j75J69k12J9R2Q3m9j59L2l0J13J18j37o3j5
5549a22J48J52p3k73L07j40Q8l19J74jK66k63j01N0Q5j7%K9j95K70K26m27K99
5572A63j7j90P7j22l6J90q1J84n0N8p2l32J27J54j74J47l11K29l2J18J45k31j19
5595a75J11N5R5m7qK0lM3k25P9j9J65k59K50J8n7k11J38nJ82J85n05M04k84k96
5620c49K37J22K1O4j65Q6M3k23M6j30J79O1J79k60J02k11J47K17k36P5J75J08
5642B88q5k83J94J10Mk51N4j4j15r5N6J47P8J52k36J15p9j7J47l42K4J57q0j60
$$ plain form
5666 -231 -121 -106 -219 27 -135 -128 56 -171 190 29 -59 -83 -252 -196 119 -16 53 -144 247 129 -277 -281 7
5689 7 58 -195 -53 58 254 -3 -122 -109 -265 -36 -23 -37 27 38 -318 -154 71 117 119 24 134 -92 -112 -217
5713 -217 69 -128 -292 171 307 203 -13 96 -92 -236 83 -90 149 90 -364 -4 136 -59 -104 87 76
5734 76 -45 15 108 326 -61 148 229 -129 -50 62 -253 39 -194 230 -19 -253 133 -272 -41 629 -244 34
5756 34 50 -176 -44 -347 -144 258 269 297 -325 850 -321 390 -178 -158 457 -876 -125 226 -177 -302 -421
5777 -421 133 51 -216 -835 -329 -114 215 156 -401 74 -60 179 -217 356 -2 241 -375 50 250 -219 129
5798 129 62 -81 96 44 -62 -265 -208 -29 -68 74 -386 -169 12 -165 -249 -33 -213 -6 86 0 -112 47
5820 47 3 -259 19 4 85 -169 -56 86 -59 70 100 -100 -24 44 -102 -170 143 47 -273 205 29 -44 161
$$ packed form
5666b31J10J5j13K46j62PJ84k27L61j61q8k4j69N6L15j35O9j97L91j18m06mK88
5689GN1k53J42J11J96k57j19J3j56K29J3j4O4J1l56J64K25M6Kr5J10k26k0j05
5713b17K86j97j64M63J36j04k16J09j88j44L19j73K39n9m54L60J40j95m5J91j1
5734G6j21O0R3K18l87K09Q1l58P9J12l15K92k33M24k49k34L86m05K31O70q73K78
5756C4J6k26J32l03K03M02J1K8o22J175j171P11n68K0O15j333P51L51m03j25j19
5777d21N54q2k67o19N06K15L29n9n57M75j34K39l96N73l58K43o16M25K00m69L48
5798A29o7j43J77n2j06k03N7J79l9J42m60K17J81j77q4K16j80K07R2q6j12J59
5820D7m4k62K78j5Q1k54J13J42j45J29L0k00P6O8j46o8L13r6l20M78j76p3K05
$$ plain form
5843 161 0 -69 148 275 70 -72 168 -107 62 35 -126 -123 -43 12 10 -52 -14 -238 41 -23 -187 355 -110 -1
5867 -1 235 -73 49 206 -134 -93 -154 89 -22 -95 -131 -22 30 12 -214 -2 -4 15 78 -20 -74 10 76 -184 -212 55
5893 55 -318 165 60 152 -155 120 -82 -109 -5 -37 20 -48 -12 102 -4 -19 51 -56 53 44 23 -51 294 -116
5917 -116 -70 -11 -54 -255 -7 89 212 -17 -94 9 -89 33 -82 136 304 47 215 -364 199 -238 174 -16
5939 -16 -5 -129 -116 251 108 -95 87 -37 -31 -66 -128 -188 -212 132 -82 -26 -100 -161 212 -22 9 -133 -68 11 -172
5964 -172 -568 60 321 69 177 7 -61 -121 -136 137 242 7 640 -208 -74 -169 -74 86 58 194 -90 123
5986 123 94 167 -20 80 343 -209 291 -371 -30 -240 -44 159 -337 190 114 9 91 -157 -192 88 -155 85
6008 85 -41 87 9 83 -199 31 -268 -422 38 255 137 -108 -134 124 48 -138 2 1 -31 328 -28 -18 240
$$ packed form
5843A61j61o9K17J27k05j42K40k75J69k7j61LQ0N5ko2L8k24K79o4j64N42m65J09
5867aK36l08J22J57l40M1o1K43j11p3l6J09N2j8k26K12kJ9O3r8n4Q4O6k60k8K67
5893E5l73M83j05R2l07K75k02k7J04l2N7o8L6J14j06j5P0j07J09rk1p4L45m10
5917a16M6N9m3k01K48R6J23k29p7J03r8J22j15K18J68k57J68n79N63m37M12j90
5939a6J1j24J3L67j43k03J82j24Ol5o2o0k4L44k14N6p4o1L73k34L1j42O5P9j83
5964a72l96O28K61k52J08j70o8o0j5K73J05k35O33q48J34r5R5J60k8J36k84K13
5986A23k9P3j87J00K63n52N00o62L41k10J96K03m96N27p6j05Q2k48l5K80k43K40
6008H5j26J28p8P4k82K30k99j54M60K17j18k45k6K58p6j86J40jl2L59l56J0K58
$$ plain form
6031 240 -26 57 -74 -268 -113 -113 -52 36 19 -295 -98 72 -90 -120 -152 -144 -93 31 91 -125 -1 -217 21 -4
6055 -4 180 88 -33 -199 52 -152 111 30 142 141 -44 46 207 -167 -215 22 166 68 92 -118 79 -154 -47
6078 -47 -165 -49 82 44 4 -98 26 -216 -135 -116 82 149 7 -9 90 159 48 -58 -190 -95 146 52 -28 93
6102 93 -74 35 -53 -284 -131 -203 138 -110 -19 36 -172 219 131 196 34 228 131 -44 380 -98 124 180 280
6125 280 -178 -51 4 119 27 206 208 -13 -67 -53 13 171 105 205 275 -93 27 -73 -97 -110 54 -162 -263 -3
6149 -3 -182 -71 87 111 118 -73 -21 98 115 -44 155 -35 28 -9 -328 -100 -45 134 117 156 -41 -113 -177 -56 201
6174 201 -23 53 97 121 0 -153 -73 202 195 118 3 -28 243 -183 -239 10 -80 4 -28 99 153 -39 -78 74 205
6199 205 101 106 -26 138 -131 -27 90 -80 108 -53 -70 -34 -76 -20 -99 90 157 100 92 108 153 182 -21 196 55
$$ packed form
6031B40k66Q3j31j94J55%O1Q8j7l14J97J70j62l0l2QN1J24O0k16J24k16K38k5
6055dJ84r2j21j66K51k04K63q1J12jj85R0J61l74m8K37J44r8K4k10J97k33J07
6078d7j18J16J31l8m0j02J24k42Q1J9J98O7j42j6R9O9j11j06j32R5K41r4q0J21
6102I3j67J09q8k31J53p2L41k48R1N5k08L91q8O5j62J94r7j75M24m78K22N6J00
6125B80m58J27N5J15r2J79Kk21n4J4O6J58o6J00P0l68J20j00k4j3J64k16j01K60
6149cj79J11J58K4Pj91N2J19J7j59J99j90O3l7l19K28N5J79j7L9j97p2o4J21K57
6174B01k24P6M4K4j21j53Q0K75pp7j15l1K71m26n6K49r0Q4l2J27N4j92l9J52J31
6199B05j04Nj32J64k69J04J17j70J88j61j7L6m2N6p9J89O7n7qJ6M5K9k03K17j41
$$ plain form
6224 55 -62 120 -92 -21 171 -29 4 100 135 26 -19 6 126 224 23 83 -127 49 -146 3 146 20 -118
6247 -118 4 -96 56 -276 -44 -157 -208 43 -68 17 -86 -44 -63 349 51 34 -146 35 -4 112 -278 86
6269 86 297 -51 -44 -92 -230 -93 -95 34 121 12 -42 -281 -118 -87 19 200 171 -51 11 -71 -55 -29 8 54 84 288
6295 288 -215 158 -72 142 -41 -34 -88 -100 219 10 -148 -86 -148 -44 22 -8 223 -23 85 186 52 123 104
6318 104 57 28 224 -6 9 -22 27 25 -185 -11 54 -139 -30 -60 109 -122 153 -111 -23 -127 -17 8 25 51
6342 51 29 -21 -180 -72 -74 120 126 274 -226 211 98 76 99 -317 18 303 302 -14 -65 -214 -55 78 -100 -31
6366 -31 -50 97 -57 -31 -178 19 153 5 -129 -93 9 -249 192 -96 -229 -162 -215 -106 78 -42 -7 118
6388 118 88 -221 -18 -102 -57 110 24 -59 -105 158 -20 -34 -113 -69 291 -247 -116 -264 77 -121 154 164 30
$$ packed form
6224E5j17J82k12P1J92k00L3R6L5j09m5K5J20R8k01O0k10J76j95J49J43j26j38
6247a18J22j00J52l32K32j13n1K51j11Q5j03M2j9M12k98j7j80J81l9J16l90L64
6269H6K11l48Pm8j38J37kJ29Q7j09n4k39J63L1J06J81k9k22O2q2J6K6L7M6L0K04
6295B88n03L73k30K14j83Pn4j2L19k09j58O2o2J04O6l0K31k46J08J01j34P1j9
6318A04m7k9J96k30J5l1M9kk10J74O5j93J09l0J69k31K75k64Q8j04J10K5J7K6
6342E1k2n0j59J08kJ94OJ48n00M37j13k2K3m16L35K85jl16n1j49J59J33j78O9
6366c1j9J47j54K6j47J97J34j48j34L6J02k58M41k88j33O7n3J09J84j20L5J25
6388A18l0l09K03q4M5J67q6q3m6K63j78j4p9M4L60n38J31j48L41j98K75J0j34
$$ plain form
6411 30 135 81 29 25 -3 68 2 146 -51 -155 -105 -311 95 85 72 104 -99 101 -151 -38 126 -25 130 108
6435 108 -2 282 -143 199 114 -96 -143 57 -35 -191 -99 -75 -17 58 -46 -15 34 -90 3 -58 126 -73 -38 -10
6459 -10 -140 87 -106 46 -133 -110 -45 22 -24 102 169 -139 -16 31 201 -37 72 34 192 -180 -13 -49 -3
6482 -3 111 -253 -125 -21 -105 51 -35 7 3 15 -134 -214 -33 33 133 -50 87 -124 -105 -11 101 40 -219 92
6506 92 -78 -173 -53 45 -221 76 -137 -16 -33 -20 98 26 238 -224 -88 -15 90 -126 -323 -138 249 -179
6528 -179 82 -4 -12 23 259 -53 221 -119 32 151 -4 -139 -13 -104 -18 118 37 23 6 163 -143 100 -251
6551 -251 146 -34 99 -293 61 92 -88 92 137 136 -153 83 78 -158 -52 -142 207 227 -54 -25 -103 -53 120 -59
6575 -59 26 -163 128 225 -59 -91 309 47 146 -65 99 18 -41 -63 -105 -54 41 303 -173 91 -124 -101 168 194
$$ packed form
6411C0J05n4n2mk8P1o6J44j97j04N0k06M06j0j3L2k03K00k52J13J64j51J55k2
6435A08j10K84m25L42q5k10m7K00r2j56R2K4N8P5j04L1M9j24R3o1J84j99L5K8
6459a0j30K27j93J52j79K3O5O7m6J26O7l08J23M7J70k38J09l8J58l72J67l6M6
6482cJ14l64J28J04q4J56q6M2mJ2j49q0J81O6J00j83J37k11J9R4J12o1k59L11
6506I2j70r5J20R8k66K97k13J21j7J3J18p2K12m62J36P3J05k16j97J85L87m28
6528a79K61q6qL5K36l12K74l40J51J19j55j35J26r1Q6J36q1j4j7J57l06K43l51
6551b51L97j80J33l92L54L1j80J80M5jk89K36nk36J06r0L49K0k81K9p8N0J73j79
6575e9Q5j89K91R7k84l2M00k62R9k11J64q1n9k2m2N1R5K62m76K64k15K3K69K6
$$ plain form
6599 194 -10 -94 91 28 64 -129 50 -39 -76 -7 -269 -44 97 -1 -190 -43 164 109 180 -12 75 19 135 121
6623 121 -114 80 -64 97 -19 15 -7 -133 -87 187 -131 128 -150 240 -225 -73 -47 -111 86 93 -66 -64 76
6646 76 -107 -53 -155 -33 34 120 67 -21 -52 116 -63 -44 30 117 -69 2 -373 -242 -116 -99 93 92 99 290 -15
6671 -15 -190 -175 196 131 99 -97 10 -86 -18 -88 18 -26 -224 -78 144 62 277 -152 -86 -113 38 13 -335 -160
6695 -160 -12 31 142 14 222 8 32 61 -7 1 64 -69 -80 182 -194 -72 73 91 -33 227 -161 -145 77
6718 77 -264 -185 -92 101 15 255 -24 -114 -66 -46 -234 -125 -16 -108 -127 -18 48 -78 75 117 38 62 146 -191 10
6743 10 7 155 54 -175 -95 -61 -106 114 16 282 69 -114 153 35 -48 -77 -7 -71 33 -64 -203 56 0 -25 -85
6768 -85 139 28 -202 121 74 -41 -21 -12 -47 20 101 55 149 42 -55 -23 15 127 180 158 42 31 92 -16 -167 63
$$ packed form
6599A94k04q4J85o3L6j93J79q9l7O9k62K25J41r8j89J47K07n5P1j92Q7n6J16j4
6623A21k35J94j44J61j16L4k2j26M6K74l18K59k78L90m65J52K6o4J97Pj59KJ40
6646G6j83N4j02J22O7Q6n3q8l1J68j79J9P4Q7j86P1l75J31J26J7J92jPJ91l05
6671a5j75J5L71o5l2j96J07r6O8p0J06m4j98J46K22q2K15m29O6k7J51k5l48J75
6695a60J48M3J11j28K08k14K4K9o8QO3j33j1K62l76J22J45J8j24K60l88J6K22
6718G7l41P9R3J93q6K40k79r0M8K0j88J09J09r2j9J09O6j26J53M2p9K4Q4l37K01
6743A0lJ48j01k29Q0L4m5K20r8K66k13j83K67j18q3k9P0o4J04r7j39K59n6k5o0
6768h5K24j11k30L23m7j15K0Rl5O7Q1m6R4j07r7L2L8J12N3k2j16j1O1j08j51K30
$$ plain form
6794 63 120 -136 -39 -101 165 32 13 139 55 -70 108 226 -175 244 17 -259 143 -29 -286 -147 -15 -10 -107
6817 -107 -63 116 139 51 -294 34 305 124 -45 124 14 -173 -106 40 213 -43 -65 -109 200 20 -79 -112 -45
6840 -45 36 -194 -52 102 52 211 -1 -108 64 74 92 65 -207 113 192 -160 -76 164 195 12 296 117 -70
6863 -70 25 -153 -65 243 -68 8 -29 -162 60 -156 0 217 0 90 106 -126 58 26 126 -71 147 29 -76
6886 -76 -228 257 192 -400 -123 204 -26 161 73 -16 -225 -48 258 -50 -4 221 189 -137 -230 138 343 90
6908 90 -90 -60 -49 -23 -88 -144 -19 231 174 81 222 -69 -179 -112 -34 -298 9 -84 73 -231 -163 -57 -244 232
6932 232 -72 -39 92 -51 5 -12 -21 -153 -65 160 6 310 13 41 128 -86 -117 -23 3 -76 -11 -15 -7 145 19 73
6958 73 57 -84 45 48 -204 -36 1 80 220 2 -68 -183 151 -86 -173 -24 186 -84 44 82 53 76 94 31
$$ packed form
6794F3N7k56R7o2K66j33j9J26q4j25J78J18m01M19k27k76M02j72k57J39J32Nr7
6817a07M4J79K3q8l45L28K71j81j69J69j10j87O7J46J73k56k2m4L09j80r9l3O7
6840d5Q1k30J42J54n0J59k12j07J72J0J8k7k72L20P9l52Q4K40L1j83K84j79j87
6863g0R5j78Q8L08l11P6l7j33K22k16J56K17k17R0J6k32J84l2J00j97K18j18j05
6886g6j52M85o5n92K77L27k30J87q8q9k09J77L06l08M6K25l2l26r3L68K05k53
6908I0j80L0J1K6o5n6J25K50n7r3J41k91j10O7P8k64L07r3J57l04O8J06j87M76
6932B32l04L3J31j43N6j7rj32Q8K25j54L04k97K8Q7k14l1R4K6p9O5mQJ52j26N4
6958G3j6j41J29Lk52J68L7P9J40k18p0j15L34k37q7J49K10k70J28L8k9K3J8o3
$$ plain form
6982 31 215 135 -188 31 -64 -154 21 -28 -49 133 -103 -68 -20 -245 -89 -19 -26 -223 113 -32 148 185 -126 160
7006 160 -149 -15 94 -63 -244 97 177 190 92 -71 91 -5 133 -164 31 -67 -191 59 6 -42 160 183 150
7029 150 -163 10 35 -223 -19 -176 79 151 44 -190 -35 -82 34 69 -179 -160 104 146 16 81 263 -19
7051 -19 40 -67 143 -238 95 18 96 -58 133 -305 63 -84 -207 36 217 -72 112 -327 -51 21 8 -157
7073 -157 -32 119 -21 -99 -159 171 230 -172 -79 -241 -162 137 -82 93 -82 77 107 167 177 -3 100 -168 27
7096 27 97 -54 -255 -141 52 88 -36 -25 64 184 -67 192 228 337 98 122 29 -56 -56 112 39 -68 -52 -137 42
7121 42 110 -84 30 -122 -7 229 32 -58 -110 98 74 -15 240 -88 68 -210 175 37 -180 -62 -141 -158 -13
7144 -13 -262 51 154 263 359 63 185 -182 -296 -158 121 142 30 89 58 -48 -103 -221 -10 -94 -154 81 190
$$ packed form
6982C1J84q0l23K19r5r0J75m9k1J82k36L5M8k25J56P0pj97L36j45J80L7l11K86
7006A60l09J34J09j57j81L41Q0J3r8j63J62r6J38k97J95r8j24K50n3m8K02K3l3
7029A50l13J73K5k58K04j57K55P2j07k34J55m7J16L5k48J9K64M2j30O5J82k82
7051a9N9j07K10l81L33p7P8j54J91m38L68j47j23K43J81k89J84m39K76P2j3j65
7073a57J25J51j40p8o0L30N9m02R3j62P9K99k19J75j75J59L0O0J0j80J03k68J95
7096B7P0j51k01J14J93L6j24J1Q9J20k51K59L6J09k39K4r3q5%J68p3j07J6q5J79
7121D2O8j94J14j52J15K36j97r0n2K08k4q9K55l28J56k78L85j38k17J18p9j7J45
7144a3k49L13J03J09R6k96J22l67j14J38K79K1j12N9l1j06n5j18K11q4o0K35J09
$$ plain form
7167 190 -80 -165 252 220 -378 4 76 -246 -105 -19 171 -201 -1 -251 -59 63 79 206 -4 -160 -83 -23
7189 -23 411 192 -9 -54 76 -18 196 26 -5 -15 -173 164 206 85 -146 -7 72 32 -104 -47 -36 7 -197 67
7213 67 -88 -225 -225 -2 -150 -223 71 -12 -132 121 -3 2 60 -160 109 111 -87 -108 -159 82 203 59 -21 -109 110
7238 110 141 -114 -168 -95 130 132 -56 -84 -104 6 -279 -102 -161 30 -41 -8 57 -88 -75 27 -108 107 214 142
7262 142 226 23 -298 -119 -16 223 116 -280 -127 29 -85 -17 -54 -91 125 207 15 -28 282 -156 -165 -146 172
7285 172 155 83 74 2 10 -118 103 131 97 -149 -35 -101 -125 -262 -6 -34 2 50 19 60 -105 63 -111 202 -158
7310 -158 35 -10 38 29 -82 120 346 23 -179 -118 -136 -77 -17 201 99 -80 -50 90 120 -73 70 -195 -40
7333 -40 51 -88 -112 1 170 -110 -187 40 20 1 165 -163 -29 85 41 -8 -68 247 123 132 -51 -105 21 -144
$$ packed form
7167A90k70q5M17l2n98L82P2l22J41Q6J90l72K00k50J92J22J6J27k10j56P7O0
7189b3M34k19k01m5J30r4K14j70l1j0j58L37M2j21k31J39P9m0j36N7J1M3k04K64
7213F7j55j37%K23j48p3K94q3j20K53j24NN8k20K69Kj98k1n1K41J21j44q0q8K19
7238A10L1k55n4P3K25Kj88k8k0J10k85J77n9J91p1L3O5j45J3J02j35K15J07p2
7262A42Q4k03l21J79J03K39j07l96J53J56j14O8l7l7K16Q2j92m3L10m38rJ9L18
7285A72j7p2rp2Qj28K21K8l4k46J14o6k4j37K56k8L6M8l1M1j65J68j74L13l60
7310a58J93m5M8rj11K02K26l23k02O1j8N9O0K18j02j79L0J40L0j93J43k65J55
7333d0R1j39k4J13J69k80p7K27k0j9J64l28J34J14m4m9o0L15j24Rj83n4J26j65
$$ plain form
7357 -144 -69 34 -7 152 205 -111 -56 2 -86 -277 -111 150 -379 -69 -62 -238 310 -139 -43 87 -712 36 225
7380 225 -424 -277 51 -261 -344 499 138 302 -134 273 31 32 -21 -239 -43 93 20 -215 -19 -124 39 165
7402 165 -130 96 202 87 -11 114 349 127 123 -57 -12 152 17 -71 115 -48 335 -6 33 33 156 -23 139
7425 139 38 -28 -162 100 102 -108 112 2 195 -237 -26 22 211 -27 -86 -167 25 126 311 -48 85 210
7447 210 131 169 -122 -153 -79 63 254 60 171 178 62 133 -18 -189 -108 12 -140 201 229 264 164 -187 46
7470 46 101 195 13 142 86 193 -214 100 96 -46 -92 -105 271 51 -106 -1 -5 -27 138 216 -146 169 -55 102
7494 102 -140 197 -175 -4 -127 -23 -181 179 -80 85 -141 106 1 -31 -126 -149 161 181 -91 -48 -149 -61
7516 -61 108 73 -61 -85 161 31 92 194 -86 -63 11 -18 77 75 301 -94 196 34 116 -88 -121 98 70 161 -84
$$ packed form
7357a44P5J03m1J59N3l16N5N8q8j91J66K61n29L10Pj76N48m49R6J30p99P48J89
7380B25o49J47L28l12q3Q43l61J64m36M07k42Jn3k18J96J36p3k35J96j05J63J26
7402A65k95K26J06j15r8J25K35k22mj80M5J64j35q8J86j63L83l41L9%J23j79J62
7425A39j01o6j34K62Kk10K20j10J93m32K11M8J89k38n9q1J92J01J85l59J33J25
7447B10p9L8k91l1P4J42J91j94J11Pj16P1j51j71Q1J20j52L41K8L5j00l51K33
7470D6N5R4j82J29n6J07m07L14mj42m6j3L76k20j57J05mk2J65P8l62L15k24J57
7494A02k42L37l72J71j23J04j58L60k59J65k26K47j05l2r5k3L10K0k72M3j01Q8
7516f1J69l5j34k4K46j30O1J02k80K3P4k9R5kK26l95K90j62Q2k04l3K19k8R1k45
$$ plain form
7541 -84 217 -181 -86 47 -163 57 -26 -45 175 -38 -105 -184 -55 219 121 76 16 272 31 -65 11 205 22 -80
7565 -80 -66 124 -64 -10 -145 110 84 32 -53 126 -11 -111 88 226 -23 -113 331 16 -38 130 157 111 18 -129
7589 -129 152 133 19 166 -186 -219 22 229 -253 -73 33 168 19 -182 268 100 -263 -146 -78 -153 251
7610 251 41 -129 -250 6 221 52 -194 -3 -271 -128 -63 -132 38 -98 220 102 72 -107 -40 169 172 193
7632 193 105 -23 133 -27 -34 -77 -4 26 -11 103 -98 -35 -46 -151 113 -144 -297 -164 -118 -68 90 63 31 125 115
7657 115 108 243 -58 -32 -164 -16 -12 45 45 -145 124 -239 212 238 -140 -3 -1 -96 -88 -111 -6 -181 -28 -94 -102 -91
7683 -91 102 -231 -69 -169 -263 354 -119 82 215 29 77 -75 37 137 60 98 -150 -87 58 69 -22 83 195
7706 195 239 -18 157 -56 -95 -94 -99 -18 -22 28 120 -14 71 -300 -119 141 -52 -38 -144 146 -32 -217 144 43
$$ packed form
7541h4L01l98R5J33k10K20q3j9K20k13o7p9J29K74r8m5o0K56k41r6P6J94j83j02
7565h0J4J90j88N4j35K55k6n2q5J79j37j00J99J38k49r0M44l15n4J68K7m6r3j47
7589a29K81j9j14J47l52l3K41K07m82J80J06J35j49k01M50j68l63J17O8p5M04
7610B51k10j70j21K56K15j69k46J91k68J43O5o9J70j36L18j18l0j79O7K09LK1
7632A93q8j28J56j60pm3P3L0l7J14k01O3j1j05K64k57j53J33M6N0J58k7l2R4j0
7657A15pJ35l01K6j32J48MN7%j90K69l63M51K6l78J37Kr5Qk3J05j75J53o6qJ1
7683i1J93l33J62j00r4O17m73K01J33j86M8j52J12J00p7L8k48O3J45J1r1J05J12
7706A95M4k57J75k13l9JnQ1mN0R2j34Q5l71J81K60j93J4j06K90j78j85L61j01
$$ plain form
7730 43 150 -153 -89 26 -130 -124 -115 109 114 87 -61 195 -85 52 274 109 195 -149 53 7 44 12 120 -134
7754 -134 284 77 -201 -5 -76 -78 -157 -144 -88 148 -4 -1 -9 -12 94 -123 -96 -183 -231 -166 -7 -48 186 9 -331 -48
7780 -48 66 95 -265 24 79 132 71 231 21 -2 -17 -83 198 -1 65 -199 182 -190 50 157 -207 12 -66
7803 -66 225 34 -213 146 146 167 44 4 -51 216 119 -99 -196 60 256 -203 -193 75 114 62 -239 -64 210 187
7827 187 -281 73 -280 -123 -168 74 -47 -157 139 -105 27 75 -267 25 83 -8 -17 204 -145 -22 25 -152
7849 -152 87 -20 145 147 84 -2 -175 3 -30 16 -111 122 78 42 245 -31 -170 -2 193 -151 -27 -32 -15 132
7873 132 -132 -131 43 -61 -258 6 189 -103 193 41 148 -31 240 145 -58 93 -3 -121 -47 -87 122 37
7895 37 -37 -109 83 64 29 68 15 77 17 -191 111 187 186 121 3 -228 160 84 -52 -62 -191 346 58 203 -70
$$ packed form
7730D3J07l03O4J15j56ORK24Nk7j48K56k80J37K22j65Q6l44K02m6L7l2J08k54
7754a34M18k07k78J96p1kp9J3N6K36j52LqlJ06k17K7q7m8O5J59m1K34j77l40K83
7780d8J14K9l60K89N5N3o1J60k10k3j5o6K81j99O6k64L81l72K40J07l64K19p8
7803f6K91j91k47L59%K1j23m0n5K67r7k18r7K56J96m59J0K68L9n2l01J75K74k3
7827A87m68L54l53J57m5K42j21j10K96k44J32M8l42K92N8r1rK21l49J23M7j77
7849a52K39j07J65Ko3q6j73J78l3M6j27K33m4l6K03k76j39J68J95l44J24nJ7J47
7873A32k64JJ74j04j97K64J83k92K96j52J07j79K71r5k03J51r6j18P4m0K09q5
7895C7p4p2J92j9l5L9n3O2o0k08L02P6jo5j18k31L88p6j36j0j29N37k88J45k73
$$ plain form
7920 -70 111 64 7 60 61 -194 -70 -152 175 -60 165 119 -177 53 184 -321 -30 -24 221 -295 -96 -190 440 -155
7944 -155 -135 0 -355 13 -202 104 83 64 -129 80 -76 -16 -206 40 -98 -59 -184 32 -87 -65 153 163
7966 163 -19 95 -240 157 80 -1 34 -54 156 114 -111 -113 -180 -115 259 90 -201 -121 -218 -163 26 -314 0 -111
7990 -111 73 93 -330 50 -169 211 -161 -104 -201 -167 -181 72 249 -261 -271 -76 -159 293 -130 67 373 -96
8012 -96 12 148 17 -295 109 -28 259 217 243 -177 -80 -273 46 49 -2 91 424 -82 82 -39 154 165 -253
8035 -253 147 -58 158 169 44 -279 214 -46 148 -102 -635 -348 -53 44 -223 205 -44 -190 24 -159 255
8056 255 -118 -23 -5 18 263 -397 -108 -299 170 -196 275 93 -696 588 -216 143 206 -289 259 328 161
8077 161 131 -271 -176 -16 447 111 -84 -149 -331 306 102 -161 -446 150 9 64 -614 94 164 291 190 -126
$$ packed form
7920g0J81m7n7N3Jk55J24q2L27k35K25m6k96K30J31n05K91OK45n16J99r4O30n95
7944a55K0J35l55L68k15L06k1j9j93K09j56O0j90K46j38L9j25K16j19K2K18J0
7966A63j82J14l35L97p7q1L5q8K10m2k25ko7O5L74j69k91Q0r7N5J89l40L14j11
7990a11J84K0m23L80k19L80l72N7r7L4j4K53J77n10j0J95q3M52m23J97L06m69
8012i6J08J36j31l12M04j37K87m2K6m20R7j93L19Ln1R3L33n06J64j21J93J1m18
8035b53M00k05K16J1j25l23M93k60J94k50n33K87K95R7k67M28k49j46K14j83M14
8056B55l73R5J8K3K45o60K89j91M69l66M71j82p89J284q04L59O3m95N48O9j67
8077A61l0m02R5J60M63l36j95o5j82O37k04k63k85N96j41N5o78P08P0J27j01l16
$$ plain form
8099 -126 32 -434 -476 -134 0 694 116 253 -228 -510 236 200 -775 452 -431 344 -209 -155 124 -447 -47
8120 -47 105 157 179 426 -818 -535 -153 329 393 -620 -268 -488 675 -187 -560 -751 -27 -512 174 846
8140 846 -142 -401 -259 302 -522 112 824 -74 -4 -770 -239 -470 1004 758 -403 -180 -179 146 -343 -230
8160 -230 -401 -476 84 946 167 -824 404 -171 664 -933 -263 -138 -378 433 868 156 -99 443 46 -124
8180 -124 -377 50 -4 -308 604 201 61 186 101 -224 -67
$$ packed form
8099a26J58m66m2L42J34O94n78J37m81k82P46l6r75J227q83P75n53N4K79n71M00
8120d7J52N2K2K47j244K83L82M82O4j013L52k20J163q62l73j91P24m85O86O72
8140H46r88k59J42N61q24O34P12q98P0p66N31k31J474k46j161K23JL25m89J13
8160b30j71p5N60Q62p79r91J228n75Q35j597O70J25k40Q11M35p12k55N42l97j70
8180a24k53M27n4l04R12m03j40J25q5l25J57
8191f7
$$ Imaginary data points
##PAGE= N=2
##DATA TABLE= (X++(I..I)), XYDATA
$$ plain form
0 0 0 0 0 0 0 0 0 0 0 0 0 0 8 -8 8 -8 8 -16 16 -24 24 -32 32 -40 48 -56 64 -73 88 -97 112 -128 145 -167
34 -167 187 -211 236 -265 297 -331 368 -408 454 -503 555 -614 677 -747 823 -906 1000 -1100
52 -1100 1212 -1339 1479 -1639 1818 -2025 2268 -2552 2893 -3315 3845 -4538 5491 -6879 9113
67 9113 -13300 23949 -115813 -167269 1988 -8187 -13276 738 46554 19078 1745 55665
79 55665 119925 65602 7147 23886 81221 74450 3518 -42878 -31898 -61569 -92469 -53518
91 -53518 6750 7580 -33121 -46729 -7467 -964 -27195 -7780 31951 34162 28507 41435 64119
104 64119 50263 -998 -16909 -154 -11653 -25049 -11454 5031 -3954 -34597 -30733 10773
116 10773 10157 -17117 -7960 10999 2352 -14257 672 34882 13841 -41645 -36380 5408 15338
$$ packed form
0@%%%%%%%%%%%%Qj6J6j6J6k4L2m0M8n6O4p2Q8j04J20j37J61j85K09k40K73l12
34a67L54l98M47n01N62o28O99p76Q62r57J058j169J291j424J570j729J906k100
52a100K312k551K818l118L457l843M293m820N445o208P160q383J0029j2370J5992
67I113k2413L7249j39762n1456J69257j0175n089J4014M5816k7476j7333N3920
79E5665O4260n4323n8455J6739N7335o771p0932m6396J0980k9671l0900L8951
91e3518O0268Q30m0701j3608L9262O503k6231J9415L9731K211n655J2928K2684
104F4119j3856n1261j5911J6755j1499j3396J3595J6485q985l0643L864M1506
116A0773o16k7274R157J8959q647j6609J4929L4210k1041n5486N265M1788R930
$$ plain form
129 15338 7543 17213 40571 29810 -13182 -7782 34497 24173 -25568 -44775 -20792 -1975 -19974
142 -19974 -19089 18400 12242 -34783 -38476 5620 34989 16188 -2381 23584 35227 2664 -9226
155 -9226 11434 16408 -8770 -27324 -1600 26735 3612 -25128 -18763 -13888 -27042 -33896 -10653
168 -10653 20603 14222 1080 23601 39056 21945 2974 -15 6330 -13 -8360 6449 11074
181 11074 -17331 -35929 -29692 -17903 -10832 -7961 10017 22887 6135 -279 17984 22344 4954
194 4954 -9463 -1516 12772 2916 -2640 18384 18404 -13065 -31662 -19244 -420 -6769 -18844 -472
208 -472 12463 -7999 -18817 936 20873 13304 -5558 6952 30806 16691 -5463 1545 11097
221 11097 -3973 -27193 -20517 6593 3306 -16353 -5665 13304 7322 -11021 -11759 7227 8448
$$ packed form
129A5338p795R670K3358j0761m2992N400M2279j0324m9741j9207K3983J8817j7999
142a9974Q85L7489o158m7025l693M4096K9369j8801j8569K5965J1643l2563j1890
155i226K0660M974k5178j8554K5724K8335k3123k8740O365M875j3154o854K3243
168a0653L1256o381j3142K2521J5455j7111j8971k989O345o343q347J4809M625
181A1074k8405j8598O237J1789P071K871J7978J2870j6752o414J8263M360j7390
194D954j4417P947J4288r856n556K1024K0l1469j8597J2418J8824o349j2075J8372
208d72J2935k0462j0818J9753J9937p569j8862J2510K3854j4115k2154P008R552
221A1097j5070k3220O676K7110l287j9659J0688J8969n982j8343p38J8986J221
$$ plain form
234 8448 -10137 -4395 15365 10856 -5954 -8207 7759 14111 -1310 -2933 11319 5966 -9447
247 -9447 -8405 1337 2126 -12464 -17188 -2627 722 -4928 4470 14556 10242 -2418 -6161 4689
261 4689 5437 -5817 -898 7735 235 -8635 -3832 8692 7828 -7580 -5717 7816 697 -10862
275 -10862 -4025 7875 3531 -13538 -12263 8117 7755 -5811 2079 17967 14186 -5237 -10527 6239
289 6239 7629 -13537 -13962 4884 5574 -9465 -12885 6114 15727 -3227 -10476 7372 11280 -3494
303 -3494 -9279 3740 13303 -2320 -14674 -123 9720 -404 -4790 4485 11412 708 -13810
316 -13810 -5414 4614 -4583 -9654 -1542 4612 621 -5060 3576 13948 5665 -1639 4203 4989 -2310
331 -2310 -6066 -1039 4028 -4446 -11084 -1898 2547 -3555 -2777 4985 7994 -1138 -9240 1337 7123
$$ packed form
234H448j8585N742J9760m509j6810k253J5966O352j5421j623J4252n353j5413
247i447J042R742P89j4590m724J4561L349n650R398J0086m314j2660l743J0850
261D689P48j1254M919Q633p500q870M803J2524q64j5408J863J3533p119j1559
275a0862O837J1900m344j7069J275K0380l62j3566P890J5888l781j9423n290J6766
289F239J390k1166m25J8846O90j5039l420J8999R613j8954p249J7848L908j4774
303c494n785J3019R563j5623j2354J4551R843j0124m386R275O927j0704j4518
316a3810Q396J0028r197n071Q112O154l991n681Q636J0372q283p304N842P86p299
331b310l756N027N067q474o638R186M445o102P78P762L009r132q102J0577N786
$$ plain form
346 7123 -3251 -5295 4798 7679 -1072 -6308 5132 14351 1324 -7548 1825 4436 -6252 -13087
360 -13087 -3687 7151 -3293 -13845 -1583 9091 2225 -3552 4114 13899 4978 -9937 -2630
373 -2630 10003 2548 -7448 -2765 6517 2834 -8978 -3875 10154 4697 -7785 -6160 831 -577
387 -577 -9300 -7788 4896 4161 -5887 -2298 7228 8345 3254 2635 8687 6583 -4965 -4372 2836
402 2836 178 -4898 -4659 -1209 -1630 -7466 -3684 5034 1556 -4168 -1492 1434 -538 -4450 -140 9316
418 9316 4810 -3225 3045 9112 4686 -1636 -56 6650 -7 -13076 -8243 1849 -2622 -9841 -6242
433 -6242 3763 4002 -5712 -1120 13280 10541 -1407 -2098 5664 5410 -6032 -7733 5787 5863 -7075
448 -7075 -8004 1256 4322 -3675 -7727 2883 6672 -5264 -7377 2524 6679 1153 -2956 3494 8926
$$ packed form
346G123j0374k044J0093K881q751n236J1440R219j3027q872R373K611j0688o835
360a3087R400J0838j0444j0552J2262J0674o866n777P666R785q921j4915P307
373b630J2633p455r996M683R282l683j1812N103J4029n457j2482J625O991j408
387e77q723J512J2684p35j0048L589R526J117n091o19O052k104j1548N93P208
402B836k658n076K39L450m21n836L782Q718l478n724K676K926j972l912M310R456
418I316m506q035O270O067m426o322J580O706o657j3069M833J0092m471p219L599
433f242J0005K39r714M592J4400k739j1948o91P762k54j1442j701J3520P6j2938
448g075r29R260L066p997m052J0610L789j1936k113R901M155n526m109O450N432
$$ plain form
463 8926 824 -3500 5146 6882 -1040 -7471 -6120 -1918 -6173 -8337 828 4437 -1005 -2415 2335
478 2335 5961 4111 1112 5102 5396 -2707 -3680 1476 2069 -1569 -4467 -566 1694 -4093 -3729 4726
494 4726 3989 -3260 -5792 -896 2281 -4060 -5953 4508 6873 -1728 -2396 4960 8430 842 -5285
509 -5285 2899 7228 -3366 -7885 101 5486 -276 -6792 -218 7246 -2203 -9681 -1469 6145 1425
524 1425 -7093 -4713 3196 -1478 -8525 38 9987 7037 261 1338 9153 8316 -1126 -773 3053 -2675
540 -2675 -8978 -6740 1022 2763 -5074 -7324 -2060 -3261 -5409 53 5819 5664 499 -766 4762
555 4762 4172 -66 3109 5438 2665 721 2152 5649 1302 -7443 -7125 -4057 -7429 -8181 -2754 2914
571 2914 1884 -3404 -21 7288 2776 -3335 990 7506 5937 -212 138 4866 -984 -10218 -5414
$$ packed form
463H926q102m324Q646J736p922o431J351M202m255k164R165L609n442j410M750
478B335L626j850k999L990K94q103r73N156N93l638k898L901K260n787L64Q455
494D726p37p249k532M896L177o341j893J0461K365q601o68P356L470p588o127
509e285Q184M329j0594m519P986N385n762o516O574P464r449p478Q212P614m720
524A425q518K380P909m674p047Q563R949k950o776J077P815q37r442L53L826n728
540b675o303K238P762J741p837k250N264j201k148N462N766j55n165j265N528
555D762n90m238L175K329k773j944J431L497m347q745L18L068l372p52N427N668
571B914j030n288L383P309m512o111M325O516j569o149L50M728n850r234M804
$$ plain form
586 -5414 4093 4272 -2080 -2927 3848 3590 -5033 -4177 2597 406 -7137 -6389 4020 9448 1225 -2871
602 -2871 1976 816 -4631 -3226 4863 8133 -48 -6187 -283 3382 -793 -1754 1577 3110 -498
617 -498 -3239 3141 6268 -1000 -6553 -4900 -4022 -3794 -2784 1639 4703 406 -874 3892 4312 903
633 903 -198 742 2191 -349 -208 3754 1607 -5522 -5076 -814 1323 -1358 -2207 2199 2398 -3718 -2200
650 -2200 3477 1440 -4549 -6350 1181 7423 3662 1737 5525 2445 -5336 -6942 -35 5436 -836
665 -836 -6574 -448 3361 -730 -2507 1194 3689 -1855 -6437 898 8849 4499 -2204 -2706 -1418 -3180
681 -3180 -5653 -608 7223 3774 -1850 338 3708 1857 -2941 -4175 52 -548 -2970 1238 5049
696 5049 2068 -2210 -3789 -340 560 -1498 457 3211 838 -911 -105 736 -1390 -4959 -2809 2317
$$ packed form
586e414R507J79o352q47O775k58q623Q56O774k191p543P48J0409N428q223m096
602b871M847j160n447J405Q089L270q181o139N904L665m175r61L331J533l608
617d98k741O380L127p268n553J653Q78K28J010M423L064m297j280M766M20l409
633I03j101R40J449k540J41L962k147p129M46M262K137k681q49M406J99o116J518
650b200N677k037n989j801P531O242l761j925L788l080p781j606O907N471o272
665h36n738O126L809m091j777L701K495n544m582P335P951m350o703n02J288j762
681c180k473N045P831l449n624K188L370j851m798j234M227o00k422M208L811
696E049k981m278j579L449R00k058J955K754k373j749Q06Q41k126l569K150N126
$$ plain form
712 2317 2787 2735 4610 2936 -2341 -5833 -3304 1716 -108 -3183 39 2398 524 -971 1638 4095
728 4095 -503 -6250 -1421 5060 3617 -565 -315 554 -2032 -6628 -2669 5617 3776 -1972 -985 2952
744 2952 2943 -2841 -3792 1519 475 -4607 -2279 4764 5478 432 -2994 1289 2165 -2950 -2647 2002 2474
761 2474 -940 -2985 -34 2375 -2168 -4102 407 2485 1739 1467 2321 2363 -1272 -3843 -515 700
777 700 -1634 -1285 396 1554 1457 512 2200 691 -3755 -3671 -69 1191 895 912 1673 577 -3578 -2246
795 -2246 2761 2328 -427 -166 1593 2342 -1374 -2662 1476 271 -4918 -3721 1933 4247 1555 -1193
811 -1193 2344 2737 -3657 -4615 694 2608 -472 -2617 740 4283 -886 -3751 352 2656 95 -2331
827 -2331 347 3816 494 -4217 -1072 1630 -920 -3129 -925 3058 3088 -445 634 3169 -846 -3700
$$ packed form
712B317M70n2J875j674n277l492K529N020j824l075L222K359j874j495K609K457
728D095m598n747M829O481j443m182K50Q69k586m596L959Q286j841n748R87L937
744B952rn784r51N311j044n082K328P043P14n046l426M283Q76n115L03M649M72
761B474l414k045K951K409m543j934M509K078p46k72Q54M2l635k571L328J215
777G00k334L49J681J158r7r45J688j509m446Q4L602J260k96J7P61j096m155J332
795b246N007m33k755K61J759P49l716j288M138j205n189J197N654K314k692k748
811a193L537L93o394r58N309J914l080k145L357L543n169k865M103K304k561k426
827b331K678L469l322m711L145K702k550k209K204L983L0l533J079K535m015k854
$$ plain form
843 -3700 -2281 868 1651 -999 -431 1963 -245 -2097 -85 1445 1169 -407 -530 1704 583 -1191
859 -1191 707 946 -1600 -1957 -481 1918 1138 -740 1226 1705 -2550 -3989 -1122 1037 41 -1831
875 -1831 474 3845 646 -1899 1749 3715 1066 -2170 -1062 2631 -78 -3857 -1190 1578 -726
890 -726 -4305 -2615 2122 2659 -1482 61 3514 1451 -2395 -1932 1828 2987 -1008 -1236 2606 1861
906 1861 -1684 -1684 721 1529 -2180 -3961 -80 1076 -1585 -1144 848 1470 -71 -1509 1271 3139 725
923 725 426 1546 334 -1284 -1919 -561 508 -1028 -1185 1094 531 -773 229 1183 1012 -1052 -1870
940 -1870 594 -363 -2012 -325 1470 395 -1411 -1582 1595 2261 -848 407 2895 1482 -1788 -1758
956 -1758 1303 2266 -1405 -2579 1483 1016 -1992 -2158 344 2000 -1642 -4066 113 2042 -531 -798
$$ packed form
843c700J419L149P83k650N68K394k208j852K012J530k76j576j23K234j121j774
859a191J898K39k546l57J476K399p80j878J966M79m255j439K867K159r96j872
875a831K305L371l199k545L648J966k649l236J108L693k709l779K667K768k304
890g26l579J690M737N37m141J543L453k063l846M63L760J159l995k28L842p45
906A861l545%K405Q08l709j781L881J156k661M41J992O22j541j438K780J868k414
923G25k99J120j212j618o35J358J069j536j57K279n63j304J002R54j71k064q18
940a870K464r57j649J687J795j075j806j71L177O66l109J255K488j413l270L0
956a758L061R63l671j174M062m67l008j66K502J656l642k424M179J929k573k67
$$ plain form
972 -798 1779 3506 1225 -1635 1148 3973 585 -1438 -598 305 -1318 -3950 -2315 894 -375 -2505
988 -2505 -529 1295 1151 93 533 3153 2030 -1052 117 1020 251 -271 -96 341 -216 -2156 -1047
1005 -1047 572 -611 -951 35 -188 -422 -1007 766 2299 628 58 1828 1145 -4 -696 423 1495
1022 1495 -995 -3232 -874 184 -1487 -1657 -60 1995 727 -2084 493 3284 1063 -1149 316
1037 316 1695 224 -2611 -1086 2424 549 -2447 -760 1066 727 -1596 -1579 1947 1066 -2043 -1644
1053 -1644 897 751 -357 -1076 1585 2377 -865 -1211 1255 1235 -172 -1046 -283 665 -863 -1270 1129
1070 1129 1090 -135 -418 -338 374 -46 -902 717 694 -1259 -876 -121 58 382 404 1421 1249 -312 395
1089 395 1730 258 -625 -652 48 -253 -2011 -1113 1295 -30 -1782 -743 470 719 -996 -699 2057
$$ packed form
972g98K577J727k281k860K783K825l388k023Q40R03j623k632J635L209j269k130
988b505J976J824j44j058M40K620j123l082J169R03p69n22J75M37n57j940J109
1005a047J619j183l40R86k23k34n85J773J533j671n70J770o83j149o92J119J072
1022A495k490k237K358J058j671j70J597K055j268k811K577K791k221k212J465
1037C16J379j471k835J525L510j875k996J687J826l39k323J7L526q81l109L99
1053a644K541j46j108p19K661P92l242l46K466k0j407q74P63R48j528m07K399
1070A129l9j225k83Q0P12m20q56J619k3j953L83P55J79L24K2J017j72j561P07
1089C95J335j472q83k7P00l01j758Q98K408j325j752J039J213K49j715K97K756
$$ plain form
1106 2057 1379 -1438 -717 1352 1563 -357 -894 1633 2235 -1048 -1922 120 693 -1111 -2034 -175 1048
1123 1048 -1167 -2183 766 1962 508 -749 210 1616 655 -808 897 1575 -323 -1715 -1226 274
1139 274 264 -860 -443 622 -426 -1091 -356 477 358 -713 -752 581 -52 -106 1420 1162 410 -78 -498
1158 -498 526 61 -947 549 47 -1143 -973 -322 -101 -521 -914 1047 1433 224 -376 1090 910 -333
1176 -333 -1177 -114 1190 -470 -1315 785 1113 -89 -1271 -420 394 -708 -1947 320 1870 601
1192 601 -1165 -404 876 872 -790 374 1907 505 -1133 -385 1135 859 -1269 -1952 -136 -115 -573 71
1210 71 1165 1096 -486 -1503 306 559 -283 163 414 474 129 -334 291 561 -1040 -488 303 -203 254
1229 254 326 30 15 -1428 -973 201 23 -190 579 999 776 3 37 630 -505 -1398 177 1415 807
$$ packed form
1106B057o78k817P21K069K11j920n37K527O02l283q74K042N73j804r23J859J223
1123A048k215j016K949J196j454j257R59J406r61j463J705O78j898j392M89J500
1139B74j0j124M17J065j048o65P35Q33j19j071l9J333o33n4J526k58p52m88m20
1158d98J024m65j008J496n02j190J70O51K21m20l93J961L86j209o00J466j80j243
1176c33q44J063J304j660q45K100L28j202j182Q51Q14j102j239K267J550j269
1192F01j766P61J280mj662J164J533j402j638P48J520k76k128o83J816K1m58O44
1210G1J094o9j582j017J809K53q42M46K51O0l45m63O25K70j601N52P91n06M57
1229B54P2k96j5j443M55J174j78k13P69M20k23p73L4N93j135q93J575J238o08
$$ plain form
1248 807 -251 -473 416 68 -1194 -59 1114 32 -1431 -749 1061 1051 -944 -920 623 43 -717 380
1266 380 1827 2084 -152 -1441 186 436 -1118 -606 438 456 -581 -1263 530 1188 -422 -1433 -410
1283 -410 235 152 -71 621 1632 43 -1077 -312 303 156 184 -119 579 530 -502 -235 -343 -1035 -918 -396
1303 -396 313 729 115 627 498 -243 -39 653 3 47 -165 738 878 -198 -249 -31 -826 -1348 -603 341
1323 341 1249 -23 -713 135 208 -597 -374 602 848 68 -549 950 1924 245 -844 -269 -331 -408 -1286 -58
1343 -58 973 -114 -1175 -603 90 -207 -513 20 1224 946 -203 267 872 132 -527 -888 401 341 -266
1362 -266 -131 380 -159 -690 -732 -537 -50 -777 -485 593 610 315 194 -41 -39 -107 240 983 783 -115 -150 -47
1384 -47 -531 -566 -422 -256 -114 -529 -33 569 -78 -231 -195 -132 -341 -519 26 1272 663 -188 438 361 -96
$$ packed form
1248H07j058k22Q89l48j262J135J173j082j463O82J810j0j995K4J543n80p60J097
1266C80J447K57k236j289J627K50j554N12J044J8j037o82J793O58j610j011J023
1283d10O45q3k23O92J011j589j120P65O15j47K8l03O98m9j032K67j08o92J17N22
1303c96P09M16o14N12j29p41K04O92o50M4k12R03J40j076n1K18p95n22P45R44
1323C41R08j272o90Q48P3q05K23R76K46p80o17J499R74j679j089N75o2p7q78J228
1343e8J031j087j061N72O93k97l06N33J204k78j149M70O05p40o59l61J289o0o07
1362b66J35N11n39n31m2J95M87p27K92J078J7k95j21k35Ko8L47P43k00q98l5J03
1384d7m84l5J44J66J42m15M96O02o47j53L6O3k09j78N45J246o09q51O26p7m57
$$ plain form
1405 -96 -410 -256 873 258 -690 -54 400 -111 -858 -1063 265 391 -395 -312 1000 836 -146 -307 238 466
1425 466 -778 -465 553 879 235 -142 -348 379 41 -617 20 399 -368 -118 -248 178 -81 -637 -190
1444 -190 99 -54 289 430 608 424 -19 -156 0 -360 -443 290 65 -83 53 -257 -239 -350 -767 149 -71
1465 -71 -96 -103 -170 49 -121 -41 406 180 -305 -369 438 377 -93 -159 -64 244 -567 -604 44 223 -22 -151 92 423
1489 423 243 -366 228 583 -50 -310 -11 490 90 -262 -137 100 -286 -542 -187 78 221 -368 -347 188
1509 188 -78 -260 -6 246 339 88 -56 91 132 -388 -152 239 -116 -23 -538 -23 -15 -165 -127 -302 -121 136
1531 136 34 277 386 33 41 -148 -355 63 434 274 -90 90 76 -20 -375 -412 262 -43 -235 -518 -15 181
1553 181 73 -231 437 266 -331 -231 219 311 11 -211 -290 377 -327 -494 34 208 -74 -439 -8 122 -70
$$ packed form
1405i6l14J54J129o15r48O36M54n11p47k05J328J26p86Q3J312j64r82j61N45K28
1425D66j244L13J018L26o44l77k06P27l38o58O37L79p67K50j30M26k59n56M47
1444a90K89j53L43J41J78j84m43j37J56l60q3P33k25j48J36l10J8j11m17R16k20
1465g1k5po7K19j70Q0M47k26m85o4Q07o1m70o6R5L08q11l7O48J79k45j29K43L31
1489D23j80o09N94L55o33k60K99N01m00l52J25K37l86k56L55K65J43n89K1N35
1509A88k66j82K54K52R3k51j44J47M1n20K36L91l55R3n15N15Qj50L8j75J81K57
1531A36j02K43J09l53Qj89k07M18L71j60l64J80j4r6l55l7O74l05j92k83N03J96
1553A81j08l04O68j71n97J00M50R2l00k22p9O67p04j67N28J74k82l65M31J30j92
$$ plain form
1574 -70 -452 -215 312 -135 -470 -65 390 302 30 136 40 -128 -176 -7 -11 211 -257 -132 -410 -334 -112 147
1596 147 61 79 -229 -29 283 -19 -29 84 -332 -129 -129 -139 291 220 -71 215 211 -42 -166 -11 361 128 -126
1619 -126 -114 215 -169 -23 42 251 163 -300 -67 372 -79 -307 -151 19 143 -56 -74 367 94 -189 -30
1640 -30 90 -169 -233 -24 0 154 -235 -341 -65 152 146 -11 261 316 149 -64 273 145 24 -26 188 325
1662 325 -106 -415 -11 27 -195 -326 -481 124 121 -99 11 161 167 35 123 -320 -143 272 84 -60 -201 -66
1684 -66 -107 -206 -122 -175 -163 -113 -150 -104 299 202 -308 335 523 -80 -102 -238 336 -18 -473 -33 14 -220 -65 -209
1708 -209 250 388 -439 -210 330 -45 104 -161 206 451 -144 -385 340 364 -134 -155 -239 -59 -152 -597 33
1729 33 265 -259 -218 177 15 153 -273 125 430 -91 -330 2 -204 105 -123 -304 -63 9 47 -96 33
$$ packed form
1574g0l82K37N27m47l35M05M55q8k72J06r6j68m8J69mK22m68J25k78P6K22K59
1596A47q6J8l08K00L12l02j0J13m16K03%j0M30p1k91K86mk53j24J55L72k33k54
1619a26J2L29l84J46O5K09q8m63K33M39m51k28J56J70J24j99j8M41k73k83J59
1640c0J20k59o4K09K4J54l89j06K76K17oj57K72N5j67k13L37j28j21n0K14J37
1662C25m31l09M04L8k22j31j55O05lk20J10J50Oj32Q8m43J77M15j88j44j41J35
1684f6m1r9Q4n3J2N0l7M6M03r7n10O43J88o03k2j36N74l54m55M40M7k34J55j44
1708b09M59J38q27K29N40l75J49k65L67K45n95k41P25K4m98k1q4J80r3m45O30
1729C3K32n24M1L95j62J38m26L98L05n21k39L32k06L09k28j81K41P2L8j43J29
$$ plain form
1750 33 146 22 -8 76 166 -123 97 71 -218 0 -134 0 -14 -164 97 -10 -233 -96 62 -58 -186 -176
1772 -176 137 234 -670 -383 238 214 -235 -30 153 267 -194 -457 297 103 -125 -303 -55 170 57 66 -15 420
1794 420 -261 -728 -130 282 294 -177 -204 543 220 -123 7 222 288 -131 -190 197 25 -192 -290 48 -75 70
1816 70 -248 70 392 -102 -116 148 69 -35 -165 -33 84 41 -123 206 120 121 57 -57 -190 410 170 113 -128
1839 -128 -405 -332 17 -376 -24 104 176 293 33 270 335 -61 -183 -181 -190 337 121 144 287 -152 -309 -150 -103
1862 -103 -9 -305 -499 282 80 -287 46 398 86 -228 -199 200 565 221 -82 281 209 11 -125 -41 489
1883 489 -103 -437 31 77 -109 -49 -112 -162 80 -262 334 492 206 -28 -145 -41 89 -91 -183 115 -239 173
1905 173 75 -69 -125 -393 -367 58 -156 112 486 -99 -17 269 198 206 -246 -211 70 -39 -346 115 243 -215 -604
$$ packed form
1750C3J13j24l0Q4R0k89K20k6k89K18j34J34j4j50K61j07k23J37J58j20j28J0
1772a76L13R7r04K87O21k4m49K05J83J14m61k63P54j94k28j78K48K25j13Rq1M35
1794D20o81m67N98M12J2m71k7P47l23l43J30K15O6m19n9L87j72k17r8L38j23J45
1816G0l18L18L22m94j4K64p9j04j30J32J17m3j64L29q6Jo4j14j33O00k40n7k41
1839a28k77P3L49l93L52J28P2J17k60K37O5l96j22KrN27k16K3J43m39j57J59M7
1862a03R4k96j94P81k02l67L33L52l12l14K9L99L65l44l03L63p2j98j36Q4N30
1883D89n92l34M68M6j86O0o3n0K42l42N96J58k86k34j17J04J30j80r2K98l54M12
1905A73r8j44n6k68K6M25k14K68L74n85Q2K86p1Qm52L5K81j09l07M61J28m58l89
$$ plain form
1928 -604 -690 52 217 -310 36 433 73 -31 21 88 388 -86 0 251 338 269 -191 -192 -66 -166 -614 -389 390
1951 390 21 -117 -291 143 100 -239 -223 300 256 200 -80 35 -1 -77 -315 -60 -123 49 170 -35 51 98 -193
1974 -193 -34 -67 -225 32 103 229 201 148 126 122 93 -31 -146 109 503 257 -41 -227 -108 30 50 -371 -363 222
1998 222 182 -72 52 -20 362 -77 -183 132 214 123 -52 360 130 179 -298 -152 -48 -276 -108 218 254 -71
2020 -71 -468 -133 205 194 -172 -29 -156 290 241 -127 342 289 132 -22 69 314 219 25 79 331 -115 -403
2042 -403 -27 112 80 -108 -221 405 -54 -216 23 -125 207 155 61 441 384 -30 236 48 -185 -45 92
2063 92 -257 -115 -41 102 164 -218 -102 151 -229 158 229 234 247 -202 120 123 140 -205 -163 -209 -193 -309 -436 41
2087 41 -128 -611 -501 7 54 298 -42 352 527 56 -28 245 286 157 -202 54 263 191 -606 -243 -64 -99
$$ packed form
1928f04q6P42J65n27L46L97l60j04N2O7L00m74Q6K51Q7o9m60jJ26j00m48K25P79
1951C90l69j38j74M34m3l39J6N23m4n6k80J15l6p6k38K55o3J72J21k05Q6M7k91
1974a93J59l3j58K57P1J26k8n3k2mk9j24j15K55L94k46k98j86J19J38K0m21QN85
1998B22m0k54J24p2L82m39j06L15Q2r1j75M12k30M9m77J46J04k28J68L26L6l25
2020g1l97L35L38j1l66J43j27M46m9l68M69n3j57j54R1K45r5j94N4K52m46k88
2042d03L76J39l2j88j13O26m59j62K39j48L32n2r4L80n7m14K66j88k33J40J37
2063I2l49J42P4J43O2l82J16K53l80L87P1NJ3m49L22LJ7l45M2m6J6j16j27M77
2087D1j69m83J10N08M7K44l40L94J75m71q4K73M1j29l59K56K09p2p97L63J79l5
$$ plain form
2109 -99 -458 -403 117 161 94 139 272 36 547 267 296 457 219 115 168 122 8 -42 -355 -67 -87 -52 -73 -177
2133 -177 -256 157 -320 -58 224 -242 221 -239 7 434 206 -329 97 -122 -107 -263 -48 280 18 -502 -252
2154 -252 106 -102 -138 -202 -129 -98 -3 21 179 -26 216 -77 150 351 257 61 283 179 134 41 -298 -93 -15
2177 -15 -261 -180 -229 -134 87 -306 -277 126 -8 -144 70 209 56 155 -21 140 124 -348 -191 41 -172 -73 -196
2200 -196 -188 -106 -388 -279 -61 -153 133 143 77 25 238 209 246 256 -65 16 -311 -252 112 -97 -45 -334 -109 -76 -199
2225 -199 -184 146 259 93 -142 233 -84 304 -308 408 259 -51 -122 -144 248 -52 -240 -352 35 -140 -372
2246 -372 -231 0 246 317 -159 374 231 132 347 134 287 432 -357 -45 84 -140 -126 -88 -82 99 -386 -283
2268 -283 188 -174 -182 -44 -124 8 104 74 88 293 198 121 -15 191 191 105 34 -46 -108 -262 -198 -167 258 -206 -300 -98
$$ packed form
2109i9l59N5N20M4o7M5J33k36N11k80K9J61k38j04N3m6j14n0l13K88k0L5k1j04
2133a77p9M13m77K62K82m66M63m60K46M27k28n35M26k19J5j56K15L28k62n20K50
2154b52L58k08l6o4P3L1R5K4J58k05K42k93K27K01r4j96K22j04m5r3l39K05P8
2177a5k46Q1m9R5K21l93K9M03j34j36K14J39j53R9j76J61j6m72J57K32k13R9j23
2200a96QQ2k82J09K18r2K86J0o6n2K13k9L7J0l21Q1l27N9L64k09N2k89K25L3j23
2225a99J5L30J13j66k35L75l17L88o12P16j49l10p1k2L92l00j88j12L87j75k32
2246c72J41K31K46P1m76N33j43r9K15k13J53J45p89L12J29k24J4L8OJ81m85J03
2268b83M71l62qJ38q0J32R6l0J4K05r5p7j36K06%q6p1q0o2j54O4L1M25m64r4K02
$$ plain form
2294 -98 90 144 54 -134 259 330 -17 -83 158 141 118 58 -139 101 134 -370 -72 -165 -204 -364 -269 138 359 -129
2318 -129 -27 91 -49 265 55 46 453 -26 33 7 -4 -31 -107 -266 162 -24 -365 -113 -217 -253 -38 -309 -14
2341 -14 265 254 72 158 -12 278 -14 15 278 143 81 -107 -110 107 -120 -342 -208 -54 19 -40 -223 19 182
2364 182 -198 -6 370 314 53 63 -159 202 -7 -112 105 -111 -142 -22 -395 -16 417 -150 -257 59 56 -87
2386 -87 -31 -105 461 107 55 253 304 160 -146 -309 -102 43 -313 -142 151 13 -46 -134 -276 177 -52 -110 173
2409 173 410 149 306 -41 71 420 25 232 47 17 -335 -377 -194 73 -229 -186 -245 -205 207 -9 -417 232
2431 232 -85 -175 32 -158 287 198 247 183 495 -219 -15 29 -275 20 -316 -284 -163 -54 -303 -197 -107 59
2453 59 224 39 245 296 201 357 131 127 298 40 172 113 16 -208 -197 -487 -248 -181 -549 10 136 182 233 -117
$$ packed form
2294i8J88N4r0j88L93P1l47o6K41j7k3o0j97K40L3n04K98r3l9j60R5M07K21m88
2318a29J02J18j40L14k10rM07m79N9k6j1k7p6j59M28j86l41K52j04l6K15k71K95
2341a4K79j1j82Q6j70K90k92K9K63j35o2j88lK17k27k22J34J54P3n9j83K42J63
2364A82l80J92L76n6k61J0k22L61k09j05K17k16l1J20l73L79M33n67j07L16lj43
2386h7N6p4N66l54n2J98N1j44l06j63K07J45l56J71K93j38n9q8j42M53k29n8K83
2409A73K37k61J57l47J12L49l95K07j85l0l52m2J83K67l02M3n9M0M12k16m08O49
2431B32l17r0K07j90M45q9M9o4L12p14K04M4l04K95l36L2J21J09k49J06R0J66
2453E9J65j85K06N1r5J56k26mJ71k58J32n9r7k24J1k90K39O7l68N59J26M6N1l50
$$ plain form
2477 -117 83 345 -185 -45 471 163 148 125 44 66 -215 -249 -45 -184 -21 -446 -171 -65 109 -139 0 377
2499 377 121 153 -44 311 340 -71 -139 46 -83 -95 -230 -341 203 263 -87 34 12 -185 -155 -162 -135 378 137
2522 137 214 115 399 337 -50 -40 -1 -135 -116 12 -186 86 58 -386 -209 -47 -621 -255 57 163 378 351 57
2545 57 395 67 44 0 -424 63 220 -96 64 247 -275 -285 -430 15 164 -272 159 76 18 177 33 -166
2567 -166 415 127 136 491 542 312 153 -154 185 -232 -416 -206 164 -231 -243 -147 -266 -125 -267 -331 236 110
2589 110 -7 59 161 661 221 117 92 197 92 98 83 27 8 -233 -503 -251 -163 -298 -299 -97 -22 25 -224 14
2613 14 225 162 178 -89 131 328 183 144 283 -352 -49 -246 -122 -188 101 -333 -375 -48 -272 148 -180 -156
2635 -156 122 -16 349 238 -115 228 -78 -186 -152 -102 5 122 -39 -139 -134 -279 87 -30 -97 5 -307 276
$$ packed form
2477a17K00K62n30J40N16l08j5k3q1K2k81l4K04j39J63m25K75J06J74k48J39L77
2499C77k56L2j97L55K9m11o8J85j29j2j35j11N44O0l50J21k2j97L0pK7N13k41
2522A37P7r9K84o2l87J0L9j34J9J28j98K72k8m44J77J62n74L66L12J06K15k7k94
2545E7L38l28k3m4m24M87J57l16J60J83n22j0j45M45J49m36M31q3n8J59j44j99
2567a66N81k88RL55N1k30j59l07L39m17j84K10L70l95j2R6j19J41j42o4N67j26
2589A10j17O6J02N00m40j04k5J05j05Oj5n6j9k41k70K52Q8j35jK02P5M7k49K38
2613A4K11o3J6k67K20J97j45l9J39o35L03j97J24o6K89m34m2L27k24M20l28K4
2635a56K78j38L65j11l53L43l06j08L4N0J07J17j61j00Nj45L66j17o7J02l12N83
$$ plain form
2657 276 240 -205 56 67 -143 -90 -82 -34 61 -124 112 69 -126 -198 8 -425 -98 127 -59 169 277 26 102
2680 102 13 -126 141 80 17 190 260 -136 -74 -264 279 -4 -237 113 -174 249 92 -132 -195 261 -27 -89
2702 -89 99 18 -163 -220 38 174 120 -132 95 -169 214 -22 -155 53 156 -187 -105 -150 -127 48 -73 76
2724 76 442 0 66 -74 -56 -141 57 -322 293 241 -227 -102 -277 -260 103 -242 -92 50 67 93 211 70 132
2747 132 -230 -243 189 135 -127 25 -56 -81 -132 -80 -115 -20 -298 120 317 -143 -53 -121 101 158 186 14 282 -34
2771 -34 148 276 -52 155 2 -210 89 102 73 109 -317 -205 -322 -46 90 -88 111 155 120 -58 353 223
2793 223 69 264 103 75 243 -91 -153 5 -40 -23 64 -119 66 -60 -116 105 -111 -73 -22 -80 276 -11 -78
2816 -78 306 145 69 142 15 -42 240 -212 -91 67 -82 207 -170 30 278 -132 -50 32 -247 -90 275 -51
$$ packed form
2657B76l6m45K61J1k10N3QM8R5j85K36m3j95p2K06m33L27K25j86K28J08k51P6
2680A02q9j39K67o1o3J73P0l96O2j90N43k83k33L50k87M23j57k24o3M56k88o2
2702h9J88q1j81n7K58J36n4k52K27k64L83k36j33K08J03l43Q2m5K3J75j21J49
2724G6L66m42O6j40J8q5J98l79O15n2m68J25j75J7L63l45J50J42J7K6J18j41O2
2747A32l62j3M32n4k62J52q1k5n1N2l5R5k78M18J97m60R0o8K22N7K8j72K68l16
2771c4J82J28l28K07j53k12K99J3k9L6m26J12j17K76J36j78J99M4l5j78M11j30
2793B23j54J95j61k8J68l34o2J58m5J7Q7j83J85j26n6K21k16L8N1n8L56k87o7
2816g8L84j61p6P3j27n7K82m52J21J58j49K89l77K00K48m10Q2Q2k79J57L65l26
$$ plain form
2838 -51 289 354 -190 338 180 -61 92 92 -198 186 -251 57 -296 -288 -11 -40 -164 -31 -232 245 20 67 40
2861 40 -1 195 -313 251 161 32 -109 20 26 144 -477 -124 177 -70 1 -363 48 88 -120 194 74 38 44
2884 44 50 151 181 27 -103 183 -162 -103 -91 -170 -65 -152 -437 -208 18 -72 144 -69 216 235 -168 19 104 -75
2908 -75 138 162 23 -99 -19 -37 148 -47 -248 -49 -80 61 190 -226 26 102 -88 85 121 49 -67 -91 -12
2931 -12 54 176 13 324 -200 -42 44 14 -295 9 -59 -85 -78 -109 223 -116 -204 -292 -47 165 26 60 -123 280
2955 280 -98 117 152 45 350 -45 -4 -155 -292 -24 -244 124 191 -166 -447 121 -20 -13 13 23 -74 213 121
2978 121 230 -81 43 -181 -92 -219 -262 139 93 237 88 50 160 -283 -24 -10 -226 110 -109 -164 165 -46
3000 -46 -207 -187 37 3 0 -4 40 237 -334 326 133 61 -3 33 49 -12 -212 -42 -95 -16 126 -125 -15 23 21 -225
$$ packed form
2838e1L40O5n44N28j58k41J53%k90L84m37L08l53QK77k9j24J33k01M77k25M7k7
2861D0m1J96n08N64r0j29j41J29OJ18o21L53L01k47P1l64M11M0k08L14j20l6O
2884D4OJ01L0j54j30K86l45N9J2p9J05q7k85K29K26r0K16k13K85J9m03J87Q5j79
2908g5K13K4j39j22Q0j8J85j95k01J99l1J41J29m16K52P6j90J73L6p2j16k4P9
2931a2O6J22j63L11n24J58Q6l0l09L04o8k6Pl1L32l39q8q8K45K12j39L4j83M03
2955B80l78K15L5j07L05l95M1j51j37K68k20L68O7l57k81N68j41PK6J0r7K87r2
2978A21J09l11J24k24Q9j27m3M01m6J44j49l8J10m43K59J4k16L36k19n5L29k11
3000d6j61K0K24l4lmM4J97n71O60j93p2o4L6J6o1k00J70n3P9J42k51J10L8kk46
$$ plain form
3026 -225 246 245 -53 -159 22 3 257 86 27 405 -90 104 -53 84 0 -285 -47 -194 17 -116 125 -63
3048 -63 25 -70 26 3 74 -19 -37 77 -242 99 34 65 194 -161 -1 -44 -29 206 55 33 29 -106 84 276 -1
3073 -1 310 148 -84 -32 -122 -19 -28 184 -182 -16 0 -126 62 -101 52 -93 -159 124 105 -63 115 127 96 187
3097 187 167 37 281 -30 19 71 -113 43 -210 51 112 119 82 -191 -55 -94 -170 -227 128 92 2 -156 121 90
3121 90 279 -239 -31 412 154 -65 123 155 237 -86 -124 -257 -25 -88 -103 -134 -273 -314 -189 -87 -17 -70 171
3144 171 226 51 -7 406 -105 -93 -10 89 -53 -30 52 360 -6 -294 -124 -97 190 -41 -132 137 -85 -213 -58
3167 -58 178 -118 -80 -1 -8 385 -124 -77 75 104 102 -105 -58 165 25 -77 235 55 79 -163 -112 -118 108 -210 149
3192 149 99 231 68 -28 -292 -37 -98 -127 181 -108 -117 111 -211 7 -281 -190 30 -84 -277 76 -238 103
$$ packed form
3026b25M71jk98j06J81j9K54j71n9L78m95J94j57J37q4k85K38j47K11j33K41j88
3048f3Q8r5R6k3P1r3j8J14l19L41o5L1J29l55J60m3J5K35j51k2mj35J90J92k77
3073aL11j62k32N2r0J03rK12l66J66J6j26J88j63J53j45o6K83j9j68J78J2l1R1
3097A87k0j30K44l11M9N2j84J56k53K61O1Pl7k73J36l9p6n7L55l6r0j58K77l1
3121I0J89n18K08M43k58k19J88L2Q2l23l8j33K32o3j5l1j39m1J25J02P0n3K41
3144A71N5j75n8M13n11J2Q3R9j42K3Q2L08l66k88J70K7K87k31r1K69k22j28J55
3167e8K36k96L8P9pL93n09M7J52K9kk07M7K23j40j02L12j80K4k42N1oK26l18L59
3192A49n0J32j63r6k64K55o1k9L08k89rK28l22K18k88R1K20j14j93L53l14L41
$$ plain form
3214 103 -121 209 -57 54 95 91 144 -154 156 -204 -20 -156 17 177 -186 163 240 -27 -88 54 -193 -71
3236 -71 105 -96 -97 166 -85 -53 -21 57 29 -3 33 244 71 -44 136 -14 17 41 -258 -134 145 -34 92 114
3260 114 52 99 -26 -196 200 23 208 106 -29 13 -225 47 42 236 403 -52 -160 112 34 -273 -131 -34
3282 -34 -418 -170 -230 58 279 -142 -255 -109 89 -26 -107 -20 56 33 -46 -19 44 -270 31 247 1 -71 25 -16
3306 -16 -31 26 -36 41 -124 -99 -378 159 -112 2 73 340 173 -221 97 -196 11 -105 257 15 133 46 209
3329 209 -165 -62 -412 -59 180 83 0 45 122 110 -63 85 253 36 206 198 -35 -75 150 137 -112 -19 32 -79
3353 -79 239 -174 -205 -110 -49 22 41 -4 89 -76 -241 -5 92 -235 -65 -114 110 184 312 152 88 -3 51 66 93
3378 93 -142 -141 -201 -199 24 -20 -51 349 -114 34 28 -96 -196 124 67 122 1 48 106 -174 8 -240 13 -102 66
$$ packed form
3214A03k24L30k66J11M1mN3k98L10l60J84j36J73J60l63L49P7k67o1J42k47J22
3236g1J76k01jK63k51L2L2P8k8l2L6K11j73j15J80j50L1K4k99J24K79j79J26K2
3260A14o2M7j25j70L96j77J85j02j35M2k38K72nJ94J67m55j08K72p8l07J42R7
3282c4l84K48o0K88K21m21j13J46J98j15q1Q7P6k3p9K7O3l14L01K16k46p2R6m1
3306a6j5N7o2P7j65K5k79N37k71J14P1K67j67l94L18k93K07j16L62k42J18q7J63
3329B09l74J03l50L53K39r7q3M5P7j2j73J48J68k17J70qk33m0K25j3k49R3N1j11
3353g9L18m13l1R5O1P1J9m5R3j65j65K36R7l27J70m9K24P4J28j60o4r1N4J5K7
3378I3k35Jo0KK23m4l1M00m63J48oj24j00L20n7N5j21M7N8k80J82k48K53j15J68
$$ plain form
3403 66 -44 -17 66 183 -279 -132 76 92 76 241 99 54 97 93 311 32 27 135 -173 -96 75 56 110 55 -158
3428 -158 -144 159 171 136 135 192 -179 143 -65 -165 -5 -103 310 -137 -7 181 107 27 -238 -184 79 -53 34 -57
3452 -57 -102 -104 194 -128 80 113 -25 46 12 19 -22 8 121 -37 -35 -192 -14 -79 -101 -143 -36 41 -113 -258 13 202
3478 202 200 81 -99 288 -41 441 152 120 218 -63 -152 -34 69 156 -54 -34 -36 3 97 11 -63 24 -100 -64 318
3503 318 42 -146 126 197 -47 -165 -296 -1 124 -244 59 27 -30 -154 17 83 -106 -242 160 -45 9 55
3525 55 123 36 71 -147 160 -66 121 -29 -124 42 -125 -294 -163 -16 -65 -105 190 -9 -89 165 -61 189 -286
3548 -286 -129 82 -21 88 115 18 -55 29 -184 -122 -92 -120 107 -148 72 44 -157 13 122 13 19 44 131 0
3572 0 -29 212 42 -136 -99 94 160 11 13 -76 -184 -3 160 67 81 77 -126 -138 -135 -277 4 -90 -115 13 157 -80
$$ packed form
3403F6j10K7Q3J17m62J47K08J6j6J65j42m5M3mK18k79nJ08l08P7J71j9N4n5k13
3428a58J4L03J2l5jN7l71L22k08j00J60r8M13m47J30J88p4q0k65N4K63j32Q7r1
3452e7m5kK98l22K08L3j38P1l4Pm1L0J13j58Kj57J78o5k2m2J07P7j54j45K71J89
3478B02kj19j80L87l29M82k89l2R8k81q9J18J03Q7k10K0kL9R4q6p4Q7j24L6L82
3503C18k76j88K72P1k44j18j31K95J25l68L03l2n7j24J71O6j89j36M02k05N4M6
3525E5O8q7L5k18L07k26J87j50r5J66j67j69J31J47m9m0K95j99q0K54k26K50m75
3548b86J57K11j03J09K7r7p3Q4k13O2L0k8K27k55K20k8k01J70J09j09OK5Q7j31
3572@k9K41j70j78L7J93O6j49Kq9j08J81J63r3J4mk03j2Lj42K81r4k5J28J44k37
$$ [...]
8191A83
##END NTUPLES=NMR FID
##END=
