##TITLE=1H_Ser 2066-EA
 DMSO
 8 sc, 
 9.4.2024
##JCAMPDX= 6.0         $$ Bruker NMR JCAMP-DX V2.0
##DATA TYPE= NMR FID
##DATA CLASS= NTUPLES
##ORIGIN= UXNMR, Bruker Analytische Messtechnik GmbH
##OWNER= root
$$ XWIN-NMR		Version 3.5
$$ Tue Apr  9 15:46:52 2024 Russian Standard Time (UT+4h)  she@DPX200
##.OBSERVE FREQUENCY= 200.1309
##.OBSERVE NUCLEUS= ^1H
##.DELAY= (6, 6)
##.ACQUISITION MODE= SIMULTANEOUS
##.ACQUISITION SCHEME= undefined
##.AVERAGES= 8
##.DIGITISER RES= 18
##SPECTROMETER/DATA SYSTEM= spect
##.PULSE SEQUENCE= zg30
##.SOLVENT NAME= CDCl3
##.SHIFT REFERENCE= (INTERNAL, CDCl3, 0, 15.7039)
##AUDIT TRAIL= $$ (NUMBER, WHEN, WHO, WHERE, WHAT)
$$ ##TITLE= Audit trail, XWIN-NMR		Version 3.5
$$ ##JCAMPDX= 5.01
$$ ##ORIGIN= Bruker BioSpin GmbH
$$ ##OWNER= she
$$ F:/spectra/data/she/nmr/H-F/1/audita.txt
$$ ##AUDIT TRAIL=  $$ (NUMBER, WHEN, WHO, WHERE, WHAT)
(   1,<2024-04-09 15:45:59.18 +0400>,<she>,<DPX200>,
      <created by zg, POWCHK disabled, PULCHK disabled
       configuration hash MD5:
       00 E9 B6 7A A2 85 ED C7 34 08 36 98 17 FE 4E 26
       data hash MD5: 16K
       F6 B4 0C 9D 61 3C 5F 37 85 2A CC 5A BA 77 87 33>)
$$ ##END=
$$ 
$$ hash MD5
$$ F2 85 C4 52 71 06 CA ED 1A 08 81 00 1F C8 45 FB
##$RELAX= 
##$RELAX= 
##$RELAX= 
##$RELAX= 
##$RELAX= 
##$RELAX= 
$$ Bruker specific parameters
$$ --------------------------
##$DU= <F:/spectra>
##$EXPNO= 1
##$NAME= <H-F>
##$PROCNO= 1
##$TYPE= <nmr>
##$USER= <she>
##$AMP= (0..31)
100 100 100 100 100 100 100 100 100 100 100 100 100 100 100 100 100 100 
100 100 100 100 100 100 100 100 100 100 100 100 100 100 
##$AQSEQ= 0
##$AQ_mod= 1
##$AUNM= <au_zg>
##$AUTOPOS= <>
##$BF1= 200.13
##$BF2= 200.13
##$BF3= 200.13
##$BF4= 200.13
##$BF5= 200.13
##$BF6= 200.13
##$BF7= 200.13
##$BF8= 200.13
##$BYTORDA= 1
##$CFDGTYP= 0
##$CFRGTYP= 5
##$CHEMSTR= <none>
##$CNST= (0..31)
1 1 145 1 1 1 1 1 1 1 1 1 1 1 1 1 1 1 1 1 1 1 1 1 1 1 1 1 1 1 1 1 
##$CPDPRG= <>
##$CPDPRG1= <>
##$CPDPRG2= <>
##$CPDPRG3= <>
##$CPDPRG4= <mlev>
##$CPDPRG5= <mlev>
##$CPDPRG6= <mlev>
##$CPDPRG7= <mlev>
##$CPDPRG8= <mlev>
##$CPDPRGB= <>
##$CPDPRGT= <>
##$D= (0..31)
0 1.2 0 0 0 0 0 0 0 0.06 0 0.03 0 0 0 0 0.0002 0 0 0 0 0 0 0 0 0 0 0 0 
0 0 0 
##$DATE= 1712663158
##$DBL= (0..7)
120 120 120 120 120 120 120 120 
##$DBP= (0..7)
150 150 150 150 150 150 150 150 
##$DBP07= 0
##$DBPNAM0= <>
##$DBPNAM1= <>
##$DBPNAM2= <>
##$DBPNAM3= <>
##$DBPNAM4= <>
##$DBPNAM5= <>
##$DBPNAM6= <>
##$DBPNAM7= <>
##$DBPOAL= (0..7)
0.5 0.5 0.5 0.5 0.5 0.5 0.5 0.5 
##$DBPOFFS= (0..7)
0 0 0 0 0 0 0 0 
##$DE= 6
##$DECBNUC= <off>
##$DECIM= 32
##$DECNUC= <off>
##$DECSTAT= 4
##$DIGMOD= 1
##$DIGTYP= 9
##$DL= (0..7)
0 120 120 120 120 120 120 120 
##$DP= (0..7)
150 150 150 150 150 150 150 150 
##$DP07= 0
##$DPNAME0= <>
##$DPNAME1= <>
##$DPNAME2= <>
##$DPNAME3= <>
##$DPNAME4= <>
##$DPNAME5= <>
##$DPNAME6= <>
##$DPNAME7= <>
##$DPOAL= (0..7)
0.5 0.5 0.5 0.5 0.5 0.5 0.5 0.5 
##$DPOFFS= (0..7)
0 0 0 0 0 0 0 0 
##$DQDMODE= 0
##$DR= 18
##$DS= 0
##$DSLIST= <SSSSSSSSSSSSSSS>
$$ [...]
##$SUBNAM2= <"">
##$SUBNAM3= <"">
##$SUBNAM4= <"">
##$SUBNAM5= <"">
##$SUBNAM6= <"">
##$SUBNAM7= <"">
##$SUBNAM8= <"">
##$SUBNAM9= <"">
##$SW= 18.0517689322627
##$SWIBOX= (0..15)
0 0 2 0 0 0 0 0 0 0 0 0 0 0 0 0 
##$SW_h= 3612.71676300578
##$TD= 16384
##$TD0= 1
##$TE= 0
##$TE2= 300
##$TE3= 300
##$TEG= 300
##$TL= (0..7)
0 120 120 120 120 120 120 120 
##$TP= (0..7)
150 150 150 150 150 150 150 150 
##$TP07= 0
##$TPNAME0= <>
##$TPNAME1= <>
##$TPNAME2= <>
##$TPNAME3= <>
##$TPNAME4= <>
##$TPNAME5= <>
##$TPNAME6= <>
##$TPNAME7= <>
##$TPOAL= (0..7)
0.5 0.5 0.5 0.5 0.5 0.5 0.5 0.5 
##$TPOFFS= (0..7)
0 0 0 0 0 0 0 0 
##$TUNHIN= 0
##$TUNHOUT= 0
##$TUNXOUT= 0
##$USERA1= <user>
##$USERA2= <user>
##$USERA3= <user>
##$USERA4= <user>
##$USERA5= <user>
##$V9= 5
##$VALIST= <valist>
##$VCLIST= <CCCCCCCCCCCCCCC>
##$VD= 0
##$VDLIST= <DDDDDDDDDDDDDDD>
##$VPLIST= <PPPPPPPPPPPPPPP>
##$VTLIST= <TTTTTTTTTTTTTTT>
##$WBST= 1024
##$WBSW= 4
##$XGAIN= (0..3)
0 0 0 0 
##$XL= 0
##$YL= 0
##$YMAX_a= 274582
##$YMIN_a= -279740
##$ZGOPTNS= <>
##$ZL1= 120
##$ZL2= 120
##$ZL3= 120
##$ZL4= 120
##$ABSF1= 10
##$ABSF2= 0
##$ABSG= 5
##$ABSL= 3
##$ALPHA= 0
##$AQORDER= 0
##$ASSFAC= 0
##$ASSFACI= 0
##$ASSFACX= 0
##$ASSWID= 0
##$AUNMP= <proc_1d>
##$AZFE= 0.1
##$AZFW= 0.1
##$BCFW= 1
##$BC_mod= 2
##$BYTORDP= 1
##$COROFFS= 0
##$CY= 11.3945322036743
##$DATMOD= 1
##$DC= 2
##$DFILT= <>
##$DTYPP= 0
##$F1P= 15.6554695791079
##$F2P= 12.8336369535428
##$FCOR= 0.5
##$FTSIZE= 0
##$FT_mod= 4
##$GAMMA= 1
##$GB= 0.15
##$INTBC= 1
##$INTSCL= 1
##$ISEN= 128
##$LB= 0.24
##$LEV0= 0
##$LPBIN= 0
##$MAXI= 10000
##$MC2= 0
##$MEAN= 0
##$ME_mod= 0
##$MI= 1.114404
##$NCOEF= 0
##$NC_proc= 0
##$NLEV= 6
##$NOISF1= 3.799351
##$NOISF2= 2.8
##$NSP= 1
##$NTH_PI= 0
##$NZP= 0
##$OFFSET= 15.70392
##$PC= 1
##$PHC0= -25382.31
##$PHC1= 13.78731
##$PH_mod= 1
##$PKNL= yes
##$PPARMOD= 0
##$PSCAL= 0
##$PSIGN= 0
##$REVERSE= no
##$SF= 200.130013532006
##$SI= 16384
##$SIGF1= 3
##$SIGF2= 2
##$SINO= 400
##$SIOLD= 16384
##$SREGLST= <1H.CDCl3>
##$SSB= 0
##$STSI= 0
##$STSR= 0
##$SW_p= 3612.71676300578
##$SYMM= 0
##$S_DEV= 0
##$TDeff= 0
##$TDoff= 0
##$TI= <>
##$TILT= no
##$TM1= 0
##$TM2= 0
##$TOPLEV= 0
##$USERP1= <user>
##$USERP2= <user>
##$USERP3= <user>
##$USERP4= <user>
##$USERP5= <user>
##$WDW= 1
##$XDIM= 8192
##$YMAX_p= 0
##$YMIN_p= 0
$$ End of Bruker specific parameters
$$ ---------------------------------
##NTUPLES= NMR FID
##VAR_NAME=  TIME,          FID/REAL,        FID/IMAG
##SYMBOL=    X,             R,               I
##VAR_TYPE=  INDEPENDENT,   DEPENDENT,       DEPENDENT
##VAR_FORM=  AFFN,          ASDF,            ASDF
##VAR_DIM=   8192,          8192,            8192
##UNITS=     SECONDS,       ARBITRARY UNITS, ARBITRARY UNITS
##FACTOR=    0.0002768,     1,               1
##FIRST=     0,             0,               0
##LAST=      2.2672688,     0,               0
##MIN=       0,             -279740,         0
##MAX=       2.2672688,     274582,          0
$$ Real data points
##PAGE= N=1
##DATA TABLE= (X++(R..R)), XYDATA
0@%%%%%%%%%%%%Qj6J6j6K4l2L2m0N6o4P2q8J04j20J44j68J92k24K56k88L25l67
34a94M12m66N28n92O61p38Q21r12J013j122J241j372J515j672J843k029K235k462
52a290K714k995L306l660M058m512N042n663O403p302Q428r881J1838j4631J8971
67A0826k6696M4573j60753m7736L69595O9906k38302k83425Q0145L02014J54435
78B74582k13400k78886J069K89216J83292j47126k92257m6304K47334K24297r5618
89A46199k79722j04496K08424K40911l5279k65270j43603J59391K53741J4390
99A94686k37382j78725J13537K52117O1946k07925k02516O4971K44985J02871
109B08565j70207k18510J8862K28268J38791j30076k25925k7135K04392J66838
$$ y = [0, 0, 0, 0, 0, 0, 0, 0, 0, 0, 0, 0, 0, 8, -8, 8, -8, 16, -16, 16, -24, 32, -32, 40, -48, 56, -64, 80, -88, 104, -120, 136, -152, 173, -194, 218, -248, 280, -312, 349, -389, 432, -480, 533, -589, 652, -720, 795, -877, 966, -1063, 1172, -1290, 1424, -1571, 1735, -1925, 2133, -2379, 2663, -3000, 3403, -3899, 4529, -5352, 6486, -8145, 10826, -15870, 28703, -132050, -179786, 189809, 259715, 21413, -262012, -181867, 120147, 274582, 61182, -217704, -216635, 72581, 255873, 108747, -183510, -229814, 17520, 241817, 146199, -133523, -238019, -29595, 211316, 176037, -89233, -232836, -73445, 180296, 194686, -42696, -221421, -107884, 144233, 206179, -1746, -204262, -139291, 105694, 208565, 38358, -180152, -161290, 66978, 205769, 75693, -150232, -177367, 27025, 193863]
119A93863q7058k24604o8351J74376J87015m3853k14422j03786J40189J98099
129A51468k388j96267j31271J03607J99691L4412j72652j51601O6017J93731O7148
140A61895j44765j65234K9047J82315R6690j12434j71878p252J63985J19504p9618
151G2255j72372l9538J43082J36947m7840j68326o7798J20537J49913j6747j60256
162e0143r3442R4474J56922J3780j45616j12774O7079J57342M1397j26756j27200
173a24937L8067J51220O5457j04660j36333R684J40806Q6860p9054j39335j7215
184a09440J25733J03201n3269j38257m2177J07309J14731k7561j31991o2902Q7272
195b7351J21660k949j21960q0298O5455J23869J9874j08750r3965M3180J22444
$$ y = [193863, 106805, -117799, -186150, -11774, 175241, 131388, -83034, -186820, -46631, 151468, 149080, -47187, -178458, -74851, 124840, 159252, -13400, -165001, -98984, 94747, 161895, 17130, -148104, -119057, 63258, 159948, 47514, -124364, -131616, 32369, 151873, 72255, -100117, -139655, 3427, 140374, 92534, -75792, -143590, -23053, 126860, 110113, -50143, -143585, -49111, 107811, 121591, -24025, -136799, -69720, 87622, 129019, 2263, -124937, -86870, 64350, 129807, 25147, -111186, -101502, 39304, 126164, 47110, -92225, -109440, 16293, 119494, 66225, -72032, -114209, -6900, 107831, 80270, -51721, -114623, -27351, 94309, 91360, -30600, -110898, -45443, 78426, 98300, -10450, -104415, -61235, 61209]
206F1209M1224r2680j04194K0436J17316O0187p5282j11687k138J09447P7357
217A01195n5613j15085k3742R8138R1054l4933j14161m3364Q3554R9937j4751
228G2229j09045n9773O7083J04803N214r9971p3432M8435J05474K4393q7165q3558
240h5313K8670J01928M1604p1877r0218R075R5290N6321n5717r4054r396Q6711
252A3024O8761l8891r4831k6356P6227P8460k1944r2971m1793O3755Q5116n113
264F3444q8078n5220M9613Q8791J1559q0251o6536L4019Q9464K7653o9871p5431
276g0844J7529Q7012M2419n7115q1326Q58Q1250N4870m3010q3911j4878P2831
288E685O4514k7978q2892k9008O2084P1130j2596p8687m1290M9355P4456K244
$$ y = [61209, 102433, 9753, -94441, -74005, 43311, 103498, 28216, -83471, -85609, 23838, 101195, 45582, -69503, -93245, 4893, 95947, 61014, -53147, -96511, -12957, 86980, 72229, -36816, -96589, -29506, 75297, 80511, -19460, -92892, -44457, 61017, 85410, -1755, -85313, -56643, 45285, 86889, 15012, -75206, -66131, 29159, 85480, 29763, -64291, -73687, 13024, 81785, 42894, -51937, -78293, -2066, 76394, 54450, -38521, -80314, -16559, 68557, 63444, -24634, -79854, -30241, 58550, 70109, -10142, -76678, -42659, 46805, 74458, 4587, -70844, -53315, 33697, 76116, 19001, -62325, -61467, 19783, 74653, 31643, -52268, -67146, 5685, 70199, 42221, -40671, -69679, -7595, 63535, 50939, -27748, -69038, -19683, 54773, 57017]
300E7017p1945n1519L5646P5345J6439o3299n9845K1571P4295K9772n3307o6358
312e6188P380P1214M1688m2284p0647o382O6133N1760l0472p2560j9358N8961
324g55N9619j7921p1565l1194M9721O5037m739o7618m1554L8511O7555Q225o1154
337g832n0114K5980O7290K0451n2502n6293J3235O4777L1408m2482o0172P85O0102
350A4633M0419l1772o1757j0838N3710M7491k0676o1173k1393M5905N2615r498
362C7666n8718l0915L7036N6162J863n4531l9320K7230N8005J2904m8916m6627
374d8161J6604N7927K3295m1821n2085N864N5966L2610l3315n5289m755N1700
386H540M0127k3783n6016j4751M5320M5580j3543n4210k3773L7133M8801l158
$$ y = [57017, -14928, -66447, -30801, 44544, 60983, -2316, -62161, -40590, 33705, 63477, 10170, -56188, -48808, 22406, 64094, 21810, -48837, -55219, 10914, 62674, 32202, -40358, -59716, -755, 58864, 40943, -30622, -61816, -12095, 52942, 48203, -19415, -60969, -22458, 45097, 53322, -7832, -57946, -31966, 35324, 55775, 3273, -53020, -39785, 24992, 56400, 13918, -46254, -45469, 14633, 55052, 23280, -38477, -49315, 4395, 51886, 31210, -29963, -51356, -5451, 47164, 37666, -21052, -51967, -14931, 41231, 43094, -11437, -50757, -23527, 34478, 47382, -1534, -48161, -31557, 26370, 49665, 7844, -44241, -38377, 17589, 50199, 16884, -38405, -43160, 8540, 48667, 24884, -31132, -45883, -563, 45017, 31474, -22736, -46509, -9376, 39425, 36267]
398C6267n0324l1512K7939N0277P040m4729l7701J8383N0071J6332l8385m2689
410c9031Q688M8343K4526l1312m6000l99M5549L1696k3578m7703r195M1250L7397
423D0231j5436m7882j7486L5638M1872o614m6164k5105K8674M4696K230m2955
435h301l1888K0631M5817J0961l7929l6927J2339M5218J8926l1701m0426L698
447b9582M2463K5284k4711m1993m402L8351L0530j6845m1586j1785L2975L4306
459C3005q985l9989j8633K6677L6772j136l7272k4564K0110L8353O457l3816k9792
472c2813J3207L8842J3514k9540l3840O286L8143J9949k4347l6544p19L5947K5300
485C3385j8458l7804p592L2226K9574j1660l7266j4048K7200L2553m470l5181
$$ y = [36267, -14057, -45569, -17630, 32647, 39687, -5042, -42743, -24360, 25711, 42043, 3658, -39031, -30343, 18000, 42526, 11214, -34786, -35185, 10364, 42060, 18482, -29221, -38416, 2834, 40231, 24795, -23087, -40573, -4935, 36937, 30323, -15841, -40946, -12272, 32424, 34654, -8301, -40189, -19558, 26259, 37220, -709, -37636, -25297, 19921, 38847, 7146, -33280, -29582, 12881, 38165, 13454, -28539, -32941, 5410, 35940, 19095, -22491, -34276, -1301, 33005, 24020, -15969, -34602, -7925, 28847, 27711, -9561, -34125, -14015, 24338, 30795, -3021, -32813, -19606, 19236, 32750, 3210, -30630, -24344, 13799, 33748, 9401, -27143, -27862, 8085, 33385, 14927, -22877, -30469, 1757, 31331, 19671, -17595, -31643, -4443, 28110, 23640, -11541]
497a1541j9744K1191L4094K589l1851k4451J4623L4166Q986k7678k7939Q129L3174
510A3748J4664k2751l0034K011L1220J9467j7536l1254m080K8159K3253j2053
522A4814l1430r633K4602K6525o191l0644j4884K0324K8907m12k9169j9730J5490
535a1431L0350N404k6541k3540J0372L0641J0685k3183k6519M790K9481J5315
547B5824j8741k7944o05K7178J9240j3470k8036n846K3597K1885q276k7313j0695
560b3202J9460K3908k800k5537j4825J5181K5240K367k3413j8462J0623K5669
572A4209O995k0806k1271O161K5452J1280j7666k3349J710K4440J4953j4178k4623
585a6693k758K2647J8358r938k5076p337J9949K1032n337k4600j1625J6392K2754
$$ y = [-11541, -31285, -10094, 24000, 26589, -5262, -29713, -15090, 19076, 28062, 384, -27555, -19426, 13748, 28412, 5661, -24373, -22362, 8858, 28325, 10789, -20465, -24545, 3614, 26867, 14814, -16616, -26249, -1647, 24878, 18687, -11957, -26841, -6517, 22390, 21978, -7191, -26921, -11431, 18919, 24323, -2218, -25758, -15386, 15255, 25940, 2757, -23762, -18972, 10509, 25824, 7083, -20861, -21466, 5712, 24952, 11482, -16554, -22400, 1197, 23082, 14806, -12507, -23202, -3742, 20166, 17366, -8171, -22996, -7815, 17425, 19792, -3621, -22083, -11460, 14209, 21204, 398, -20873, -14712, 10740, 22020, 4354, -18995, -17285, 7155, 22108, 7930, -16693, -19451, 3196, 21554, 11616, -13460, -20797, -848, 20184, 14847, -9753, -21378, -4986, 17768]
598A7768o48k3077j5201J2431K3641L877k0717j8005Q187K3390P950j7607j9849
611a7860L794K2142J1404j4061k0947m99K0305J4398j0172k1263m558J7980J6978
624A7641o086k1070q444J5233J8912k251k0530j1922J2367K0449J639j9413j4975
637a8450R218K1389N421j7668j7532N627K1321Q988j5013j9188J753K0227J2149
650A8242j1713k0000k169J8236J4615q045j9974n826J5758J6686m052j9277r247
663a6766J2735J7968k13j7946j2168R358J8406L326j5996j4247O125J8368O514
676A5464j3801j5899K830J7782R418j1246j7129o02J6697J2100q346j7865l965
689a4562J5124J4404n231j8048p228J3062J6253j842j7474j0128J0471J7279J422
$$ y = [17768, 17120, -5957, -21158, -8727, 14914, 18791, -1926, -19931, -11744, 11646, 19596, 1989, -17860, -14066, 8076, 19480, 5419, -15528, -16027, 4278, 18676, 8504, -12759, -17317, 663, 17641, 11555, -9515, -17959, -2726, 16186, 13935, -6595, -18517, -6150, 14299, 15938, -3475, -18450, -9232, 12157, 17578, -90, -17622, -11995, 9326, 18314, 3301, -15887, -14134, 6093, 18242, 6529, -13471, -15640, 2596, 17211, 9166, -10808, -16634, -876, 15810, 11758, -7519, -16766, -4031, 13937, 13724, -4222, -16390, -7032, 11374, 14700, -1296, -15543, -9418, 8950, 15464, 1663, -14236, -11406, 6376, 15794, 4548, -12581, -13183, 3514, 15614, 7268, -10597, -14562, 562, 14966, 9735, -8313, -15541, -2479, 13774, 11932, -5542, -15670, -5199, 12080, 13502]
702A3502j6182j2454P476J7429M484j4165j4158M251J6882P418j1518j5191Q76
715a1350J5560R877q458j5551k437J3674J1839n362j5440n325J1643J3298k458
728I510j4946p838R542J4432L62j4203j0095P314J5131L085j3008j1975M749J5167
742G227N646j1267j3342K061J4715P995r147j4221o57J3712J0096o634j4622l487
756a1925J2109J1779l889j4380n995J0086J2829j168j3486q051P750J3257J447
769A0363j2048r673N255J3127L796j0297j0792K756J2538N872q390j1640L10J1806
783B983P835o381j2224k060J0864R532m276j2494m320R580J0882k161j2397o301
797a0938Q085J1818k5j1809q014O277J2262K151j0715r443M142J2190M280r070
$$ y = [13502, -2680, -15134, -7658, 9771, 14255, 90, -14068, -9817, 7065, 14483, 2965, -12226, -11350, 4210, 14087, 5629, -9922, -12359, 1315, 13154, 7792, -7648, -12973, -1330, 11968, 9510, -5436, -13274, -3732, 10700, 11062, -3141, -13236, -5922, 9209, 12294, -714, -12689, -7940, 7227, 12873, 1606, -11736, -9675, 5040, 13035, 3888, -10333, -10990, 2722, 12818, 6184, -8438, -11925, 184, 11963, 8074, -6306, -12301, -2215, 10614, 9446, -4040, -12091, -4341, 8916, 10363, -1685, -11358, -6103, 7024, 10820, 523, -10269, -7513, 5025, 10897, 2507, -9133, -8823, 2983, 10818, 4437, -7787, -9847, 1017, 10549, 6273, -6221, -10541, -961, 9921, 7760, -4637, -10938, -2853, 8965, 8940, -2869, -10883, -4606, 7656, 9807, -908, -10351, -6209, 5981, 10261, 1191]
811A191j0458J736J1492O197p040j0976o24J0352P756m907j1023k713R049Q929
825H961k812j0763m617P514R724p83j0228o214N891J0185J112r362p510M205J0349
840E652K916q329q647K397J0291M680p076r544N28R917O296n617j0183j372R218
855A127P694l925j0376l170Q153Q734k076j0059m817O647R257k07r275o139M907
870c525R368J608q073p144L032R101L298o709p881J180Q626M815n227q403n67
885f501P979O066l805q682k199P177P102k360q715l583O308P911q91q512m919
900g624N149Q440O15q022o098L771Q672K211p117p074K224Q540L694n960p759
915f338N52Q061N011m529q086j024P281O004l042q027k507O183O668j531p638
$$ y = [1191, -9267, -7531, 3961, 10158, 3118, -7858, -8482, 1870, 9626, 4719, -6304, -9017, 32, 8961, 6149, -4614, -9231, -1717, 8007, 7224, -3004, -9218, -3327, 6858, 7970, -1392, -8902, -4697, 5652, 8568, 239, -8408, -6011, 4280, 8960, 1884, -7660, -7132, 2785, 9081, 3464, -6719, -8091, 1127, 8821, 4896, -5480, -8650, -497, 8237, 6161, -3898, -8715, -2068, 7189, 6982, -2293, -8432, -3525, 5843, 7451, -622, -7766, -4734, 4367, 7665, 956, -6925, -5745, 2881, 7696, 2469, -5934, -6501, 1478, 7544, 3739, -4943, -7142, 35, 7137, 4777, -3938, -7521, -1213, 6698, 5807, -2705, -7624, -2475, 5965, 6580, -1442, -7540, -3769, 4903, 7114, -3, -7077, -4853, 3687, 7381, 1421, -6338, -5786, 2275, 7286, 2757, -5329, -6353, 928, 6932, 3890, -4137, -6644, -461, 6207, 4676, -2962]
930b962l700M973P076l9p009m735L667P250J333o298n669K355P272K652n477o434
946e745J078P207L876m581p031k03O939M945l592p398j459O418N833k429p463
961c605k668N562O459j132p140l788M463O778K74o497m730L159O823J616n625
976e1n458J766O599K823m582n959M38O190L812l529o221p41N663M621k458o259
992c346j829N012N241j398o221k847M246N733l24n978l772L403O127Q14n575m645
1008e359K429O316J904n029n364J343O277K948m226n837K33N939L841l265o016
1023c866r02N303M509k144n890j921M473M965r57n541k859L475N217J61n070l678
1039d725K483N344J256m485m330J517N399K181l883m872N66N278L026l235n267
$$ y = [-2962, -6662, -1689, 5387, 5348, -1661, -6396, -2729, 4521, 5854, -444, -6113, -3758, 3514, 6166, 689, -5745, -4667, 2540, 6416, 1835, -5196, -5399, 1540, 6485, 2893, -4505, -5964, 454, 6287, 3858, -3605, -6273, -711, 5748, 4616, -2524, -6312, -1849, 4929, 5203, -1294, -6024, -2865, 3958, 5574, -51, -5509, -3743, 2856, 5679, 1097, -4862, -4424, 1766, 5578, 2049, -4172, -4913, 750, 5371, 2913, -3346, -5175, -163, 5078, 3680, -2541, -5388, -1142, 4591, 4267, -1711, -5483, -2080, 4047, 4861, -714, -5359, -2930, 3386, 5290, 261, -5103, -3760, 2517, 5465, 1239, -4598, -4365, 1574, 5415, 2150, -3866, -4768, 535, 5044, 2900, -2990, -4911, -438, 4527, 3570, -1971, -4830, -1355, 3862, 4023, -1047, -4725, -2242, 3102, 4358, -127, -4457, -2940, 2459, 4640, 757, -4115, -3549, 1729, 4755, 1520, -3747]
1054c747l49N044L791k469n475j262M597M426j565n490k214L964M928n73n253
1069a647l078L108N177N23m811l813K117N255J506m148m357J114N064K390l342
1084A058m665J00M672L102k477m766q30M123L679j587m714j696L521M120o66m550
1100a576k481K849M466J99m328l195K159M694J038m002l810J413M816J850l547
1115E45m257O30M687K561k894m524k38M333L190k104m559j107L775L651j176m413
1131a900j875L036L951k47m083k568K240M095O13l622l115J452M077J346l093
1146C07l495P01L951J995k560l741PL735K557k005l886o83L425L042j369l990
1162b009j348L052L467p10l932j991K555L758L9l752k588J965L923P30l403l047
$$ y = [-3747, -4096, 948, 4739, 2270, -3205, -4467, 130, 4556, 2991, -2499, -4713, -749, 4179, 3606, -1647, -4725, -1617, 3560, 4083, -728, -4541, -2424, 2831, 4337, 189, -4168, -3054, 2010, 4400, 1058, -3607, -3507, 1165, 4267, 1790, -2976, -3806, 317, 3996, 2409, -2305, -4001, -480, 3640, 2974, -1576, -4057, -1208, 3258, 3457, -871, -4066, -1907, 2787, 3825, -177, -3987, -2574, 2242, 4092, 545, -3712, -3082, 1605, 4166, 1272, -3252, -3490, 843, 4033, 1929, -2630, -3737, 38, 3689, 2513, -1900, -3775, -739, 3212, 2965, -1118, -3686, -1446, 2649, 3262, -360, -3475, -2023, 2054, 3400, 307, -3188, -2487, 1464, 3459, 899, -2842, -2835, 900, 3457, 1452, -2434, -3117, 308, 3350, 1981, -2009, -3357, -305, 3162, 2452, -1480, -3471, -916, 2842, 2881, -871, -3459, -1494, 2429, 3159, -244, -3291]
1178c291J293L896J369k888l349N49L670J965k245l489j73L305K445j549l463
1193a955q72K831K806q64l397j485K350L101k25l256j999J885L314L81l071k496
1209b952J410L482R35k852k906R16L501J484k495l176L17L391K016k031l389k95
1225b644L158K465j442l434r36K752K870p88l384j540K275L088j24l140k046J694
1241a176L199N27k795k439J105L162J089k393k708N02L030J570j920k914q3K867
1257F23K053j455l069o46K637K466r60l145j187K361K817m56l144j701K002L076
1273B272Q5l025k151J553L203O51k731k529R83L187J198k305k780L45K997J721
1289B674j754k907l05K673K142j147k928q80K274K461n58k840j389J847K689J5
$$ y = [-3291, -1998, 1898, 3267, 379, -2970, -2421, 1249, 3214, 969, -2520, -2693, 612, 3057, 1508, -1955, -2827, 4, 2810, 1946, -1451, -2936, -586, 2515, 2290, -966, -2965, -1080, 2234, 2615, -456, -2952, -1542, 1940, 2875, 23, -2883, -1967, 1534, 3018, 523, -2653, -2336, 1055, 3071, 1040, -2349, -2644, 514, 2979, 1537, -1897, -2833, -81, 2789, 2001, -1383, -2923, -648, 2440, 2316, -824, -2870, -1176, 2023, 2550, -245, -2684, -1579, 1583, 2672, 279, -2429, -1927, 1103, 2673, 753, -2161, -2244, 623, 2676, 1221, -1848, -2494, 143, 2609, 1649, -1496, -2683, -322, 2495, 2039, -1105, -2806, -804, 2272, 2357, -668, -2819, -1266, 1937, 2588, -143, -2672, -1689, 1498, 2696, 391, -2389, -2044, 953, 2674, 920, -1987, -2292, 381, 2523, 1376, -1552, -2432, -158, 2303, 1745, -1095, -2484, -637, 2052, 2067]
1305B067k691j858J412K813N32k472k212R38K854J022k149k500M51K817J482j799
1321G07k724p3K687J913j370k878n95K443K310q77k893j126K107K572l15k766
1337h78j579J636K691K55k486j971J108K683P63k122k223N53K568J233j669k394
1353a832J5K371J642j233k485m97K140J982p83k515r48J870K239l47k492j349
1369b222J592K422O2k397j680J244K544M95k199k015Q34K558R20j885k238L39
1385a626K450J348j483k364j61K237J718j046k411o45J945J975n57k355j070J591
1401d54K143o5k187j431J182K213L75j961j709P64K240P78j691j938L71K193J118
1418A941j415k113l4K117J459j103k242m21J979J773p71k306q04J763K012m13
$$ y = [2067, -624, -2482, -1070, 1743, 2275, -197, -2409, -1471, 1383, 2405, 256, -2244, -1793, 1024, 2506, 707, -2017, -2090, 597, 2510, 1140, -1738, -2333, 110, 2420, 1543, -1350, -2476, -369, 2203, 1888, -878, -2457, -821, 1870, 2125, -361, -2332, -1224, 1459, 2222, 100, -2123, -1570, 998, 2231, 562, -1832, -1817, 554, 2196, 963, -1522, -2019, 121, 2103, 1320, -1195, -2143, -273, 1966, 1619, -873, -2222, -630, 1792, 1854, -543, -2223, -979, 1565, 2060, -139, -2154, -1320, 1238, 2158, 273, -1965, -1626, 824, 2172, 689, -1675, -1836, 401, 2119, 1073, -1338, -1983, -38, 1937, 1380, -975, -2045, -454, 1689, 1624, -563, -1994, -812, 1401, 1776, -185, -1894, -1130, 1110, 1888, 197, -1741, -1370, 823, 1941, 526, -1587, -1621, 496, 1955, 852, -1390, -1811, 168, 1941, 1170, -1136, -1940, -177, 1835, 1422]
1434A422k262j165J466K152K4k123j471J080K211M51j873j737O47K162Q69j539
1450C14j946J81K049J251j157k042k90J866J551p68k096o60J631J785m16k056
1466h03r95J382J943o0j975j308J089K059L09j857j591P87K124O69j663j817M12
1483a295K122J047j415j999K7K035J362j093k117l83J857J637o98k104p77J570
1499b24J846k63k016j130J202J950J69j818j437Q11K001N65j571j669M16J960
1515G92R29j319j843L4J882J267j043j952l11J758J511p20k022o38J554J730m03
1532A206k003r63J364J862m7j918j244J044J965L11j734j519O75J985O96j493
1548A87j714K87J896J048j160j845j27J738J332p96j886n02J511J557m31j853
$$ y = [1422, -840, -2005, -539, 1613, 1637, -486, -1957, -877, 1334, 1785, -88, -1825, -1178, 984, 1853, 314, -1632, -1451, 598, 1849, 692, -1350, -1640, 226, 1777, 1009, -1087, -1747, -116, 1669, 1253, -803, -1798, -416, 1527, 1467, -508, -1816, -727, 1332, 1641, -216, -1807, -1020, 1104, 1773, 110, -1707, -1295, 827, 1874, 459, -1540, -1513, 522, 1884, 791, -1326, -1709, 148, 1785, 1087, -1017, -1794, -224, 1622, 1359, -657, -1787, -585, 1365, 1534, -284, -1721, -910, 1091, 1656, 85, -1584, -1168, 792, 1721, 402, -1441, -1407, 475, 1742, 699, -1253, -1564, 194, 1705, 985, -1037, -1675, -121, 1609, 1206, -797, -1760, -396, 1466, 1419, -499, -1743, -699, 1266, 1577, -157, -1676, -1001, 984, 1680, 187, -1527, -1240, 656, 1704, 544, -1301, -1428, 310, 1642, 846, -1040, -1542, -31, 1526, 1095, -758]
1564g58q36J259J678p0j735j132R51J795K75j602j363O51J826O00j418j585L54
1581a110J815R02j225j716K3J767J158r58j831k84J635J397o54j863n94J410J573
1598A445l10j784r28J136J703O1j658j199P97J747M24j430j437M40J727P66j190
1615C10j596R9J651J052r49j684k36J539J298o79j727n29J400J460l90j725p85
1632a491J196J592r3j690j045R52J722K22j590j288P07J767N25j415j512L82J761
1649G02Q33j179j655L6J678J124q99j716l13J511J357n77j743o48J286J530k11
1666A116j676r43J001J669J30j554j227P26J718M62j409j432M33J725P66j213
1682B92j592J17J709J010j000j703j71J595J252p29j760m82J441J459m38j741
$$ y = [-758, -1594, -335, 1343, 1273, -462, -1594, -643, 1152, 1427, -175, -1538, -887, 939, 1539, 121, -1464, -1110, 705, 1607, 382, -1334, -1311, 456, 1614, 656, -1175, -1459, 176, 1573, 919, -944, -1538, -128, 1445, 1135, -649, -1577, -441, 1262, 1323, -335, -1534, -737, 1010, 1434, 4, -1433, -993, 734, 1500, 310, -1286, -1187, 464, 1516, 567, -1117, -1353, 186, 1484, 805, -922, -1451, -51, 1409, 1019, -706, -1491, -295, 1297, 1204, -486, -1531, -579, 1143, 1365, -225, -1513, -806, 961, 1486, 71, -1441, -1059, 702, 1535, 356, -1299, -1263, 415, 1539, 640, -1076, -1389, 122, 1479, 902, -841, -1489, -203, 1327, 1116, -560, -1503, -502, 1167, 1297, -257, -1484, -758, 960, 1422, 13, -1419, -986, 739, 1505, 292, -1300, -1183, 526, 1536, 536, -1167, -1338, 257, 1509, 780, -980, -1462, -21, 1438, 1000, -741]
1698g41p74J208J614j04j669j049R18J676K77j516j298N96J719N97j292j496K61
1715a073J659Q91j044j598r3J551J151p44j648m06J376J344m35j646o97J149J498
1732A235j36j582r64R41J594J61j482j178O74J644M55j349j365L99J641P17j134
1749B71j491J00J570R59q83j558k06J403J186n93j573n05J214J334k56j516q03
1766a347R58J448O3j398j021O72J477L76j226j218L76J485O28j044j333J05J422
1783D23Q46q39j402j32J305J031o00j445l79J189J159l56j416o08J000J277j03
1800I50j344q32P80J355J51j233j000N37J361M07j069j137K68J328O41q75j240
1817i52J2J225Q38o24j263k64J085R92l76j244m84Q97J114j49j204o77P20J164
$$ y = [-741, -1515, -307, 1307, 1203, -466, -1515, -597, 1079, 1356, -160, -1458, -862, 857, 1454, 162, -1334, -1073, 586, 1477, 433, -1165, -1258, 293, 1444, 700, -948, -1354, 22, 1366, 931, -715, -1412, -263, 1235, 1099, -483, -1447, -506, 1088, 1249, -233, -1411, -737, 907, 1362, 13, -1352, -953, 688, 1405, 271, -1220, -1120, 450, 1409, 526, -1032, -1238, 165, 1351, 758, -815, -1320, -106, 1228, 972, -544, -1347, -389, 1059, 1122, -276, -1297, -625, 852, 1228, 2, -1216, -840, 645, 1273, 229, -1104, -999, 423, 1269, 430, -972, -1104, 201, 1232, 632, -813, -1192, -3, 1156, 800, -616, -1224, -224, 1053, 950, -394, -1226, -446, 909, 1060, -173, -1173, -636, 725, 1132, 63, -1074, -806, 522, 1163, 288, -952, -940, 285, 1123, 499, -764, -1028, 57, 1049, 673, -571, -1055, -158, 956, 807, -397, -1074, -354, 810]
1835H10J05j118q47N47J193K94j019r67L57J188M80q76j051J48J144O34p09j118
1853h05n2J078P72n17j138k58R48Q98l14j114m55P82J000q5j052o37N95J061J22
1872H29r57p81M04J061L22q25q94K13J032M95o93r51K9R71O29n27r85j76R04P66
1892H66l88r98l20P96Q55j96j018m74O90R31n4r60o04N44R81J29q94p51L95R87
1912E17L04p82q40K07R67M71o44q99J3R09O13m72r47j78Q04P50k88r53l61O94
1932a15Q33j05r14n26N62R18N3q67o50M25R29K21p85p54K73R25L75o87q43J19
1952f13R20N06n79q92l1Q54O33m10r37k13P84P45k58r25l70O46Q38p5q84n38N14
1973b85Q81R9q01o58L41Q99K67o80p84J78Q67M51n81q18rQ25N73m27q69j56P51
$$ y = [810, 915, -203, -1050, -503, 690, 984, -35, -1002, -645, 543, 1023, 147, -904, -756, 388, 1022, 313, -805, -857, 221, 993, 476, -662, -920, 28, 926, 612, -502, -957, -175, 825, 740, -312, -949, -354, 707, 829, -128, -909, -505, 556, 878, 53, -841, -628, 404, 899, 206, -745, -716, 255, 884, 357, -628, -804, 100, 866, 478, -520, -840, -44, 811, 615, -403, -877, -187, 744, 690, -270, -874, -330, 651, 780, -114, -865, -470, 517, 821, 39, -801, -594, 373, 844, 200, -699, -686, 223, 836, 364, -583, -761, 43, 793, 505, -448, -809, -115, 718, 613, -301, -827, -265, 653, 706, -161, -811, -386, 543, 764, -21, -775, -502, 423, 798, 111, -732, -613, 307, 813, 234, -658, -689, 165, 798, 388, -549, -762, 22, 767, 509, -416, -786, -140, 698, 623, -261, -799, -285, 596, 695, -106, -764, -423, 476, 743, 63, -721, -543, 324, 775, 194, -624, -633, 192, 765, 338, -531, -687, 64]
1994F4O75k87q91l02O78P46j30q62m57N72Q11Nq14n71M38Q55J51p28o71K86Q63
2015D31L04o50p51J23Q31M59n23q09l9P72N77l52q48k05O73O86j99q27l67N48
2035a66P69l5p83m97M28Q01J18p21o10L11Q11K51o35o94J64Q01L93n39p56J0P70
2056A91N20m21q03j28P17O18l04q01k67O30O94j53p82m03N15P34J9p36n26L71
2076c15P74J68o62o17K18P86L12n52o98N7P40M67m31p50r4O84N70k99p64k38O05
2097c9O58j65p63l55N18P05j7p23m81M08P36J22o82n70K68P64K58n89o51J29P52
2118B83L69m72p12j4P06N10l67p51j73O32N97k01p39l18N25O92n9p17m36M01P29
2139D85R1o47n55K57P40K45n58o46J27P10L88m64o85j7O61M93l29p40j40O06N72
$$ y = [64, 739, 452, -439, -741, -63, 683, 553, -309, -766, -194, 617, 622, -192, -763, -325, 530, 681, -47, -718, -432, 431, 735, 85, -666, -543, 288, 747, 224, -585, -624, 148, 725, 373, -475, -680, -7, 679, 480, -347, -714, -166, 603, 568, -215, -712, -284, 517, 635, -86, -696, -385, 426, 677, 42, -652, -488, 313, 706, 167, -589, -579, 191, 711, 290, -513, -641, 76, 694, 390, -411, -678, -48, 646, 493, -289, -692, -177, 557, 576, -160, -686, -315, 459, 627, -35, -652, -434, 352, 664, 112, -586, -529, 211, 678, 247, -503, -597, 87, 657, 358, -406, -644, -39, 619, 454, -309, -664, -146, 559, 542, -181, -662, -254, 482, 604, -78, -648, -380, 384, 642, 53, -598, -469, 283, 652, 180, -532, -546, 160, 670, 303, -448, -621, 11, 608, 407, -332, -650, -125, 567, 508, -209, -645, -244, 485, 576, -71, -626, -369, 371, 616, 58, -588, -461, 249, 637, 173, -512, -529, 132, 625, 296, -444, -584, 22, 594]
2160E94k18p12k81N27O34r4o88m00M29O89M9o62m93L15O89J97n68n79J60O99L30
2181F17m87o42QO76M43l59o90j24N90N53k15p02k65N19O18q7o74l83M07O63M9
2202E15o34m70K81O88J88n82n51J89O67K90m91n96N7O45M02l87o46r1O12M86k77
2223B95o60j92N42N58j46o57l13M50O08j1o23m22L29O49R4n44n10K18O38K43m70
2244G6n69P2O28L51l89o06m4N85M46k84o37j45N25N14j74o34k60M57N70p0o24
2265b12l32L68O13L5n81m38K79O29J48n10n22J82O29K56m46n65N4O02L58l63n97
2286d13o6N61M57k60o32j64M89N35j39o19k94L93N98j2n88l94L14O22J07n39m80
2307e24K11O34K07m83n35R4O23L13l97n86j5N96M06l14o05j25N35M86j94o21k29
$$ y = [594, 376, -336, -617, -90, 544, 450, -238, -638, -209, 480, 529, -133, -626, -311, 378, 575, 7, -572, -412, 287, 617, 130, -512, -504, 172, 615, 256, -434, -558, 32, 585, 370, -332, -597, -78, 540, 453, -221, -604, -197, 466, 515, -119, -589, -308, 380, 568, -14, -565, -376, 291, 581, 90, -506, -449, 196, 598, 211, -435, -526, 86, 572, 295, -365, -557, -15, 543, 397, -260, -573, -123, 485, 474, -149, -571, -242, 407, 501, -43, -553, -335, 303, 546, 76, -493, -421, 207, 558, 169, -437, -481, 104, 550, 266, -371, -516, 9, 523, 349, -285, -545, -88, 482, 412, -212, -544, -176, 437, 472, -109, -547, -268, 361, 509, -1, -523, -341, 288, 544, 98, -467, -413, 189, 547, 184, -413, -479, 82, 539, 279, -353, -517, -28, 507, 368, -251, -545, -152, 446, 434, -154, -548, -234, 388, 495, -44, -524, -313, 321, 528, 45, -490, -396, 227, 540, 143, -443, -458, 138, 544, 230, -375, -500, 35, 521, 327, -294, -523]
2328e23M53N52q2o02l41L69N95M6n64m39K61O25J56n16n02J38O26K86m26n72K3
2349d37O03L81l31o10q6N34M66k15o03k26M73N37j04n95l29M11N62J7n74m10K95
2370b41N99J31n19m77J83O08K43m63n28N8N85L44l46n89o0N58M39k59n98j75M78
2391b9N10j32n90k76L82N63J3n76l74K82N82J27n06m77J78N98K35m34n28O3N57
2412A68L37l40n59n3N28M14k27n80j64M47M87j28n66k58L74N26k1n29l49K82N60
2433C49Q9m84m29J85N56J94m08m75O5N38K91l21n29l1N03L81k43n24j50M38M35
2454D30j19n22k47L54N00j7n10l28K80N10P9m57l96J81N15J92m05m40Q6M83K85
2475D54l32m78k4M75L42k34m91j08M11L98j62m80j91L52M36n0m65k76K72M82L7
$$ y = [-523, -70, 482, 400, -202, -543, -174, 421, 467, -97, -536, -275, 350, 506, -10, -512, -374, 252, 538, 112, -460, -437, 166, 547, 216, -394, -480, 54, 520, 305, -298, -524, -51, 486, 382, -213, -542, -131, 431, 448, -126, -536, -241, 358, 489, -30, -507, -324, 284, 527, 64, -464, -406, 179, 523, 177, -412, -472, 86, 525, 266, -332, -507, -29, 481, 349, -241, -517, -135, 428, 441, -135, -509, -227, 355, 482, -24, -501, -323, 275, 510, 76, -452, -389, 168, 505, 165, -394, -447, 81, 495, 268, -312, -476, -29, 458, 330, -236, -494, -120, 406, 385, -144, -493, -211, 349, 438, -46, -475, -290, 266, 460, 52, -423, -358, 180, 471, 150, -379, -410, 93, 474, 231, -293, -443, -5, 430, 311, -211, -458, -104, 396, 379, -131, -459, -179, 331, 410, -47, -443, -262, 253, 445, 40, -400, -314, 169, 454, 122, -356, -380, 95, 437, 203, -288, -396, 15, 413, 251, -229, -420, -68, 368, 318, -147, -423, -151, 331, 368]
2496C68m29l56J91M94J27l81m09J11M74K23l18m37OM45L05k44m57j05M16L64j61
2517B27m65j57L48M16p5m53k44K76M45J8m21l09K19M52R8l89l55J28M42J78l18
2538F1m04M8M28K70k68m34m0M01L19j93m32j21L58L68j00m43j92K90M03j4m11
2559a06k75K31M30P0l83l39J63M34J36l41l57P0M30K10k79l91kL92K81k07m27
2580b60q1L68L22j32m28j49L11L76n8m13k27K62M03J0l86k81J94M12R5l57l38
2601c57J28M19J62l00l63K5M01K56k35m16l0L65L01j69m13j19L48L45j02m16j91
2622c61K90L88l6l99k45K26M10N3l71l07J70M01J32l29l47Q8L96K00k71l84J2
2643b84L92K49k07m03n8L49L19j47m06j44L07L55o2l97k16K50L97Rl66k82J85
$$ y = [368, -61, -417, -226, 268, 395, 14, -395, -284, 190, 413, 95, -342, -336, 109, 414, 170, -287, -392, 24, 388, 227, -238, -395, -47, 369, 294, -159, -403, -127, 318, 336, -85, -394, -175, 277, 375, -14, -369, -241, 201, 379, 61, -343, -295, 133, 403, 135, -299, -339, 62, 381, 188, -244, -365, -7, 361, 261, -182, -374, -84, 319, 305, -106, -381, -150, 280, 350, -33, -372, -209, 225, 361, 20, -337, -267, 163, 373, 94, -297, -299, 93, 374, 167, -260, -341, 27, 349, 217, -211, -360, -49, 327, 269, -144, -371, -109, 294, 304, -82, -363, -169, 243, 338, -19, -357, -229, 190, 352, 52, -311, -286, 115, 371, 136, -280, -310, 55, 356, 187, -226, -345, 3, 348, 246, -170, -361, -71, 317, 281, -118, -363, -137, 273, 326, -45, -352, -182, 219, 351, 22, -325, -237, 159, 359, 88, -296, -284, 108, 357, 150, -253, -311, 38, 357, 210, -196, -340, -33, 322, 260, -137, -353, -103, 294, 303, -63, -345, -160]
2664a60L97J11l51l24R6M15J59k80l63L3L91K30k22m08k6L56K85j63l99j15L23
2685a5L35p7m06j79K62L80j4l73k53K00M02O2l53k95J28M02J34l02l46N9M02J99
2707C52k68l65pL60K73j89l92p2L24L15j14l97j64K93L55m6l77k27K34L68L9l51
2729e6k78J48L97J07l08l13P9L92J73k58l68K0L78K37k17l65o0L31L00j52l93
2750b06j07K81L49q5l80j84K47L65kl65k43J79L79P7l18l02J24L75J45k86l44
2771c01N6L74J99k28l58k1L33K74j56l76q8K92L08r3l77j38K38L36k3l56k11K07
2793a09L39M6l13k71J47L47J19k98k93P0L59J69k42l27QL38K17j96l25o1L12K69
2815C05j30l65j10K81L11p2l52j73K23L34kl13k37J59L54N8k89k70J08L63J10
$$ y = [-160, 237, 348, -3, -327, -231, 184, 343, 63, -300, -267, 124, 354, 132, -276, -302, 54, 339, 176, -223, -338, -15, 320, 243, -163, -342, -80, 300, 286, -87, -340, -140, 262, 324, -29, -324, -196, 206, 340, 38, -308, -249, 153, 352, 84, -281, -288, 72, 345, 156, -236, -308, 16, 331, 217, -180, -344, -51, 304, 258, -119, -346, -112, 256, 295, -56, -334, -186, 211, 318, 10, -303, -224, 168, 341, 83, -285, -265, 113, 350, 133, -232, -292, 39, 339, 187, -206, -313, -32, 317, 232, -148, -332, -85, 280, 278, -87, -330, -151, 228, 305, -13, -315, -191, 184, 329, 43, -301, -245, 129, 328, 100, -258, -279, 54, 328, 172, -204, -292, 0, 308, 215, -162, -300, -62, 274, 251, -105, -316, -109, 230, 276, -37, -308, -161, 186, 305, 7, -286, -216, 143, 312, 70, -257, -249, 89, 306, 110, -215, -276, 36, 305, 175, -190, -300, -19, 292, 220, -132, -305, -82, 252, 250, -63, -300, -141, 213, 271, -18, -288, -180, 183, 293]
2836B93k54l02L7L37J85k17l22j1L10K28j63l26p1K78K67r2l35j30K49L06o3l07
2858a03j83K00L13K1l03k26J45L31Q3k84k58Q7L33J43k46l09L8L15J96j95l13
2879b15m0L03K32j31l28q4K57K62o8l25j59K29L03j7l20j89J72L14N1k84k48J28
2901a57L10J09k56k66O8L19J50k03l00QK92K11j69l07m7K58K54j13l11j10K28
2922c2K71m1l00j62J80L09Nk93k01J36L10O3k53k35O8L10J21k12k72K5K96J66
2944B59j62l00j3K72K01j21k95p7K33K53p4k94j28K00K68ok92j69J42K85L8k50
2966c0k07Q6K99R3k20k46N2K76J39j82k68J1K64J79j31k87m0K12K31p7k75j01
2988b22K01K32k9k57j64J76K49Rk25j88J14K48P4k05k25P5K59J01j76k33J3K43
$$ y = [293, 39, -263, -226, 111, 296, 79, -243, -254, 56, 284, 121, -205, -276, 2, 269, 177, -158, -288, -39, 267, 204, -103, -286, -86, 227, 248, -55, -281, -136, 195, 278, -6, -264, -177, 156, 299, 53, -256, -218, 97, 293, 98, -215, -255, 48, 280, 149, -179, -263, -6, 256, 188, -137, -296, -67, 236, 219, -101, -290, -118, 196, 247, -37, -285, -157, 153, 262, 6, -260, -192, 127, 277, 74, -226, -218, 74, 285, 116, -191, -238, 20, 274, 161, -150, -260, -32, 239, 198, -102, -264, -84, 225, 230, -63, -264, -128, 182, 245, -8, -243, -175, 135, 256, 44, -228, -203, 93, 259, 97, -203, -216, 56, 257, 136, -159, -236, -3, 250, 176, -118, -246, -46, 222, 216, -76, -245, -103, 182, 220, -30, -237, -151, 148, 241, 21, -225, -173, 103, 242, 60, -208, -197, 67, 246, 115, -172, -212, 0, 231, 154, -121, -222, -21, 211, 182, -75, -239, -63, 186, 195, -30, -218, -104, 144, 218, 13, -212, -137, 122, 223, 47, -186, -173, 70]
3010G0J48j36k41l9K18J98j04k39p7J84K09l9k44j23J52K38qk20j59J27K36M1
3032A92k08j66O5K24R4j76j94K5K23J27j28k22j8K06J56r5k22o2J79J99o7k18
3054h6r9J57J95j8k12j26J19J97K7j77j63R2J95P2j68j66L6K07R1j23j86MJ81
3077D9J25r6j94l6J78J40n5k00p1J53J70l7j92j06J36J68Mj64j32Q9J74N2j59
3100dj61P2J85O8j37j67K4J76R9j03j79j5J82J23q6j71m1J54J32m4j81p7J39J57
3124A45j8j78r4J05J78Mj67j31P4J78N0j44j50M9J76Q0j28j53J2J65R5r7j53m2
3148a44J57J33o1j75n5J36J50k9j79q0J11J73j6j60j10R2J51M6j38j28M8J64O4
3171A50j27j47J7J60R9r0j61k2J44J16n6j63n1J29J36l7j59p7J02J46Oj47j08
$$ y = [70, 218, 82, -159, -198, 20, 218, 114, -125, -202, -18, 191, 152, -92, -215, -63, 175, 167, -53, -212, -85, 151, 192, -16, -182, -117, 107, 201, 25, -169, -144, 79, 206, 78, -144, -162, 44, 200, 105, -117, -179, 0, 199, 132, -86, -185, -28, 167, 149, -63, -189, -70, 127, 154, -23, -186, -94, 101, 173, 5, -161, -125, 82, 173, 50, -136, -132, 49, 174, 78, -116, -152, 26, 166, 111, -89, -160, -7, 163, 126, -66, -172, -36, 132, 136, -28, -160, -71, 103, 155, -4, -165, -93, 92, 160, 23, -144, -120, 56, 155, 52, -127, -142, 40, 163, 77, -94, -135, 19, 151, 107, -74, -151, -12, 145, 127, -51, -145, -40, 138, 142, -25, -156, -82, 96, 146, 2, -148, -99, 77, 157, 29, -124, -112, 53, 148, 51, -102, -144, 13, 146, 85, -90, -145, -9, 141, 112, -67, -147, -36, 137, 121, -39, -149, -57, 94, 140, 2, -126, -78, 86, 150, 23, -124, -107, 53, 152, 62, -99, -121, 23, 139, 83, -80, -131, -2, 134, 97, -62, -139, -37, 109, 115, -32, -140]
3194a40P9J62K2j28j23N9J46N6j19j21K1J41P9r1j32j0J28J05n1j44l9J07J18
3217A25l9j30n9Q2J31j6j22j01Q1J34J9j17r5L6J34M3r4j10J6J18Q1q1j15qJ12
3242B5Q0m8j12l6J05R1k4j23n7P3J15pr8o3N3R4L1j08p8M2J01M0p8q8QR7N3o3
3270B5r5kQ7P5n5r0j1N9P9j9r1l5O4Q5lr6n3N7Q5J5q4n9L6P6K1n9p2J5Q6L4m8
3301B7p2lO1N0l9p8qP1N7k7q4j4N4N8Jq5l9N9O2nn6m7M0O1J4o5m7L0N7K2l7o6
3333d8J7O3K7l8p1nO5M8k1o8j3M7N5j8o6k7L6O7%o7l8L6O1Mo4l5L0M9K6m6n2R
3365c7N8K9k9o5ON6L3k6o3qN4L2%n6l5L8O9rn5l7K0O8J0m7o1L0N6K4m7m8kN9L9
3398E6l8o3j1N7M6k5o2k0N5N7j5o5k6M0O4j1m8l2K5O3On0n1RO6L0l9o6RN8M4l1
$$ y = [-140, -61, 101, 123, -5, -128, -69, 77, 133, 14, -107, -86, 55, 134, 43, -89, -99, 29, 134, 83, -61, -100, 7, 125, 86, -44, -103, -21, 110, 94, -28, -129, -48, 86, 105, -12, -107, -71, 63, 106, 12, -98, -82, 36, 117, 36, -79, -87, 25, 105, 57, -55, -91, 14, 105, 81, -42, -99, -26, 89, 82, -16, -79, -26, 68, 99, -9, -87, -45, 56, 96, 18, -70, -62, 35, 88, 25, -70, -72, 15, 90, 35, -55, -66, -7, 72, 53, -38, -73, -9, 76, 73, -23, -76, -19, 66, 81, -3, -62, -26, 50, 71, 12, -60, -45, 41, 75, 27, -45, -48, 13, 63, 24, -54, -62, 9, 66, 39, -45, -59, -5, 53, 54, -31, -70, -11, 51, 46, -10, -57, -17, 44, 58, -7, -54, -24, 33, 55, 18, -48, -31, 32, 59, 21, -50, -55, 10, 58, 37, -31, -44, 3, 58, 40, -26, -53, -17, 50, 50, -17, -55, -19, 42, 46, -18, -53, -23, 26, 52, 6, -46, -37, 21, 50, 21, -44, -38, 18, 51, 25, -38, -46, 8, 40, 40, -16, -51, -13, 56, 47, -8, -45, -25, 43, 53, 6, -55, -25, 31, 55, 8, -40, -42, 17, 56, 18, -45, -56, 1, 47, 22, -40, -60, -5, 52, 37, -28, -54, -14, 50, 39, -9, -41, -16, 47, 53, 3, -48, -39, 27, 57, 18, -48, -39, 19, 63, 32]
3430C2o1k1N1O0j6p6k9N4N6jp1m5M0P7lm7n9K4O5L7n2p3QO1N7l2q0qP1O5m2p4
3462c2k7O3P2j5q3m0L9O5K4o4p8L7Q3J8m4q4LQ8N1m9r2jP9P1m0r2m0P6R3k1r1
3493c1n6O5P5J2q8n0K5J01L8q1p1J7R5M7n8q8k0R4O5m8q6l1Q5O8k8q5m1O3Q7%
3523G5r7o5N6P3L2p6p7L4Q5M6p1q8J0R5N3n5q8j5Q5P4l7q6m4P3Q5j5r7l8O0R0
3553G7Kr3p2M9R6K7q8p4K1J03L6p0q7NQ9N9n6r7oP5Q9m3q9l6P5Q7j2j09m6O9Q6
3584F7Pr1n3L7J02J8q3q3K4J07L9p7j00K2R5O6n4j02j8Q7P7l3j01l8P5R2k6r5
3612c9n6N6J06J2j11o9N8J00L1q6r2K3J03N4o7q7kR2P9o5r6k4R5Q2m9q0m8P8Q7
3641H5j7j02n6O5R9Pr6q3M8J09L1q5r7L0R7N7p3j00%J00O7o1r7j0Q8Q2m1j00k7
$$ y = [32, -29, -50, 1, 61, 45, -31, -60, -6, 50, 49, -22, -67, -27, 50, 47, 0, -59, -35, 30, 67, 15, -58, -50, 11, 68, 36, -44, -52, 19, 84, 42, -32, -59, 4, 76, 61, -22, -62, -23, 42, 66, 2, -76, -39, 44, 62, 18, -66, -63, 25, 76, 27, -65, -66, 13, 84, 44, -48, -88, -12, 81, 60, -31, -87, -22, 53, 65, -23, -73, -48, 53, 91, 10, -61, -44, 51, 98, 40, -48, -68, 26, 91, 43, -43, -74, 11, 79, 51, -34, -75, -12, 75, 75, -22, -87, -31, 42, 74, -2, -79, -45, 40, 86, 15, -73, -63, 32, 85, 30, -58, -73, 12, 86, 49, -37, -81, -8, 77, 62, -35, -73, -13, 77, 79, -14, -86, -37, 59, 86, -2, -76, -55, 48, 84, 14, -73, -68, 21, 80, 24, -73, -79, -4, 85, 42, -47, -83, -8, 79, 67, -42, -88, -19, 67, 74, -17, -70, -33, 69, 87, 4, -79, -55, 52, 91, 14, -86, -64, 31, 97, 43, -59, -77, 10, 87, 54, -47, -85, -10, 82, 56, -39, -95, -39, 67, 79, -32, -101, -43, 57, 88, 2, -90, -67, 36, 90, 23, -64, -66, 26, 105, 40, -56, -80, 15, 97, 48, -32, -80, -2, 85, 68, -34, -90, -25, 74, 81, -15, -98, -50, 59, 90, 5, -92, -62, 35, 92, 19, -81, -81, 19, 86, 25, -72, -82, 6, 88, 47, -53, -80]
3670h0O9R5pj07n2O5J03rr6o2M3J11J5q5r8L6J13M8q6r1OR4O7n7r8j8Q5P9l2j04
3700e3m1Q6R5k1j04m9O3R4J4j06o9M8J02L0q3q2J9J01N2o4j05QR1P0n8r6j3Q0
3728IQ0l0j04l2P6Q6k4j02m4N6Q9nq3o9N2Q7K6p2q5L3J03L8o5r2J1R6N3n9q6j2
3758f9Q7O8l8r4k4Q2O6k7q5m7O4Q5lr2m6M7Q2K0q5o6L9Q4K8q7p2K6Q0O4q1q0%
3789g4R2M9m3p8j4P6O9m0p3l5N8Q9j8q8l6M8P8Pq1n4M7P9Ro4p7L5Q7K5n8q0KQ3
3821B0M8n2o9j6Q6N1m1p6k4P3P0l0q7k3N6P6j1p0o3N5Q3Ko7n3L2Q9J4p2o5K9Q3
3852D8L1o1q4J1Q9M3n3q8oP3O9l7r7j7P7Q2l3q8m5O4Q2rq4m5L3J08Pq5o3L8R6
3883E6K4p0q7K4R2N6p5q1JR4N6n6q8j2Q5Q2n7r5l1P2R2j7j05n5O6J06jj02p2N3
$$ y = [-80, -11, 84, 77, -30, -82, -17, 86, 77, -19, -81, -38, 73, 88, 3, -95, -59, 54, 102, 16, -75, -69, 25, 92, 35, -63, -81, 4, 83, 51, -53, -94, -8, 87, 66, -38, -87, -24, 70, 84, -22, -91, -43, 59, 89, 6, -76, -57, 44, 96, 32, -73, -65, 26, 96, 38, -58, -71, 9, 89, 59, -45, -77, -1, 85, 61, -41, -85, -29, 60, 55, -28, -97, -45, 42, 68, -4, -89, -56, 47, 85, 20, -72, -61, 35, 88, 29, -57, -69, 18, 86, 48, -46, -70, 12, 78, 51, -34, -81, -17, 68, 65, -27, -73, -26, 56, 76, -9, -75, -36, 48, 76, -11, -83, -57, 23, 87, 6, -74, -74, 18, 67, 24, -54, -68, 8, 77, 37, -36, -71, -13, 76, 58, -30, -66, -18, 60, 67, -14, -68, -21, 58, 67, 3, -74, -39, 48, 73, 15, -65, -63, 20, 68, 16, -53, -69, 17, 68, 27, -49, -73, 0, 70, 40, -47, -70, -14, 62, 51, -19, -82, -27, 56, 58, -9, -62, -30, 59, 73, 1, -64, -35, 48, 79, 18, -66, -55, 34, 77, 24, -64, -70, 3, 72, 35, -62, -79, -2, 80, 47, -41, -86, -22, 60, 51, -33, -78, -45, 63, 70, -15, -78, -40, 56, 80, 10, -77, -53, 39, 95, 20, -61, -60, 34, 90, 34, -54, -66, 19, 101, 44, -51, -82, -10, 82, 65, -40, -95, -29, 77, 76, -26, -98, -45]
3913d5J08K0q8p7L3R4N1q4r3J3J12O4q5r5nJ05Q2o6j05l8J05R2l5j07n5R6J02
3940I9j0j17p4Q3J04Pj14q2M8J14L9j00j05L6J18N5q6j18J2J20Q3p5j22j5J22
3965B2Q1l8j21m4R8R9j9j23p3Q6J28jj22q3O0J19L8j13r0M4J13K1p1r2J3J01N6
3992H9o4j02MQ2Q2n2j13k1R9Q5l6j02m7Q2R3pj02n4N4J03K4j12p2M5J07K6r9p2
4020h0K6J13M4q4r4oJ11O4o5r0k6R4P5l8j11k7Q4R3k8r2n8O7R5j2q3o2N1R7K2
4049H0q7q4L5J05M6p7r2MJ05N9o6j01KR3P3n1j01j9P7Q3k8r9m7P2R4j1j02o0N7
4078d0J12kr6p5N2J03L1r0q4L1J05M3p3r7J1Q9P5o6j03NQ2Q8m9j11l8R7Q0k3j08
4107e1m9Q9Q9oq5p8N1J06K9j14p9M5J03L2p1r8J6J15M2o5r1j5J05O2m0j09k7J03
$$ y = [-45, 63, 83, -5, -82, -49, 45, 96, 12, -81, -68, 44, 108, 23, -72, -77, 28, 110, 44, -61, -99, 6, 98, 63, -44, -99, -3, 99, 89, -28, -102, -19, 85, 92, -22, -104, -56, 58, 97, -3, -108, -72, 46, 101, 15, -103, -91, 29, 112, 37, -85, -100, 22, 103, 65, -56, -100, -2, 97, 78, -45, -118, -32, 96, 95, -27, -110, -50, 69, 107, -6, -96, -52, 61, 82, 11, -81, -68, 33, 89, 25, -77, -73, 9, 91, 39, -74, -95, 4, 89, 53, -49, -96, -14, 79, 72, -30, -84, -30, 73, 97, -15, -87, -42, 65, 91, -8, -80, -54, 59, 103, 19, -75, -81, 30, 94, 29, -61, -87, 7, 82, 44, -67, -94, -10, 83, 55, -37, -95, -28, 67, 55, -28, -90, -39, 58, 80, -7, -91, -56, 49, 95, 18, -74, -70, 35, 94, 28, -73, -71, 22, 95, 44, -57, -76, 1, 84, 56, -43, -90, -18, 76, 65, -37, -97, -40, 72, 70, -26, -101, -49, 54, 85, -5, -89, -58, 47, 90, 17, -80, -69, 20, 95, 29, -74, -69, 13, 101, 52, -59, -97, 0, 80, 57, -51, -100, -11, 78, 72, -13, -91, -40, 66, 95, -19, -98, -53, 50, 82, 11, -87, -71, 44, 86, 21, -70, -85, 20, 82, 42, -67, -94, 9]
4135IQ1l2j04m3P7R9mj17m9N7J10%r1q5M4J12M8r1r8K0J09N4p4j07%J02P3n4j15
4164f9k3J06P5l3j17m4R5Q9j0j12n0O3J06lq6p9M8J10L3r2r1K1J12M4o8j00%J16
4192D1P5p1j18j0J02Q5m2j20l0P9R6k4j10o4P8J13Jj06o6N4R6K2r5p8L6J07M6
4219I7p1j11QJ10N2n6r1j4J01P2m3r7k8Q2P5l0r4n3P5Q8kj00n9N1J06Nr2p0L0
4248e9J06K4q3o9J4J08L9n7r1lQ0P2n4q4j0P0Q3l5r4m2P5Q7j8q3n5O9Q0J2r2n4
4278f4L9Q1L0r0n3K2Q0L4o2q0%Q6N4o3q9J2P1N7k8r4lO6O6j8r3j8M8P7j5p5m6
4309f8M6Q0np1n0L6Q0M2q4p3L5P1L9n4q5QP1M3l4q3rQ0M7k6q6k0N1Q6k4q2l0M4
4341b5Q2po5m3L6O1Rm9n2K7N9L2n5n1kP3M1n4o2JO2M6m1n8k3O6M9j7p6k5N5M9
$$ y = [9, 90, 58, -46, -89, -12, 87, 83, -34, -83, -26, 84, 84, -7, -92, -48, 64, 112, 21, -77, -57, 52, 106, 32, -75, -75, 27, 100, 46, -69, -92, 14, 89, 56, -61, -105, -10, 79, 69, -43, -93, -30, 76, 73, -13, -92, -44, 66, 99, 7, -84, -63, 49, 93, 25, -75, -75, 41, 116, 45, -73, -83, 19, 104, 62, -58, -88, -9, 87, 63, -47, -111, -33, 80, 81, -25, -91, -37, 59, 81, -14, -92, -56, 51, 97, 26, -85, -77, 33, 85, 29, -62, -76, 25, 97, 54, -43, -71, 11, 86, 56, -38, -91, -16, 72, 70, -30, -89, -38, 68, 73, -19, -89, -59, 47, 71, -12, -81, -67, 41, 80, 23, -68, -71, 9, 81, 27, -57, -67, 3, 86, 51, -43, -85, -10, 77, 59, -24, -79, -10, 70, 82, -10, -64, -25, 56, 86, -4, -57, -35, 45, 79, 17, -63, -63, 23, 77, 14, -75, -63, 8, 65, 37, -57, -60, 6, 72, 54, -39, -57, -9, 68, 53, -22, -68, -22, 58, 53, -18, -68, -32, 48, 90, 6, -67, -32, 39, 78, 24, -61, -53, 18, 61, 27, -56, -65, 15, 62, 36, -50, -70, -19, 67, 43, -39, -69, -25, 57, 50, -15, -58, -22, 39, 48, -1, -53, -26, 33, 65, 10, -41, -43, 30, 71, 17, -45, -44, 18, 64, 23, -35, -58, 8, 57, 40, -36, -61, -6, 43]
4373D3qn8l0L7P0j2n9m5M0N3J8o1m3J9N9K7m3n1oP7L1l8o2KN3M1l0n2j4N6N0k6
4405C8p1j8N6M5k1n3l3L5O4ro0k7M1M8J1n3l4J0N7K4m5m6RN4K8m4m6lO7L0k9n4
4437b9oN1M1k6m6k6M0M8j0n7k7M6L9Qm9m2K6M9J7n2m0K1N0J7m9m6ON5L9l5o4K0
4469c1M3L8k1n8mL6M9k3n2k7M9N3qn6l3K6O7j3m2l3J0O2K2l7m6LN5K1l2n3JN5
4501B1K0j8o2%L5M5j6n2k0N2M0j1l6l9L4M7jl7k8J2M5K1m0m9K4M7K0l9l9kL9L3
4533D6k6m3j7M2M3l0l9k1M4M5j7l9k0K5M3rl9k1MM2K2k1n9J2M7J9j8m1j1M9L7
4564D9j9m5j7L0N4j8m9rJ7M5kl6l4K2M6Ql9m4J3N8J3l8m1LN1J8k6m1OL6L2k2m7
4597b6j0L4M7j7m3k9L2N1rl3l7K8M3J3m5k9J2M9J7k9m8KN1J0j8m9PM2K0k2m2j5
$$ y = [43, 35, -23, -53, -16, 54, 42, -17, -62, -22, 31, 49, -12, -55, -36, 23, 50, 7, -44, -50, 27, 58, 20, -42, -40, 13, 54, 24, -28, -42, 14, 64, 38, -33, -51, 5, 50, 29, -24, -57, -22, 42, 33, -27, -54, -13, 35, 46, -7, -41, -31, 26, 50, 5, -41, -32, 22, 50, 6, -40, -43, 24, 54, 25, -29, -35, 16, 57, 31, -15, -41, -1, 47, 37, -20, -47, -1, 38, 46, -3, -45, -19, 30, 47, -5, -45, -24, 26, 43, -6, -52, -46, 9, 48, 13, -51, -31, 12, 50, 29, -29, -33, 3, 52, 29, -23, -50, -1, 52, 44, -12, -45, -19, 48, 35, -7, -40, -30, 32, 54, 17, -29, -26, 29, 50, 18, -35, -34, 21, 41, 23, -39, -39, -4, 41, 25, -27, -47, 5, 45, 34, -2, -41, -7, 40, 39, 2, -26, -14, 31, 52, 12, -37, -13, 34, 54, 15, -24, -26, 13, 46, 20, -23, -40, 2, 45, 15, -24, -45, -1, 44, 27, -12, -32, -7, 36, 27, -12, -33, -29, 13, 35, 14, -45, -33, 14, 33, 15, -26, -37, 12, 49, 30, -15, -32, -2, 52, 34, -15, -24, -7, 38, 36, 0, -34, -12, 34, 42, 3, -41, -28, 30, 43, 5, -36, -33, 18, 36, 10, -31, -25, 11, 43, 21, -26, -36, -2, 45, 28, -15, -44, -12, 39, 30, -3, -40, -12, 31, 44, -1, -30, -18, 31, 48, 19, -29, -27, 24, 34, 16, -33, -26, 16, 36, 14, -28, -43]
4629d3L4L9lm9k3L9M0rl7l4K6N8Jm9k3J8M9Rl8l9J4N2J5l4m8pO1L1j5n4j0N3J4
4662C8qm9j9N0M0k4l9k9K9O3k4l8l9K5N3Qm6m1K7M9J9n0l1MM9K1l3m4ON3L3k7
4694B6m9rM9L6k3n5JK3M5jo5k4N5K4No0k3K8N2Km6l3J7M0K3m8l2LN3L4l8n7J5
4727c2L9L7j9n5pN2L7j7o1j0N2L5j2m7k8L4N3j5m5l3K5N6Pn4m2J7O5J0m6m6K5
4758b5N0K5l3o0JN7L7l4o3mN5M4k2m3l9N0N0rm4l6L4O2rl7l9J5N4K2n0m5J2N4
4790C0K2m0n2J7N0K3l7n3mM7L2j9m6j2M3M6k1n0k0L8M3Jn0l9L2O0jl9l6K0L8K3
4822D6l8l8OM0K7k6m9kM7K9j3n2j0M3M6m2m4j7M7L2rm2j5J2N6jm1l3K4M9Ml7l8
4855c9QO2J5m6m2J8O4Mk5m8mN6L0k5l6k6M0N4j9n4l3N6M4j5m9l3L4M6om0l0K0
$$ y = [-43, -9, 30, 27, -22, -45, -6, 34, 25, -12, -46, -20, 38, 39, -10, -33, -15, 34, 43, 5, -34, -20, 32, 47, 13, -35, -42, 19, 50, 35, -19, -29, 24, 38, 30, -19, -38, 12, 52, 28, -11, -40, -11, 52, 28, -10, -49, -24, 29, 37, -9, -50, -23, 26, 45, -5, -36, -32, 17, 38, 5, -39, -33, 20, 53, 26, -23, -32, 17, 53, 30, -25, -24, -1, 44, 43, -22, -46, 9, 33, 38, -22, -45, -17, 35, 37, -9, -42, -25, 15, 38, -10, -42, -39, 14, 48, 10, -47, -32, 7, 44, 25, -30, -37, 15, 52, 35, -26, -36, 16, 51, 39, -8, -36, -2, 51, 36, -9, -42, -17, 39, 46, -8, -50, -33, 32, 42, -4, -50, -25, 25, 50, 17, -43, -42, 15, 52, 18, -45, -49, 6, 50, 28, -15, -54, -4, 46, 37, -7, -43, -9, 53, 44, 7, -32, -17, 37, 59, 9, -36, -24, 30, 52, 12, -40, -23, 27, 50, 13, -40, -44, 3, 35, 16, -30, -42, 1, 47, 26, -24, -44, -6, 37, 38, -12, -51, -19, 41, 40, 1, -35, -15, 23, 46, 8, -30, -24, 16, 43, 17, -32, -34, 13, 42, 29, -23, -33, 10, 56, 14, -30, -47, 0, 32, 23, -19, -34, -22, 34, 33, -8, -41, -17, 32, 36, -1, -39, -31, 31, 46, 0, -42, -24, 40, 44, 19, -29, -33, 23, 53, 28, -8, -34, 6, 60, 41, -13, -46, 10, 54, 39, -10, -43, -9, 37, 31, -9, -39, -19]
4887a9M3J8m9n1L1N0K6m0n7J6M4L7k7o3PN3L1j5n2k2M9M2k0n5k2M5M6%o1k6L1
4918a0N0Om9n3L5M5J9m2m4J3N0L4l9o0LO3K5k6o4rO0M8k2o8j1L9M3om3k3K1O3
4950D8Nn5m0L1M3J7m1n1J9N4K8n0n3MN4L7l0n8j1M4L8j8n5pN4L5pn8l1M4N2jn3
4983a2m8M1O0J3o3n1K5P1K9o1m9K4N1K4l5n7%O0L2l2n9j6N9N1k4o3k4N1M8k2n7
5014c4k3M3N4Mn9m2L8N6Rm9n6K9O0K2n4m6J0O2M1l8p6KO3M5l1o4k1N7O1j9o8k7
5046e1M6N2jp3l7M1O8Oo7n3K9O5K7o5n1J8O7L3m1o0jO6M4l5o8j2O0N0rp8k6N7
5078AO0mo9l7L0Q1lp5m4K3P5K5o8o1K2P7K0n6n9J6N9M2m4o5j1O8N4l0p4k0O1O9
5110F3j9p7l2M9N5J3p1l2L7O6J3o2o4K9O6L4n8p0QP4M5m7o8j2P5M8l1p6k7O1O4
$$ y = [-19, 24, 42, -7, -58, -27, 23, 49, 9, -48, -32, 12, 49, 22, -41, -34, 19, 50, 35, -17, -39, 10, 52, 32, -23, -45, 0, 46, 46, -15, -41, -10, 40, 46, -3, -56, -21, 24, 43, 1, -43, -30, 20, 54, 15, -45, -42, 21, 46, 20, -44, -53, 7, 55, 33, -35, -46, -7, 36, 30, -13, -36, -15, 48, 53, -2, -42, -11, 32, 49, 8, -43, -24, 30, 58, 8, -45, -41, 13, 50, 20, -38, -49, -5, 33, 15, -40, -47, 7, 42, 35, -23, -54, -10, 42, 41, -12, -60, -19, 41, 54, -9, -60, -35, 36, 65, 4, -45, -21, 30, 54, 19, -38, -38, 22, 54, 22, -37, -53, 6, 57, 33, -30, -54, -3, 45, 23, -34, -57, -14, 40, 44, -15, -57, -19, 37, 46, -3, -59, -30, 30, 52, -2, -48, -38, 24, 65, 27, -49, -47, 16, 61, 30, -34, -55, 2, 63, 44, -24, -51, -5, 47, 46, -27, -64, -23, 45, 51, -16, -69, -40, 25, 52, -13, -64, -46, 21, 54, 13, -47, -48, 18, 62, 27, -41, -53, 7, 57, 48, -30, -56, 1, 61, 57, -12, -49, -19, 62, 59, -16, -60, -37, 38, 63, -5, -66, -44, 33, 53, -3, -62, -46, 13, 55, 11, -54, -65, 3, 57, 27, -47, -67, -6, 63, 44, -33, -65, -16, 39, 52, -19, -51, -14, 52, 65, 3, -61, -32, 34, 68, 10, -60, -52, 22, 67, 20, -48, -60, 15, 63, 32, -44, -71, -10, 54]
5141E4j3p8l3N1O2J8p9m5M1N6J9o3o6N3N8J9n3o3J8N7N7n7o1qP9M1l3o7j2N8M8
5172E8k4n9k7M2O0np2m2L8O7Qn8m3J9P4J2n5m9OQ4K6m2p5J1O8K9l0o9lN9M4rp8
5205c5j9M9O1j0p6k1L7P2j0n9n1L5P7Pn9n3K0P0J8m8o8J8O0L6m0o0qO0M8l4n6
5236c9j4O2N4k2n8l3N6N1%p7l6M4N9J0n7m8K1O2K4o1m9J0P1K6l9p5OP9K6k2p6
5267d5mN1N3k8o6j7M1N3%o4l9L7Q2j2n7l2K0P6J5n5n8K4N6K7m1n7LP3L6m6o6q
5299d8O2M0k0o7k8N0N2no5k7K6P8Ko9l8L8O7kn0n7K9O5K9n2o0MN5N3l6p7QN0N3
5332F0j6q1oM2O4j9o3l4M3O6lo7m4K8O6K0n7n2J4P5J6m9n9J8O3K1k8o0pN7M1k4
5364B5o0j4M9N6j5p1j5L4P0Kp1m0K7O9J4p2l6K2N5K7n0n9J1O5L2m6n7kN2N2l7
$$ y = [54, 41, -37, -70, -19, 43, 61, -18, -63, -22, 34, 53, -10, -76, -23, 35, 54, 1, -62, -44, 13, 70, 13, -48, -56, 23, 64, 31, -36, -48, 10, 58, 34, -25, -52, -10, 50, 45, -27, -69, -31, 36, 44, -14, -57, -38, 36, 48, -7, -56, -50, 34, 60, 18, -57, -46, 22, 51, 21, -48, -51, 8, 52, 43, -35, -54, -5, 56, 46, -30, -51, -14, 58, 48, -11, -62, -27, 50, 57, -2, -55, -35, 35, 53, 5, -63, -45, 15, 51, 11, -49, -57, 3, 51, 17, -39, -53, 9, 63, 41, -17, -50, 6, 57, 57, -20, -56, -12, 47, 57, 0, -48, -27, 35, 59, -2, -51, -41, 30, 56, 17, -58, -52, 27, 53, 31, -45, -49, 2, 55, 27, -39, -56, -15, 38, 38, -26, -65, -28, 54, 42, -15, -47, -27, 49, 64, 9, -49, -25, 31, 58, 17, -40, -37, 36, 72, 26, -40, -48, 14, 54, 34, -33, -61, -11, 41, 36, -29, -56, -30, 48, 50, -19, -57, -19, 48, 46, -4, -61, -32, 33, 62, 10, -50, -46, 9, 62, 26, -51, -43, 7, 60, 44, -37, -43, -1, 63, 44, -19, -53, -10, 56, 53, -14, -58, -30, 36, 56, -1, -53, -39, 36, 52, 3, -56, -38, 25, 46, 18, -42, -49, 8, 49, 25, -35, -49, 0, 56, 41, -30, -45, -11, 59, 61, -10, -50, -23, 46, 60, -12, -48, -26, 29, 56, 6, -53, -42, 23, 55, 9, -48, -50, 2, 54, 17]
5395A7n5j8N2L8ro5j7L7N8Jo3l6L8N6Qm9m0L4M9K1n9n0K6N7J7l1n1%N1L0l2n7
5427d2nN4L5j6o0j9M3N0j4n7j5M1L8Mn7l7L4M4J0n2m0K4P6Qm0n0J9M6K2l2n1l
5459d2O2L4k5n1j6M2M1j6m3l0L9L9j0m9l2L6N5j4k8m4L2N4%m3l7J1O3J9l9n6J0
5490c8M8L0k2n9j3N8N0k5m9k5M3N3j9m8l1L2O3Jo4k3J8O3lm1m8J7O4J3n4m2K1
5521c0N2K5l4m5j3M9M5k2o0mL7M2j0o1k0L3O0om5m5L7N6On7l3K2N7J6m2n5J0N6
5553B1L4n2l6j3O2K6j5p0j8N2O0l3o1mL5N8j6n5k5M1N0jo3k0K2N6K6n2m5J1M8
5584B3K5l7m6%O7K7l5o9j1O3M8k9n9oL6N4k1n5k3L0P3j2p9j8L0N7J3n5n9L2O3
5615B7J0m3n5K4N4K5l7n0rO0N1l6n5rN1M5k1o5j1M8N0j0o8k4L6M7On3l8L6M6%
$$ y = [17, -38, -56, -4, 34, 25, -40, -57, -20, 38, 39, -24, -60, -22, 34, 42, -7, -47, -13, 36, 57, -2, -52, -26, 31, 48, 17, -34, -34, 17, 47, 15, -42, -47, 7, 42, 26, -34, -53, -10, 40, 26, -31, -46, -5, 33, 37, -20, -57, -23, 21, 31, -21, -61, -37, 39, 47, 7, -43, -24, 22, 44, 12, -39, -42, 20, 54, 29, -22, -38, 4, 45, 29, -14, -44, -5, 34, 24, -25, -57, -21, 34, 20, -8, -52, -20, 34, 34, -9, -46, -35, 28, 47, 8, -48, -38, 10, 40, 18, -41, -54, 4, 54, 29, -20, -45, -2, 51, 32, -16, -47, -15, 48, 49, -15, -38, -20, 43, 40, -1, -49, -32, 32, 45, -9, -51, -30, 22, 47, 13, -32, -45, 4, 49, 27, -33, -37, 0, 42, 32, -29, -49, -16, 44, 38, -7, -52, -15, 41, 47, -10, -43, -21, 36, 52, 10, -45, -35, 21, 55, 3, -33, -46, 16, 42, 27, -43, -61, -9, 51, 18, -43, -47, -12, 46, 30, -25, -50, -9, 41, 40, -23, -43, -21, 35, 61, 9, -36, -25, 23, 48, 11, -35, -35, 32, 59, 24, -45, -56, 7, 55, 26, -33, -39, -3, 51, 30, -25, -48, -18, 55, 43, -36, -54, -24, 33, 46, -9, -68, -36, 27, 37, -6, -61, -37, 17, 42, 5, -45, -54, 6, 57, 21, -34, -43, 8, 53, 32, -33, -44, 4, 54, 44, -24, -48, -12, 35, 41, -12, -50, -14, 32, 32]
5647C2l2m9J3O4K3l9n2KO0L0m1n6pO7L1k6o7j4N8N3j2n5l7N3O0j1n0m0L6O2jn8
5679cl9K0O2J1m8m7PN8K2l9n6JO3M2l9n7qN6L7j5o1k9M8O5j1n5l4M0N4ml9m7J7
5712b8P0K0n5n6J9O9K2m6n6%O0L7k5o8pO1M5l5o2j8M7N5j0o1m3N3O1on8m2K9P1
5744D3Nn4m3K6O3J7n3n5K0O0L9m5n8pO2L6k9o4j0N4N0j4o6k7N3N0qn8m5M3N5M
5776D4n3m1K3O3J0m9o3K6P8K7n7n6J0O7L5m1n6pN3M7j4p2j5M4O5k4n3l9L2P0J
5807E5o5l9K6O7Jm4n1J6O8J7n2n3J8O1K7m7n7J3M8M0k3o3k5O8N2j7o7k7N0N0L
5838E0o1l7M0O0Nn3m8K5P1J1n5o0J9O2K8l8n9j1O1M6l3n5j6M4M9j5o7k0N2M6l
5869C8n5l5M5L9Pm4n2K9O5J5m9m7K5N4K4m9m8J7M2K7j9o1pN0M5k3o7qM0M9j2o2
$$ y = [32, 0, -49, -36, 28, 51, 12, -40, -38, 22, 52, 11, -45, -52, 15, 46, 20, -47, -61, -3, 50, 38, -17, -54, -1, 59, 48, -2, -42, -6, 56, 55, -3, -42, -22, 40, 51, 3, -44, -37, 21, 43, 4, -52, -51, 12, 54, 15, -42, -50, 6, 43, 28, -33, -62, -14, 51, 40, -15, -49, -9, 45, 41, 2, -45, -28, 42, 62, 7, -49, -30, 39, 61, 15, -41, -41, 19, 56, 31, -37, -44, 17, 62, 27, -35, -53, -6, 49, 39, -22, -65, -12, 49, 43, -15, -57, -28, 43, 48, -6, -49, -23, 40, 57, 4, -51, -31, 29, 68, 23, -35, -42, 20, 56, 27, -37, -47, 7, 57, 43, -23, -50, 3, 53, 45, -13, -58, -15, 40, 44, -9, -50, -27, 36, 46, -3, -66, -40, 38, 65, 8, -48, -38, 29, 64, 23, -33, -40, 13, 60, 46, -26, -41, 3, 68, 44, -9, -48, -16, 54, 55, -10, -49, -23, 44, 45, 1, -50, -34, 34, 51, -1, -54, -36, 25, 52, 5, -52, -39, 9, 49, 26, -37, -62, 6, 58, 41, -26, -53, -3, 47, 50, -11, -48, -8, 52, 57, 4, -44, -19, 52, 63, 8, -52, -33, 29, 57, 19, -40, -51, 10, 56, 23, -32, -48, -4, 45, 30, -37, -57, -5, 41, 38, -17, -52, -7, 32, 39, -5, -57, -28, 37, 52, 3, -44, -19, 35, 59, 10, -38, -21, 21, 48, 29, -32, -39, 11, 56, 33, -34, -42, -2, 47, 35, -27]
5901b7j8L1M9Jo4k4K4N0Nm6l8K7N6J1m6l3J9M9K4l8n6QN0L0k7m8pL9M4j0o0k7
5933e2N5L1ln3k8M1M8nm7k7K4M5Nm3m1J4N7K0m9m1MN9K0l5l4lM2M1k9m7RL6L2
5966D6k0n5qM5K7Mn1j8J6M8Lm3m0QN8J5l9m5J0O2J2m3l4J4M2K4k8n7kM6K9j1n5
5999d0j0M2M3j0o0rL7M9j2m1k2J9N5kl3l5J2N1J1m6l7J2M2J6l1l7MK7L6k4n2R
6031c6K8M4j7l8j3J7M0km2l4K8N0Nl3l5J3M4J9m7l4J7M8J2l5l6J0M2L3k4m1qK9
6063DM7l9l5j6L0L3mm2j4K3K9J6m0m0K6M0Ql7k4qN4J2j1m9J1L7J6nn0oM8K3j9
6096A8l5pK6L1j4k1l1K5L1J4m4k6K7L3j0j9k8OL9J0k9l5QL4J5j7m4kM7K1k2k5
6128b4oL4J8pl1j5L8J9Rm6k4K9K6Lk5l9K8K7J3l0l0J9K2J5k6k1pL1K6k7j9j6L3
$$ y = [-27, -45, -14, 35, 36, -28, -52, -28, 22, 27, -19, -57, -30, 26, 37, -9, -42, -23, 26, 50, 12, -44, -36, 14, 44, 17, -31, -38, 1, 45, 35, -25, -52, 3, 34, 31, -22, -50, -9, 39, 34, -13, -40, -16, 29, 34, -9, -50, -36, 21, 41, -8, -49, -45, 14, 34, -1, -35, -38, 4, 45, 16, -31, -22, 14, 46, 26, -29, -37, 8, 35, 39, -12, -30, -14, 34, 37, -6, -46, -38, 20, 35, -4, -49, -39, 23, 35, -8, -42, -28, 14, 38, 10, -47, -49, -3, 26, 15, -40, -50, -8, 35, 25, -35, -44, -7, 42, 30, -11, -33, -14, 41, 39, 6, -29, -17, 34, 45, -1, -38, -26, 16, 32, 1, -36, -32, -5, 31, 7, -45, -36, -8, 36, 19, -19, -32, -15, 25, 23, -19, -53, -25, 25, 30, -3, -38, -25, 19, 38, -9, -43, -26, 22, 34, -1, -37, -27, 15, 48, 24, -17, -25, 4, 51, 12, -23, -39, -9, 24, 20, -22, -36, -13, 16, 32, -8, -48, -22, 18, 26, -11, -35, -43, 11, 23, 12, -37, -26, 11, 27, 22, -28, -34, 14, 37, 18, -17, -24, 2, 33, 19, -2, -33, -8, 23, 37, -7, -33, -6, 27, 17, -2, -30, -24, 15, 25, -4, -39, -31, 3, 18, 1, -43, -45, 2, 23, 1, -24, -30, 4, 22, 15, -16, -31, 7, 26, 35, -11, -35, -6, 20, 23, -2, -41, -13, 14, 27, -3, -33, -14, 8, 23, -3, -24, -31, 0, 26, -1, -20, -36, -3]
6161cK3nl9j5L0K6ml4j6K7K7jk3k5K2L0Pl2j9J6L0J0l4k0K0K2Pj9k7pK7K0rl3
6195b1j0K8K8j5l4j2K9L4j8j8j8J1L7ml7j4J0L1Rj9k4J3L1%j3j8QJ9K2j7l6PK5
6228A4J8j8k8qK1L4j6l4j7K5L5ol8k2J9M1j3rk7LM1Kl1k3J7L5%j9j6j3L8K7j7
6261A5l3j1K1L6j7l0oK4K3ll0rJ8L1ml3j2J1K8jk8k3OL6J3k9k1KK8L1j8l7mK8
6295BJ8j3l6mM1Rjk9rOM5Jl5k6J6L3K2m9j4J7K7Rl0j6MK2J3j9k5jK7K8k0l2j2
6330c1K8K6pl4k2L3K7Ol4l0J9L6Kk1j7NL5Jj8rpK8J5mm6RK4J8j9k8j7L8J7j1j6
6365dk3K2J4Rk9j7J7J6J2k0k6J6K7Mj6j8MJ7J4j2m1QK8J8j2k0kK3K4j1k5nRK2
6399B3Om2pK0K3pj6k2J5J7J1k9k2J9KL6k0k2qK8K0j7l0LK3K4j3l5J4JJ5J3k8k0
$$ y = [-3, 20, 15, -24, -39, -9, 17, 13, -21, -37, -10, 17, 16, -7, -32, -10, 20, 27, -5, -24, -8, 22, 32, -2, -22, -2, 20, 27, 8, -19, -26, 1, 21, 12, -21, -31, -3, 25, 10, -24, -36, -7, 27, 9, -9, -27, -16, 21, 17, -20, -34, -24, 7, 16, -3, -27, -14, 17, 17, 4, -14, -6, 13, 35, 18, -18, -11, 14, 32, 14, -14, -22, -1, 33, 17, -17, -34, -9, 26, 20, -18, -40, -21, 20, 7, -2, -29, -26, 15, 17, -14, -37, -20, 15, 15, -4, -20, -33, 5, 32, 15, -18, -29, -8, 28, 11, -19, -25, -1, 22, 19, -11, -20, -2, 29, 25, -8, -20, -9, 19, 18, -10, -33, -27, 9, 22, -7, -28, -26, 2, 33, 15, -22, -26, 2, 20, 7, -29, -33, 8, 17, 16, -13, -22, -16, 29, 30, -5, -31, -15, 18, 40, -9, -23, -6, 21, 30, 0, -16, -12, 10, 23, 4, -21, -22, 5, 33, 13, -19, -31, -3, 23, 16, -18, -40, -7, 20, 26, -8, -38, -19, 17, 19, -2, -19, -14, 21, 22, 4, -5, -12, 16, 31, 27, -19, -10, 14, 32, 13, -15, -32, 6, 23, 12, -4, -27, -5, 9, 18, -11, -28, -11, 5, 17, -3, -29, -13, 14, 18, 2, -16, -12, 5, 19, 7, -34, -26, 2, 20, 8, -12, -14, 9, 33, 22, -3, -8, 1, 23, 29, -13, -20, 0, 23, 16, 0, -22, -7, 10, 21, -8, -30, -11, -9, 27, 7, -15, -23, 5, 25, 8, -22, -19, 4, 28, 15, -20, -6, -5, 10, 23, -5, -25]
6433b5J5L0Pj5l6NM1qrj7PK5Rj8k4lK4J5k3j1k0K8K5j0l1j0J9K0j0mk2K1K9Jl1
6468fmJ2K8rk5j6NL0K0k8j5j0L4J6k2l1J0K6J9k6j3j4K6J5Kl4j1J8OJ3k4j9J6
6501a1J4K1l5pJL3J5k2k5oM2Krl0jL3J7ll6kL0LJl4jJ4K4Om5j1NK9J0j3k9RK0
6538IJ8l3jj4L8nql2NK9J4kl4lJ5K5nk1j5J3L2nk6pJ1K4J3k9j9OK4Qk1j8J5J5
6574A6Lml4KK0J0jj2k5J4K9rk2j0K6M%rj8J9L2j1j8k0J6RJ9j9j8JK4K2k3j9mK7
6610A7Okk3qK6J4j3k1kOK1qj7j5J8K6nk7k7K0J5J6j5l2J3K4Nmk4KJ7K3j3l1kK6
6646FJ7pl4NJ1K1Pl2qJ2K5Kk0j9J2K1Ok6pMJ7J4k3m3K1J2J8km7J2K6J2mj3pRJ8
6683A6Lk1jLL6j8k3j1J5J8J4k9j8J5J8Ok5j5%K3K6k5k4JK2K4k1k4LJ5JLk3j2J9
$$ y = [-25, -10, 20, 27, 12, -24, -19, 22, 14, 5, -12, -5, 20, 29, 11, -13, -16, 8, 23, 0, -11, -31, -3, 22, 12, -19, -29, -10, 10, 0, -4, -26, -5, 24, 25, -6, -10, 2, 30, 21, -4, -20, -15, 15, 35, 7, -8, -18, 16, 32, 10, -21, -11, 15, 34, 8, -5, -19, 7, 22, 24, -10, -21, -3, 3, 16, -8, -27, -11, 3, 24, -11, -18, -17, 16, 31, 9, -16, -22, 20, 22, 13, -17, -18, 15, 32, 29, -7, -9, 21, 24, 25, -9, -10, 4, 28, 34, -11, -22, -17, 12, 22, 9, -20, -11, 9, 27, -6, -7, -21, 17, 12, 4, -28, -23, 6, 20, 18, -16, -19, -4, 21, 16, -5, -20, -7, 25, 20, -6, -13, -2, 22, 35, 6, -13, -7, 17, 25, 4, -14, 1, 16, 19, 15, -19, -17, 3, 13, 12, 0, -25, -11, 18, 9, -13, -23, 3, 7, 7, -2, -20, -1, 31, 20, 2, -18, -2, 7, 26, 7, -11, -10, 14, 36, 13, -6, -10, 17, 23, 21, -2, -10, 16, 30, 17, -4, -6, 0, 21, 13, -4, -19, -1, 25, 20, -7, -34, -14, 1, 17, 2, -30, -17, 7, 12, 8, -16, -14, 3, 26, 13, -18, -20, 6, 23, 16, -18, -13, -2, 19, 26, -6, -14, -2, 23, 25, 5, -14, -2, 19, 25, -1, -8, -4, 13, 27, 4, -39, -18, -6, 12, 10, -37, -25, 1, 13, 9, -4, -11, -2, 16, 19, -2, -3, 0, 36, 18, -5, -16, -1, 17, 31, 2, -16, -1, 17, 23, -2, -17, -17, 6, 32, 7, -17, -16, 6, 30, 9, -15, -12, 3, 4, 7, -16, -28, -9]
6718iL1nk5k2K6K3%k1j0lL3J0j7k2%K7Qj7j9%K9J5j1m0OK6MQm5qK7J7ok4j1J5
6754a0J7Mk9j4J7L2Jk4pkK0J2j7j5qK6K9j7k8oK4K0j0l2%K1K1qj4k6L5Roj1k2
6789a8QK0Qk1j9PL0Nj6l0NK1J9j8k5nM6Rj9k0PJ1K0nk5oLK9jk9lJ6K2Rl5j4ML3
6827B3%j6l0NK8Rj7k3NJ9J6j3k9oK5K7k2k9lK6J6Jk1j6K1K4J0l1j9QL4jj0l0J9
6862@J7J4ol4mK6K4j7l3mK2J0pk2j5K3K7qj7k9L0K7Jl2l0J4M1pk2k2K2K0J7k5
6896Ak6MM3Rj8k3oK3K6nl5j2K1L6k2k6rJ4L2j2k3j9K0J9J5l2k4PL7Nj0m5RL1K3
6931B8k1l2RJ4K8nl3j0K2K2mk3j5J2M0j0l0j7J2M1Ml1k3K0L0Rk8k8jJ7L1j8m4
6964c4mK7K6ll0rK0K1j0j3k2J8L3Mm0pJ2K4J7l4k2jM4J0k3k3mM2Nj4l0qL6K1q
$$ y = [-9, 22, 17, -8, -30, -4, 19, 19, -2, -12, -15, 18, 28, 11, -11, -11, 16, 24, 7, -12, -12, 17, 32, 21, -19, -13, 13, 17, 25, -20, -28, -1, 16, 10, -14, -25, -10, 7, 11, -18, -32, -15, 17, 18, -6, -13, -15, 5, 17, 0, -15, -23, 3, 32, 15, -13, -19, 5, 25, 15, -17, -17, 4, 25, 17, 3, -23, 12, 21, 15, 4, -18, -10, 10, 18, -3, -22, -15, 15, 20, 4, -26, -21, 0, 19, 1, -24, -29, 17, 26, 7, -13, -6, 5, 25, 20, -5, -11, -8, 21, 20, -9, -12, 4, 26, 35, 0, -14, -10, 23, 23, 7, -23, -18, 10, 19, 2, -21, -16, 3, 19, 6, -23, -29, -4, 23, 1, -28, -31, -5, 11, 12, -9, -25, -4, 20, 30, -1, -20, -12, 22, 21, 11, -19, 0, 17, 31, 25, -9, -13, 13, 37, 20, -13, -17, 5, 15, 8, -14, -29, -6, 21, 13, -4, -33, -3, 24, 25, -7, -37, -23, 18, 11, -11, -33, -11, 9, 26, 1, -25, -21, 22, 31, 13, -10, -16, 7, 33, 28, -7, -19, 2, 38, 16, -10, -19, -5, 27, 15, -8, -27, -7, 12, 27, -5, -29, -22, 15, 20, 10, -35, -26, 5, 28, 7, -25, -16, -2, 26, 21, -12, -22, 0, 22, 18, -5, -20, -8, 32, 22, -8, -25, -13, 28, 32, 1, -22, -2, 28, 37, 9, -19, -20, -3, 28, 10, -34, -38, -11, 15, 12, -18, -27, -7, 14, 4, -9, -31, -13, 20, 24, -16, -23, -11, 13, 30, -4, -26, -27, 17, 27, 4, -19, -23, 19, 24, 10, -20, -28, 8, 29, 21]
6999B1l1k4M2K1ll9k3K5K5nj4l2J3L3Ok1k9J4L2Nj9k8J1L2K0k0k5LJ7L3k6l0%
7032a6K6J8rl7MK0J8Ml6pJM0Ml2k9K0K2Ok6j7J1K5J6l9j1MK1J7j4k1j0K3K0jl4
7067a9JK8QOj9j3J0K8%l0k8L0K2Ml4j9K0K3Mj7j6qK2K0k7j9lL7Lj0k3nL1J9k2
7102Dok3K8K0Jl3j3K3K1Ml1j1PL6mk0j9J3K1Jj4k7OL1J5k9j7lJ6J7nm2NL2K0k0
7138Dk4j0K0L8qk6j6K5J1Pk8j5RK7J9l9j6J2K2J6j3k9QK3J7k1l5QK1K8j5l7kJ7
7172bK6jl9oJ4K9rl5j2J3L4rll6K5K3J5k6l0PM9Qk3l6MK4K9j8l3j2L6K7j6k6j4
7207b3K5L3rm7LQL6pl0j9J8K2J7l5k2J1L2J2k2k3j0L6K3j8l6LK8K2nl9j4L1K5
7240B6Lm2j3K6K8Nm6j5K6K5Pl2l2QM2J0l5j8pM9Oj6l7jL7K3j0m3k1N1K5lm3k4
$$ y = [21, -10, -34, 8, 29, 26, -13, -36, -11, 14, 9, -5, -37, -24, 9, 15, -6, -35, -21, 11, 16, -3, -31, -20, 12, 32, 12, -13, -10, 7, 40, 14, -16, -16, 10, 28, 19, -18, -14, 6, 24, 28, -8, -15, -14, 26, 30, -2, -31, -11, 11, 17, -9, -26, -15, 10, 26, -13, -24, -20, 1, 18, 4, -17, -27, -4, 16, 15, -19, -18, 10, 18, 24, 5, -8, 2, 30, 30, 0, -28, 2, 24, 28, -6, -25, -5, 18, 22, 5, -11, -19, 3, 23, -4, -23, -26, 11, 14, 4, -19, -24, 7, 26, 4, -2, -25, 3, 23, 24, -9, -22, 1, 22, 26, -5, -16, -9, 27, 23, 3, -16, -3, 18, 19, 5, -22, -16, 15, 30, 1, -16, -19, -3, 14, 9, -33, -28, 4, 24, 4, -20, -30, -10, 28, 20, -6, -22, 3, 14, 21, -7, -22, -13, 14, 33, -6, -22, -10, 12, 28, 15, -14, -6, 17, 34, 13, -22, -14, 7, 35, 20, -17, -19, -2, 24, 23, -16, -22, -8, 21, 12, -23, -35, -22, 12, 3, 0, -36, -11, 12, 27, 1, -29, -22, 27, 35, 12, -24, -20, 4, 33, 15, -18, -30, 6, 33, 17, -9, -23, 2, 35, 26, -21, -18, -10, 26, 19, -11, -30, -12, 10, 27, -8, -30, -19, 13, 25, 3, -20, -30, 6, 29, 11, -25, -22, 6, 28, 23, -16, -30, 1, 26, 29, -13, -26, 0, 28, 33, -13, -28, -2, 23, 30, -2, -34, -26, 16, 26, -9, -27, -34, 15, 21, 5, -32, -33, 4, 27, 17, -26, -47, 4, 29, 26, -17, -41]
7274d1L2M0%m8k3L0L8Kl3k4J4L8K4m3l0J2K5J7j8n1NL5K6j8m1j2L2L8nl0l4K9
7306a4L4Pm7k0K2L6Pl4l0J7L6K3l8k8QK2M0l2l7lL5M1k3l2k2M3K7j0l3k3L0L3
7338C5j0l2k6J2M8Mm5k0J5K9J4l8k7J3M7J1l6k3mM4K5j9l1pL5K5j7m0k3M4L2j0
7370B5k6l4L3K4Pl2k4L4QJ7l8j7kM3J7l5k8pN4J5k2m2lL8L1k8k8nK7K9j1l2j2
7403b4K9K1Jm4rK8L2Nl0l2J8K6K2m0l3J4M1J1l2l0mN1J2k8l6kL0M0l2k3j3K6L4
7436B9nm6j3K2L3Ol0k4J5L8Qk3l8J9L8J5l2l9RL2J6om0jL3K4j9l7oJ8M2k4k9j8
7470c3J9M2j2l0k3K0L8J3l6l3L0K3Pk5l1J4M5J3l4j9%K7K1nn3jL5J4lk9j1L2J9
7503C4kl3j7J6K6Ql1l0K2K5Ql4l1J2L8Rj1m7J1L9J4j9l6jK7K8ol4j0K3M1pn0l
$$ y = [-41, -9, 31, 31, -17, -40, -10, 28, 30, -3, -27, -13, 25, 49, 6, -24, -12, 13, 30, 12, -39, -34, 1, 27, 9, -32, -44, -12, 26, 21, -9, -43, -14, 20, 27, -20, -40, -18, 18, 25, -9, -39, -22, 14, 37, -1, -29, -21, 1, 41, 9, -28, -31, 4, 45, 22, -10, -32, 11, 38, 28, -5, -28, 2, 35, 25, -7, -33, -21, 27, 31, -14, -34, -19, 10, 24, -14, -41, -28, 19, 30, -6, -29, -33, 11, 36, 17, -14, -21, 14, 39, 22, -18, -41, 3, 35, 25, -1, -35, -2, 22, 29, -3, -27, 7, 15, 32, -6, -23, -25, 18, 35, 0, -28, -35, 19, 34, 12, -30, -33, 5, 36, 8, -20, -25, 2, 31, 20, -12, -24, 5, 26, 27, -17, -26, 2, 34, 39, 9, -23, -5, 21, 43, 3, -30, -16, 25, 36, 4, -26, -30, 21, 33, 5, -31, -33, -3, 37, 5, -18, -31, -5, 29, 24, -22, -35, -13, 20, 26, -4, -28, -13, 25, 33, 10, -28, -9, 29, 44, 12, -27, -18, 14, 30, 24, -16, -17, 16, 40, 21, -16, -22, -4, 38, 14, -15, -33, -14, 28, 16, -14, -37, -17, 21, 34, -2, -35, -5, 18, 25, 0, -31, -17, 28, 41, 7, -12, -12, 15, 36, 31, -22, -23, 12, 26, 23, -6, -17, 15, 34, 32, -1, -18, -2, 24, 32, 1, -29, -7, 18, 26, -8, -39, -27, 11, 20, 9, -38, -27, 12, 26, 7, -29, -30, -3, 25, 19, -15, -25, -2, 39, 32, -18, -21]
7537b1J0M6j6k2k5J9L7Kl1k3J6K5J7k6l3OK8K5k7l3RL0J8k1l4j0L4J9ll4j8L4
7569bK2Jl7rJ3M3%l4j4J5K9J2l1m2K1L6Oj9k5j1L6K5k3l8LL2K3j9l2j3L1K7lk9
7603fk7K9K4Ll3j9J3K3Rk4l0K0L3J6j8l4QL7J4k1l7J0K4K0rl2oRM0qm4mK6J6l
7638A9k8j8K0K3Ol8k0L0J9J3l0k2J5K2J7k8k3nM2J7j7l7LK8K2j5j7k4L2L4rl2
7670ak4K5K8J0l5k8J9L5%k7l6K7K0J4l1k6kK9K4j8k8MJ9K2kl5nJ8M0j8l5qK0L9
7704C4j1l7j3K7K3J0k6l3NL1J9k2k7lL9J5j9k9PJ5L0k1l1k1L5K7j2k1k4K5K1J
7736A4k5j9J2L7jj9k8K6K7J1l0k1lL2K0j7k9JK5J3pk8j1K5K1j0j9j6K4QJ1k8k1
7769b5J2L4Rn1pK3J8J0l0j9JL9J7l4j8pM3J2j7k0j9L9K0pk8j0J8J9Nl2j5J9L7
$$ y = [-21, -11, 35, 19, -3, -28, -9, 28, 30, -1, -24, -8, 17, 34, 8, -25, -19, 9, 34, 7, -26, -17, 13, 31, 10, -24, -34, 0, 19, 16, -18, -36, -2, 20, 21, -16, -25, -12, 31, 31, -3, -17, -2, 27, 39, 8, -34, -13, 23, 29, 10, -15, -26, 10, 35, 12, -26, -23, 9, 32, 13, -19, -32, -1, 26, 23, -6, -33, -4, 20, 23, -10, -29, -16, 7, 16, -8, -38, -18, 15, 31, 13, -21, -13, 24, 38, 17, -20, -10, 14, 34, 25, -7, -13, -4, 36, 28, -16, -20, 6, 22, 19, -9, -27, -7, 16, 22, -16, -36, -6, 13, 26, -4, -26, -11, 11, 28, 0, -23, -28, 14, 31, 14, -23, -20, 8, 30, 15, -2, -26, 6, 40, 31, -1, -25, 0, 28, 38, 3, -25, -6, 29, 29, 2, -34, -7, 13, 27, -4, -30, -32, -3, 21, 3, -25, -21, -2, 20, 18, -17, -22, -4, 36, 18, -17, -25, -5, 34, 23, -14, -27, 0, 23, 33, 7, -26, -21, 10, 29, 7, -20, -23, 16, 31, 12, -17, -10, 5, 35, 14, -17, -38, -3, 24, 12, -9, -33, -8, 13, 14, -11, -30, -18, 19, 18, -1, -29, -3, 24, 35, 5, -16, -19, 13, 33, 16, -13, -12, 13, 26, 19, -9, -20, 5, 26, 16, -3, -19, 5, 13, 24, -4, -25, -13, 21, 30, -21, -28, -5, 13, 23, -7, -26, -25, 14, 31, -3, -21, -28, 15, 27, 10, -10, -29, 10, 30, 23, -5, -15, 3, 22, 27, -5, -20, -1, 36]
7802C6j2l2j7J2K6J3l2k4J1K2K2k4k8RK4J7j9k6OJ8L7l0l4OK2K0j0k5rJ0L3Pk7
7835BpLM1k2ok7KM4mj9k2NK9J3k0l3jL5Qj1m0LK8J2nl0lJ6K8mk2j8K1L0lk4k1
7872b2J4K9Oj1k9MK9J6l2j8%L0Pj3j7%J8K3k3k3lJ2L4j4j9j7RL2j0k4j9J3K6N
7906A3j7l1J3L1Oj7j9NL3Rj9j9kK7J6%l4j0J8J9rk4oJ7K2j2j9okK7Ok7j0J4K2
7941A5Lk0k3%L3J8k9k5jL4Rrk1pL2Mj0qj5K9J5j2ok1K1K1j3j3k5K2K2J4m7j%K8
7977A4Mj9j7PK8Qk6j1pK3J6j3k9J0K4J2nl9PJ6J5jj9k1K7J5Lk0j5J0K4Mk9j0R
8012eK0J3k3k2PK0J3j6l2PK5Rj9j3kK5J0j3j8oL3Nnj8mRJ9Kk6mOK9Jk6lj5K8J7
8050B8k5j5JK4K4k4k8OK6Onj6j7K1J3Jk8j8K7Qpj6j5J6K1Kj5j5J9K4ok2j0J0J9
$$ y = [36, 24, -8, -25, -13, 13, 26, -6, -30, -19, 3, 25, 1, -27, -18, 6, 23, 4, -22, -16, 2, 39, 9, -25, -19, 3, 23, 13, -12, -21, -11, 22, 29, 2, -5, -2, 39, 17, 11, -16, -14, 30, 26, 7, -15, -10, 19, 32, 12, -21, -22, 13, 21, 10, -30, -27, 1, 13, 8, -22, -25, -9, 19, 15, -7, -25, -4, 26, 23, -1, -22, -8, 21, 27, 16, -13, -9, 20, 36, 4, -14, -14, 16, 23, 10, -7, -7, 11, 34, 11, -12, -15, -3, 31, 17, -2, -19, -10, 22, 12, -12, -31, -18, 8, 13, -4, -35, -22, 9, 15, -2, -21, -16, 17, 26, 7, -12, -14, 13, 29, 29, -5, -15, 3, 22, 13, -11, -17, 0, 22, 10, -9, -15, -17, 10, 16, -11, -21, -7, 15, 18, -2, -25, -25, 8, 26, -3, -28, -29, 5, 14, 5, -16, -23, 9, 13, 3, -5, -20, 9, 24, 12, 6, -15, 6, 27, 14, 1, -24, -2, 20, 34, -13, -14, -14, 14, 18, -1, -18, -11, 17, 25, -1, -12, -19, 4, 20, 7, -22, -12, 12, 24, 19, -20, -13, 3, 18, 17, -2, -23, 4, 19, 22, 2, -13, -3, 21, 25, -4, -14, -5, 15, 28, 5, -17, -10, 10, 23, 7, -25, -18, 7, 16, -3, -16, -18, 7, 17, 4, -14, -20, 13, 18, 13, -5, -9, 0, 19, 21, -5, -9, -3, 26, 27, 1, -2, -17, 11, 28, 3, -12, -11, 13, 37, 13, -15, -9, 17, 23, 18, 2, -15, 6, 19, 20, -8, -26, 1, 9, 2, -14, -29, -13, 8, 10, -5, -20, -1, 23, 17, -5, -15, -5, 14]
8085A4J5k8j1%J6J3Ll3pK4J8mj8j7J9J7j2j7kJ1J4pj6KJ4J2j5qj1LJ3J2qj4j2
8120b0M1Jk0j0kJ9Rqj5KJ1K3k4nO%K6j3l0mJ7K2ol0j0J0J9Kj4j8J7OJ4j4j9NK4
8157A2Qj8k3LJ4K0jk7qL2%jj8JJ0J4%l0J0JK5%k3oOL2j5j2k8J3J7J1j7r
$$ y = [14, 29, 1, -10, -10, 6, 19, 22, -11, -18, 6, 24, 20, 2, -15, 4, 21, 9, -8, -10, 1, 15, 8, -8, -6, 8, 20, 5, -3, -14, -11, 2, 14, 6, -8, -20, 21, 22, 2, -8, -10, 9, 18, 10, -5, -3, 8, 31, 7, 2, 8, 8, 34, 21, -9, -13, 4, 26, 20, -10, -20, -10, 9, 11, -3, -21, -4, 2, 16, 2, -17, -12, 12, 20, 2, -21, -18, -4, 16, 15, -12, -20, 12, 12, 11, -7, -6, 4, 18, 18, -12, -2, -1, 24, 24, 1, -5, 1, 33, 18, 6, -22, -9, 8, 19, 2, -7]
8191g
$$ Imaginary data points
##PAGE= N=2
##DATA TABLE= (X++(I..I)), XYDATA
0@%%%%%%%%%%%%%%%%%%%%Qj6J6j6J6j6J8k6L2l2L6m4M9n6O7p2Q0r5J03j12J28
41F8j44J60j79J99k19K43k70K97l27L61l96M36m81N31n86O47p15P91q79R79j095
62e79J233j397J591j819K068k227J517J1937K21145m642l18580j89987J69198
75a10542L13944M1324k73387k32589J13946L02311R8018k33331k54039N2228K87444
86A05327J44372j81419k68181m341K60149J85058j29509k70389n9644K25369K11990
97B18782p6097k61367j03214J86633K30038k6760k44673j41196J45010K38288
107A65444K0310k21544j72092R9948K38226O4944j89941j94233N4413K29051J03591
118A98117j55088k08886R500K12612J36588j15922k14266l2776J88476J61273
$$ y = [0, 0, 0, 0, 0, 0, 0, 0, 0, 0, 0, 0, 0, 0, 0, 0, 0, 0, 0, 0, 0, 8, -8, 8, -8, 8, -8, 10, -16, 16, -16, 20, -24, 25, -31, 36, -36, 44, -51, 52, -60, 68, -76, 84, -95, 104, -115, 128, -142, 155, -172, 189, -207, 229, -252, 279, -307, 340, -375, 416, -463, 516, -579, 654, -743, 848, -971, 1097, -1130, 387, 12324, 233469, 228827, -89753, -279740, -110542, 203402, 244726, -28661, -261250, -147304, 155007, 253025, 19694, -234345, -182117, 105327, 249699, 68280, -199901, -204242, 55907, 240965, 111456, -158933, -218577, 6792, 218782, 142685, -118682, -221896, -35263, 194775, 168015, -76658, -217854, -72844, 165444, 185754, -35790, -207882, -107934, 130292, 195236, 5295, -188938, -134525, 94526, 198117, 43029, -165857, -156357, 56255, 192843, 76921, -137345, -170121, 18355, 179628]
128A79628p5161k09846o9190J59206J76441l6200j98003r9311J26941J84301J115
139A39921j80457j24773R1623J85037L6714j56467j43087N5823J79135O8101j29402
150B2168j55706K0803J67759R4088j01669j62903j1091J53708J16390p2413j64723
161i3589m0782J35566J33291m3102j61549o8076J12828J44033j3072j50925q9855
172a35232Q7648J48552J5164j35972j07737O0333J47255M1030j17258j20869L2648
183h4438J41498O4918r4666j28490N566J30517Q3631p1721j31598j9283J16468
194A2402R8408m7747j29646m1333R9811J09121k3823j23790o1033Q0403J15044
205H7817r45j14461p7494O0248J18143K1433j02475r1689L8791J17770M2447q7871
$$ y = [179628, 104467, -105379, -174569, -15363, 161078, 124878, -73125, -172436, -45495, 138806, 139921, -40536, -165309, -73686, 111351, 148065, -8402, -151489, -95666, 83469, 151570, 22168, -133538, -112735, 55024, 149112, 47443, -115460, -126551, 27157, 143547, 71134, -93589, -134371, 1195, 134486, 91384, -70165, -138241, -25413, 118620, 105548, -45377, -135232, -47584, 100968, 116132, -19840, -127577, -67244, 80011, 121041, 3783, -117086, -84438, 57060, 121978, 27312, -101178, -95612, 34905, 118536, 46815, -84783, -104066, 12402, 110810, 63063, -66583, -107916, -8105, 101016, 77193, -46597, -107630, -27227, 87817, 86872, -27589, -105083, -44835, 73308, 94741, -7734, -99423, -60632, 57138, 99585, 11714]
217A1714j02627J6738J13469O1268p0654j09198m548J05293P6429n2230j11399
228f5745k4306R3551Q7765l2642j08923m2032P8880R5393j2572j02541n7722O1473
240b9421R8876P138r2507p0466M2862R8851K5453q0223q0131K4480R6161M1667
252H2740o6847q7181O590R1136N5958n2120r1282j0689Q3348O7626l6577r2210
264d9508k6817P3187P6673k0186q9988m1624O0874Q3224l235q4814n5030M6393
276c0851Q6499J3347p6723o6013L0768Q6576K8885o6104p3964J4841Q3492M2444
288G3197n3557p8575p62P7128N3466l9575p9775j5459O8099O1783k4947p8007
300c6984k8837N7161O7621j0085p3824m0732M5126P1513M521o7883n1203L2301
$$ y = [11714, -90913, -74175, 39294, 100562, 29908, -79290, -83838, 21455, 97884, 45654, -65745, -90051, 3500, 91265, 58623, -50300, -92332, -13452, 81941, 69369, -33172, -90894, -29421, 69455, 76593, -15914, -86380, -43518, 55333, 80786, 563, -79568, -55088, 41073, 82740, 15893, -71288, -64698, 26438, 82396, 30276, -61006, -71695, 11653, 79279, 42702, -49508, -76325, -3138, 73535, 53349, -36639, -78263, -17389, 65835, 62600, -22214, -77244, -30851, 55648, 68995, -7728, -73741, -42973, 43603, 72488, 6384, -67580, -52739, 30753, 73197, 19640, -58935, -59697, 17431, 70897, 31322, -48453, -63912, 4187, 65970, 41023, -36984, -65821, -8660, 58961, 48876, -24948, -65680, -20554, 50959, 55480, -12403, -63606, -31305]
312c1305P3273J8307o0476n9926J9024P2803L0974n1399o6184N894P0037M2118
324F3140m0843o9852p131O4552N1296k8950p0686j9741N6459N8223j5996o8520
336b8049l1209M6290O2577k825o3813m1033L4890O4546R861n7022m8823K2975
348c1635O4098K1249m8847n4516J0959O1396L1091l9550n7902m84N7019L9549
360E2427k9356n9263j1451N0951M6403j8704n8982k2029M3490N1869p583n6936
372a9164l1726L4897N5692L574n3149m0206K5348N7551J4309m7484m6800J5201
384c1957N7018K3982m0143n1292M652N3877L2179l1263n3192n564M8650L8831
396D5778k1278n2799j5214M1605M3601j1067n0681k3963L3558M6824r48m7030
$$ y = [-31305, 41968, 60275, -201, -60127, -41103, 31700, 62674, 11275, -54909, -49015, 21022, 63140, 22297, -47555, -54686, 9866, 61162, 32212, -38474, -58215, -1756, 56467, 40471, -28049, -59258, -12968, 49609, 46784, -17029, -58062, -23172, 41374, 51235, -5787, -54610, -31635, 32463, 53712, 4865, -49651, -38692, 22704, 53795, 14245, -43657, -44141, 12878, 52427, 23071, -36192, -47643, 3308, 49711, 31007, -27975, -50004, -6514, 45355, 37772, -19164, -50890, -15993, 39699, 43273, -9876, -50082, -24734, 32817, 47126, -358, -47158, -31957, 25061, 49043, 8900, -42392, -37740, 16137, 48316, 17053, -36139, -41703, 6947, 45778, 24500, -28299, -43513, -1908, 41693, 30626, -20055, -44018, -10460, 36364, 35416, -11614]
408a1614l1463K5050M8485Q454m2460l7657J6337M8688J7129l6746m2219P733
420c0283M7454K4917l0131m5444j222M4355L1525k2561m6959r887L9897L7304
432C8965j3909m6577j8137L3873M1419n171m4715k5682K6608M3729L572m0895
444f920l1571J8896M4261J1649l5710l5928J0645M2687J8617k9388l8486K611
456b8637L9723K4708k2169l9536n192L5491K9521j4838l9533j2608L0488L3530
468C0948p193l8387j9233K5090L6584J97l6417k5238J9021L8285P247l3306l0107
481c2509J2553L8626J3929k8909l3588N745L7283J9843k3345l5614j338L4327
493G003K4889j6806l6152q282K9970K8710r835l5113j4445K4729L1330k890l2900
$$ y = [-11614, -43077, -18027, 30458, 38912, -3548, -41205, -24868, 23820, 40949, 4203, -38016, -30283, 17171, 42088, 11957, -33487, -34709, 9646, 41171, 18610, -28349, -38236, 1661, 38965, 25056, -21521, -39658, -5785, 35634, 30463, -14252, -39934, -13326, 30403, 33975, -6920, -38491, -19595, 24666, 36315, 605, -35323, -24678, 18009, 36626, 7238, -31248, -28637, 11086, 35794, 13625, -25911, -31103, 4388, 33909, 19071, -20462, -33070, -2582, 30948, 23755, -14632, -33865, -8775, 27809, 28006, -8411, -33649, -14628, 23657, 30904, -2402, -32509, -19956, 18670, 32599, 3690, -29898, -24153, 13130, 32973, 9628, -25986, -27324, 7003, 31892, 15086, -21066, -29348, 622, 29332, 19497, -15616, -30061, -5332, 25998, 23108, -9792]
506i792j9716J9010L2553L485k9825k3932J3062L2607R395k5824k6942P190L1665
519A2936J4604k1418k9212J199K9757J9231j6392l0427m622K7218K3417j0929
531A5362l0867j0316K3734K6565n489l0406j5502J9632K8914L08k8526j9744J4932
544a1403K9881N629k5697k3166R497K9237J0554k1643k5229M050K7607J4978j6801
557G494k6193j376K4828J8385j1872k6427o470K1675K1367o735k5876j1071J8160
570d111K3541j893k4757j5143J4260K4808K703k2919j8380J0382K5484P097k0524
583E48k1103O027K5137J1230j7374k3161J343K3970J5121j3437k4289l326K1869
596B555J8358r047k4443p815J8883K0721m490k3607j1693J5315K2028j01k1839
$$ y = [-9792, -29508, -10498, 22055, 25540, -4285, -28217, -15155, 17452, 26847, 1023, -25919, -18729, 12936, 27540, 6122, -23090, -21891, 7866, 27097, 10705, -19722, -24344, 2874, 26291, 15362, -15505, -25821, -2087, 24478, 18989, -11417, -26919, -7287, 21627, 21935, -6591, -26335, -11403, 18478, 24107, -1590, -24756, -15259, 13978, 24532, 2889, -22340, -18290, 9317, 24295, 7494, -18699, -20075, 4753, 23138, 11266, -15161, -21631, 44, 21411, 14676, -11200, -22271, -4111, 19430, 17537, -7220, -22363, -8103, 16705, 19408, -3511, -21891, -11509, 13975, 21072, 548, -20555, -14528, 10609, 21839, 4465, -18696, -17353, 6617, 21738, 8301, -15988, -19314, 2555, 20913, 11866, -12577, -20392, -1509, 19212, 14722, -8885, -20578, -5263, 16765, 16664, -5175]
609e175j4845J1374K2420M142j9247j7244P176K1972P978j6200j9033K921K0856
622G095J1462j2803k0272j241J9392J4612r285k1018n193J7463J7187n734k1198
635i533q813J5280J9359k018k0754j2217J2434K0700J789j9385j5109Q840K0966
648A1539N581j6918j7082N101K0405Q985j3976j8469J103J9017J1994j0545j9200
661a2465k832J7034J4560o827j9093o351J4535J6269l208j8360r421J1757J7375
674A2973K62j7094j1933Q844J7934L521j5464j4128N652J7991O737j3362j5968
687a4035K340J7605R842j0824j7259j062J6540J2491p952j7974m429J4888J4616
700A4787m807j7828p426J2582J5947j540j6808r980R771J6535J701j5119j2057
$$ y = [-5175, -20020, -8646, 13774, 17916, -1331, -18575, -11399, 10573, 18551, 2351, -16682, -13761, 7095, 18557, 5754, -14518, -15759, 3633, 18245, 8960, -12058, -17251, 212, 17399, 11665, -9533, -18346, -3066, 16293, 14275, -6479, -18696, -6262, 14438, 16227, -3158, -18267, -9427, 11539, 17120, 202, -16880, -11779, 8626, 17611, 3635, -14834, -13731, 5286, 17280, 6735, -12465, -15297, 1737, 16297, 9470, -9623, -15974, -1439, 14830, 11622, -6738, -16159, -4402, 12973, 13235, -3859, -15792, -6948, 10986, 14507, -957, -15085, -9433, 8558, 15295, 1933, -14035, -11695, 5910, 15752, 4928, -12331, -13393, 3147, 15638, 7686, -10288, -14717, 171, 14787, 9980, -7848, -15274, -2692, 13255, 11715, -5093, -15073, -5302, 11233, 12934, -2185, -14242]
713a4242O600J6410M846j2792j3622L159J5569P628j0090j4531j1J4381R935p489
727E751j5028k837J3057J1872m910j5260n588J1441J3434k242j4969q008R438
740c849J4454M70j4073j0101P109J4935L172j2691j1858M492J4878N751j0810
753A879j3188J678J4226Q129q527j3958j151J3022J0066n950j4006l703J1275
766b08J1377l295j3466n947R181J2137p54j2483p808O943J2446J691j1122r343
780a0651M619J2479M012r683j0669K316J2297O168q073j1739k0J1771Q097o255
794D669j2417k220J0891R634m335j2537m247R649J0803k191j2240o198P895J1534
808H690J00j1330p884N722J1709K418r849r167L403J1381M492q131j0022J123
$$ y = [-14242, -7642, 8768, 13614, 822, -12800, -9641, 5928, 13556, 3466, -11065, -11076, 3305, 13240, 5751, -9277, -12114, 943, 12815, 7905, -7355, -12943, -1502, 11932, 9690, -5279, -13287, -3849, 10605, 11075, -2998, -13099, -5990, 8945, 12117, -574, -12432, -7940, 6938, 12689, 1879, -11309, -9631, 4595, 12724, 4197, -9761, -10912, 2110, 12176, 6226, -7780, -11483, -208, 11169, 7874, -5592, -11539, -2358, 9779, 9025, -3458, -11266, -4323, 8123, 9814, -1308, -10651, -6032, 6447, 10459, 776, -9893, -7577, 4720, 10888, 2815, -8924, -8944, 2827, 10924, 4669, -7748, -9968, 923, 10557, 6222, -6315, -10562, -913, 9890, 7699, -4541, -10739, -2844, 8690, 8790, -2540, -10424, -4702, 7007, 9425, -424, -9591, -6188, 5193, 9685, 1554, -8468, -7345]
822g345J0690O235o293j0476r88R731P662m421j0645k904Q556Q730k534j0405
836d407m599P216R531o38r929o170N702J0065J190r261p592M057J0360L087q257
851C55q774K260J0325M853p001r627L99R849O352n439r994j461Q890P524l634
866D877r894l197P512Q277j719r288m682N915Q678J75q408n986M182Q789J928
881G159p391p040K448Q714L554o245p829Q56Q450M931n077q429o63P990O115l833
897C710q733k110P286P103k399q766l610O268P861q51q420m919M973Q350Q26p700
913a131o089L444Q417K363o751o984J828Q162L763n474p456K99P569M918m087
928B791p640j182O683N756k673p505k528N700O393j221p195l727M586O886J56
$$ y = [-7345, 3345, 9580, 3287, -7189, -8177, 1554, 9216, 4795, -5850, -8754, -198, 8532, 5998, -4407, -9006, -1790, 7741, 7103, -2826, -8996, -3294, 6771, 7961, -1300, -8892, -4835, 5525, 8612, 355, -8419, -6159, 4166, 9019, 2018, -7609, -7210, 2639, 8991, 3552, -6442, -7903, 987, 8511, 4877, -5017, -8214, -702, 7575, 5856, -3432, -8114, -2199, 6479, 6654, -1754, -7740, -3558, 5231, 7159, -232, -7272, -4824, 3890, 7444, 1199, -6630, -5774, 2676, 7607, 2530, -5899, -6562, 1428, 7543, 3710, -5023, -7133, 153, 7256, 4857, -3909, -7519, -1251, 6610, 5759, -2661, -7580, -2607, 5743, 6569, -1131, -7220, -3776, 4641, 7004, 253, -6731, -4903, 3259, 7022, 1548, -5908, -5609, 1960, 6878, 2791, -4849, -6031, 652, 6408, 3735, -3770, -6298, -598, 5795, 4574, -2621, -6348, -1762, 5124, 5280]
943E280o803m829L482P252J505o258n794K358P433K730n601o593J127P345L875
958F509m700p091j34O944M876l561p231j423O168N651k218p080k692N124O167
973E309p99o654l799L910O453N83n962m680K680O497J821n159n352J475O306K852
989E481m330n799L19O000L778l399o087p69N572M570k422o248j851M987N263j384
1005C681o235k883M281N826k68o044l875L386O169Q47n603m696K375O281J954
1020E196m878n239J260O043K885l958n554P1N490L685k874n612j026M815M351
1035D655j747n469k051M002M804o45n264k980L183N183L63m941l754K374N402
1050C115J321m547m426J536N482K212m003m932O50N371L044l289n290l41N036
$$ y = [5280, -1523, -6352, -2870, 4382, 5887, -371, -6165, -3807, 3626, 6356, 755, -5838, -4711, 2634, 6509, 1809, -5282, -5416, 1528, 6404, 2843, -4388, -5811, 357, 6008, 3790, -3290, -5982, -858, 5309, 4510, -2144, -5943, -2033, 4420, 5003, -959, -5639, -2959, 3538, 5359, 200, -5152, -3677, 2629, 5481, 1151, -4648, -4329, 1671, 5449, 2050, -4037, -4806, 766, 5336, 2914, -3334, -5185, -198, 5065, 3681, -2554, -5437, -1156, 4670, 4402, -1642, -5517, -2131, 4038, 4885, -718, -5414, -3039, 3242, 5196, 318, -4921, -3661, 2382, 5267, 1309, -4245, -4174, 1316, 5001, 2127, -3485, -4511, 304, 4655, 2908, -2561, -4612, -610, 4194, 3549, -1715, -4695, -1512, 3671, 4034, -907, -4661, -2287, 3115, 4436, -111, -4537, -3001, 2481, 4693, 690, -4242, -3592, 1779, 4823, 1534, -3756, -4097, 939]
1065I39L776k411n431j343M466M410j375n326k296L700M844l19m993l152K801
1080a710N011O86m479l770J820M987J600l802m213Q67M756K408l020m479o3M380
1096I79L085k227m619r75L950L690j413m694j813L474M202n85m639k579K910M583
1112C329K23m433l269K234M766J033m036l794J424M713J818l418m142N37M441
1127A426K539k625m300l75L958L124j748m277j258L344L556q71m104j995K690
1142i16L833l0l825k585K024L969P04l479l055J371L979J352l043l420O82L904
1158A465J986k561l733%L748K559j996l920o89L456L084j367l995j395L049L468
1174C159o77l909k022K483L704O4l603k527J832L740P68l157k920J107L609J405
$$ y = [939, 4715, 2304, -3127, -4470, -4, 4406, 3031, -2295, -4591, -891, 3953, 3634, -1359, -4511, -1710, 3301, 3987, -492, -4262, -2442, 2545, 4145, 343, -3870, -3003, 1753, 4161, 1141, -3338, -3401, 979, 4064, 1837, -2782, -3757, 193, 3883, 2470, -2224, -4037, -563, 3639, 3054, -1585, -4164, -1254, 3329, 3552, -881, -4150, -1916, 2850, 3883, -153, -3947, -2523, 2190, 4008, 590, -3552, -3015, 1426, 3965, 1340, -2960, -3335, 623, 3747, 1999, -2278, -3536, -192, 3364, 2493, -1611, -3606, -916, 2917, 2887, -938, -3523, -1499, 2470, 3174, -305, -3360, -1989, 1990, 3342, 299, -3121, -2439, 1465, 3451, 890, -2843, -2843, 905, 3464, 1468, -2452, -3141, 315, 3399, 2032, -1963, -3358, -309, 3159, 2482, -1427, -3449, -966, 2738, 2802, -801, -3328, -1496, 2244, 3012, -145, -3065, -1958, 1651, 3056]
1190C056k581l155L49L368J964j960l308l22L056K442j368l386r49K745K838q05
1206A984l412j521K408L159k61l350k040J985L376L09l191k478J505L498R17k883
1222Ek864R07L477J470k448l145K47L303K035j901l313m17L008K491j260l323
1238a728j044K580K797o18l180j577K063K979Mk957k024J532L053N89k652k396
1254b579R97L066J132k295k718M42L036J641j921k978j32K923K135j517l156o63
1270b587K733K541j018l252j182K449K849m84l169j685J985L048J20k912k140
1285b704J415L070P38k528k479P71K978J329k023k713J30K772J789j500k829m65
1301b249K489K186j006k864r76K184K481m66k813j450J800K677O4k671j867J384
$$ y = [3056, 475, -2680, -2331, 1037, 3001, 1041, -2267, -2589, 467, 2909, 1541, -1845, -2794, -49, 2789, 1984, -1428, -2949, -541, 2618, 2357, -993, -3033, -1048, 2328, 2637, -554, -3032, -1527, 1971, 2888, 5, -2859, -1952, 1525, 2995, 547, -2598, -2351, 952, 2987, 1086, -2227, -2644, 364, 2855, 1595, -1728, -2772, -192, 2605, 1987, -1193, -2770, -707, 2272, 2276, -681, -2705, -1173, 1880, 2469, -183, -2579, -1582, 1484, 2616, 321, -2397, -1955, 1081, 2722, 801, -2177, -2309, 614, 2749, 1232, -1924, -2587, 146, 2687, 1669, -1583, -2765, -316, 2533, 2049, -1120, -2805, -820, 2228, 2348, -564, -2704, -1289, 1781, 2519, -9, -2488, -1717, 1261, 2590, 567, -2146, -2016, 756, 2545, 1045, -1784, -2249, 240, 2426, 1420, -1444, -2420, -236, 2245, 1779, -1034, -2484, -684, 1993, 2057, -614, -2481, -1097]
1317a097K832N51k458k246R33K884J047k153k566M18K828J562j764k771j40K685
1333E45J971j297k851o73K353K291p57k772j180J923K468j77k556j607J425K547
1349A653L67k258j938Q95K553Q75j930k193L71K473J323j563k399j02K359J699
1365B185j181k510n26K168K006p92k566r33J927K250m02k515j344J623K428O1
1381A879k376j703J188K497N54k107j997P08K462J005j750k198K15K310J416j346
1397G57k313k89K087J733q77k305p26J808J946m22k239j098J437K090Lk078j445
1414a931J087K199M21j919j721P42K237Q05j720j973L68K240J152j449k181%K161
1431E18J493j155k283m03J980J766p76k281p95J709J974l31k176j167J332K099
$$ y = [-1097, 1735, 2286, -172, -2418, -1485, 1399, 2446, 293, -2273, -1855, 973, 2535, 771, -2000, -2140, 545, 2516, 1219, -1632, -2305, 48, 2339, 1582, -1190, -2370, -447, 2021, 1844, -712, -2319, -894, 1653, 2020, -238, -2176, -1281, 1272, 2147, 217, -1976, -1605, 868, 2191, 628, -1771, -1873, 486, 2185, 1004, -1506, -2032, 136, 2142, 1350, -1216, -2149, -222, 2028, 1626, -889, -2233, -610, 1818, 1879, -497, -2200, -1012, 1485, 2039, -68, -2065, -1357, 1105, 2110, 360, -1838, -1623, 687, 2103, 757, -1556, -1845, 242, 1975, 1098, -1207, -1933, -125, 1821, 1399, -840, -1938, -501, 1589, 1592, -486, -1931, -844, 1355, 1776, -143, -1864, -1122, 1115, 1920, 200, -1773, -1405, 835, 1987, 538, -1643, -1643, 518, 2011, 856, -1427, -1830, 150, 1916, 1140, -1141, -1936, -227, 1747, 1416, -760, -1927, -595, 1504]
1447A504J09j977j507R26K128N64j709j757M78K093R81j413j937O1J986J306j087
1464G49k053l06J808J566p55k095o70J651J793m34k076j004J406J967p4k016j323
1481a866J112K090L33j884j617P73K149P10j658j844L64K127J062j347k008m0
1497a544J967J413r77k057m70J732J636n58k020q50J400J831j31j917j173J049
1513f69J956K64j742j477P20J977O27j547j709L89J952R80j321j869N3J906J273
1530A763j072j969k93J777J509p44k023o20J564J728l95j966r78J273J866Mj843
1547d19j276R29J937M16j635j536N44J913P71j356j714J67J801J083j038j811
1563a224k08J633J351o92j826n63J420J563l79j784q81J201J707l8j728j152R46
$$ y = [1504, 1613, -364, -1871, -945, 1183, 1747, 38, -1719, -1241, 852, 1833, 420, -1517, -1456, 530, 1836, 749, -1304, -1610, 198, 1764, 1009, -1086, -1756, -105, 1688, 1254, -822, -1826, -420, 1547, 1473, -543, -1866, -754, 1336, 1669, -215, -1832, -1059, 1090, 1800, 142, -1702, -1338, 789, 1851, 504, -1504, -1544, 423, 1836, 859, -1198, -1668, 64, 1700, 1142, -878, -1728, -328, 1503, 1372, -545, -1718, -669, 1287, 1551, -191, -1668, -948, 1029, 1656, 109, -1600, -1211, 741, 1721, 400, -1469, -1416, 490, 1763, 691, -1278, -1571, 206, 1715, 971, -1052, -1672, -108, 1620, 1225, -741, -1719, -446, 1420, 1424, -419, -1695, -766, 1171, 1587, -48, -1584, -1040, 873, 1644, 288, -1426, -1259, 542, 1625, 587, -1224, -1432, 201, 1552, 860, -966, -1529, -109, 1454, 1075, -709, -1590, -389, 1318, 1280, -448, -1600, -654]
1580f54J806L00j610j405O67J867N99j446j601L62J849Q95j224j724J0J733J176
1597A600r23j806l19J553J406n75j787o67J292J588k05j710r86J007J682J75j575
1614b50j248O99J733N06j391j452L92J712Q03j177j610Q9J673J045r37j704k07
1631a324J559J279o93j750n12J410J470l97j767q08J215J631q5j695j086R54J744
1648A145K39j575j325O55J771N64j372j513L12J727R02j099j658l7J609J161p90
1665G16j708m10J434J381m55j712p12J209J573j42j670r95R71J679J75j569j257
1682a492P13J743M98j439j464M45J757P59j250j611J46J698J036r98j717j76J576
1699B24J277p04j727n10J372J475l64j717q27J125J612Mj607j112Q34J677L44
$$ y = [-654, 1152, 1452, -158, -1563, -896, 971, 1570, 124, -1477, -1115, 734, 1629, 405, -1319, -1309, 424, 1600, 677, -1129, -1448, 105, 1511, 936, -851, -1518, -226, 1362, 1157, -553, -1539, -532, 1150, 1325, -250, -1498, -799, 934, 1440, 49, -1403, -1011, 701, 1504, 327, -1283, -1194, 479, 1524, 587, -1117, -1324, 235, 1514, 821, -929, -1441, -31, 1439, 1042, -725, -1533, -318, 1313, 1228, -467, -1553, -599, 1145, 1384, -191, -1516, -861, 910, 1474, 102, -1411, -1099, 628, 1530, 431, -1227, -1264, 345, 1506, 716, -992, -1402, 32, 1413, 958, -754, -1466, -257, 1316, 1174, -496, -1491, -520, 1159, 1334, -235, -1492, -779, 964, 1462, 23, -1441, -996, 761, 1520, 270, -1341, -1195, 503, 1539, 541, -1176, -1352, 224, 1501, 797, -930, -1440, -68, 1407, 1043, -674, -1501, -376, 1236, 1240, -367, -1479, -645, 1032, 1376]
1716A376j429j323M98J670O49j207j507J80J607R36r50j602j54J502J164o86j640
1733i16m40J335J351l97j646p18J157J497j14j585r60R13J603J64j472j172O56
1750g44J632M61j284j361L72J586P41j071j468M8J474R93p91j528k78J314J194
1767A290m73j518n81J090J336j51j454q37Q50J433J30j350j030O06J460L91j190
1784Bj196L62J444O15j005j301J20J379Q26q03j384j13J260J013n83j394l86J134
1802a0J162l44j371o08R36J265q0j293q29P16J313J88j158r97M52J316M38r99
1820I7j110K01J238O64p69j195n3J149Q38n42j226k93J027R84l34j213m98Q87
1838a48J078j30j168o62P13J148P5j105q03N33J180K45r81r39L47J163M49q53
$$ y = [1376, -53, -1376, -878, 792, 1441, 234, -1273, -1093, 514, 1450, 500, -1102, -1256, 246, 1410, 724, -916, -1356, -21, 1330, 933, -713, -1431, -274, 1223, 1109, -476, -1436, -523, 1080, 1244, -228, -1400, -744, 888, 1349, 65, -1296, -924, 662, 1403, 332, -1136, -1088, 386, 1379, 588, -940, -1218, 96, 1290, 817, -701, -1282, -192, 1144, 993, -461, -1298, -448, 985, 1115, -235, -1265, -659, 801, 1192, 2, -1194, -832, 612, 1227, 222, -1079, -959, 420, 1246, 443, -941, -1054, 206, 1219, 636, -758, -1144, -10, 1152, 808, -563, -1171, -235, 1030, 950, -343, -1172, -456, 857, 1045, -113, -1110, -658, 658, 1096, 97, -1013, -812, 426, 1090, 321, -874, -927, 222, 1060, 518, -708, -1001, 26, 1010, 676, -537, -1035, -148, 930, 800, -368, -1030, -317, 831, 906, -199, -1002, -469, 711, 956, -25, -964, -617, 546, 995, 142]
1856A42j019J30J115O10o57j093p0J002P85m57j107k91Q82R00k46j070m92P20
1874b16J000m4r92o51N45J028J59r09p77L85J015L26p77q89J99J010M82o74r40
1893g20J3R63O26n34r92j29Q83P53l94j007l03Q05Q50k37j004m54O87R22l9r59
1913b70n97N30R73J28q55p29L40R82L13p29q29J53R39M84n76r07m8Q85O30m24
1933C93r26k19P81P59k65r40l83O76Q45j17r20n11N64R09L6q67o32M30R35J91
1953G39p80p41K79R29L61o84q21J26Q90N19n60q78o0Q50O42m01r16k31P43P60
1973G66k24r11m00O16Q23l7q51n49M57Q67J39p65o78L04Q68L13o63p74J43Q51
1993B95M65n61q22j4Q14N77m24q63j64P61O68k95q55l19O77P55j54q49m36N54
$$ y = [142, -877, -747, 368, 978, 321, -772, -842, 160, 945, 488, -619, -910, -28, 872, 626, -444, -936, -216, 784, 740, -252, -903, -358, 670, 829, -80, -857, -472, 543, 869, 92, -797, -598, 412, 894, 220, -720, -707, 256, 882, 348, -644, -773, 110, 863, 469, -538, -841, -36, 814, 577, -427, -881, -194, 728, 689, -270, -867, -337, 636, 764, -91, -820, -480, 502, 815, 86, -743, -590, 349, 833, 257, -650, -698, 187, 817, 393, -533, -752, 29, 788, 523, -417, -800, -124, 721, 604, -316, -827, -263, 646, 682, -185, -817, -387, 548, 739, -41, -782, -503, 426, 787, 103, -718, -592, 298, 817, 257, -621, -681, 169, 811, 410, -506, -737, 6, 766, 542, -369, -769, -153, 670, 633, -218, -767, -310, 557, 696, -69, -747, -443, 425, 738, 75, -699, -556, 295, 760, 199, -623, -637, 177, 754, 330, -533, -697, 64, 732, 437, -418, -737, -60, 695, 541, -308, -744, -190]
2013a90Q15J2p96n67L97Q65J66p22o80K53Q39L28o00p56N7Q18M82m64q13q2P29
2034I1O06l21q15k55O53O91j76q05l77N29P75k2p72n03M28P92J25p18o05L07Q00
2055D28K69o41o93J55Q06L93n36p50J1P49N05m02p93j37O86O10k62p99k83N95
2075h9P01j10p73m28M78P51L5p00n37L24P76K19o27o40J84P53L48n07p07K9P24
2096B04M86m17p48j11O88N69k99p64k42N90O58j52p56l67N12P03rp18m83L78P47
2117D69J30o53n96K50P49K89n47o76J02P24M12m37p25n5O77N32l10p34k01O01
2137AO17j63p35l39M82O77no83m83L56P25J38o20n80K40P19K76n47o45J03P10
2158B44L78m38o89m1O67M96l22p17j65O02N76k06p12k84N03O45n2o80m16M09O75
$$ y = [-190, 625, 637, -159, -726, -329, 536, 702, -20, -700, -447, 392, 720, 120, -636, -579, 239, 721, 257, -556, -638, 91, 697, 376, -439, -694, -41, 650, 474, -331, -708, -179, 596, 574, -198, -701, -273, 519, 644, -74, -679, -372, 428, 697, 56, -637, -482, 324, 717, 181, -569, -558, 191, 696, 294, -499, -636, 50, 660, 398, -401, -684, -89, 612, 502, -271, -699, -221, 530, 565, -135, -672, -348, 428, 647, 20, -620, -436, 317, 665, 158, -549, -520, 204, 690, 273, -475, -586, 102, 671, 372, -392, -634, -44, 614, 462, -294, -661, -149, 554, 545, -173, -656, -278, 469, 599, -54, -650, -400, 349, 638, 91, -585, -483, 241, 653, 216, -509, -564, 113, 645, 335, -399, -600, 1, 618, 455, -280, -619, -137, 540, 535, -148, -631, -275, 450, 588, -32, -612, -372, 347, 623, 76, -569, -466, 244, 622, 184, -505, -546, 121, 617, 295, -422, -587, 15, 591, 385, -327, -611, -108, 537, 485, -195, -611, -202, 473]
2179D73R1o27n15K58P05K21n44o08J23O82L60m36o58k9O46M65l35o77j41N56N57
2200E67j98o91k66M86O07o0o63l88L98O64N0o09m73K71O82J80n46n49J61O64L00
2221E87m57o12M4O27M00l52o51q8N81N01k49o63k14M97N69j13o42l26L98O09K6
2242D72o05m42K97O47J48n37n06J68O50K59m72n70O1O32L57l85n99m2N84M30k69
2263B78o25j53N25N05j79o26k55M67N60o9o19l51L72O05M3n74m37K66O16J63n05
2284Gn16J49O27K72m42n73M2N90L81l43n99r0N56M61k24o21k01M90N37j13o19
2305b29l10M12N85Ln77m20L11O29J16n55m76K04O22K14m65n49R3O13L22m02n85
2326d44j4N67M18k78o18j48N25M86j62o16k54M44N62n8n92l46L27O11O3n50m51
$$ y = [473, 564, -63, -578, -320, 385, 606, 62, -546, -423, 259, 619, 183, -475, -504, 142, 607, 272, -405, -546, 10, 567, 369, -322, -588, -102, 505, 445, -218, -606, -208, 456, 506, -103, -576, -305, 377, 557, 11, -538, -377, 287, 587, 130, -482, -438, 189, 589, 237, -414, -502, 79, 580, 331, -332, -546, -49, 520, 407, -235, -561, -163, 446, 472, -133, -575, -278, 369, 517, -20, -526, -358, 292, 551, 79, -491, -430, 202, 559, 174, -425, -467, 117, 547, 278, -347, -500, 25, 530, 351, -275, -530, -63, 497, 428, -191, -542, -170, 435, 478, -96, -533, -267, 349, 512, 7, -509, -360, 267, 539, 97, -476, -434, 156, 537, 194, -405, -495, 61, 522, 298, -323, -524, -34, 503, 390, -229, -539, -127, 458, 461, -116, -536, -225, 404, 520, -35, -511, -307, 315, 529, 64, -485, -392, 221, 543, 141, -444, -458, 109, 527, 249, -369, -517, 8, 494, 332, -284, -538, -94, 468, 410, -182, -528, -201, 410, 473, -77, -528]
2347e28K45O17J86m76n32J37O05K96l98n81QN71L95l03o07j15N21M79j97o09k36
2368e22M59N32q3o03l19L55N89M0n67m14K64O10J50m97m88J60N91K61m10n44M0
2389c96N70L66l23n81q9N25M41k00n90k07M59N08r7n82l08L59N63K6n31m25K57
2410b55N99J32m75m78J55N55K66m16n23L7N57L40l10n54o0N03M11k09n46j98M41
2431b8M84j07n40k78L60N18Qn17l63K50N43J25m61m30J51N30K29l73m91K5N25
2452A60L08k94n29n6M69L92j89n37j67L95M55q7n28k62L51M86Nm87l28K51N09
2473C17R9m29l96J60N09J83l67m49O8M72K78k90m85l4M67L24k16m95j11L90L95
2494C90j20m82k01L19M46k1m66k91K56M70P2m24l58J79M71J68l72m05Q4M70K36
$$ y = [-528, -283, 334, 520, 44, -488, -351, 254, 550, 152, -429, -421, 150, 545, 242, -365, -480, 41, 520, 323, -286, -522, -63, 469, 386, -217, -536, -181, 408, 448, -119, -533, -269, 341, 491, -6, -494, -334, 257, 518, 108, -436, -396, 174, 540, 217, -364, -453, 72, 513, 313, -277, -484, -25, 483, 386, -196, -504, -145, 418, 444, -87, -512, -255, 344, 476, 1, -477, -322, 233, 499, 83, -440, -403, 154, 494, 184, -370, -430, 73, 484, 275, -271, -469, -28, 456, 349, -191, -469, -109, 409, 417, -100, -463, -213, 330, 455, -6, -436, -285, 245, 474, 101, -390, -365, 160, 468, 174, -355, -411, 58, 450, 261, -276, -443, -48, 407, 320, -208, -470, -119, 367, 372, -115, -443, -192, 317, 416, -13, -409, -249, 260, 443, 76, -373, -305, 167, 445, 155, -330, -364, 103, 427, 211, -284, -395, -5, 390, 270, -212, -413, -94, 352, 331, -135, -426, -170, 300, 372, -52, -410, -231, 240, 408, 36, -369, -285, 185, 421]
2515D21k97m40j8M44L10k28m54j03M06L59j39m64j68L29L98n4m42k44K68M22K2
2536C28m06l18K02M36J22l71l77J28M38J81k98m04K5M39K53k33m25n9L99L17j58
2557B19m28j47L55L62q4m29k19K88M02J0m16k71K00M33Q0l66l42J44M22J52l25
2578D0l60L8M20K27k74l90k3M05K66j86m26r0L66L26j17m26j55L05L81n5l99k35
2600c62K56L98K5l80k87J87M11J12l37l42J02L98J85k93l70J3M12K37k29m12m6
2621c22L75K96j59m20j15L21L56q6m20j89K71L81j8l75k66K21M03O2l58l08J56
2642a94M13J41l20l52O4M18J99k59l77j0L73K67j80m13p9L41L09j11m07j63K83
2663e7L68l4m03k25K27L91L5l78k84J80L94J10l25l35R7M03J88k90l54J4L97K36
$$ y = [421, 124, -316, -334, 110, 420, 192, -262, -365, 41, 400, 261, -203, -371, -42, 356, 302, -140, -384, -116, 306, 328, -78, -396, -194, 242, 364, -7, -384, -256, 182, 363, 65, -339, -314, 125, 378, 145, -280, -339, 60, 377, 219, -209, -356, -1, 361, 277, -152, -371, -83, 319, 329, -87, -358, -158, 275, 355, -11, -353, -209, 213, 365, 40, -320, -282, 138, 365, 91, -299, -322, 83, 349, 163, -263, -353, 13, 339, 222, -204, -359, -54, 327, 272, -127, -362, -106, 292, 317, -63, -350, -163, 248, 360, 23, -319, -217, 181, 366, 73, -297, -284, 128, 365, 136, -276, -322, 53, 349, 190, -230, -345, -24, 332, 246, -174, -363, -92, 289, 271, -104, -370, -149, 254, 316, -42, -350, -194, 219, 360, 40, -312, -248, 170, 369, 110, -267, -277, 96, 363, 183, -230, -309, 32, 341, 230, -177, -340, -57, 311, 277, -126, -351, -124, 267, 302, -76, -360, -180, 214, 324, -1, -336, -239, 164, 352, 62, -292, -278, 119, 355]
2685C55k16l86n8L69K88j40m07j25L02L51p6l88j93K52L71j1l68k61K02L67P7
2706C05l27l13J18M01J38k83l54N9L91K12k46l77k6L53K92j76l89j06L33L16r9
2727B22l72j80K75L64l2l77k26K13L89L7l41k94J62L80J22l11l28P7L83J73k57
2748G9l63PL63K32j76l94n2L23K92j18l91j37K82L37l9l88j85K36L60L2l61k54
2770c15J71L72J02l20k99R8L77J64k73l54L9L64K07k10l50n0L36K67j51l82j05
2791c12L02L04q8l70j60K51L27kl61k09J99L41O4l19k72J35L64J11k82l04P4L62
2813A55J63k13l39%L42K25j79l53o1K96K77j20l50j33K69L02n7l48j72K10L33
2834B47Ol23k28J51L45O8k93k66J14L31J38k61k98M6L25J90k02l27j1L15K34j45
$$ y = [355, 139, -247, -305, 64, 352, 212, -195, -320, -18, 333, 257, -131, -324, -72, 299, 288, -80, -341, -139, 228, 305, -22, -335, -217, 184, 322, 39, -315, -256, 135, 347, 101, -276, -302, 51, 343, 167, -222, -328, 5, 321, 222, -150, -330, -55, 309, 277, -100, -326, -113, 276, 313, -28, -322, -160, 220, 342, 31, -297, -220, 163, 336, 79, -284, -277, 86, 318, 142, -252, -304, 19, 311, 193, -198, -335, -53, 284, 245, -143, -328, -92, 268, 300, -61, -315, -144, 228, 330, 10, -289, -191, 186, 350, 77, -277, -238, 126, 333, 123, -227, -277, 59, 326, 175, -207, -312, -10, 294, 206, -164, -324, -73, 254, 252, -109, -318, -119, 222, 286, -33, -305, -170, 194, 305, 23, -281, -207, 155, 318, 105, -234, -234, 108, 333, 154, -199, -260, 36, 313, 193, -157, -290, -21, 281, 224, -124, -296, -86, 247, 253, -70, -298, -147, 198, 266, -27, -293, -179, 152, 290, 29, -269, -223, 102, 292, 90, -237, -248, 67, 301, 156]
2856A56l33q2K84K57q8l25j44K39L02l6l20j84J78L21L7l10k40J46L40P9k70k78
2878b71P9L22J43k24k95K3L04J92j80l12l8K94K40j26l24j00K58K72o0l22j46
2899b71K17K96kl15j88J70L10N4k82k37R8L19J15k51k66M4L05J65k02l03rK91
2921E8K11j57l03q0K71K45r6k93j33K41K60k1k94j77J87K89L0k78k12J23L06Q0
2943B57k44k36P9K94J19k02k80K2K87J81j67k88m0K54K13j13l03o8K26K38o3k87
2965a21j29J91K64j7k65j75J46K74M9k43k15J02K90Q2j91k68N0K80J37j61k54
2986a74j4K48J81j12k74n6K17K16p7k64j01J80K28k9k37j57J46K47J7k26j77Q8
3008a30K61P8k06k13N5K48J25j66k26oK50J47j22k45l2K12J86p8k48p6J76K08
$$ y = [156, -177, -259, 25, 282, 194, -131, -275, -36, 266, 230, -90, -274, -96, 225, 262, -48, -288, -142, 198, 277, 7, -271, -192, 130, 273, 49, -246, -223, 81, 273, 93, -219, -257, 37, 277, 151, -173, -273, -15, 257, 197, -125, -271, -54, 242, 240, -75, -263, -93, 217, 271, -11, -248, -150, 169, 284, 33, -233, -189, 116, 281, 79, -224, -233, 58, 269, 112, -191, -271, 0, 245, 149, -144, -277, -36, 224, 203, -91, -268, -81, 208, 238, -40, -252, -129, 177, 257, 13, -223, -144, 150, 269, 67, -213, -191, 96, 277, 110, -178, -218, 36, 249, 136, -167, -235, -9, 229, 166, -121, -250, -59, 205, 188, -77, -252, -106, 168, 217, -26, -241, -139, 151, 233, 42, -226, -176, 104, 241, 80, -174, -188, 60, 241, 129, -145, -201, 16, 232, 155, -109, -210, -30, 198, 169, -68, -225, -79, 168, 185, -41, -218, -130, 131, 209, 3, -210, -155, 93, 218, 52, -174, -180, 70, 217, 95, -150, -182, 30, 216, 138, -110, -186, -10, 198]
3030A98k8k34j29J47K25J0k18j71J07K34N2j94j87P2K27Q3j70j91J0K18J21j20
3052F2k15k4J92J59q2k09o4J65J86n0k03j11J60J93nk05j20J13J98L9j78j56Q0
3075g5K01N9j42j85L2K00Q5j12j87j0J84J17q5j97m5J75J52p0j92o3J30J73k3
3098A22j94j01J18J92Lj79j21R0J83M2j51j49O5J76O4j17j67K8J79Q8j11j55l0
3121a25J76J23q9j65o1J57J28l8j77p5J29J47j4j73j07J03J71K0j54j45Q4J76
3143I1M4j32j44L5J85P8j06j68J1J61J18r3j70l4J53J34n1j73o4J29J47k4j61
3166c4r6J00J48J9j57j13O4J60N0j39j38M4J63O0j01j56OJ53J00q4j53k0J38J24
3190A38n4j60m9J25J26j2j52q9R9J44Lj30r8P3J41K7j24j12M0J45O1j18j25J3
$$ y = [198, 170, -64, -193, -46, 179, 189, -29, -200, -93, 141, 193, -1, -188, -116, 111, 194, 24, -167, -157, 61, 182, 62, -153, -177, 15, 174, 92, -117, -181, -16, 170, 120, -83, -194, -34, 159, 154, -51, -171, -58, 140, 179, 1, -155, -75, 126, 185, 43, -142, -110, 90, 175, 63, -124, -134, 50, 167, 82, -115, -160, 15, 167, 97, -95, -158, -28, 145, 122, -72, -173, -55, 137, 140, -39, -160, -70, 113, 155, 4, -145, -80, 96, 160, 43, -124, -96, 83, 171, 60, -95, -125, 51, 174, 85, -80, -141, 16, 144, 106, -71, -146, -17, 130, 116, -57, -164, -61, 110, 130, -24, -169, -85, 91, 135, 3, -141, -106, 79, 157, 51, -117, -106, 55, 173, 80, -90, -124, 29, 163, 112, -61, -125, 4, 151, 127, -34, -130, -30, 118, 137, -20, -133, -69, 91, 141, 2, -136, -92, 71, 131, 30, -126, -120, 33, 133, 49, -104, -124, 14, 138, 84, -76, -125, 0, 126, 114, -38, -127, -28, 116, 119, -11, -109, -36, 105, 132, 8, -104, -64, 81, 142, 24, -101, -88]
3214h8J29P5o6j47j6J13J12n0j47l9J16J14k6j25p6Q2J28nj11p9N4J33L7j22q9
3239i3L7J21N6q3j01OJ05O9o7j07j9J03Q5m1j19m6R4Q7k4j08n1P3R2or7o0M9R8
3267E3K0p6q2K5R6M0n7r3J2R7M9n5r4jQ1P3m4p3l6O4P7j4r3l0O6O2kp7n3M6O3
3298D4J7o9o3L3O9J8n5p2K6P8L0m6p2nP0N2l7o6kO9M9l5o8j6N7N5lo6n0O1N8n
3330E6o2m5L1P1J7p1m7L1N7J6m7n1QM7L3l1o1j4P3L0k3o3rN1N1j8o4j8M7M8Kn6
3362a1m5M8M9J9n8m1K0O6K5m9o4J2P0K9l8p1RM9L3k4n6j8N1M1k1m3l7L8N1kn4
3393b2l5M1N7J0n3n0J4O0L3l6o9NP3L3l1n2j1N6L9j6o1k2N0O0j1o6l4L8N2J6o3
3424En3K2N7J9m7n1QN1M1m5n5j2O7M9k7p3j5M7O9j3p1l7N0O4J3o8n3M5P4K0o9
$$ y = [-88, 41, 116, 50, -97, -113, 0, 112, 62, -85, -124, -8, 106, 80, -45, -121, -39, 89, 84, -27, -106, -52, 81, 118, -4, -93, -56, 65, 121, 38, -63, -57, 48, 117, 50, -57, -76, 27, 112, 71, -48, -94, 0, 87, 63, -45, -96, -23, 69, 63, -34, -94, -45, 53, 73, -3, -85, -60, 36, 76, 19, -74, -62, 35, 84, 29, -65, -66, 15, 88, 44, -29, -65, -1, 76, 62, -31, -61, 5, 67, 65, -12, -65, -19, 44, 61, -8, -71, -38, 31, 49, -6, -78, -52, 26, 56, 10, -62, -67, 3, 55, 18, -48, -50, 19, 68, 33, -35, -51, 6, 61, 58, -8, -58, 3, 61, 56, -6, -51, -20, 51, 68, -3, -50, -19, 38, 54, 7, -44, -36, 11, 44, 13, -48, -62, 11, 41, 18, -45, -54, -3, 48, 30, -34, -52, -5, 43, 45, -11, -56, -8, 41, 60, 2, -39, -19, 47, 72, 23, -41, -29, 41, 70, 32, -39, -30, 19, 52, 28, -28, -46, 5, 46, 25, -18, -55, -17, 34, 32, -22, -57, -16, 41, 51, -2, -52, -38, 22, 55, 19, -50, -45, 28, 61, 30, -22, -33, 23, 62, 46, -15, -37, 13, 73, 62, -4, -38, 0, 52, 68, 5, -48, -26, 31, 50, 3, -48, -40, 11, 52, 7, -48, -60, 7, 56, 29, -44, -59, -12, 57, 44, -27, -64, -14, 50, 63, -5, -58, -13, 61, 81, 12]
3455A2o0J2P9M3n5p4kP0N3k1r7j5P2N7qj00m5N7Q4nq5n3L6R2J7o9n6OR1K8n6p7
3487f9KQ7N9m2q7j4P7P3k8q8k6N8P8j4q6n2M9R7Oq1o5K9Q6K4o0q0OQ9N8p6q2o
3519g8P4P3l9r6qO1Q4k4q3m6O3R9j1q0o4M6R1K3p7p3K5R2M1o9q7J0R8N5n8j00
3549e8j6P7Q0l6r6l4O7Q9k3r3n4P0Q7Lq1p0M2R9K3p3q8K8R6N2p4p7%Q7P2o1q8
3580e0k1R4O1jj09l9P2Q4rr4p0N6J01Kr2p1M2J01K6q0q0J4R6N4o7r3nR1P0m8r8
3611f3k3R8Q2l5r4m2O9R1%j17m2N8J06J5r6p3K3J15L2p5j15L1J02M5o9q9j1J00
3639B3P5o0r5l2R5Q2l9r6n6Q0R3lr8o3N1J10J8j04n7L1J02M8q8r2K6R3O5p2j01
3668f4%J07O2m3j05l2Q4R5l6r6o0P4J01j3r5o8M1J00K0r4q1L3J14L5q2q8L0R5
$$ y = [12, -48, -36, 43, 86, 31, -43, -45, 25, 78, 57, -40, -55, 17, 74, 66, -34, -79, -22, 62, 57, -28, -81, -45, 47, 64, -5, -61, -55, 36, 64, 8, -69, -67, 20, 79, 37, -50, -64, 13, 86, 58, -30, -56, 2, 80, 66, -20, -72, -23, 74, 80, -1, -66, -37, 49, 73, 13, -67, -61, 28, 86, 10, -72, -78, -4, 69, 30, -66, -74, -13, 71, 47, -36, -82, -19, 80, 69, -11, -75, -29, 62, 85, 8, -65, -40, 52, 93, 24, -63, -53, 45, 100, 42, -58, -74, 3, 83, 47, -49, -83, -16, 73, 50, -43, -97, -27, 60, 63, -18, -88, -46, 53, 76, 3, -85, -57, 39, 91, 17, -60, -60, 27, 99, 38, -50, -71, 23, 84, 83, -26, -65, 7, 91, 82, -12, -82, -26, 75, 77, -15, -86, -44, 57, 83, 3, -77, -63, 33, 87, 20, -73, -78, 13, 83, 35, -63, -86, 12, 94, 59, -35, -77, -8, 83, 83, -34, -76, -18, 88, 103, 7, -66, -43, 72, 104, 29, -86, -55, 47, 92, 23, -66, -77, 23, 98, 38, -57, -89, 6, 88, 49, -47, -103, -23, 70, 67, -31, -94, -43, 67, 85, -19, -76, -45, 57, 105, 17, -75, -49, 44, 109, 37, -64, -64, 43, 105, 62, -43, -75, 9, 104, 68, -28, -88, -14, 87, 74, -21, -89, -48, 52, 72, -22, -103, -70, 44, 79, -3, -91, -61, 34]
3696C4N6p2r4QR6P6n8r5k5R4Q2k4j13k9O6R9j7r4o7N9J13j1q5p9L4J01K9p9q4
3725g9K1R7M2o3r4%R2O8n6q7j6P2Q6l9r7j4O7R3k4r9m8N7J03Or8n9M8R0K2q2p8
$$ y = [34, 90, 18, -76, -68, 28, 104, 46, -49, -74, 20, 102, 78, -35, -64, 2, 101, 84, -10, -77, -18, 95, 84, -1, -80, -46, 55, 84, 5, -79, -58, 39, 81, 18, -76, -76, 16, 84, 28, -59, -75, -3, 83, 44, -53, -67, 0, 93, 69, -30, -78, -21, 82, 88, -10, -69, -21, 69, 91, 9, -69]
$$ [...]
8191a8
##END NTUPLES=NMR FID
##END=
