##TITLE=1H_Ser 2065-NEA
 CDCl3
 8 sc, 
 6.2.2024
##JCAMPDX= 6.0         $$ Bruker NMR JCAMP-DX V2.0
##DATA TYPE= NMR FID
##DATA CLASS= NTUPLES
##ORIGIN= UXNMR, Bruker Analytische Messtechnik GmbH
##OWNER= root
$$ XWIN-NMR		Version 3.5
$$ Tue Feb  6 14:18:24 2024 Russian Standard Time (UT+4h)  she@DPX200
##.OBSERVE FREQUENCY= 200.1313
##.OBSERVE NUCLEUS= ^1H
##.DELAY= (6, 6)
##.ACQUISITION MODE= SIMULTANEOUS
##.ACQUISITION SCHEME= undefined
##.AVERAGES= 8
##.DIGITISER RES= 18
##SPECTROMETER/DATA SYSTEM= spect
##.PULSE SEQUENCE= zg30
##.SOLVENT NAME= CDCl3
##.SHIFT REFERENCE= (INTERNAL, CDCl3, 0, 15.7039)
##AUDIT TRAIL= $$ (NUMBER, WHEN, WHO, WHERE, WHAT)
$$ ##TITLE= Audit trail, XWIN-NMR		Version 3.5
$$ ##JCAMPDX= 5.01
$$ ##ORIGIN= Bruker BioSpin GmbH
$$ ##OWNER= she
$$ F:/spectra/data/she/nmr/H-F/1/audita.txt
$$ ##AUDIT TRAIL=  $$ (NUMBER, WHEN, WHO, WHERE, WHAT)
(   1,<2024-02-06 14:16:05.50 +0400>,<she>,<DPX200>,
      <created by zg, POWCHK disabled, PULCHK disabled
       configuration hash MD5:
       00 E9 B6 7A A2 85 ED C7 34 08 36 98 17 FE 4E 26
       data hash MD5: 16K
       16 10 6C 57 F7 CD 48 5E D3 E2 1D 90 6B A4 DB 21>)
$$ ##END=
$$ 
$$ hash MD5
$$ A1 91 B5 92 C4 0C EE 26 7B EB 48 5B CF 3E 9B 49
##$RELAX= 
##$RELAX= 
##$RELAX= 
##$RELAX= 
##$RELAX= 
##$RELAX= 
$$ Bruker specific parameters
$$ --------------------------
##$DU= <F:/spectra>
##$EXPNO= 1
##$NAME= <H-F>
##$PROCNO= 1
##$TYPE= <nmr>
##$USER= <she>
##$AMP= (0..31)
100 100 100 100 100 100 100 100 100 100 100 100 100 100 100 100 100 100 
100 100 100 100 100 100 100 100 100 100 100 100 100 100 
##$AQSEQ= 0
##$AQ_mod= 1
##$AUNM= <au_zg>
##$AUTOPOS= <>
##$BF1= 200.13
##$BF2= 200.13
##$BF3= 200.13
##$BF4= 200.13
##$BF5= 200.13
##$BF6= 200.13
##$BF7= 200.13
##$BF8= 200.13
##$BYTORDA= 1
##$CFDGTYP= 0
##$CFRGTYP= 5
##$CHEMSTR= <none>
##$CNST= (0..31)
1 1 145 1 1 1 1 1 1 1 1 1 1 1 1 1 1 1 1 1 1 1 1 1 1 1 1 1 1 1 1 1 
##$CPDPRG= <>
##$CPDPRG1= <>
##$CPDPRG2= <>
##$CPDPRG3= <>
##$CPDPRG4= <mlev>
##$CPDPRG5= <mlev>
##$CPDPRG6= <mlev>
##$CPDPRG7= <mlev>
##$CPDPRG8= <mlev>
##$CPDPRGB= <>
##$CPDPRGT= <>
##$D= (0..31)
0 1.2 0 0 0 0 0 0 0 0.06 0 0.03 0 0 0 0 0.0002 0 0 0 0 0 0 0 0 0 0 0 0 
0 0 0 
##$DATE= 1707214564
##$DBL= (0..7)
120 120 120 120 120 120 120 120 
##$DBP= (0..7)
150 150 150 150 150 150 150 150 
##$DBP07= 0
##$DBPNAM0= <>
##$DBPNAM1= <>
##$DBPNAM2= <>
##$DBPNAM3= <>
##$DBPNAM4= <>
##$DBPNAM5= <>
##$DBPNAM6= <>
##$DBPNAM7= <>
##$DBPOAL= (0..7)
0.5 0.5 0.5 0.5 0.5 0.5 0.5 0.5 
##$DBPOFFS= (0..7)
0 0 0 0 0 0 0 0 
##$DE= 6
##$DECBNUC= <off>
##$DECIM= 32
##$DECNUC= <off>
##$DECSTAT= 4
##$DIGMOD= 1
##$DIGTYP= 9
##$DL= (0..7)
0 120 120 120 120 120 120 120 
##$DP= (0..7)
150 150 150 150 150 150 150 150 
##$DP07= 0
##$DPNAME0= <>
##$DPNAME1= <>
##$DPNAME2= <>
##$DPNAME3= <>
##$DPNAME4= <>
##$DPNAME5= <>
##$DPNAME6= <>
##$DPNAME7= <>
##$DPOAL= (0..7)
0.5 0.5 0.5 0.5 0.5 0.5 0.5 0.5 
##$DPOFFS= (0..7)
0 0 0 0 0 0 0 0 
##$DQDMODE= 0
##$DR= 18
##$DS= 0
##$DSLIST= <SSSSSSSSSSSSSSS>
$$ [...]
##$SUBNAM2= <"">
##$SUBNAM3= <"">
##$SUBNAM4= <"">
##$SUBNAM5= <"">
##$SUBNAM6= <"">
##$SUBNAM7= <"">
##$SUBNAM8= <"">
##$SUBNAM9= <"">
##$SW= 18.0517328524113
##$SWIBOX= (0..15)
0 0 2 0 0 0 0 0 0 0 0 0 0 0 0 0 
##$SW_h= 3612.71676300578
##$TD= 16384
##$TD0= 1
##$TE= 0
##$TE2= 300
##$TE3= 300
##$TEG= 300
##$TL= (0..7)
0 120 120 120 120 120 120 120 
##$TP= (0..7)
150 150 150 150 150 150 150 150 
##$TP07= 0
##$TPNAME0= <>
##$TPNAME1= <>
##$TPNAME2= <>
##$TPNAME3= <>
##$TPNAME4= <>
##$TPNAME5= <>
##$TPNAME6= <>
##$TPNAME7= <>
##$TPOAL= (0..7)
0.5 0.5 0.5 0.5 0.5 0.5 0.5 0.5 
##$TPOFFS= (0..7)
0 0 0 0 0 0 0 0 
##$TUNHIN= 0
##$TUNHOUT= 0
##$TUNXOUT= 0
##$USERA1= <user>
##$USERA2= <user>
##$USERA3= <user>
##$USERA4= <user>
##$USERA5= <user>
##$V9= 5
##$VALIST= <valist>
##$VCLIST= <CCCCCCCCCCCCCCC>
##$VD= 0
##$VDLIST= <DDDDDDDDDDDDDDD>
##$VPLIST= <PPPPPPPPPPPPPPP>
##$VTLIST= <TTTTTTTTTTTTTTT>
##$WBST= 1024
##$WBSW= 4
##$XGAIN= (0..3)
0 0 0 0 
##$XL= 0
##$YL= 0
##$YMAX_a= 133597
##$YMIN_a= -165628
##$ZGOPTNS= <>
##$ZL1= 120
##$ZL2= 120
##$ZL3= 120
##$ZL4= 120
##$ABSF1= 10
##$ABSF2= 0
##$ABSG= 5
##$ABSL= 3
##$ALPHA= 0
##$AQORDER= 0
##$ASSFAC= 0
##$ASSFACI= 0
##$ASSFACX= 0
##$ASSWID= 0
##$AUNMP= <proc_1d>
##$AZFE= 0.1
##$AZFW= 0.1
##$BCFW= 1
##$BC_mod= 2
##$BYTORDP= 1
##$COROFFS= 0
##$CY= 11.3945322036743
##$DATMOD= 1
##$DC= 2
##$DFILT= <>
##$DTYPP= 0
##$F1P= 15.7292609196834
##$F2P= 12.9074282941183
##$FCOR= 0.5
##$FTSIZE= 0
##$FT_mod= 4
##$GAMMA= 1
##$GB= 0.15
##$INTBC= 1
##$INTSCL= 1
##$ISEN= 128
##$LB= 0.24
##$LEV0= 0
##$LPBIN= 0
##$MAXI= 10000
##$MC2= 0
##$MEAN= 0
##$ME_mod= 0
##$MI= 1.114404
##$NCOEF= 0
##$NC_proc= 0
##$NLEV= 6
##$NOISF1= 3.799351
##$NOISF2= 2.8
##$NSP= 1
##$NTH_PI= 0
##$NZP= 0
##$OFFSET= 15.70392
##$PC= 1
##$PHC0= -24588.44
##$PHC1= 1.252678
##$PH_mod= 1
##$PKNL= yes
##$PPARMOD= 0
##$PSCAL= 0
##$PSIGN= 0
##$REVERSE= no
##$SF= 200.130013532006
##$SI= 16384
##$SIGF1= 3
##$SIGF2= 2
##$SINO= 400
##$SIOLD= 16384
##$SREGLST= <1H.CDCl3>
##$SSB= 0
##$STSI= 0
##$STSR= 0
##$SW_p= 3612.71676300578
##$SYMM= 0
##$S_DEV= 0
##$TDeff= 0
##$TDoff= 0
##$TI= <>
##$TILT= no
##$TM1= 0
##$TM2= 0
##$TOPLEV= 0
##$USERP1= <user>
##$USERP2= <user>
##$USERP3= <user>
##$USERP4= <user>
##$USERP5= <user>
##$WDW= 1
##$XDIM= 8192
##$YMAX_p= 0
##$YMIN_p= 0
$$ End of Bruker specific parameters
$$ ---------------------------------
##NTUPLES= NMR FID
##VAR_NAME=  TIME,          FID/REAL,        FID/IMAG
##SYMBOL=    X,             R,               I
##VAR_TYPE=  INDEPENDENT,   DEPENDENT,       DEPENDENT
##VAR_FORM=  AFFN,          ASDF,            ASDF
##VAR_DIM=   8192,          8192,            8192
##UNITS=     SECONDS,       ARBITRARY UNITS, ARBITRARY UNITS
##FACTOR=    0.0002768,     1,               1
##FIRST=     0,             0,               0
##LAST=      2.2672688,     0,               0
##MIN=       0,             -165628,         0
##MAX=       2.2672688,     133597,          0
$$ Real data points
##PAGE= N=1
##DATA TABLE= (X++(R..R)), XYDATA
0@%%%%%%%%%%%%%%%%%qJ6j6J6j6J8k6L2l2M0m8N3o1O9p8Q9j02J15j30J46j62J81
39I6k04K27k51K79l10L43l77M15m57N05n59O15o77P45q22R08j005J118j246J392
59G35j567J779k036K364k795L383m244N629q213J4642o0653j08016J02123J03890
73D7021K6298L02L0176j1227p9990l7112Q9786O8343m9166q6802l4712N206K486
86b9391J2626N8878Q173r2637o3965M5078O8385J8319j3942O712n784n3773j7955
99e9276N4777K9844k3119j4118K0609J0688l7527k1805L9637J4029m5043k8174
111e9478J5962K1535L258K1544O2519J7730o5525m2403K6323L1532O619Q420K5902
124G3938j3472p4122l1716M7516L1436j9018k2708n397j3149l2076Q196N8660
$$ y = [0, 0, 0, 0, 0, 0, 0, 0, 0, 0, 0, 0, 0, 0, 0, 0, 0, 0, -8, 8, -8, 8, -8, 10, -16, 16, -16, 24, -24, 29, -32, 37, -41, 48, -54, 61, -69, 77, -85, 96, -108, 119, -132, 147, -163, 180, -197, 218, -239, 266, -293, 322, -355, 390, -432, 476, -529, 589, -657, 735, -832, 947, -1089, 1275, -1520, 1863, -2381, 3248, -4965, 9677, -50976, -158992, -56869, 47021, 73319, 73621, 103797, 92570, 12580, -24532, 65254, 133597, 84431, -2371, -37083, -31877, -29391, -16765, 42113, 50286, -42351, -106316, -61238, 7147, 25466, 11524, 18236, 12452, -41321, -59276, -4499, 25345, 2226, -11892, 8717, 19405, -18122, -39927, -290, 13739, -31304, -59478, -43516, -21981, -18723, 2821, 65340, 83070, 17545, -24858, 1465, 32997, 39616, 48036, 73938, 60466, -13656, -45372, 2144, 33580, 14562, -8146, -13543, -26692, -58768, -50572, 8088]
136H088P701o3663l9569K2656M6189L1336K8362L0794k9225q3382k2574N7081
148f206M6933m138j9053K273r499l5796R053N4517N612n0753l1829J9763L0207
161A1084k041J887K5025j5648n4024j1895M5316M3896j467j9007J328k0168n1068
174d6782r069L8666K1952j3569j3671J3277O606k1475K440L1314M2k9062j0454
187b9785K1169K3017J8R090K3504j6556m4891n931L2370K5831m564j1767k216
200A9289k7677m2105J1652M8377J6253k2259j8947Q031L281j3416J4954K9548
212B6981j8699m5136r825L4680L3020j124k672P224k6015l9280R530M4741K0833
225C4258k3871k4725N853k196j3794K2467L8139k496l6195j8255K1174J7780j2180
$$ y = [8088, 15789, -47874, -87443, -64787, -18598, 12738, 41100, 71894, 42669, -40713, -63287, -6206, 40727, 36589, 17536, 19809, 10310, -25486, -16433, 38084, 43696, -7057, -38886, -19123, 11084, 9043, 10930, 35955, 20307, -33717, -45612, -296, 43600, 42133, 23126, 24454, 4286, -46782, -55851, -17185, 4767, -8802, -22473, -9196, -2590, -24065, -21625, 9689, 9731, -19331, -29785, -8616, 14401, 14419, 23509, 47013, 30457, -14434, -20365, 12005, 37836, 33272, 21505, 19289, -8388, -50493, -38841, 9536, 25789, 3530, -15417, -7386, -4105, -17521, -2567, 26981, 8282, -36854, -46679, -11999, 21021, 19897, 17225, 24449, -1566, -40846, -31316, 13425, 34258, 10387, -14338, -8485, -10681, -24475, -2008, 36131, 33635, -2560, -20815, 359, 18139, 5959]
238E959O81J3157j8799l2038K160L6721K4599j6211j5645M024j4294k3639J1100
251b2225L2202R692k4070j8456J3778Q424o296J4597J9925j1313l0833j2107K1417
264e265J7863o716J372O369j8258j9703J1485L1892J3481j9601j5775P46j2556
277a4666j0575K0855K5839m724k8381j0202J9678P890o586J1830Q814k3652k9112
290c2992M636L3908J5532j4222j988P086j5759j3931J6907K9152J61l2044j5098
303a8652J1867j049n602J7213J8033j2009k9970m460K6852J0031j1597K264K826
316E747j7490j6908J2662L4429J0100k0968q206M627r180o849J4518J9245p573
329A4154l1250q257J9603P403j027J1692O960j5372k3273L008K7966P436j4197
$$ y = [5959, 6640, 19797, 998, -31040, -28880, 7841, 32440, 16229, 584, 4608, -9686, -33325, -22225, 9977, 19669, -4401, -22857, -9079, -655, -6951, 7646, 27571, 16258, -14575, -26682, -5265, 12598, 5882, 7254, 13623, -4635, -24338, -12853, 19039, 32520, 12919, -2856, -2110, -14666, -25241, -4386, 21453, 16729, -11652, -21854, -2176, 5714, -872, 10958, 19772, -3880, -32992, -28356, 5552, 21084, 6862, 4874, 11960, -3799, -17730, -823, 28329, 28490, -3554, -18652, -6785, -7834, -13436, 3777, 21810, 9801, -20169, -24629, 2223, 12254, 657, 2921, 5747, -11743, -28651, -15989, 18440, 28540, 7572, -634, 3993, -5187, -12036, 2482, 21727, 14154, -17096, -25353, -5750, 1653, 626, 12318, 19278, 3906, -19367, -16359, 11607, 19043, 4846]
342D846k437j70j2146n928J6478K5015k954k7020r525M083m772o4J4274R459j3605
357d466k3265N036K4953O509j495Q104j752j8934j3413J5567K7149k546j8158
370C289j33J999j0103j273J8877J6622j7257l1711j174J4407j386p18J2641P331
384A1411j6179k0752J2916K8784N81j3874j073j031j3021r093J6761K5517p213
397A3734k3881j765Q103p85K87J1727R690j5808k4658O110K1323N921j07N380
411A5271N28j3135j2228J3785K0734o693j7771m952k792o249j54J6554J4420j5168
425B150k1716K013R242Q73K103P730K553j6340j4387J5874K2163J742l986P36
439A0750l296j1433o240J6808J5321j3091j6271K03L075q79M253J5015P251k0222
$$ y = [4846, 2409, 2239, -9907, -15835, 643, 25658, 22704, -4316, -13841, -9758, -14530, -14594, -320, 9139, -4466, -27731, -22695, 2258, 8767, 7272, 15376, 13624, -5310, -18723, -3156, 23993, 21447, 3289, 3156, 5155, -4948, -6221, 12656, 29278, 12021, -19690, -20864, -6457, -7843, -8561, 4080, 11411, -4768, -25520, -12604, 16180, 16761, 2887, 1814, 783, -12238, -21331, -4570, 20947, 13734, -10147, -11912, -3809, -4594, -4307, 7420, 17110, 1302, -23356, -17246, 4077, 9998, 9891, 15271, 15799, 2664, -9564, 4221, 24955, 18262, 491, -4461, -7253, -13502, -13656, 2898, 17318, 2150, -19566, -17553, -8311, -7438, -5335, 2395, 4948, -11392, -25779, -9905, 12258, 14000, 10014, 10750, 7454, -3979, -10219, 6589, 21910, 8819, -7452, -7249, -4174, -5053, -800, 14215, 21466, 1244]
453A244j8456R090J2368m85j066M494j126j6573r238K0552J9374p990j3588l761
467e161k421r046k509J8977J3731j6699j6849N738J1866M133J522Q663L023j8304
481c336j3167J4310J7483N46p285l115j59q349k424J7549J1554j2886j7081n655
495a2015J653R6K146J2711N522j5396j0398Q458R067J173k419J574j621j4082
509a3531k982J7862J1520n469q157j678N18n544K131J8102O021j6814j3318J266
523a0073O014J765M292J3797K352j8339q675J1029Q393l024o601qk292j2068J473
538a1965K0974Q674j2487j5075l505L460j266M897J6708N67k0203j2046Q614J4011
552A358M237m98N960j853j5338k134J5617Q940q548j3438o92O122j348M519J4623
$$ y = [1244, -17212, -8122, 4246, 3761, 2695, 7189, 6063, -10510, -19748, 804, 20178, 12188, -1400, -5161, -7582, -16628, -19137, -160, 13571, -3128, -19977, -14239, -2373, 1760, 3282, 11945, 14968, -3336, -16503, -2193, 15290, 15836, 8551, 5436, 5277, -3072, -5496, 12053, 23607, 10721, -6360, -12015, -10362, -10266, -8120, 4591, 10113, -5283, -15681, -7223, 1844, 3017, 598, 2172, 551, -13531, -16513, 1349, 12869, 7400, -757, -2435, -1917, -7461, -5330, 12772, 18793, 1979, -11339, -10073, -4059, -2294, 1998, 15795, 18147, -192, -8867, 2162, 10555, 7531, 930, 922, -1370, -13438, -11965, 9009, 17683, 5196, -9879, -13384, -9924, -11190, -6293, 10415, 10982, -9221, -21267, -12653, 1358, 5595, 5097, 11057, 9204, -6134, -8268, 7349, 16289, 7741, -5697, -6389, -267, -1615, 2904, 17527]
567A7527k3j7735j4155K116J0299J645l41P296j868j3225l494J0002Q672k014
581D702n531K387n97q819P70J0576J959p628o841L377M509k319M999J1912k869
596A0587j5040q094M524P561J027M503R789m514j5415j555J1972P379n729p830
610h35N41l541q295P142J5957P63j5067j2448M288R165R82M917P895q473j7805
625a4814l449J4082J3831k305m707K591l563p732N769J2332Q23j4607j1931N608
639h072P118M18O098P002n772j3918n466R719Q913m368j549M651l767p282J222
654e053Q918M713p513m898N448n91n258K604O081j278r843n912O072M989K15P440
670F134P044o160j2410n440O859O945j046L224L663p396q192M205J0823K053j0471
$$ y = [17527, 17504, -231, -14386, -12270, -1971, -326, -667, 6629, 4761, -8464, -11958, -1956, 6716, 4702, -829, 1558, 961, -7858, -7088, 3488, 5447, -2181, -9022, -5645, -1136, -3455, 1544, 13456, 10587, -4453, -12547, -8023, -462, 565, 5068, 14857, 10343, -5072, -6627, 5345, 12724, 6995, -835, -294, -3835, -12130, -4988, 10969, 11732, -3335, -15783, -11495, -2330, -1348, 3569, 11464, 2991, -14814, -18263, -4181, 9650, 7345, 2638, 5229, 1666, -6066, -297, 12035, 12858, -1749, -13680, -8072, -954, -536, 5562, 12564, 6792, -7126, -12592, -2873, 6040, 1672, 123, 4774, 1007, -6275, -5053, 3865, 8578, 1065, -3833, 1615, 1024, -4234, -1630, 4451, 3173, -6670, -12582, -6510, -1521, -1306, 6134, 13178, 7018, -5392, -10832, -3973, 2972, 1926, 5150, 8813, 1417, -6775, -2570, 8253, 10306, -165]
685a65o880K745j431m76J0382P685p494j5977m865J2058R544P74L860M41j1370
700a169j1532K377J4066O129r187l949M553j109j498N409N595n414j5356m213
714a5298J1621O822K4K813O03o954r260O87J2135N030n480r37J102m625m731J690
730d758P595J720p324r2O146j088k335K301K454m296r504r08R394M109J166M081
746H661J3q481r132O15J0455L930m083l00j184n402k026O247Q359k252j0709j780
762g069N271J051K033M200l78q891j0159L729J4364M754k234p3l584p632m419
777i037O383J0946j487r528m88L995N56K94L588K682p174j1485K102J0003K050
792C400j897m37r32m855o207N411J1347R85n772j662k18k456j963L843P273j986
$$ y = [-165, -7045, -4300, -5731, -6207, 4175, 11860, 4366, -11611, -16476, -4418, 5126, 5900, 9760, 10201, -1169, -12701, -10324, 3742, 9871, 684, -3265, 1288, 179, -1319, 4090, 9685, 4271, -11085, -15298, -3677, 3145, 3169, 5982, 6585, -369, -9629, -8942, 3193, 8223, 2743, 1806, 2908, -1717, -6448, -4758, 2837, 4557, -2767, -2859, 3287, 2199, -136, 2165, 4619, 323, -9181, -10089, -695, 3414, 4580, 8661, 8674, 193, -8939, -8324, 2131, 6061, 1978, 1678, 494, -4908, -6934, -687, 7672, 5420, -5289, -7069, -1798, -747, 1286, 5486, 5108, -3783, -13942, -10213, 4151, 8905, 6671, 6598, 3014, -4618, -9037, -2654, 8292, 6805, -2723, -3211, 784, 1340, 1634, 5222, 7904, 730, -10755, -8653, 1350, 3400, 1503, 1066, 134, -4721, -10928, -5517, 5830, 6815, 1043, -619, -837, -3293, -5256, -1413, 5860, 3874]
808C874p698J042M573J547R0P08J58o247q326L537R101K669m63k47k255m972l462
825f371O091Q869k218o426j860p44r12J098M556L582o431q347K961N702J646k4
841A172j84k042o935m265Q841J0408L63k822j694j106k980r86O817N906o597p847
857c951J124L330J051k59K293J125q191o966O162P307K65l110j674k28l727k444
873g893Q578Q766l165o333k384Q92o19j297M133L701o460n910K471N819K919p41
889B477l69O0n799l330P014P014L49l528k356n43j492k81O940K881o044o355j586
906d948J322N37M06K694L20o974k933O072N307J105j645j071q15n135J74R090
922C506N055l294m367j262J313j405J00N929O44q294m739K278M330J240l78K765
$$ y = [3874, -3824, -2782, 1791, 3338, 3428, 4136, 4294, -1953, -10279, -6742, 2359, 5028, 4565, 4318, 2063, -2909, -6371, -280, 8589, 6371, -55, -1915, -2659, -3571, -2473, 2083, 5665, -766, -9113, -6152, -450, 1196, 1172, 988, -1054, -7989, -12254, -3413, 6995, 7358, 4536, 2842, 1736, -1244, -2230, 4587, 10493, 3896, -3951, -2827, 503, 1554, 1295, 3588, 4713, -3478, -10444, -4282, 3025, 3290, 180, -1494, -1722, -5449, -7893, 685, 9451, 6286, -47, -2431, -1539, -2158, -3455, 678, 4379, -2081, -7991, -5520, 299, 3218, 2477, 2108, 2168, -3631, -6961, 53, 7067, 7416, 3888, 1532, 989, -503, -784, 6156, 9037, 2993, -3362, -4948, -3626, -3089, -2683, 11, 331, -6643, -9576, -3504, 1803, 2908, 1263, 192, -623, -5758, -5584, 3506, 8561, 5267, 900, -362, 951, -454, -354, 5575, 6219, -2075, -6814, -4536, -206, 1034, 656, 3421]
938C421o15o658j368P497N007j549n067j546K6l604O47P891K683o158n775o63
954e831L486l28l35M298l76o976k312N377O584J753k539P6k79m416K74O847L069
971H372l525o036j586J657l44J172N349j131o210l941P85M533J187m82J913k212
987d99n083J569N644L998j136l603r01j394l144K722O012l17m795l927J191L110
1003e53n43K153M148k954o602j033M650M697n40j844J669k252m666K285O289K068
1019F972m656n448j65R65k121K544N146r28n453l388L396M970l27m00K026l284
1035a51m627O81N397M723k000l724J59j226k003K876L848M25m763m712J390K877
1051h30oK344K332k482m111j425L661M112j317j750j46k939k109K772M807K203
$$ y = [3421, 2806, -3852, -5220, 2277, 7284, 5735, 668, -878, -852, -4456, -3809, 4082, 6765, 607, -5168, -5831, -2345, -2673, -3008, 1290, 914, -6062, -8374, -2997, 3587, 5340, 2801, 2877, 2598, -1818, -1544, 5303, 8372, 4847, -1189, -2775, -1118, -1462, -290, 5059, 3928, -2282, -6223, -5438, -905, 282, -200, 1713, -499, -5582, -4013, 1631, 5629, 4493, 890, -11, -1405, -4549, -1827, 4185, 3868, -927, -4854, -3663, -553, -1096, 1057, 5205, 2251, -4351, -5384, -734, 3963, 3423, 1579, 3248, 996, -3670, -1385, 4904, 6972, 2316, -3132, -3297, -2332, -4453, -1909, 3237, 2309, -3144, -6532, -3136, 1834, 1507, 1107, 3133, -151, -4778, -4097, 1300, 6023, 4023, 299, 458, -768, -2771, 105, 3953, 4378, -385, -5097, -3707, -830, -836, 1508, 3840, 1358, -2753, -4178, -517, 3595, 2278, 528, 382, -2557, -4666, -1894, 2913, 5116]
1067E116l255l875M89o09r8L526K842j624m406k602L249K767q2J378J044m038
1083a78l784N19M727K614l566k104P05k351m65L917M857J49n694l546K603Q90
1099g07m12L121J960k222m959j163N475L058k085j131r3k692j868J716N039K065
1115E102n036l174J685P35R46K481J861j419n845k653L304K175j51Q65n72j851
1131a547k569N31M246J827k843j198j48r38R04L211L268J61m432j439J567K67
1147H68J011K101N15k947n095r50M003J099k13O07r48k821j781K547N087l6m322
1164a275j273N75l91J759L526K633k465o646q69L254J012P71P86p60k686l440
1180e489K169O310J275k992r34j0j96K14K548L863k109n867j199K222J448M84
$$ y = [5116, 1861, -2014, -1525, -2134, -2232, 1294, 4136, 2512, -1894, -4496, -1247, 1520, 1438, 2816, 3860, -178, -3962, -3443, 1284, 3898, 332, -1772, -1067, -3418, -3883, 34, 4891, 5040, -654, -4200, -1597, -707, -1119, 2002, 3962, 1740, -3219, -4382, 1093, 4151, 2066, 935, 842, -1850, -3718, -2002, 3037, 5102, 66, -3108, -1423, -688, 258, 2739, 4600, 3181, -2664, -5317, -2013, 162, 11, 876, 304, -1547, -4116, -3585, 661, 2488, -355, -1553, -1701, -2639, -1735, 1476, 4744, 4905, 473, -966, 601, 868, 1879, 3980, 4495, 1548, -3547, -4497, -494, 605, 392, 999, 51, -2770, -4551, -2004, 3083, 3047, -1275, -2548, -1973, -2364, -605, 2921, 5554, 3089, -3557, -4426, -1172, -160, 611, 1397, 637, -2049, -5489, -3320, 2990, 4265, 1273, 339, 329, 133, 347, 2895, 6758, 4649, -1218, -2417, -195, 1253, 1737]
1196A737M65K52l259n106J32L813P76p64l63nj67p62K243M528p20k758n62L89
1214a31R04Q48J676J765k386m369l17J596P39J590N08n29k970l423J850L584P24
1231A659l44k67q60q33N0K916K934l051m903q92J34J442J847J824M95m769m466
1248g084J985L916J600J91p8n62j649q77M350M045j706k908n12Q26J249kJ548
1265D332L56m811m882J288K703J669k92q8j99k839k423K635L216J0j219n44R34
1282a54J5o20K253J681k321k528n60J258J363J30R12J51l374k530J641K678K186
1299B181Q70k20n50k657j209K913K239p58j235j437k79j48L65K537l65m614k931
1316e298N90J972K056Q09O08j215m128n06M140L441O73j404q97n5j563P5L635
$$ y = [1737, 2202, 2454, -805, -5911, -5779, -1966, -1190, -1954, -2317, -2322, -2489, -3251, -1008, 3520, 2800, 42, -520, -131, 773, 1621, 3297, 5062, 2676, -1693, -2010, -414, 325, 1915, 2423, 1894, -1076, -4499, -2649, 935, 1659, 1315, 1048, 188, -645, -595, 2321, 5255, 2204, -2699, -3591, -3457, -2015, -168, 1656, 2151, -2618, -7084, -5099, -1183, 417, 608, 530, -32, -1681, -2558, 1792, 5837, 4131, 1223, 711, 1537, 2786, 2784, 4332, 4688, -123, -5005, -3717, -1014, 655, 363, 275, 76, -2763, -5186, -2551, 665, 675, -544, -1088, -154, -139, -759, 1494, 3175, 854, -1674, -2234, -976, 387, 517, 1429, 1580, -1794, -4324, -2683, -5, 2181, 3051, 2831, 2281, -376, -1585, 1328, 3567, 2809, 1574, 137, -142, -290, 75, 2612, 2247, -2367, -5298, -4708, -2736, -680, 129, 737, -478, -4606, -5112, -972, 2469, 3142, 1738, 841, 786, -777, -702, 2933]
1333B933J161l090k604J93K205J109k72P74j228m148j508K334L471J089r43m51
1349A025n20k543j80K777J869r22k204j095J038j11k92K148l32k329j645N93K584
1366a39J535j41L9j141k637k28K618K582J469j634r24q81j738P36K542J17j704
1383D71k013n73J364P64Q77J365k010l283m80J758K678J122q47n62j862k363J455
1400b139L456J351j023k063k94J23p73J188K311r06k342j455J597K866kj86M18
1417B127k159k701J49K523K954o43k416m01n44j271J317K477Q58j897k403M58
1433a572J334M78L33P27j010k072m61J826L043o0j491p42j837j415J238K298J944
1450B561q47k423k26K10o6J643J056p56j699j414J191J796Q5K79n31k213j207
$$ y = [2933, 4094, 1004, -1600, -1407, 798, 1907, 1635, 2409, 1181, -2967, -4475, -2141, 1330, 2419, 1476, 1025, 505, -2038, -2218, 559, 2428, 1506, -698, -1793, -755, -866, -1158, 990, 658, -1671, -3316, -2723, -139, 1396, 1255, 1294, 153, -2484, -2712, -94, 2488, 3957, 2323, 1399, 518, -1220, -484, 2058, 2175, 471, -1542, -2115, -751, 13, 890, 2255, 245, -3038, -3518, -1760, 918, 2040, 1193, 631, -1231, -3594, -2139, 1317, 2668, 1645, -418, -712, -589, -1362, -174, 2137, 1231, -1111, -2566, -969, 1897, 1895, 1709, 2127, -32, -2733, -2584, -61, 2893, 2250, -166, -567, -1111, -2382, -1065, 1412, 2270, 373, -2030, -1572, -238, 240, 573, 1300, 290, -1782, -2243, -417, 2626, 2566, 1075, 333, -1504, -2919, -1681, 617, 2561, 1714, -709, -935, -725, -791, 852, 1908, 1152, -547, -1961, -770, 1026, 1111, 1390, 859, -1354, -2561]
1467b561O86K216J894j210j231n72j489M3K191J886O25j871j675J025N08j16J184
1484A533L22j534k064r27K806J883j394l06o57j671j114J372K606J650k313j727
1500a535J42K50M55J729J411p3k669j772J789J476N6p4p81j027j624M05K838J640
1518B636j492j511r12p60Q24J510J767K76k267j520M75P68J142P26p64j072j914
1535b088l46K213R45n92k76r93j196L82J177K576M44j662j026j27j00J221J457
1552B009Q61o76k736n10J410M11K33K45j230j414j489P09L081L05j281q31p27
1569a630j63M85J337K223l04k848q52R03P61J051M25n4j217k399K75K425R22k80
1587A060p60r16o12j09J247K717m0j883j128j96P34O17Q36P27j167k741k79Q74
$$ y = [-2561, -1875, 341, 2235, 1025, -206, -778, -2267, -2224, -33, 1853, 2478, 607, -1068, -43, 465, 349, 1533, 1855, 321, -1743, -2670, 136, 2019, 625, 319, -338, -2009, -3123, -1751, 855, 2505, 192, -1535, -1393, -1143, -688, 1041, 2452, 2379, -290, -2062, -273, 1203, 1259, 1185, 404, -623, -2247, -1842, 996, 2636, 1144, -367, -1279, -2039, -1215, 295, 2062, 2338, 71, -1449, -974, -206, 936, 1662, 898, -174, -2088, -2434, -221, 724, 132, -144, -1137, -2333, -1951, -774, 1802, 2246, 584, -442, -569, -669, 552, 2009, 2870, 2194, -542, -1052, 358, 769, 1002, 1247, 17, -1397, -2886, -2177, 904, 1209, -72, -903, -1630, -1793, -1308, 29, 2252, 1948, -900, -1752, -849, -88, 963, 1388, 1334, 117, -2282, -2007, 418, 1340, 1060, 300, -616, -1228, -1337, -90, 2627, 2587, 704, -424, -620, 114, 731, 1567, 2294, 1127, -1614, -1893, -1019]
1605a019J133O50n94r55r92j083R10K366J21o04r58n96N37P29J748J099p00j872
1623h0l10l4R06J263N8j50j592j846J111J395L71n4p58q20j140LJ784J879p78
1642A208j720q03j5M70N63J348Q21j819k321L83P42J358K86j98k05j506p78J694
1660d92J857L16r72j028n81O03K71J755J167j107j681r82N86J273M16r2j79j922
1678g92j395P28J220R98l36j128n99n91j43J864J327p75p32j166KJ257N93J502
1696A834J88j786j067j55Q48J369J50r9p55j730l48J701Q75M01n54j132m54j30
1714h44L97J946L61j512j266n28P67O38O69N29n60k176n17N39J614O08n25q12
1732f72j79j048O81J952R58m75j372p79P89Q08L80J152q7j703j065J02J174Q55
$$ y = [-1019, 114, 764, 170, -785, -1777, -2860, -1950, 416, 537, -67, -1025, -1621, -1084, -355, 1393, 2492, 1792, -80, -390, -424, 482, 1745, 1803, 1653, 61, -1785, -674, 721, 1092, 1038, 280, -540, -1680, -1677, 107, 1986, 1208, -512, -1315, -1330, -860, -297, 1051, 1872, 53, -2268, -1885, -1143, 215, 501, 303, 98, -1408, -2186, -492, 1365, 1681, 709, -319, -900, -297, -26, 1729, 2896, 1789, 108, -874, -288, 985, 1401, 1309, 1130, -792, -2187, -1459, -239, 759, 423, -705, -1304, -1895, -2038, -174, 1153, 378, -354, -1520, -1518, -261, 332, 1834, 2022, 236, -831, -986, -138, 1231, 1381, 1282, 527, -1203, -1551, 150, 1025, 1426, 872, -260, -714, -844, -447, 1499, 1860, 348, -918, -1446, -679, -41, 628, 1157, 597, -1579, -2096, -1557, 57, 665, 140, -672, -851, -1899, -1218, 734, 1692, 1217, -155, -934, -145, 663, 1043, 2195, 2108, 405, -660, -558, 616, 1471]
1750A471j68n42j153j084pR04J052L49j365p68l2K67Q72J189o5l77j376o49J207
1769b75O44M74K34n15j486j40K06J100R00p18m22o74o83Q48J308M49Nj191n12
1788d48K06L93J146R81r20j390j402j24J408P06M9N3j270j496J65J096J408O8
1806F29j319m14Q3r2J338J309k9q77j542K0J421N14K95R7q90j197q44N97J705
1825H04l2n69m14m18l17N54O59P72l40j341k36N70M15R84K68q09r15j311M57J064
1845a55O17K86l71j166p20M02O53J279K1o58j54q63L51J263M41O1o85j278L92
1864b84N53M93O25j67j417j154n42R15J135L98k49m56j121k5P68J305M85p36r37
1883d11r5M44K11J276j55m58j381r56J077J253O7K02r07r22p43K24J286J238l91
$$ y = [1471, 1303, 761, -392, -1476, -1483, -579, 473, 822, -543, -1311, -1343, -1076, -204, 985, 920, 543, -833, -1482, -275, 369, 843, 1077, 562, -924, -1064, -858, 242, 1142, 424, 2, -672, -1355, -507, 801, 1250, 1255, 64, -448, -242, 151, 1297, 2278, 1358, -32, -1434, -1558, -150, 556, 605, 658, -612, -2108, -1943, -847, 561, 629, -690, -1104, -1021, -1113, 225, 1534, 1505, 628, -914, -894, 527, 1041, 1336, 1433, 543, -654, -1498, -901, 804, 772, 203, -211, -629, -946, -392, 267, 1039, 699, -642, -878, -308, 107, 1091, 1359, 550, -365, -1676, -1219, -155, 462, 748, 377, -789, -1509, -1107, -454, 825, 846, 188, 34, -829, -478, 785, 1226, 1287, 602, -676, -284, 269, 762, 1387, 1220, -197, -1351, -1893, -978, 157, 555, 306, -150, -1271, -1296, -528, 777, 1262, 526, -411, -506, -62, 149, 1425, 1270, 812, -569, -1525, -448, 805, 872, 1074, 167, -755, -1498, -1274, 12, 1250, 859]
1902H59p42m94l24M74N61O73j34j222m96K42N85P75O6l68p05q98k86J117J114
1921G97K54j98r10q28J05L18J219N53o09r60m95K22O18P10J96n78j407j63O78
1940d78O04J011j59r87p41o12R7J394J091l97m95p02m82N18P50N51j61j047n93
1959h38K57P52P58J55n70n79j088M7J280J027k27m26q13n60j44N67J226K0r49
1978a05n81m27O45N82K30L33n36j106j30J120N97Q38o60q73n19m01N97J018O46
1997A268l65o36r26J7K59M25Q66l04p89k21l15P51O39Ll34n26r04M45Q57M67K90
2018I67o21j103l38o2Q44R04r3o64l61l18K50O55M53O34q52q09L95M22O40M20
2038A363l45p10o81p25Q27J060J10k99r60o07j15K70N66R80m95q30l79O4Q38N27
$$ y = [859, 117, -377, -701, -227, 334, 1007, 873, -349, -845, -603, -18, 757, 823, 455, -250, -1148, -1434, -317, 797, 1051, 853, -57, -885, -780, -462, 757, 1310, 701, -259, -754, -532, 86, 796, 992, 414, -993, -1156, -478, 126, 1137, 978, -9, -750, -1362, -1265, 129, 1220, 823, 328, -374, -856, -338, 412, 963, 802, -245, -838, -581, 171, 929, 1084, 514, -65, -1153, -1106, 174, 1201, 974, 548, -265, -825, -969, -402, 824, 844, -105, -686, -1113, -468, 114, 344, 677, 141, -965, -1095, 25, 622, 1460, 800, -73, -592, -993, -396, 622, 1268, 903, 267, -659, -642, -383, 42, 908, 604, -185, -406, -721, 30, 669, 672, 338, -188, -1092, -647, 210, 677, 967, 346, -757, -1095, -1157, -313, 591, 498, -166, -527, -845, -595, 60, 513, 1147, 295, -514, -119, 303, 943, 1363, 1018, 308, -373, -1098, -271, 789, 899, 600, -360, -967, -1082, -812, -246, 734, 239, -591, -970, -906, -68, 459]
2058D59R7L6q63o66N33Q38M17L15j268o45l83L14P62R66j02n13q24k99P68K35
2078A77R22K49j012n71r9M24O48L57p37o41p53q3P75M23J94m74q58m12K31M56
2098g84J128L09n19k50k88P4R55N3M25k60r02k38L36K84O14m39n24j80r09M42
2118f73R26M83l11o89m14j08N05N24P86k8r18o76J56K63Q17j45k98m16q93P7N92
2139d40R18P4o14q98K01O8N24R60R9J5p88n66N97M86K33L35o47o75l31k7N75N35
2161F34n38l53p43m03P45P79M4L02q03l77K11L96N29N31l74o16l33k63P24O36
2181G28j88k44o15p14L96N98O67o1m56m88k18l0Q04O91P8k63p33m79N35J90L00
2202D98L29o09j002k46L53Q20Kk61j18n69k82N25P98M69j58p44j68J82K10O66
$$ y = [459, 556, 592, -271, -937, -404, 434, 851, 1166, -102, -747, -1130, -816, -54, 912, 810, 297, -527, -826, -58, 177, 1099, 1348, 336, -235, -334, 90, 738, 1095, 358, -283, -1036, -1119, -344, 79, 273, -201, -1059, -1471, -1240, -784, 344, 653, 134, -116, -404, -330, 625, 678, 1103, 843, -59, -297, 39, 323, 937, 498, -26, -206, -1115, -673, 253, 736, 425, -264, -678, -786, -281, 243, 1029, 1001, 83, -593, -437, -174, 643, 498, 200, -216, -1109, -1032, -440, 478, 552, -62, -960, -759, -691, -167, 793, 892, 907, 119, -447, 150, 636, 869, 1204, 557, -118, -449, -476, 99, 634, 96, -257, -1000, -1403, -658, 121, 165, 467, -336, -713, -502, -106, 423, 954, 580, -36, -369, -632, 92, 728, 540, 296, -319, -1033, -637, -39, 628, 567, 111, -377, -595, -625, 179, 870, 948, 685, -48, -527, 8, 198, 498, 827, 218, -784, -1030, -677, 143, 145, -116, -234, -803, -1085, -560, 238, 707, 549, -195, -363, -181, 29, 695]
2222F95K15m73l26n63l4O99L07L9k68o74l61K16K03Q82j86n39j04o05N24Q62K01
2243G10J8n71q27M1M70L28M37k18o43l44j17J41O91K71J2m51o25J8O88M22L97
2264H48l45n06k85n2M92N86j35l25n34o38L36N04L69J80l16q50J32J14N73L96
2284E44R2p01p8l95L34N09K21L22p25q29N9M54M19M77k45n05k75n86P36Q05j63
2305D70j74j80n52l0L07N71L13m37o19l43J23N94M31Qk19o81j75L54N21J94K29
2326G05n19l23j20J27M81J45N2l38n70k38N31J18L55o5p39Jl41K41Q19K71m07
2347A86l69l10R2M47M79K74k55p01l60K36J17O79K13q53l27j79J91M12L31L86
2367F89l87q25m9M21K88N42J57o39m06j23J07Q16L3l43n19m08O9K93J3O96l5p51
$$ y = [695, 910, 437, 111, -452, -486, 213, 520, 559, 291, -383, -744, -528, -325, 557, 371, -168, -272, -877, -353, 509, 710, 728, 157, -670, -629, -159, 169, 606, 388, -255, -599, -716, -575, 116, 387, 399, -52, -677, -659, 29, 451, 848, 503, -3, -288, -340, 152, 738, 603, 278, -256, -894, -558, -54, 315, 495, 179, -671, -539, -425, 148, 544, 636, -65, -143, -538, -204, 305, 526, 848, 123, -706, -647, -193, 226, 703, 458, -47, -322, -908, -172, 633, 470, 296, 116, -436, -466, -159, 412, 725, 288, -331, -674, -551, 43, 474, 482, 263, -418, -593, -239, 282, 476, 705, 186, -137, -257, -130, 351, 496, 548, 210, -360, -598, -67, 51, 406, 341, -398, -397, -738, -497, 322, 593, 186, -183, -493, -401, 46, 525, 799, 544, -157, -517, -281, -164, 515, 728, -125, -452, -631, -440, -28, 303, 689, 302, -523, -572, -151, 137, 679, 836, 197, -209, -332, -225, 591, 624, 281, -238, -646, -577, -284, -271, 425, 390, -361]
2389c61j62k57O34O41K3N6m58n60J42O20R7N00m71o28k63R6L04L28k6l00m33k63
2411g41K98N72K07L26p67j47j24K08L26N62k21o19k26l61O38L07k49K67n20l91
2431f55P3J80P07J63k49k99n57K00N55P42O6k45o63l49M07R5O05q5n07m58k97
2452e71o3N32M06p5m22k18m29N31M81J2J58l84n12R5M20L60K94J0o28m53p9M00
2474a35M13K79j78m46m33J68j8N71K46m77Q3n51K64P24Q3q3j36o66k19L68L8N03
2496C98J04o17l46m50L06M90M04j65j49n02j50M27J05Q04k37n57o8J23J39L67
2516D26J11J74n66m81r3M21J18M08j61n75l88N5L54L04J89k79l15l09L32M91K42
2537D58p2j57n33k38R6M56N54j49l42k88k24J50L79N3K51O0p58N5K36M29P4no14
$$ y = [-361, -523, -780, -146, 495, 518, 574, 116, -444, -302, 318, 415, 915, 444, -184, -447, -351, -47, 281, 255, -45, -478, -741, -443, 129, 336, 662, -105, -252, -376, -168, 158, 720, 499, -120, -346, -707, -69, 238, -11, 256, -264, -655, -582, -402, 305, 468, 219, -80, -637, -437, 118, 860, 926, 681, 18, -331, 76, 171, 776, 691, 184, -274, -571, -634, -102, 304, 229, -193, -411, -840, -309, 172, 184, 342, -42, -554, -459, -39, 321, 615, 625, -3, -456, -535, -135, 278, 557, 379, -67, -500, -332, -350, 221, 467, -10, 73, -478, -214, 510, 593, 510, 374, -292, -511, -143, -105, 398, 502, -115, -461, -911, -605, -115, 289, 124, -25, -527, -677, -250, -145, 659, 422, -135, -203, -80, 59, 426, 537, 711, 145, -336, -429, -8, 110, 518, 357, -218, -606, -551, -197, 107, 296, 17, -298, -607, -275, 216, 458, 386, 229, -304, -542, -446, 10, 564, 415, 73, -215, -439, -289, 90, 143, 394, 454, -304, -249, -13, 416, 490, 485, -129]
2560a29j93j45L99L42K18k29m30l01M5K86M43K07l13l93k71J17J87N46o6K8n07
2581a59j99J0N73J68j0k39o39J36J58N36L75m41k44l24m07O38L25K98q7n76o6
2602a74j58J37L01L10l90o1l99j40N10L18KJ97p82j96J81J52O17k1j73l81j07
2623b57l32O65L92o9qn47l93N24J06K98k18l26l16K41J49L08K09j52j14n92J35
2644b97J51K14L98k31k93k30j94L48L93J32l01q9n39N6O19K09o3k24l45j16J75
2665b27K61N84k35l07k51l84J84N76l6L25l19m55q6J26K22N49k52j99k98q6K90
2686a8L51J04j5o30j75K16O5L02K14q5n45q0k39L09M14J11j03k50k85J20J94J46
2708A21L78n02j46j79K30J93Q4K49k43o15p8R4N51R9J75n07m02J2K71L83L06m01
$$ y = [-129, -322, -467, -68, 274, 492, 263, -167, -468, -423, -137, 306, 513, 200, -193, -464, -347, -160, 386, 320, 348, -159, -358, -348, 225, 393, 383, 144, -495, -359, -201, 335, 710, 269, 25, -299, -706, -68, 257, 555, 468, -108, -174, -332, -195, 106, 416, 26, -35, -434, -574, -64, 254, 256, 453, -329, -525, -344, -192, 425, 404, 231, -150, -257, -589, 76, 468, 399, 391, -156, -549, -25, 81, 379, 161, -165, -481, -240, -91, 217, 426, 274, 160, -432, -297, -146, 68, 466, 235, -58, -288, -482, -134, 259, 391, 90, 1, -538, -482, 137, 346, 283, 59, -286, -402, -227, 34, 618, 383, 76, -175, -559, -375, 201, 165, 490, 171, -284, -370, -244, -22, 527, 275, 76, -222, -308, -18, 333, 437, 422, -208, -383, -167, -102, 200, 414, 329, -216, -296, -535, -226, 188, 299, 196, -54, -339, -219, -25, 121, 499, -3, -149, -328, -98, 95, 179, 428, 185, -430, -508, -414, 137, 236, 411, -96, -498, -486, -215, 168, 474, 73]
2730G3q2k70n4N41J43L75l27m73p1k91L96L63J44l24k96k79k66O75J39K21j91
2751A46m02k29K10K65L02J23k87k85k57J63L99K70R0n35l77J8K63K84J24O8l46
2772Gm16P6L94K77K91m98o4j60j19K91K31K30l97m40K0j94O06K74l22K9m43j71
2794d98J24K03M59N8j81m86KlL58N00j06l19j85l13M11K59k0l8j84l13L4J59K06
2817A27K30l09j71j38j89M00L49k3n6j23n78J61RM95Q6j82l03j73o3L49P30m09
2839B19k2m24l81L28L30L32Q6m80j29j53PO86O5k99j70j47l60M70K63J30j41l55
2861a45K6n2OM80o0r6l8n06o3K46M45j12m6n28o2M22j18N13J84k69m84J39j03
2884b21M27J1J22j84l49j32N5K60K89R5l80k15k6J12K37Q5K03m98l75J83M25J34
$$ y = [73, -9, -279, -333, 208, 351, 726, 399, -74, -145, -436, -40, 323, 467, 143, -153, -432, -698, -23, 116, 337, 146, -256, -485, -275, -10, 292, 415, 128, -157, -414, -251, 148, 418, 508, -27, -404, -386, -123, 161, 285, 353, 7, -409, -333, 61, 338, 629, 131, 67, -93, -212, 79, 310, 540, 143, -297, -277, -471, 135, 409, 87, 116, -327, -498, -374, -171, 288, 346, 165, -321, -319, -322, 36, 536, 430, 111, -74, -387, 24, 283, 263, 225, 41, -272, -238, -79, 127, 357, 48, -123, -261, -450, -50, 299, 276, 220, 97, -481, -320, -311, 184, 270, 88, -215, -388, -451, -102, 628, 219, 197, -227, -608, -280, 50, 382, 468, -12, -141, -294, -287, 399, 464, 165, -5, -152, -512, -42, 221, 351, 210, -145, -119, -171, -165, 315, 255, 159, 121, -385, -448, -202, 243, 131, 85, -443, -505, -83, -201, 312, 496, 227, -257, -118, -221, 206, 217, 339, 155, -194, -326, -271, -11, 278, 373, -7, -222, -248, -136, 101, 186, 389, -109, -484, -301, 124, 258]
2906B58KK7n13P2l92L46L48J14o2m08j05j45L65L63j10m2l71K92j54K69K35N5
2928D44k14k19p2j06L07J80O5k24m79r0K45K69K23k08j73j42o4J43L31L1k1j80
2950D6m23K01O3L92K42j19o58Om7K95K69J03l17j93k45J42L1N58j14p1l39R3l2
2973a17J94K80j25P7l58l03L28J77M4j11j64j96M%K11K06o3j69k48l7M34J79J70
2996D13j76l14q8K22q5M23j25L9k44n62L08M9K52l7Jk83q4R9K59K46n0j71j54
3019f2l33K38L72J20j75j04l79R5K6J37K67P9m68r3%P1L42L1Q5m01j45KM18K5
3043A48L12J8o21o0R8%O32l06j29k00k50k5M62J81O0m42l43J00n9M31L59N4o08
3066a88J67j69J4K83K22L3n20p0J9p8K53K61k94K4m1k40L45K64k65p3J14m24K50
$$ y = [258, 260, 287, -226, -154, -546, -200, 148, 262, 200, -208, -313, -458, -93, 270, 160, 118, -253, 39, -115, 154, 389, 444, 230, 11, -61, -167, 140, 320, 385, 161, -318, -408, -163, 106, 329, 121, -52, -194, -258, -115, 216, 247, 226, 46, -377, -176, -113, 279, 521, 402, -256, -250, -297, -2, 267, 370, 53, -140, -385, -243, -212, 346, 232, 161, -178, -85, -117, 77, 357, 232, 309, -49, -352, -24, 153, 197, 86, -78, -274, -270, -270, -59, 147, 84, -85, -333, -370, 64, 243, 413, 237, -77, -165, 57, -28, 395, 270, 309, 65, -497, -189, -140, 112, 75, 76, -207, -291, -192, 67, 313, 263, 92, -62, -395, -157, 215, 335, 160, 56, -323, -228, -202, -65, 202, 281, -187, -280, -280, -209, 133, 164, 249, -152, -297, -295, 123, 148, 460, 478, -143, -203, -105, -105, 527, 221, 92, -108, -358, -383, 79, 260, 320, -122, -465, -365, -424, 7, 366, 420, -188, -21, -190, -176, 107, 329, 362, -158, -228, -209, -287, -34, 227, -67, -43, -84, -324, 21, 285, 20, -53, 61, -363, -113]
3089a13OL04K46j57l38k91j1K70K18J2L8k80j46O6J80J50J6O3l87N3j7J58L41
3112C81k16M0l53l0p9L77K21j01k68l12L3P4M01j12R3n3m23M8M04Q2MKl03n1j40
3137b81K10L25K42l73l14r0k7L30J78J58k54l55p4j83O51J07j57j27Rl2j04K28
3159F7J1J23j52l33k06N39o2L07n9m87Q9K4K0L66J61l1j50m82k8M85j54K10j67
3182I1k02Q0j92K01K83rl82l32J46k1L65M0J93qo12J09P5L84J80k57j42L3n37
3205e14L98J97J35j73J6j96P1qK25L62l36j91Nl98O00J60p7M0k64k48n0J51K25
3228A30J40j12l53j63R4J17N42j25k07k50j94J34J60L58J35k76j9j70l9K67K98
3249D67p0m54k6k64J26K14R5Q1m77K62q8J1J66L23K8l68j32N3J67K02J08r7m35
$$ y = [-113, -107, 197, 443, 286, -52, -343, -354, -84, 134, 146, 184, -96, -242, -176, 4, 154, 170, 233, -154, -101, -118, 40, 381, 165, 205, -148, -178, -257, 120, 341, 240, -28, -340, -307, -233, 168, 56, 149, 96, -327, -279, 125, 207, 211, 213, -90, -141, -281, -71, 254, 496, 123, -191, -281, -308, 22, 200, 358, 104, -251, -325, -508, 143, 250, 93, -34, -25, -57, -161, 67, 78, 201, 49, -284, -490, 49, -13, 294, 235, -252, -163, -139, -119, 247, 408, 377, 227, -255, -283, 202, 48, 258, 91, -111, -31, -223, -22, 261, 252, -130, -462, -316, -337, 28, 68, 261, 253, -359, -250, -175, 209, 389, 132, -10, 23, -514, -116, 81, 216, 43, 59, -137, -66, -74, 151, 513, 177, -14, -9, -407, 193, 353, 276, 316, 52, -196, -246, -95, 130, 270, 158, -195, -358, -264, -147, 395, 270, 63, -187, -381, -247, -87, 271, 406, 130, 111, -59, -98, 169, 467, 397, -57, -83, -347, -221, -7, 88, 169, -308, -46, -134, -123, 43, 366, 394, 26, -106, -53, 114, 316, 424, 327, -108]
3272a08j86j23M38J83l28Kj05j21P8J02L04j4r5l81J04K47J86J76l0l00q3Qj58
3295b04L39J32j72Q9k94l59K46K82Q5j34l09O7k7L51J96J75k84l46p6%L68O9J08
3318C02p7l48k07P4K34Q3J49l48r5J36j12K13R8K5k57Q0oj04L00L38k52k2j76
3341B8l72K80K16l8l8k29k49K02P1J99J64j51j27r6J74R8K05o0j16k00j55L39
3363A45q0O3J97l66Q4k51M3N6K17J41j33k16j0l2K58J00q4k02j36J74L4J34J30
3386B66j69mk74k33K82K96kj31k69k0r5L71M1N10n94k56lj7L23J93K49l78k91
3409b05o8K2L29L05k67j69L6k93n4N48M0l24rr4j11L04K42J74r4n14L1K32j3J37
3433A85k0l5l22k47M70J81k81J54L08m63k12R6Q2L67J7k27j79j89k3M97Q5q8o1
$$ y = [-108, -294, -417, 21, 204, -124, -122, -227, -348, -270, -168, 136, 122, 27, -354, -250, -3, 183, 359, 329, 29, -54, -46, -204, 135, 267, 95, 184, -110, -469, -223, 59, 144, 10, -299, -232, -259, 92, 288, 463, 179, -167, -243, -243, 125, 194, 302, 225, -123, -330, -256, -22, 61, 210, -138, -233, -97, -209, 4, 102, 127, -130, -50, -56, -160, 140, 478, 226, 204, 28, -344, -64, 152, 114, 76, -153, -402, -200, -129, 70, 234, 83, -44, -140, 34, 132, 337, 277, 161, -39, -194, 145, 65, 128, 325, -41, 43, -208, -165, -109, 108, 249, 116, -100, -110, -142, 116, 216, 132, -70, -206, -32, 2, 136, 266, 97, 93, -181, -414, -132, 164, 162, 31, -238, -258, -353, 18, 59, 569, -25, -281, -284, -301, 22, 215, 464, 86, -205, -273, -251, 78, 383, 116, -53, -17, -310, -364, 184, 224, -100, -109, -203, -314, -10, 232, 406, 312, -202, -171, 61, 48, 185, 165, 130, -192, -439, 31, 212, -69, 85, 393, -70, -282, -186, -104, 263, 280, 53, -126, -315, -338, 159, 244, 156, 95]
3456I5m00J15P0L01M8O2j03k55m07L14L20j46Q0l00k33K67K4M48k2M9l40j38J5
3479a36k08N93o3m7r9k73kQ9K92k19K02l48J09j32J96K45l9Rk17l47J51K31K32
3502B19P8k82j33l7n8L84M4K3n9m70L52j99M07j96l1j33p5k0l2K88J50l15k14
3525c09N5J0K88L2j27K82l31j95J74J07K21R2j32l17k2N6K90Q7j46P7l16p1J02
3548i3Q4P0K34l01j73J59j78M11N9j16K6k57m6J69J25P4k01j27n8l05J77M23K12
3571C68m98K3j66N9N6K93J48r5l25j85J68K35K78O2j42l71j52K14J11J22m5j39
3593A9k84N1M4P1L18L8n13k99M45K80M1l6k23J58j95j08M3K48R1k72k34J47r7
3616b67J8M29J17k03p1j84n5J65Q7M36l75q8j78jK29M63m72j25r4j61L64o7O2
$$ y = [95, -305, -190, -120, 181, 229, 291, 188, -67, -474, -160, 160, 14, 94, -206, -439, -172, -148, 300, 278, 327, -13, -151, -136, -344, 249, 186, 139, 40, -233, -235, -146, 146, -73, 129, -219, -110, -242, -46, 199, 160, 169, -48, -395, -244, -13, 219, 297, 15, -118, -155, -213, 171, 215, 238, 179, -291, 61, -138, 269, 73, 42, -91, -166, -186, -218, 70, 220, -95, -309, -254, -244, 44, 76, -51, 231, -100, -295, -121, -14, 207, 299, 167, -150, -172, -116, 174, 261, 115, 192, -124, -195, -93, -9, 61, 295, -6, -179, -20, -198, 213, 272, 156, 182, -75, -121, 48, 173, 247, 46, -81, -139, -444, -267, 156, 368, -130, -107, -273, -214, -158, 135, 283, 188, -137, -322, -154, 81, 359, 421, 279, -92, -244, -30, 81, 203, 158, 19, -265, -214, -170, -99, 219, 257, -256, -555, -110, 170, 211, 175, -48, 110, -85, -193, -150, 98, 189, -83, -317, -170, -267, -249, 180, 297, 94, 23, -161, -216, -51, 36, 472, 97, 9, -169, -170, 59, 522, 50, -75, -169, -330, 34, -33, 29]
3639B9M8k04M0l0j0K19K53m8j92k67j18L53L9J44j39j17j79j39K04L10m6k85K59
3662A24n11J85K26L00j38j82j48r2J76K85N3k25J19k10k22KJ50R2o7J38J04m98
3684c39K70P9K24j99k02Om7K23L7J52L0l6k66j05K77K5J78q1m65k00L64q0O34
3707D79k07l04M8j76j6J09J83N4j21k30r3K53r8K80l8j01j85j8j0K96J3j11n9
3730e2k30J61j05L24K92k87j02R5l95K14L25M2j49j97k62L01J51N6l6j94j66j09
3752c23J27J26J62P4L2k38n8N7L94j89P2l13j41J69j47K29M6J29j2l94Q7N4J61
3775A04j6J33m69P9Q8J92q5J98l5P5l67l39P16r6O9k85q4O3j01O0J75J94j2l51
3799i4j25lL60J78m0j59j33l36M5N95n0j50j79j49K43j20J75K2P4l18k5j95L57
$$ y = [29, 77, -127, -87, -117, -127, 92, 345, 297, 105, -162, -280, 73, 112, 256, 117, 0, -179, -318, -114, 196, 150, -135, 124, -387, -202, 24, 324, 186, 4, -144, -236, -60, 225, 278, 53, 172, -38, -260, -258, -108, -16, -83, 55, 159, -339, -69, 10, 234, 35, -167, -161, -208, 15, 52, 204, 234, 198, -68, -173, 104, 129, 307, 226, -239, -439, -75, -155, 479, 272, -32, 16, -160, -176, -67, 116, 170, 49, -181, -274, -21, -119, 161, 123, 22, -163, -181, -191, 105, 118, 7, -52, -282, -121, -226, 98, 390, 103, 1, 96, -299, -85, 240, 282, 133, -64, -326, -25, 126, 182, 146, -48, -214, -323, -196, -70, 92, 166, 198, -40, -98, -41, 353, 164, 236, -77, -218, -49, -196, 33, 79, 208, 196, -198, -111, -57, 104, 88, 221, -248, -169, -81, 111, 26, 224, 189, 264, -103, -442, 274, 178, 247, -38, -122, -59, -160, -100, 75, 269, 257, -94, -219, -222, 138, 316, 276, 117, -16, -352, -307, 288, 238, 88, -91, -240, 3, -117, 58, 80, 154, -164, -189, -384, -27]
3822b7K67k14J7j25J57l11mK61J91k05jM8j20q1M03j52l0k79J11p8J10K25K6k46
3846e7N2j54N1L71J31j76j37k32o4J82m2K27l0k94J83p9q1J36J13J08j48l24R0
3869a74J37J02J60r5k86NK42J52j29J37j98j24rQ1P5n0J38j95l9l6j02K47K02
3892B41j99q8J75k52J93l9m0J99m10K62j66q7J09L39k47Q8k70M8K30R1o2O3l61
3915a83m3O7K67P2r2P1l45j4l1J93K39k20J65l54j8rJ22K54J29k62j51l3R6K63
3939A83l7M3j50j68L2J67nJ43q6k84q2J16j3L12n8j94j1J6rjk1L62l09J85l00
3964a69O9J5K11k1k77J43l11O3M65n8k39J1j90r4K33J54J99m1k14m0M4r6J79K15
3988B51k39J00k74J00l3K19P4j38k83P7n9J48J98K42l44n6l72L78N7N1J06j98
$$ y = [-27, 240, 26, 43, -82, 75, -236, -240, 21, 212, 7, 6, 54, -66, -147, 256, 104, 74, -205, -94, -172, -62, 163, 189, -57, -5, -159, -108, 263, 394, 218, 81, -151, -215, -33, -75, 152, 122, -172, 11, -68, -149, -13, 100, 208, 60, -264, -174, -37, 65, 225, 130, -156, -151, 91, 243, 114, 251, 53, -71, -80, 1, 76, 26, 164, -31, -70, -106, -208, 39, 241, 42, -46, 129, -123, 70, 31, -9, 190, -220, 42, -124, -211, -102, 237, -10, 78, -192, -144, 86, 177, 115, 178, -183, -226, -159, 108, 180, 88, 159, -186, -200, -231, -38, 201, -19, 146, -208, -226, -235, -113, 141, 270, 8, -143, -176, -80, 183, 146, 189, 39, -129, -97, 70, 65, 208, 122, -162, -244, -128, -141, 171, 113, -81, -92, -76, -85, -86, -107, 255, -54, 131, -169, -100, -85, 126, 105, -172, -29, -340, -277, 188, 130, -109, -98, -288, -382, -149, 5, 204, 163, -51, -91, -47, -143, 36, 251, 12, 112, -162, -62, -95, 124, 198, 60, -223, -146, -205, -57, 141, 383, 39, -17, -389, -11, 46, 97, 203, 5]
4010Eoj94j8L51m1P5j99n3M0j40L14J1k83J57j57K55k11J80L38m22J3k81L44j10
4034c2j6J08K7m25J68J6j04L70N9j41n3q2o0l5K10j7N4j02j25K32n8Q2J2k07R9
4059b0k26K24n1j14J88J8K0k25K21K0J82j05k13K37j74j20K12K8k06j20J54p7
4081a47K88l7n8J66l62j44Q1J04L34k64J14pk95J8J45K52n0Q9l01j99K95P9J0
4104A11Nj02p8j93K91M4K7N2%l61J1L35J48m7k98J22j12M4j34K32O9k73L6J2j53
4129b12K19O4J25j87J0po6K97k02q6J44l55J24J51J29J15k70M0l25J94r9K6K25
4152E4Kj73n6J9K48k83L56j18j30k20L47j04L64p4l49J8j5J1k3L58j15j58K8r7
4176a10J30j25J34L3K8rj70oK2J48J07j33p7j91K89j62J94r9j55J21j59R8P3K08
$$ y = [5, -1, -195, -213, 138, 97, 172, -27, -80, -40, -180, 134, 145, -138, 19, -138, 117, -94, 86, 424, 2, 15, -266, 78, -32, -48, 60, 87, -338, -170, -154, -258, 112, 171, 30, -23, -105, -165, -200, 10, -7, 47, -55, -180, 52, -6, 76, 88, -119, -20, -246, -22, -73, -187, 1, 19, 39, -186, 35, 55, 237, 132, -81, 156, -18, -138, 74, 102, -104, -224, -70, -147, 141, 104, 46, 212, -150, -294, -213, -109, 225, -39, 75, 68, -227, -209, -64, 188, 138, 227, -74, -273, 22, 101, 111, 116, 14, -64, -257, 34, 78, 105, 157, 157, -204, -193, 142, 290, 243, -55, 67, -45, -1, -135, 97, 166, -107, -71, -59, -212, 7, 71, 196, 9, 19, 12, -54, 243, 41, -45, 99, -256, -132, 19, 148, 263, -7, 33, -292, -98, -197, -171, 54, 56, -117, -173, -154, 94, -189, 167, 49, -81, -301, 46, -58, 306, 232, -117, -99, -114, -103, -126, 232, 117, -41, -13, -110, 20, -105, 29, 62, 90, 81, -89, -95, -73, 75, 182, 49, -28, -219, 70, -92, 102, 3, -152, -31, -190, -92, -19, 189]
4200A89k49K67l34kK41j19l3K07k40R4q1J13L68l16m5m6k13J9J31J36N6O5k47
4223c9k51M55j38J34j00j93K48j74p9K08P0%j88P8p9K2n4Q4R5m5j84J44j37K80
4247A57q5K0J29l72L19l0j83L6m2m5r0R4K62n9L4n5J7l27J66K63k25K70l05J13
4271F2j48M1L1j28J96j25J9m7j3L54j25p7p9M6j47k9M38j12j0k44l2J88j52J18
4295B5j1P6j84l0Q9Q9J4J13j39l13Q6q0L49j51K45j69L3j3r5O8K65j36m01P4J36
4320f0J14j91L32j36J27n10K22K73k70l4J51m6l5j23N8J68lj29N5J1k29M25l21
4343a51K55Ql02J32j7L1P4q3p6K81l58J8J51K42lj13j35Q5l5O5oQ5j52M6J7j61
4369a02K17j87J45j49J9j8J54J23Q6k55j4Np3N2j3l2K11j76j94J62J73j37j7P6
$$ y = [189, -60, 207, -127, -129, 112, -7, -40, 167, -73, 21, -60, 53, 421, 105, 60, 14, -199, -180, -49, 87, 143, 208, -39, -290, 165, 27, 161, 61, -132, 116, -58, -137, 71, 141, 141, -47, 31, -48, -26, -80, 4, 99, 54, -130, 14, -123, 157, 72, 92, 221, -151, 168, 138, -45, -9, -51, -96, -186, -92, 170, 111, 145, 90, 107, -220, -54, 209, -16, 254, -51, 62, -86, -45, -14, -142, 54, -71, -52, -99, -112, 242, 117, 40, -39, 7, -140, -169, 269, 157, 147, -97, -129, 59, -93, 25, 14, 90, -94, -124, -35, 54, 68, 181, 42, -271, -185, -265, 84, -67, 178, 9, 42, 29, -66, 2, 267, 131, -270, -196, -60, 54, -137, 195, 59, 186, -324, -102, 171, -99, -133, 18, -28, -63, -186, -128, 40, 37, -92, -37, -26, -255, 170, -151, 104, 112, -190, -58, -75, -44, 30, -53, -129, 152, -206, -188, -37, 205, 202, 89, -46, 39, 4, 69, 63, 148, -4, 42, 59, -102, 115, -72, 73, -76, -57, -75, 79, 202, 288, 33, 19, 24, -49, 3, -10, -42, 169, -7, -201, -39, 134, -3, -20, 56]
4393E6o5k55J25K49j07K10l18L6L9k52L49L3N2l6j60j15J01J66L4o5l21J2Q4J30
4417a8k8L3P2k65P6K58k96J81O8J3j23R3pp0J40k2j1k35J00qQ6R8j62K12j89J55
4443A51j87K30jj12j86N8M9q0r4L24j38Oj30K76k04K66j65j07M8j6k37K76q6K30
4467A71K11l14k0p9O8J50r9k50K01j89J72k9J06J15L8j71j11q3L2J59n9J72k87
4490i6p2L9J40P6q9j9j34M1K5l1N37n66j27L99j99O7J02p0J71k81j40N3J94N0
4514G0J14q3j82j63Q9K12J1J78k61K36j89L1o0r0M5P3l02J19O4j09K85O4j67j3
4538b8Rp7J94j5J02k20j20Q7n0Q6J73j67L9l81K23P3N4J51j23J7j32P6j19J17
4562c1P6j44J06j81L87m43L69j36J01K6j79K90k89K3J26k17J27j56J56J24q9P7
$$ y = [56, -9, -264, -139, 110, 3, 213, -105, -69, -30, -282, 67, 100, 152, 116, -44, -159, -58, 108, 142, 77, -244, -232, -148, -18, -46, -13, 59, -206, -130, 128, -168, 13, 81, 94, -29, 64, 57, -13, 127, 105, 94, -141, -41, -49, 37, 135, -27, 185, -4, 151, -36, 194, 193, 81, -105, -47, 2, -78, -172, 152, 14, 20, -110, 166, -38, 228, 63, -44, 4, -12, -249, 27, -59, 171, 382, 68, 48, -31, 37, 187, 88, -162, 39, -150, 22, -7, 99, 214, 252, 81, -30, -113, -81, 78, 19, 191, -96, -168, -129, 11, 87, -2, -21, -155, -114, -89, -120, 417, -149, -276, 123, -76, -9, 93, 23, 194, -87, -227, -174, 20, 70, 184, 101, -81, -244, -155, 57, 68, 246, -15, 221, 32, 63, 3, -87, -42, 31, -271, -152, -88, -197, 88, 152, -15, -28, -19, -96, 98, 83, 185, -35, -155, -68, -118, -32, 141, -26, 13, -368, -145, -72, -18, 133, 10, 27, -105, -29, -148, -31, 45, -99, 7, -174, 213, -230, 139, 3, 104, 130, -49, 241, -48, -25, 101, -116, 11, -145, 11, 135, 46, 123]
4584A23L4k16n6J7K84k53J67r0k33L33q5m6J23j09p2l9J48j17OK3m6J04k3q6J81
4609G2J55m6k30kp2l9K40J9j18j29J50o1L7k14L33J52k43j67l5L39pq8j07K04
4633A43j24j10K08P8j91J30k38j8J57j13J55n3j6k08K61k4P2j43K80j41j23r0
4655a08J01r5J78J57k79K64l05Q6k8kn7J70k60j2L2J36R5N8n1j7Q7k7r1j21J64
4680G5j67j63M41j50J9M3q0K0p3k13J84J50m8k4kk41L91J1l48J97p8J06j5o0j6
4705d1P9p6k4l5j48l8K68L1N3p2J12p9j7P6n6j2o0n5R2m8J39k16K92j10j55j7
4731a17J67m6J18M6j30k22k3L25n3O8r2j49O4J12j54J96j10q9j03O8M8M2J03r5
4755b6O7j63r8R7J59Q4j26P5r0K35k04J19j23K4k22J68J0j27JK27j01K5M4j07
$$ y = [123, 157, -59, -115, -98, 186, -67, 100, 10, -223, 110, 25, -21, 102, -7, -79, -118, 30, -87, -81, -58, -104, 0, -23, -109, 72, 227, 181, -49, -51, -123, -162, 78, 97, -21, -150, 0, -61, -24, -238, 95, 247, 4, -163, -198, 141, 134, 46, -61, 143, 19, -91, 117, 195, 4, 134, -104, -122, 35, -78, 77, 24, 8, -200, 61, 37, 109, -34, 246, 105, -18, -108, -7, -102, 76, 233, -46, 218, -87, -1, -29, -31, -88, 82, -178, -190, -158, -22, 73, 131, 80, 63, 150, 123, 32, -89, 75, -92, -255, 186, 36, 55, 98, 18, 38, -35, -248, -64, 86, 38, 14, 12, -229, 162, 173, -175, 22, -56, 50, 35, -25, -41, 38, -38, -62, -97, -245, -283, -15, 16, 69, -3, 109, 30, 13, 89, 33, 21, -39, -94, -2, -50, 89, -127, 165, 55, -100, -117, 50, 4, 122, 168, 38, -184, -207, 118, 65, 133, 41, -108, -44, 68, -86, 110, 0, -89, -192, -124, -76, -34, 69, -26, 41, -122, -220, -123, 36, 120, -6, 69, -21, 214, 10, 129, 6, 30, -192, -24, -14, -141, -140, 87, -14, 11, 55, -52]
4779e2J25p1J94j67r9J50O5o9M9q0j7j22k8L9J7L58m13J65j12J14k24J55P7R5
4803A49j92p3R6J21J7L1j18M0J16l17J61P3Mqk79jK05N1k15J02qP4j99J38nJ23
4829H6j50J56j11J00n7MJ70o0o6j62N3l8j8J63J6k29K57j27Mo9J41J03k93r9P8
4854a48K09N2j17pqj69J84J01o7p8J17j65p3K08j46R3Kj26R3OJ40r5j2j7J11q3
4880Ej59K06N3k17m1k3K67j15n3J84k20M2j1j4O3j9q9r4L91j27p8j8O8J62j39
4905B4j2K02j35j76R3r3J01K9p6m6J28Nn2J03r2kj47l2M27k2k37L3j65J70M0j01
4931c3J33q0j9O4m8j76J71N4J13k34L0qJ14n0o6L7K26k92M0J22Pj99M2J15j33
4956g0Q9J14k06K19k20K9oJ40j52J33j48p5K69n5Mj87K24k50J70N9j05j86R9L75
$$ y = [-52, 73, 2, 196, 29, -70, 80, 145, 76, 125, 45, 28, -94, -122, -83, -66, 292, -121, 44, -68, 46, -178, -23, 54, 149, -43, -116, -20, 101, 118, 149, 31, 71, 187, -130, 31, 104, 108, 100, -179, -180, 25, 76, -139, -37, -45, 29, -170, -32, -37, 86, -64, 92, -19, 81, 24, 28, 198, 138, 72, -90, -37, -75, -93, 70, 86, -143, 114, -13, -9, -78, 63, 166, -127, -226, -148, 61, 113, -4, -11, -19, -188, -4, 97, 30, -48, 69, -96, -169, 39, -107, -14, -12, -138, -45, -39, 101, 6, -6, -23, 88, 5, -154, 52, 105, -112, -153, -176, 91, -24, -77, 107, -113, -71, -82, -96, -33, -52, -141, -235, 156, 29, -49, -67, 1, 163, 24, 12, 214, 79, -97, -4, -97, 4, 33, -43, -89, 39, 44, -8, 95, 3, 1, -146, -178, 249, 227, -10, 23, -142, 28, 68, -33, 100, 20, 1, 65, 17, -159, 12, 66, 179, -55, -25, -33, 81, 31, -35, 2, 228, -64, -24, 98, 105, -94, -52, 63, -70, 19, 133, -73, 146, -74, -45, -51, 89, -63, 70, -78, -153, 116, 61, 65, -122, 102, -148, 22, 81, -24, -210, -111, 264]
4980B64l54k3L95l19N9r1K22j70J12k52R3j34K77N1L1l00J60P0p0j06K7J19k24
5003a63M2J60ln9Q5Q3j47r9J99l4o6J90j11k46J88j1j20K27m1j68j6J4R7O4k3
5028D2j28J01j62J88J0m8Q1k12K6J58j58J12j5j0lk3k21L04l4O2P1k69J87j64
5052a05O2J63n3mk4j88L0J17l9J02j15J08j99Q7r1J93j6N2j90O4JJ23l5O5k19
5077a11M4J8J83j40R5l0o8%k31L13j27M7qN3mlk01J74j03J22r0j04K25k91K51
5102A4J04k03O5M2j86m4L53Kj41Q2j05Q4j6j6Jk4j83J27J28j9kj89K38k69K00
5127D3k00QJ72N5P9l69J56k02J95P0m7j0R7m6P5Q0r7j44NM0j50J75L7j47J33n2
5153d4j15r0L22p2n0N7j00J85j87m1R0L16k85p9J87j7n6o4P8o2j90J38N0N2l13
$$ y = [264, -90, -113, 282, -37, 22, -69, 153, -17, 95, -157, -64, -198, 79, 130, 161, -139, 21, 91, 21, -85, -58, 61, -163, -121, 39, 36, -23, 62, 145, -2, -101, 98, 64, -2, 188, 77, -169, 19, 8, -112, 115, 74, -94, -110, -96, 1, 65, 42, -86, 15, -147, 41, 51, 3, 84, -128, -102, 56, -102, 10, -5, -15, -18, -41, -262, 42, 8, 70, 141, -128, 59, -105, -43, 120, 67, 63, 39, -149, -119, -2, -41, 61, -54, 54, -145, -58, -149, 44, 28, 80, -110, -46, -45, 78, 43, 108, -111, -67, -49, 134, -6, 89, 59, -9, -9, -240, 73, -54, -7, -15, 38, 34, 31, -170, 4, -99, 23, -67, -171, 54, -237, 14, 118, -85, -20, 22, -164, -208, 145, 147, 6, 88, -17, 67, 51, 35, 36, 12, -171, -44, 84, 65, 63, -126, 112, -157, 43, -157, -149, 23, 78, 157, -212, -56, -258, -63, 7, -40, -50, 47, 1, 76, 156, 59, -85, -80, -40, -190, -15, 22, -125, 8, -44, -159, -249, 73, 1, -49, 8, -92, 93, -94, -135, -45, 271, -14, -93, 94, 77, 21, -43, 35, -27, -217, -79, -29, 23, -290]
5178b90J71K1O7K40l65J95O4Nj35n9O2l0R0q9k4q5K05j18Q9j53K33j91J56k6j9
5203A4O6j90J09O0r0j44K01J22k93R0k9K3o8J34J35k09K00j85J57k23L24l71J93
5226B6o4J17n7q8J6p8nJ60o0J09j43l4K51m9j5Q4k54R9o8N5o0l7j72K56p0oL27
5253B40k04l8J45j75o2M7K75k71J04j74J82k3Pp8Q7k63Q1K10n3n8Q5O5k19Q6o3
5278f7J06j1l9J59k04j04M1J50j1J09k20L14j87j67P7M0Q6K3k50K45j29P1j36
5301a04J06K7JP0j9k07R7Kn8J58k13J69Rk08L33j95J91q9j15L40j84k58K14n0
5325A7J3Q6j28Qk55K06K31j91j52J24J54n0l64J97L1q4L34k85R7l04K97n1M8j7
5349c8O9Q9o2j54r5J63j42J94r7K1l9m3J29k7l2J90k29J07q1J3J80k64J21J74
$$ y = [-290, -119, -98, -31, 209, -156, 39, 103, 108, -27, -86, -24, -54, 36, -53, -77, -162, 43, -75, 14, -139, 94, -97, 59, 33, 14, 80, -110, -1, 59, -31, -175, 26, 148, -145, -55, -84, -61, -129, 5, 140, -69, 131, -54, 103, -120, 204, -167, 26, -38, 79, 22, -66, -50, -128, -133, 27, -33, 76, -67, -101, 150, 101, 86, 170, -84, 15, -53, 2, -58, -95, -267, -11, -81, -87, 240, 36, -2, 143, -32, -94, -47, 228, -43, 61, -113, 69, 46, 53, -25, 62, -201, -120, 90, 37, -21, 64, 129, -90, -4, -67, 39, 28, -11, 148, -56, -160, -119, 31, 20, 129, -91, 223, 36, -131, -54, -14, 72, 95, -155, 90, -39, 32, -104, 2, 29, 30, 100, 81, -126, -29, -27, -85, 73, -140, 29, 38, -170, 163, -32, 159, 70, -45, 295, 111, -147, 67, 17, 30, 116, -12, -4, -259, -53, 178, -13, -165, -41, 113, 63, -301, -104, -73, -157, 177, -108, -11, -315, -18, -69, -21, -38, 31, 120, 58, -96, -191, -28, -170, 24, -73, -52, -91, -134, -5, -32, -64, 126, -103, 4, -77, -64, 116, -148, -27, 147]
5373A47j99J40Q5j32J05k25M1M8j06K47j05j74J98k08K65j64K0K3k1Q0P8p4J21
5396A90j22j67J33R4K8r5J34m63J98N7m8O5P5k99L12N6m7k2r5m1K64k23q7N7r
5421e5K26l25K03L6q9m4L7j48L7O1J22j73J46q3j73R8J23j6n1o1J63N2j73K26
5445A39j57m5J93j75nJ26n9q8N0j02J53M9Pk10N9J66j24m2j47L29j61m6L2p2J70
5470D0L6o7p0q1JJ85J43j73nnJ8L7oJ96m43J50o1PO4K8q4%O2l54L08l7Q0jJ52
5499A20k41jj7M44m62O2K58k04M1k13J39Q8o7j11P2J79k41J3J83m3L13m05lJ31
5523C5o4L24k20k25KPp9J24J5k3rJ38L3P7j51j0qn5j0q4K07n0N6JJ1K48l00j68
5551a78J82o2q4R6nm4O8J6MQ5J5j36J3j68K55j48j20L26p8l10L39j67J06N4j73
$$ y = [147, -52, 88, 173, 41, 146, -79, -38, 10, -96, 151, 46, -128, 70, -138, 127, -37, -17, 6, -15, 65, 143, 69, 190, 68, -99, 34, 128, 156, 61, 195, -268, -70, -13, -61, 4, 79, -220, 92, 148, 101, 79, -16, -57, 207, -16, -103, -46, -55, 171, -154, 49, 85, -4, -48, -11, -159, -122, -61, 61, -112, 34, -49, -222, -124, -1, -17, -68, -129, 34, 86, -87, 139, -18, -63, 130, -45, -50, 76, 17, -71, -21, -123, 30, 79, 86, -124, -65, 101, -23, -65, -212, 117, -44, -90, -58, -130, 40, 76, 9, -61, -142, -141, 44, 187, 14, 9, 4, 22, 59, 53, 249, -194, -44, -105, -98, -34, -6, -90, -90, -28, -382, -74, -111, -31, -32, 120, -121, -122, -139, 305, -157, -95, 163, -41, 0, -213, -74, 14, -53, -164, -92, 87, -154, -141, 42, -1, 312, -93, -96, 35, -29, 295, 75, -150, -148, -141, -220, -96, -81, -104, -113, 25, 58, 135, -16, -26, -34, -89, -99, -183, 24, -26, 30, 31, 42, 290, -10, -178, 4, -58, -142, -46, -51, -95, -27, -11, -7, 78, 93, -43, -30, -198, 57, -91, -211, 115, 37, -273, 66, -101, 5, 59, -114]
5576a14P6oJ15J63l41J36N3K3j01Q8Q9k88K28k28O7q5ML7J54K6j30J13r4k0Ln4
5602h6onM7l9Q9p9J53l2j67L19j06k10K20p2j9R1L7j67j81K17m7J36k97J78Q3
5627E7k45J95j1Oj7J9j14J70j07k5p0J95k4J39k13j54K86j13j27N0lJ14j28M20
5651C00m60l5L29j06O8k83NK90k45K94j72j07L3j32J87J89k66R6J22m5%k07M7
5674i8J41J0K9q6p0L0N3R6k69M9O7Q2Q9k77J41J57k4j66J15r4r8L8J92k89L70
5699A88j04j24Q3n2l10L49j17P3j47L55l08N7J21r1J0P1j17P6K2j08o6J43K2j4
5723A2l5j7p6K56j7j69j05J56n9m4K49k20O3Q3j28K13j59J8L8q2K0O7J19l51J41
5748b7J53k05N0L9%m6j15J38q7J37k14K55l5j64J68J62k56p5J47N9j45P2j92K79
$$ y = [-114, -38, -44, 71, 234, -107, 29, 82, 105, 4, 92, 181, -107, 121, -107, -40, -125, -121, -84, 70, 96, -34, 79, -15, -35, -32, -86, -92, -97, -50, -89, 0, -79, 74, 42, -125, 194, 88, -122, 98, 26, 7, 98, 135, -32, -213, 4, -43, 93, -204, -26, 57, -188, 7, -4, 2, -15, 4, -110, 60, -47, -72, -142, 53, 29, 168, -45, -199, 87, -26, -153, -103, -106, 8, -120, 300, -160, -195, 134, 28, 96, -187, -182, 108, -137, 157, -15, -122, -89, -221, -34, 155, -111, -15, 107, 62, 62, -145, -98, 43, 53, 82, -4, -74, -44, 9, 105, -164, -115, -48, 34, 123, -154, -13, 144, 120, -46, 69, -25, -123, -85, 107, -182, 188, 84, -40, 43, -9, -319, 30, -87, -14, -161, 194, -114, -57, 64, -27, -17, 54, -63, 13, 35, -73, -139, 4, 26, 12, -23, -40, -116, 140, 123, -46, -151, 5, -54, -98, 151, -69, -6, 77, -51, 162, 3, 21, 59, -23, -3, 64, 183, -168, -27, 126, -79, -29, 10, 10, -36, -151, -13, -100, 37, -177, 78, 43, -121, 47, 209, -47, -122, 25, 84, -61, 11, -181, 98]
5772I8l3j35N9N4m31K83K52k42n4M06Q4m31K74k02m4MR7J19n7R5j02R9p5j02J52
5797A68l34J50p6N9J47O1l91J9K61j0l8K0n7J33J8j03QK7j86J21Oj3Mp7J42%n2
5824Gj33K1j04J52L3j0M9j65L31j84K35j69q4l2K20p5L0k34PM8J40j60M0J3Kp0
5850i2N7j69K93K6j42R6l6N4l55L06p0P4M6j39L2J06q2M0O9m21L52J18k52J31
5874D2k5J19k4k42j2L21J32k28j89R5J01r0j5p1J1J29j9oj84J51k24L47p4l35
5898b90K25K5j51K97k80K31q3o2J99k93N5l8L16q6m0M3j84K13j13p2kR2K0n7r7
5923a32J74n8J64j82j47o3L85j33k39M50l15K07j30P5j82J67pP8j48J35k6K1j13
5946a9Q8k00L61l50M6m9K7K44j38K18l11O1Q8k63J13O4m2Q7pJ08n0O6j81K65l11
$$ y = [98, 65, -70, -11, 43, -388, -105, 147, -95, -149, 257, 341, -90, 184, -18, -62, -58, 39, 158, 101, 196, 94, 193, 118, 16, 168, -166, -16, -92, -33, 114, 175, -216, -197, 64, 54, 16, 36, -21, 112, 130, 27, 35, 62, -124, -3, 3, -10, -6, -83, 59, 59, 7, -126, -105, -209, -57, -24, -34, 15, -150, 181, -3, 232, 63, -21, -53, 167, 92, 122, -112, -105, -57, 83, -77, -37, -24, -22, -92, -35, -204, 89, 115, -27, 69, 33, 87, -268, 38, -32, 42, 88, -51, -19, 87, 5, 45, 114, -307, 45, 163, -89, 42, 17, 136, 112, -130, -142, 179, 311, 83, -106, -11, 90, 0, -15, -86, -75, 54, 35, 29, -155, -4, -228, 119, 45, -290, -65, -40, -191, 106, -174, 57, -26, -88, 111, -182, -127, -165, 151, 65, 25, 68, -116, 97, -16, -88, -90, 2, 22, -35, -132, 42, -16, 148, -34, -181, -244, 141, 8, -231, 219, -96, 111, -19, 56, -126, 41, 34, 112, -36, 99, 73, 94, -19, 69, -131, 230, -120, -74, -123, -96, 148, 10, 228, -83, -22, 66, -197, -84, -20, -62, 25, 18, 126, 76, 142, -39, 226, -85]
5971h5L0o2J87o3M1j34l1J53o1m6J42j46KkJ0J37k25J68J34p3M1k37K55k40J49
5996D4K4j8N6j76J38k88K37k13J59O0K18k91M5m0P6k1j28L9J69p4K8j50j7J51
6020B8r7J83k36L04j56Kn5p2R0J9J79o0j79OjJ27k3j72K01k96J27R1k97K94J8
6045B5p0K91l31J70k64P2%J32l66K48o9K22m4j57K77j53m3M9m3o7j19L25o4J04
6069A25l33J35K9J30j68J22J91j39J73l23j30K17l9k2q1J26pr9K0P8k3J18N1k19
6093f8K5j9L9j51P9K74j66l3N6k86K25p6J97j56J11j22O1j5m7J91k12O1m5J61
6117H4j9j20j4j03K28j61J38p0M2o3j41J23M3l4m7K3N8k05J67J46k9J01p2P0j69
6142b4J3J1m1n7L5J06k80J40J85r7J84p5R9m39L11K52l64o5q5J39R8r8J50j54
$$ y = [-85, -55, -117, 70, 7, 48, -86, -117, 36, -25, -71, 71, -75, -73, -75, -65, 72, -153, 15, 149, 76, 117, -120, 135, -105, 44, 68, 50, 106, -70, 68, -220, 17, -196, -37, 23, 241, -50, -5, -45, 31, 10, -118, -79, 90, 16, 44, -106, -123, 28, -69, 114, -122, 182, 26, 28, -27, -99, -9, 10, 189, 129, -50, -44, -45, 82, 59, -113, 88, -208, -81, 10, -287, 7, 25, -45, 246, -85, 85, -179, -107, -107, 25, -341, -93, -162, 60, 16, -141, 136, -17, -60, -11, -54, -121, -240, 85, 21, 125, -208, -73, -44, 86, -82, 40, 231, 92, 265, -58, -188, 29, -10, -32, -113, 13, 6, -93, -73, 5, -18, 100, 151, -68, -43, -62, -23, -174, -95, 179, 13, -20, 36, -250, -25, -101, 96, -60, 51, -71, -10, -25, -72, 119, -93, -32, -77, 84, 65, -55, -69, -172, 56, -105, 33, -37, 5, -58, -199, -76, -33, -67, -114, -91, -33, -238, -71, 75, 46, 147, 75, 145, -24, -11, 0, -41, -98, -63, 43, -237, -97, 88, -9, 175, 100, 199, -240, 71, 323, -41, -106, -191, -52, 46, -52, 98, -56]
6166e6M0N9j08K8n3J87o5J64j26k87J05K64q5j68J83po1j14J5j30K54j19L20k42
6190bL6j09oL7j6P8j56j04J59J97p1O6q5j38L3K93l55L22k81MK03k56L5Q1k88
6215c23N05k77N0Lj5N6o1K19l12lJ87J07k25J74n1M7o1J00p2J34j42n9j1l9R5
6240B6o4q1J26R9l0p4j46J20P3K2m3j42K01o4O2o6N6j51Q7j75K2K63k17O2o5K97
6266A98k81M0k2J6K29k15k7o4m5J24o5J91l0k26J02J47j03K5J17l06J95J96j62
6289C4p6l4j53J03L5L03j80o6j23L4K18o0J4j73R3k6J73j76J14r9k9J53p1Mj1
6314AK9n8J72l0p9pmj44K18k52J37j41K90j42o4RJ68J9k39L7l6P2O7O9r9K01j62
6341C2n7L2J73l16K34q3j58J35%L5j39K02k75L13j31O5k1j00j51L15qk08K62j45
$$ y = [-56, -16, 43, -65, -37, -90, 97, 32, 196, 70, -217, -112, 152, 67, -101, 82, 75, 14, -100, -85, -215, 39, -80, 240, -2, 34, -75, -81, -44, -60, 18, -138, -242, -83, 114, 43, 109, 24, -114, -81, 212, -143, 179, -102, -98, 105, -151, -116, -35, -323, 182, -95, -45, -42, -57, -1, -62, 157, -155, -158, 29, 136, -89, 85, 34, 81, 20, 120, 48, 182, 40, -19, -30, -69, 26, -38, -119, 7, 106, 76, 2, -144, -24, 49, 71, 28, -114, 87, 23, 85, 19, 75, -76, 11, -164, -142, 121, -96, -34, -99, 198, -83, -43, -65, -49, 180, -35, -62, -126, -171, -47, -112, 79, 49, -177, -75, 72, -31, -6, 111, -195, 0, 196, 34, -42, -76, -229, -126, -91, 212, 32, -34, -157, -123, 95, 35, 49, -124, -31, -57, 116, -60, 54, -45, -74, 79, 8, 12, 1, 30, -28, 144, 114, 35, 28, 24, -120, 98, -154, -17, -158, 132, -10, -74, -65, 103, 122, -117, -80, -116, -44, 23, 92, -7, 194, 32, -25, 7, 180, -136, 98, 15, -143, -8, -8, 27, -112, 90, -185, 128, -3, 62, 41, -59, -210, 105, 97, -111, 151, 6]
6365FJ10j2j26RO4n9P2j4j75P8J14K9k29K66j47j6J97k69J41J14k63Rr3L52l20
6390a62L31j58k7K01l15K64k25r0J10j9m2Q0J3k4m6K16Kk28JN2J51J10N7k91J32
6415I3k61K20nl2L2L6o7k16K91j43K4j14L08j31m0Q9P6K5Rq2k41K92k26qk7J08
6441A0r3J55l44K21M0J04n7j47j11Q5N0L6n8J29j23J83r0q7m7N8J4J62K1p7l1
6466ClR5m3N1m6J8L2l2m2k72pJ67J32j18J13m6j5N3o6J19j61K02l48K35j22J07
6492FMmL8P9Q7l24J11K57k25Pj10j10P0L47j94q7j38J53J31j97J31j56J69p9J
6517c3J84l68Q2J27j73R0M8m5j89J84m4P8p4K7J17l0j19J39Jj00J10M2j00j2J21
6542F3K7j79K82k25l8J82k55J26L7L0j26J43N2j33M4K97l25j52J07m0K15j29L8
$$ y = [6, 116, 104, -22, -13, 51, -8, 64, 50, -125, -47, 67, 96, -133, 133, -14, -30, 167, -102, 39, 153, -110, -101, -194, 158, -162, 169, 11, -16, 185, -130, 134, -91, -181, -71, -90, -132, -52, -39, -63, -109, 107, 109, -119, -118, -66, 85, 195, 252, -39, 93, -168, 52, 47, 15, 47, 83, 16, -200, 91, -52, -28, -142, 166, 35, -5, 84, 160, 185, 194, 112, -129, 163, -63, -71, -98, 10, -83, 72, -272, -51, -11, 93, 36, -111, -222, -137, -87, -51, -109, 20, -103, 80, -10, -97, -144, -86, -72, 90, 111, 34, 3, 0, 95, 52, 103, 57, 75, 107, 75, 33, -239, -246, -79, 53, -65, 48, 2, -13, 40, -26, 93, -68, 134, -214, 21, -101, 6, 10, 6, 44, 123, 210, -114, -3, 254, 29, 36, -74, -184, -114, 233, 39, -48, -186, -33, 98, -99, 32, -124, 45, -34, -33, 151, -217, -135, -8, -181, -91, -43, -88, -277, -93, -137, -59, -133, -106, 11, -19, -138, 1, 2, -98, 12, 54, -46, -58, 63, 90, -89, 193, -32, -70, 112, -143, -17, 20, 50, -76, 67, 119, -14, 30, 327, 2, -150, -43, -83, 132, 3, 41]
6565D1k6J24j59R4j78K01J04l77N8j12P3K86n9r9j97K13J5K9k9K91l00K9R1j09
6589Dj20L19k7k74K7J43K09k13q9k2m3L6J04K1K9j24O1O8j73K61j92J21k04q8
6613a66K63j06J72j72j00K22j05n2J13r7P5l1q4M7J6k67K25J65j2j73K69l7k36
6636g1J60q6j61N8P1n7K13j84M6j77K02n8o8J05J28j99k2L0j5j79J97J01J29j57
6660Fj22L3O6N3j12O5k13L98k05N1N1j28R0K8m0K2n0R9j94q5K58J2j10K1l1P3
6686C6J02p4r0J54l23J21J63l4lM1j33J05N8q2q2l8N6j23O1Q5j26L83n00J98K63
6711B18k88J93j73LpL4j80K69r6M7J02k46P9n4N3k0k1Q8N3O0j12J46M4j89Q1J8
6737A02k36J80j62P2M1j19Q2J09k18J76L2Q7k41J48j21J7J95P6j98O3jr1M1L9
$$ y = [41, 15, 139, -20, 74, -104, 97, 201, -176, -118, -230, -157, 129, 70, -29, -226, -13, 2, 31, 2, 293, -7, 22, 113, 4, -116, 203, 176, -98, -71, 72, 281, 68, -21, -43, -86, -50, 54, 75, 104, -20, 41, 109, -64, 197, 5, 126, -78, -166, 97, -9, 163, -9, -109, 113, 8, -44, 69, -28, 47, 16, -68, -21, -5, -272, -47, 118, 106, -67, 202, 165, -71, 89, 3, -158, -100, -29, -86, 127, -57, -11, -188, 14, -44, -112, -7, 121, -78, -100, -70, -85, -264, -67, 34, 163, 6, -116, -83, -17, 36, -76, -11, -224, 174, -31, 20, 71, -57, 33, 61, 21, 43, -7, 92, -102, -187, 71, 83, -27, -6, -37, 36, 138, 64, -26, 128, -195, -74, 89, 55, 52, 93, -40, 65, 123, 41, -41, -79, -23, -146, -85, 0, -126, 257, -243, -45, 218, -70, 123, -50, -47, -54, -20, -200, 69, -27, 20, 122, -124, -45, -99, -46, -66, -87, 1, 54, 114, 2, 148, 192, 3, 84, 102, -134, 46, -116, -44, -3, -122, -40, 69, -149, 27, 59, 146, -95, 53, -68, -51, 144, 220, 22, 85, 84, -7, 34, 73]
6761G3n4n5K66j10m2j74J56o7j6j37mJ31k5k8P4P6K2r7NK52l06K44j14j35L8j74
6787b01K06k9k4N6j07m8J17M6J33j48q9R4K0Oj19N2K4J75k41J45J93k55M6q1J1
6812a8N4K6j9j38R3N9KK8L1q3Pm9R1p5%k0O7J91j24j4j77L2M8O2kj76J4o8J04
6841e4L9J68q3p0n0k5J51q4K3l6ko0J35O8L0j6k84K2R8j02J74r3J55Qm7j66K01
6868A00o4j61K34j99J51j51j9J03p3L9P3j29J03m3Q2k66K24P3J5k67K9L0J12J0
6892FJ56k88J17M3n8q5M8K74l33J1L2L6N0j15J38j51K63k59J39oj52J78j91N7
6916i0M9K21k30N9K06k24j34J05j43J46J56Pk60K51Q1j47O3j4q2L4O8k36K75j51
6940A0O6j50K42l83J96kj0K01j01m3j40J04J80r1j39k7J38j70Q2K3J05n2n4l0
$$ y = [73, 19, -36, 230, 120, 78, -96, 60, -7, -23, -160, -164, -33, -58, -86, -12, 64, 86, -11, -6, 246, -60, 184, 70, -65, -27, -201, 5, -24, -48, 8, -99, -147, -30, 16, 149, 1, -88, 6, 26, 32, -87, -35, -11, 164, -77, 68, 261, 6, 52, -29, -18, 36, 62, 43, -95, -2, 57, 59, 87, 118, 35, 42, -7, 84, 9, 9, -11, 56, 247, 123, 109, -68, -36, 12, 74, 72, -104, -90, -158, -54, -15, 153, 70, 0, -50, -75, 76, -8, 15, -21, -23, -83, 52, 120, 150, 134, -150, -128, -30, -132, 42, -51, 104, 112, 65, -101, 100, 36, -125, 109, -90, 61, -90, -109, -6, -79, -40, 33, -96, 7, -36, 46, -220, 4, 77, 92, -175, -146, -116, -4, 6, 162, -126, -9, 34, -24, -109, -61, 213, -120, -109, -77, -41, 9, -106, 32, -119, 144, -115, 24, 18, -134, 44, -147, -90, -41, 180, -50, 9, 215, -9, -143, -38, -181, -35, 121, 128, -132, 119, 200, 53, 116, 102, 20, 54, 122, -114, 161, 10, 76, -74, 168, -215, -19, -21, -31, 170, 69, 26, -114, -10, 170, 79, -60, -87, 51, -119, -37, -14, 91, 39, -15, -45]
6964d5O8j15j52K78O3j05j6Q4j06J6j20J33j1J30j87L3J4l4qJ62J2k14K35j75
6988f0J4j11J70j17O6Nj18RK63r6j18N9J04k2Q1j13R2j44K56l47O6J07p3J06o1
7013A8j57J41q9l9J56Jj12O4n0K32O0j59q7k0m0K07j18j31Q9N2n1j1qJ52j40J25
7039H5N8l08J67j18J03qq0J40pR6j18O1r6K97l48Q8j72L26l92J60O1q8K27r0j39
7064i5k5J46p4J00n3qK2m6m5K69l49J33r6J35Q2l52K96J15j99O2m7J28L0j99q6
7089a56P5O5M5j23M2k4l8J69P3p4j07RM4O3j51N8K46j66p2K00j31o6Lj72J98m0
7115c0K5M1L6J1o7k10K37m3p2j3n7L7J18M6q3R0q6N1M8j27J79k67J25oj87K88
7141H4n3j22J0J29R2j26%j16j0N6J8J61L3l77K5K54J9j45J7j0J54m4M0k00Q8J53
$$ y = [-45, 23, -92, -244, 34, 97, -8, -24, 60, -46, -30, -150, -17, -28, 102, -85, -52, -38, -72, -80, 82, 94, -120, 115, -60, -46, -157, 13, -104, -38, -33, -151, -142, 121, 25, -93, -34, 70, 48, 129, 16, 108, -36, 220, -127, -61, 46, -27, 79, 18, -139, 2, -87, -126, 30, 31, -81, -17, -67, 165, 225, 66, -21, -41, -81, 126, 8, -123, -34, 18, -33, -44, -52, 100, -40, 85, 143, -165, 2, -116, -13, -21, -101, 39, 32, 128, 10, 71, -25, 272, -76, 12, -160, 166, -226, -66, -5, -93, 134, 44, -95, -120, 26, -48, 52, -1, -9, 13, -33, -78, 191, -158, -25, -121, 14, 96, -256, 40, 155, -44, 18, -29, 99, 129, -70, -156, -81, -16, 29, -94, -52, -76, -114, 55, 128, 54, -53, -44, 0, 63, -88, -30, 216, 50, -22, 178, 47, -19, -16, -188, 10, -30, -5, 36, 72, 83, 16, -194, 43, 0, -72, -85, -142, -105, 13, 59, -24, 66, -20, 31, 79, -48, 131, -136, -11, -17, -204, 84, 31, -91, -81, 48, 140, 14, 14, -102, -112, -56, -38, 123, 156, -221, -196, 58, 77, -68, -51, -61, 93, 49, 89, -111, -23, 130]
7167A30k84K16j69Q5m7l0K80l15O4o8J89j32P1L3k0M3r9K2j98K54J98l99Q8K08
7191A20q8Q0j37RJ16j67O6k4J03k96K32p2k2j07K16j26J37m9q9J8Q5J52j46j11
7215a00N6O4P6k20J67j05L0q7J46P6j33J64Rj44N8j02nk39K73j17J65j18O1l2
7239e7J27j73L25k47N7p9J16l0j03J25k19K38j68K05R6n2k73L00j72J22j08N7
7261H7j2j45J38j61ON1J3J13P5Q6k92J89J19k36Q9j49K4r9L12l64K18J5M0j88
7285g1JJ21J08n9M5q7r5n6p2J22J52j54l7q4J19k1P8k34J74%j81K13qNP4l0j42
7312a19o9J30P4j01R2j33J06q8J0K1N7N7K28l08R8k95K29J48l32N5J10K0PN8j19
7337f4O2j27K10J40l51J40J08k02J52j94J70J14j34M1Qr5K4J1j1J14j71j53L6
$$ y = [130, -154, 62, -107, -22, -69, -99, 181, -134, -70, -138, 51, -81, -10, 23, 3, 46, -53, -31, -229, 25, 223, -176, -88, 120, 32, 112, -25, -16, 100, -67, -1, -25, 78, -218, 14, -58, -80, -187, 29, -97, 40, -9, -98, -80, 5, 157, 11, -100, -44, 20, 96, -124, 43, -62, -32, -119, 27, 103, -30, 134, 143, -1, 57, -45, -50, -289, -16, -133, 32, -86, -25, -57, 70, -103, 222, -25, 32, -47, 69, 39, -64, 61, -158, 80, -88, 117, 213, 161, -112, 188, 16, 138, 30, 87, 75, -70, 68, -93, -87, -36, -23, 90, 165, 251, -41, 148, 267, 31, 120, -29, -5, -104, 208, -156, 62, 77, 117, -71, -70, 51, 159, 100, 145, 58, -37, -93, -165, -43, 109, -45, -82, -166, -47, -68, 10, -224, -50, -50, -231, -18, -26, -21, 53, 23, -119, -188, -58, 16, -85, 7, -126, -20, -108, -98, -77, -20, 37, 265, -43, 55, -240, -11, 137, -195, -140, -30, -10, -3, 55, -64, -2, -129, 81, 221, -130, 10, 118, -84, 68, -126, 44, 158, 24, 65, 73, -22, 2, 13, 2, 116, -55, -208, -172]
7360a72J36m7P8j21K23j70J04n7j08Q3J02j34Qn2J41J64k14J41Q5k45r1J10N9
7383B3J9R5r3J66j21j96j21L48j72M6J29j65M8m7m3P3m9KK09m06K34J1q9L0l4
7408a03Q2J42j19Q4N9k39J18N9l8j40n9j00L06j59K18o7m7qo8RJ35j2N5k22Q5
7433b9K60N7l71PK02k41P3Pj93J32J73K2j96J25J3Po0J30j83J37mn5K9J68l7m13
7459b40L17j82K88j83q8k5N0O7j03n2NJ71j8j3m7mJ12m8q0n1R9J94q0l2j52K84
7485A89k40n1O8j55L02j73P0K7J2m3P5j75J98P6j90k0n2K07j44K61j91j13O7j76
7509a71K07j03j99K02J30r9L1O1q2L4R8j41j3K28J3k1P3k16P9j35O9r6j9l2J03
7534Ak11L31k09kNJ92k44J2K68l18J1L01l47K66l5q5K3l6R8j07J51j39J2l4L31
$$ y = [-172, -36, -83, -5, -126, 97, -73, 31, -26, -134, -51, 51, -83, -75, -127, 14, 178, -36, 105, 190, -55, -146, -36, 23, 42, 137, 44, 210, 89, -107, -228, 120, -52, -6, 123, -42, 6, -41, -84, -11, -60, -58, 151, -255, -21, -10, -99, -69, -103, -21, 121, 2, 86, 145, -94, 24, 83, 45, -95, -154, -254, 52, -107, 111, 44, -3, -11, -79, -70, 65, 53, 108, -114, -29, 231, 288, -83, -76, 126, -115, -42, -35, -228, -96, 77, 99, -97, 28, 41, 48, -12, 118, -65, 72, 68, 13, 42, 210, 173, -240, 77, -105, 183, 0, -88, -113, -63, 4, -99, -151, -146, 25, 7, -6, -53, -57, 55, 7, -73, -124, -25, 169, 89, 57, -95, 189, -51, -102, -34, -189, 113, -60, 10, 37, 49, 6, 81, -94, 104, 180, -10, -30, -82, 125, -19, 242, 51, -62, 5, -171, 36, -67, -266, -64, 66, -33, -2, 59, -23, 11, 109, -32, -45, 183, 196, 175, 248, 32, 111, -24, 45, -51, -70, -102, 1, -210, 121, -88, -90, -85, 107, -137, -125, 143, -175, -164, 137, -210, 56, 21, -64, -41, -77, 21, -86, 65, -74, -62, -96, 235]
7559B35l33K66p2Q2l84K84k49K46j40j61J15P2J28j34R7j08r3J04J96n3r1j2J47
7582A42r4n5o9PK5P7O0L1j06m5k5n7R3N2k2j37J96j12n4J23JM5J5J0j05J3j66
7609a57J35K56M4j46l88M28q3r4q6N8pJ13L1J1J0r1N4k52K54j52J0Q1o4P5j33
7634i3l1p5K95j69NK51j08k29J82k6m2k03K03J10op1%L1J2Q7j92q5K41Kk89K73
7660G3j47J70k63J31R4j10o6J50N9j47J92j24j2j3j46J32M9j00P9J51j67o8J70
7683H7m7j74K49j35O1j1j09K2k3J71q1L7Mr7J22j34Q2k1Q5J02j90Q9j12J7M4L2
7709G0K0p7L5M5j31M3R2k1j17R8m8K00l41J85k7q8K5lK48j30n4o7j40K53J7j04
7735a7o3lQj32O3L5q3K68J3R8k04n6N6J91p6j84M1J29Lk29J80L0j49L2P2Q1nj33
$$ y = [235, -98, 168, 96, 178, -206, 78, -171, 75, -65, -226, -111, -39, 89, -45, 52, -56, -149, -45, 151, 98, 7, -5, 142, 48, -7, -76, -69, -44, 33, 93, 124, 18, -27, -52, -109, -16, 36, 14, -123, 73, -39, -93, 30, 31, 76, 91, 101, -4, 9, -157, -22, 234, 278, 132, -256, 172, 89, -5, -91, -33, -40, 73, 104, 115, 125, 34, 88, -164, 90, -62, -52, 29, -35, 40, -93, -124, -199, 96, -73, -68, 183, 75, -154, 28, 2, -40, -243, -40, 70, 64, -7, -7, 24, 36, 123, -69, -154, 87, 89, -200, 73, -74, 96, -167, -36, 58, -52, -118, 32, 91, -56, 136, 12, 0, -13, -159, -27, 22, -78, 1, 152, -15, -83, 87, 40, -134, 115, -20, 41, 30, -79, -57, -80, 91, 10, 47, 51, -46, 76, -58, 24, 3, 88, 190, 0, 89, -23, -6, 38, 70, 90, 13, 48, 93, -38, 5, 97, 76, -41, 57, 9, 209, -132, 53, 26, -62, -37, -40, 208, 78, 24, -43, -183, 70, 87, -17, -80, -83, -75, -207, -144, -109, -192, 76, 89, 187, -17, -73, -17, 174, 98, -86, -45, 84, 87, -142, 38, 68, -81, -49, 23, 104, 99, -34]
7763c4J19j86O0p3J15K78k97j51J23M7j05J64k34J71o6J35k3J3j11N5O5j99o8
7786b02j08L70p8R8m6M7j99J22l6K3L1%o6J21l38L43j01j6q4J24p9Q9l5J06o2
7811B4n7j11K29n0J30l43K62k48K00m6k8J6n9J66O5k35l7q4L33k36J00N7j81L65
7835B32k07n3r8L07k21q0J72MR0j63R7j69J63k4j3J19j95j8rL50l46O0L2J14l17
7860a73J87M6k6p8j36J40J07M4n3m3k17M8R3k2J10J7k00M9J73l3PJ2r0J62p2j55
7886a03K59k62J77p9P8Q5rl24K92j14P0j8j73J68j34Q3J3K06l66L06J40k10k3
7909F2j03p0o7J6K19K7o3K02k06j43J72j09l6N3k04K43J54j01m3j25L46j90j94
7932a60K23j18J29J47m21K08M3Q9j60l6J0P0k15L66l53L92j35L8l27K67o8J8K4
$$ y = [-34, 85, -101, -41, -114, 1, 279, -18, -169, -46, 1, -104, 60, -174, -3, -69, 66, 43, 56, -55, 0, 65, -134, -202, -310, 60, -18, 80, 34, 81, -118, 4, -32, -9, 22, 22, -44, 77, -261, 82, -19, -35, -119, 5, -74, 15, -20, 86, 24, -33, -144, 85, 35, 165, -178, 84, -164, 36, -10, -38, -22, -81, 85, 150, -85, -122, -206, 127, -109, -9, 48, -133, 232, 25, -28, -126, 181, -40, -120, 52, 56, 146, -17, 80, -89, 74, 50, 37, 156, -39, -57, -66, 284, -62, -2, 30, 144, -173, 14, 60, 34, -44, -180, -40, 67, 111, 58, 15, -202, -154, -61, -83, 27, 44, -156, -107, 66, 33, 40, 52, -38, 124, 52, -103, 156, -106, 71, -8, 70, 155, 146, -178, 114, 0, 70, 52, -121, 47, -87, -4, 9, 215, -151, 155, 295, 85, 62, -41, -111, -178, -162, 57, 84, 21, 223, 17, -126, 46, -63, -99, -46, -250, -7, 147, 46, 3, -122, 224, 34, -160, 63, -55, 74, 221, -200, 8, 51, 140, -20, -56, -46, 24, -191, 175, -178, 214, 79, 117, -210, 57, -11, 7, 31]
7955C1k43K40P5p4p9J72j48o0N6Q4p0P1k04J04N5j0O9k5N2j39j38Q7J86m7M6j1
7981H0m3K7j26o2J81P2j00m3j22K37j21j7P0j01L3J01j03k8L7O7j15q8L95m17
8005a86L01r2p9J96l45J86nk40J03K22k8p6J84j44J2k7j07P2K31j57Lk8j23L5
8029i2K25j62m0L0J35q4n6J56K4j50MM2k26K83p8j2l8k9J9J88n2j82J64K3k03
8054a11L06l27o1K47m5j79K59P0k24KJ53nj51L4R6q4N6n5r2L2O8L7K6k53K18K53
8080B70l01k6K15k6j68O4r0j7K18j09q9Q2j22QM2j35J71J54j78J78J36k94J04
8103H7k1j15p0J56j14J42k15J95N3j18N5L4j05N6J81j13j21m4J41l87L48j10l2
8126a17J69Ml45M43j1k49O9J59j7j30O3j01J49l5n4J7O1r8k8K5q2KJ14R3qk34
$$ y = [31, -212, 28, 103, 29, -50, 122, -26, -86, -30, 54, -16, 55, -149, -45, 10, 0, 69, 44, 96, -43, -181, -94, 92, 45, 91, 80, 37, 64, -62, -124, 57, 129, 29, -14, -136, 101, -20, -37, 33, -68, -35, 66, -37, -65, -28, 39, -76, -164, 231, -186, 115, 23, -56, 140, -205, -19, -24, -264, -161, 61, 33, -43, 141, -3, 9, -18, -125, -53, 178, 21, 24, -4, -127, -92, 133, -29, -69, -39, 96, 12, -44, 112, 136, -14, -10, 32, -194, 89, 11, -1, -39, -68, -49, 139, 87, -95, 69, 92, -111, 195, -132, -193, 54, 9, -170, 89, 159, -65, -63, 90, 85, -66, -32, 64, -20, 36, -19, -111, -79, -11, 26, 52, -201, 17, 270, -31, -57, 158, 132, -36, 28, -62, -79, 139, 30, -59, 23, -99, -91, -49, -184, -13, 141, -37, 141, 277, -17, 87, 66, -49, -119, 37, -77, 65, -150, 45, 98, -20, 35, 69, -36, 20, 201, 88, -33, -77, 64, -323, 25, -85, -117, 52, 56, -289, 154, 143, -106, -37, 122, 105, -25, 38, -63, 86, 51, -3, 14, 75, -23, -51, -26, -108, -106, 8, 101, 93, -141]
8152a41R1NK07k91J64nj62O3j61K73l5lN5j8k1O3q9O4O8j25j11R7l5J77l0j50
8178e0mJ70j32Q6j16M5m8J06L3j13j24o2j5
$$ y = [-141, -50, -45, 162, -129, 35, 30, -132, -69, -230, 43, 8, 5, 60, 42, 21, 84, -5, 59, 127, 2, -109, -12, -47, 130, 100, -50, -54, 116, -16, 70, -46, -1, -49, 57, 90, -23, -147, -209, -224]
8191b24
$$ Imaginary data points
##PAGE= N=2
##DATA TABLE= (X++(I..I)), XYDATA
0@%%%%%%%%%%%%Qj6J6j6K4l2L2m0M8n6P2q8J04j20J36j54J78k08K40k72L06l46
34a84L92m42M98n61O27o99P79q67R63j067J181j304J440j590J753j932K128k344
52a229K582k847L144l478L857m289M789n375O073o920P976r337J1162j3754J7760
67A0114k4837M1091j50571m1425K04460p919k5320l4274p188m6110K4350R5199
79C7570N7893p7157n3597L6070P1461J0379k2257l110r783p8036l3546O4859O5209
92F5955j0319l8710k3075k0564n2129j696Q5047O0142k1929k5251L333L87l2319
105a1128j8452L2469J0371m5371j3815L6803J9751k0544j7649J9490k03n8635
117f6913k2232N6201M9429M528k646P848j5693m8092P517Q8424N1096l2567m2852
$$ y = [0, 0, 0, 0, 0, 0, 0, 0, 0, 0, 0, 0, 0, 8, -8, 8, -8, 16, -16, 16, -24, 24, -32, 40, -48, 56, -64, 72, -82, 96, -112, 128, -144, 162, -184, 208, -234, 264, -297, 330, -369, 410, -457, 506, -561, 620, -684, 756, -834, 919, -1013, 1115, -1229, 1353, -1494, 1650, -1828, 2029, -2260, 2529, -2846, 3227, -3693, 4283, -5054, 6108, -7646, 10114, -14723, 26368, -124203, -165628, 38832, 30913, 5593, -28681, -35869, -81979, -57629, 37570, 95463, 18306, -35291, 779, 72240, 82619, 60362, 57252, 47469, -30567, -64113, 746, 65955, 55636, 16926, -6149, -26713, -78842, -80538, 4509, 64651, 42722, 17471, 20804, 21191, -11128, -29580, 2889, 13260, -32111, -45926, -9123, 10628, -9916, -27565, -8075, -8278, -66913, -89145, -32944, 16485, 21013, 18367, 26215, 10522, -37570, -30053, 58371, 109467, 76900, 34048]
130C4048j5257r404j7246Q667M2090p937p0046k7717M1026L9135l75j7383o753
143g152k9376n3035J2490Q2264M3554k5894l4878j953N594j1362K0494N4001m946
156D9801o4392l1287K7168L2919m182j0972J3680j0359l9604O975N5079L0506
168E5332k2608l3268J106J853k3422R447M6893J2931l0258k4001O892P546j9256
181a0813m698K2428j0516l9934r909K6713K5664m53j886J3433j3793l5129R072
194b9821M4828K2368j3403j8522M41p488j9528K1741M6430m00l9242k2220J1486
207c330J1844j0153L756J6423k4289m1420P690M7367L1054j2452k1039k696j8815
220a6060k6068K1210M5555P538l4170k5589J3419J2037q586J3940K5526j5765
$$ y = [34048, 18791, 9387, -7859, 808, 42898, 34961, -35085, -62802, -21776, 17359, 16984, -399, -7152, -36528, -89563, -77073, 5191, 48745, 22851, -12027, -13980, -8386, -19748, 746, 54747, 49801, -14591, -45878, -18710, 14209, 10027, -945, 12735, 2376, -37228, -30253, 24826, 55332, 32724, -544, 562, 2415, -21007, -11560, 35333, 48264, 18006, -5995, 897, 8443, -10813, -15511, 6917, -3599, -43533, -53442, -26729, -1065, -1518, -3404, 10029, -3764, -38893, -29821, 15007, 37375, 23972, 5450, 5891, -1597, -21125, 616, 47046, 46646, 7404, -14816, -3330, 8514, -1639, 2117, 18540, -5749, -47169, -39479, 7888, 38942, 26490, 5451, 2755, -16060, -42128, -20918, 24637, 32175, -1995, -27584, -14165, -2128, -10714, 3226, 28752, 12987]
232A2987l8586p269L2043K2378j5126r513J0032j2127k1069J7075M1053J5015
244D6893k7745k7787L334l580j4580J5910L0404L4k8916j6534J8288J4396j0162
257d5K525J1320j6437k6264J537K8742J9042j3514j0067M208j1664j0404K0080
270i41K8596J889k8872k0327P270K063j728K2142K0410j3779k8841m640K3648
283F890J0145j4504l70L728k1354j8612J6832L4834Q177k5008j1872Q981p121
296i254p548K0694K3060q962l3249r989K3478J0682m975J1706J0122j8190k6793
309a9218J595K8940P940k1635p039M333j1010p103J8771K8518J68k9453j2167
322a7360J1940N42k590J4456J2624j2642k6794j349K7823J0421r300Q65k14j7663
$$ y = [12987, -25599, -32868, -825, 21553, 6427, -3086, 6946, -5181, -26250, -9175, 31878, 46893, 19148, -8639, -5305, -8885, -23465, -7555, 22849, 22883, -6033, -22567, -4279, 10117, -45, 2480, 13800, -2637, -28901, -27364, 1378, 20420, 6906, -3161, 1047, -10617, -21021, -941, 27655, 29544, 672, -19655, -12385, -10322, -12050, 10092, 30502, 16723, -12118, -16758, 6890, 17035, 2531, 2161, 5889, -15465, -34077, -17245, 17589, 25766, 758, -11114, -2133, -9254, -16802, 3892, 26952, 17990, -15259, -25248, -1770, 8912, 3937, 15643, 25765, 7575, -19218, -17623, 11317, 19257, -2378, -9417, -5084, -16094, -23197, -4426, 24092, 24260, -5193, -17360, -5420, -4878, -7468, 6988, 19612, 6970, -19824, -21173, 6650, 17071, 7771, 8636, 8422, -9241]
336i241j6606J0273K8102M030k1297n305P238k853K005J8449J6638j0613k9659
349h839o273J5382L086r40R507J365j7601j9311Q507K5508R79j5245k114m024
363a0013j4666l474K1173K4971o078k2012J983J2038k197K701J6095P117k0295
376G343k7737O393K4274J370o935N434j93j6694j4713J5197K6606n994k3427k653
390a1729M673m578q5J8498J9344j2292k7100J000J5412M49l589M129J263j7030
404a1635j8630J2166K6196J867r763r89j249q133l887J7280K0357r778k0246O68
418e776Q056K375M759J2839O280j9415k2814N463J3485j687m836O32k842j3230
432a6711q301J8205K0946o505j3927k218m85l982K132J7046J2415j5603j7411
$$ y = [-9241, -25847, -15574, 12528, 16558, -4739, -10044, -2806, -5659, -3654, 14795, 31433, 20820, -8839, -15112, 270, 3356, 2416, 11923, 13288, -4313, -23624, -15117, 10391, 11370, -3875, -5989, -10013, -24679, -28153, -6980, 17991, 11913, -10099, -8116, 3922, 1725, 4426, 20521, 27638, 7343, -20394, -14001, 10273, 11643, 4708, 10142, 9949, -6745, -21458, -6261, 20345, 14351, -9076, -11729, -7056, -11634, -11719, 6779, 26123, 13831, -13269, -12269, 3143, 3592, 3, 4132, 5395, -11635, -30265, -18099, 8097, 9964, 201, -788, -2037, -10170, -14057, 3223, 23580, 13802, -6444, -5776, 2280, 4655, 9414, 22253, 28533, 9118, -13696, -8233, 5252, 3565, -1271, -639, -3481, -16711, -25012, -6807, 14139, 7634, -6293, -8511, -8996, -12978, -10846, 6200, 18615, 3012, -14399]
445a4399O491J0470K153L100P846p16k1086j5991J4537J6300l240m993K212j78
459B506q793k126K1071J5128j6280j8942J76M922q88J621J4107O194k1782j8866
473b1952R864J4833P24m756k35j706j5901q894J9555J8715m166r991p42M948L4
488C30Q75J4212O750j7645j6039L657J0815N544J330M917r88j8321r826J2180
502b209J0469k896o429k439j538q831Q6J8678R392j0976r945R50L671j448O63
517b802J1599N92j9355j0103J0493J1739K874l31M582k982j7731m730J7330J0971
531A2146n512p981J81J721m583M232J9303M440j8786j4303J808Q064J340K70P733
546A0073l953k0644o338J5041J4211j704r180j403j529j0459K426J8699O639j2168
$$ y = [-14399, -7908, 2562, 4715, 7815, 15661, 14945, -6141, -22132, -7595, 8705, 5465, 472, 2684, 2506, -6287, -8413, 12658, 27786, 11506, -7436, -7260, -2338, -3226, -1605, 12502, 18696, -3086, -21952, -12088, 2745, 3469, -1287, -1522, -3228, -19129, -28023, -8468, 10247, 6081, -3910, -4652, 296, 330, 1205, 15417, 22167, 4522, -11517, -7860, 2955, 8499, 9829, 14746, 13758, -4563, -14389, -2209, 8260, 5364, -1065, -3504, -5042, -13873, -13787, 4891, 14283, 3307, -6638, -5688, -2017, -3465, -2802, 8797, 9389, -9966, -20069, -9576, 2163, 5037, 4706, 9288, 6306, -11425, -16155, 1175, 12146, 6634, -1347, -1166, 555, -4028, 204, 19507, 23947, 5161, -9142, -7334, 730, 2070, 2340, 10073, 6120, -14524, -20862, -5821, 8390, 6686, -2494, -3897, -5426, -15885, -13459, 5240, 11879, -289]
560b89j2062L486J1621K980K077R109l864j8769r134Q465J2999R19m796K644r78
575D408j1008j06J1524N172o726q931J541L526m203K352J0788p69j0573o072M706
590d371P100j069J309O628o435j6979m376R377R610J493q9N485m359j3536K013
605h199J4033M379q332p892L749M461k105P216J1884o327j8818q714R543J2906
619G784K95k624J128j0707j5878K410J7487J1184n974r045K324K29n192N154R583
634H158l401j3782n452J2291J2894j237j269Q03r849j2614K52J3379R449n303
648D319o265L226k787o230L260R878L279o833n027O056J748o192R39M749l029
663A091p728j721R013O898l337l04P65r409j0801J183J2080R026k556k007J623
$$ y = [-289, -12351, -8865, 2756, 5736, 7813, 16922, 13058, -5711, -14845, -6380, 6619, 7538, 2742, 5386, 4408, -6600, -6706, 4818, 9990, 3264, -5667, -4126, -600, -4803, -2451, 8337, 7568, -3005, -9077, -4371, 2729, 1660, 2969, 9597, 3162, -13817, -18193, -8816, 794, 2287, 2198, 7683, 3324, -10212, -8199, 5834, 10213, 1881, -6011, -2262, 2199, 94, 7310, 19194, 12867, -5951, -14665, -5122, 7784, 8079, 5455, 6583, -4124, -20002, -17592, -105, 11079, 5105, -3940, -1616, -1387, -6579, -1425, 8158, 4757, -9025, -14477, -2186, 10708, 9471, 8202, 9005, -844, -13458, -13206, 173, 9622, 4319, -1946, 1280, -1507, -7737, -4477, 5401, 8680, 1847, -3180, 2876, 4624, -1568, -629, 4120, 1091, -6637, -8358, 655, 7553, 4216, 3912, 4677, -4732, -15533, -14350, -2270, 6756, 4200, 2193, 3816]
678C816o374n851P876J0597j20j1220n961O268K718j335O330K875j0651j2302
692a3334J426J5464Q572o076m742k466r196n244R399J5271L632j2262n851O206
706G99J387j873L902K631o729j1441M68J4154O802n292k487j287n855m796M470
721e147J1834K699r542m079K755k015j449M515O822q1q033j831O690r20l899J877
737A96J082m104o412K029J1181M111l837N7k170p464m712M945J1072K651p446
752A179k175J001k641M30O640M858n341j1103l80Q623K493j304J337l087q108
767g578m869P536J4211J503q281m158k828m468L96P863R252l336j0778P25P956
782C146J146j044R64j30o318p289N520J2467J063o774k267j298l306k337N913
$$ y = [3816, -2558, -8409, -533, 10064, 9944, -1276, -7237, -969, 1749, 414, 6744, 9619, -1032, -13334, -11908, 3556, 12128, 6052, 1310, -1156, -10352, -15596, -6197, 9074, 12706, 444, -5407, 799, 2186, 313, 4215, 6846, 117, -11324, -10856, 3298, 10100, 4808, 2321, 1034, -4821, -9617, -5147, 6687, 9386, -156, -4235, -1480, -3495, -4944, -429, 6393, 6312, -1721, -3552, 3138, 2218, -1681, 196, 1278, -2826, -9238, -7209, 3972, 8083, 4246, 4303, 2133, -5331, -10043, -5098, 5974, 8625, 1179, -996, 5, -2636, -2206, 4434, 9292, 3951, -7152, -7532, 1091, 3584, 2280, 3617, 530, -7578, -12447, -4911, 9300, 10803, 2522, -1636, -4464, -8932, -8536, -673, 8579, 5243, -5535, -4810, 3146, 4292, 3248, 4212, 4082, -2236, -9525, -4005, 8462, 9525, 2751, 484, -814, -4120, -6457, -544]
797e44R849k304r805k544J340l21N6L694N490k962p619K331O598M04k077j225
813C61j268m031m163O270J0487j84n042k625k713k095m1O699P461m436p971m95
829c786L139J482K253L094J106o355o809M711P186j418l929k795k613l651q14
844i199Q880Q460m493p795j705J52M77J549O108M562o449o633M543O410J194j254
860D807m71l29o062m799P389P430l205o221k438P42p35j00P853O300o933q120
876d892l94L448K438m92K547K394n905n591M774N943K2m240l220j082l012j166
892h428P697N860k939m931j741K188K196J844N380K036p123n084K430L973J618
907D976l67nj091o479k418O434L718l228n017k385Kj845J742Q969L282o115m478
$$ y = [-544, 9305, 7001, -2804, -5348, -4008, -4329, -4273, -579, 4911, 1949, -5670, -3339, 3259, 3663, 1586, 361, -907, -4938, -9101, -2831, 7656, 7472, 2430, -195, -2908, -5003, -5044, 1655, 9116, 4680, -3291, -3786, -647, 835, 3088, 6182, 7288, 933, -5876, -1165, 6021, 4603, 674, -2121, -4734, -8385, -9199, -319, 8141, 3648, -4147, -5852, -5700, -5223, -3674, 2434, 6996, 547, -6086, -1543, 4867, 6061, 4807, 4336, 4007, -2055, -6854, 535, 7965, 4760, -1461, -3899, -3157, -3892, -3992, 3861, 10161, 3228, -4892, -5286, -1838, 600, 108, 2655, 5049, -856, -6447, -1673, 4270, 4292, 52, -3168, -4250, -7262, -8428, -731, 5129, 2190, -2741, -4482, -2294, -98, 1746, 7126, 9162, 2039, -3045, -615, 3358, 4976, 4609, 4604, 3513, -2966, -5384, 1050, 4768, 1540, -3477, -5862, -5860, -7705, -5963, 3006, 6288, 173, -4305]
924d305R60L167J330J91L896l94q219l081N505N161j38l044n76n95n253k30P921
941B296L862m331n103l11L005M81J702O775Q98q167m952K263M175K98k733J097
957A255j236o978r99O663M735j826n217j449J313j761J921P140J971m644m394
972c506J152M884J438L83K909k317o999k249L177M063K3k892n41j311l565K480
988b871N912J709l463m267o40J656m42L073N478j767o020k633L071L335m58n54
1004A119J223l463o282J113O068L784k136l454R14M48k329L176O151N7n740m888
1020d239K168L814m74J344L337k904o337j981M082M425j653l273N23j851l048
1035f067K574N755K813l466m428Q82J823p64K775L101k202m874l342L371M679
$$ y = [-4305, -3345, -178, 1152, 1343, 5239, 4845, -3374, -6455, -950, 4211, 4073, 1029, 453, -142, -5395, -5625, 2296, 6158, 1827, -3276, -3587, -582, -101, 1601, 8376, 9274, 1107, -3845, -1582, 2593, 2891, 158, 1255, 19, -6959, -7958, -1295, 3440, 1614, -3603, -5052, -3739, -5500, -3579, 3561, 5532, 888, -3506, -2354, 2530, 3968, 4351, 7260, 4943, -2056, -4305, -1128, 2935, 2958, 66, -475, -1786, -5351, -2871, 3041, 4750, 1287, -2980, -3620, -1964, -2406, 667, 6145, 4378, -1642, -4275, -1204, 2131, 1673, 1119, 2342, -1121, -7403, -6290, -222, 3562, 1426, -2028, -1114, -666, -2995, 181, 6332, 6389, 649, -4239, -2071, 1743, 1269, 2613, 5950, 3046, -3291, -5272, -1190, 3235, 1582, -1691, -1168, -3019, -6067, -3493, 2262, 5075, 1609, -2819, -1937, -114, -878, 1897, 4998, 2796, -2078, -5420, -2049, 2630]
1050B630n1l37O91l439l658L32M521L247k586l001L99j013k72L526L682k02m663
1067a94l828K015J585o8K333J113l047l998l95M762L719j891m21L5l931j832K546
1084a497M690J472m244k939J509r2k06L739K393k681n917k326M075L138r53J297
1100A458P89l342k997J173N877K454m013k967N12j269m10K912L705j1n658k992
1116d779L702K116L00J637rk184l971q49N314L114j929o76n99j978r80Q34L306
1133B369M88n019k247R54K01J177K601J772j553m401j032L647J980N63J753m12
1149B841k697k525P25N274J068k337p63j132k088j72J960L127j579n445q81K703
1165a921J447J765K471O0l357n301O43N559J699j322k70j763k298j776K475N016
$$ y = [2630, 2579, 2242, 2933, -506, -4164, -3832, 689, 3936, 1350, -1651, -1252, -2265, -2537, 989, 4671, 4469, -194, -4022, -2007, -422, -490, 1843, 2956, -91, -4089, -4484, 278, 3997, 2106, 1685, 1720, -2211, -4043, -1497, 3193, 4665, 421, -2518, -1009, -1101, -1307, 2432, 4825, 2144, -3773, -6099, -2024, 1114, 161, 1458, 2247, -1095, -4092, -2919, 2958, 5412, 1399, -1568, -1056, -2325, -2735, 177, 3882, 3871, -1787, -4779, -1077, 1039, 1339, 2976, 2967, 783, -3188, -4037, 1277, 4391, 2462, 1786, 1187, -791, -1771, -937, 2369, 2857, -2162, -4409, -3455, -3254, -2077, 524, 2296, 743, -3658, -4690, -1043, 937, 1500, 3253, 2841, 144, -2381, -1656, 3618, 4686, 2349, 1586, 454, -1634, -1806, 154, 3281, 1702, -3743, -4624, -1921, -474, 1291, 3762, 3822, 465, -4836, -4193, 1366, 3065, 1743, 1473, -290, -2588, -4364, -1889, 3127]
1181C127r30n046j196J129J043R41J932K100k297m758J269N418K427J88o97j351
1197C299k179l481J301M433J45k862j348q11n81p40P77K672j676l756K56K095
1213b456J309J384R87P26k102l193J691M005R89J00q86j990k681j835K469M235
1229B752m24k256o94p46J17J310K042J939l167m175J867L064J834R66l57j703
1245B369m463k884K946M435q52k506j846j438n91p9L715L426k931l090J018K582
1261a89K187M91M87J18l437k323L511M042N95j767k247r25k035j870K941K665
1277B244j595k414q15J038Q67j19J361J506k641k208J293J860J833n34r35k89
1293D52l031j642K593K924L45r45j888j129j056o2L942K303j386j530K3J100J401
$$ y = [3127, 2197, -2849, -4045, -2916, -1873, -932, 1000, 3100, 803, -3955, -2686, 2732, 5159, 5347, 4650, 3299, 1120, -2361, -1060, 3373, 3518, 656, -692, -1503, -2084, -2824, -2047, 625, -1051, -4807, -4551, -2456, -1147, 237, 1224, 1950, -152, -3345, -1654, 2351, 3340, 3440, 2554, 564, -2117, -3952, -1483, 2752, 2328, 72, -622, -1368, -1251, 59, 2101, 4040, 873, -3302, -1435, 1629, 3463, 4429, 4072, 2369, -2094, -4978, -2032, 2403, 1551, -955, -2801, -4239, -4830, -4909, -1194, 2232, -699, -3789, -2771, -189, 1998, 2489, 2976, 3094, -343, -2666, 845, 4887, 5482, 3715, 1468, 543, -1492, -3362, -421, 2244, 649, -1765, -2580, -1542, -675, -794, 567, 2073, -568, -2776, -1483, 377, 2210, 1676, 741, 452, -2579, -4221, -1628, 1296, 1641, 696, -1192, -2321, -3377, -3439, 503, 2806, 1420, -110, -87, 1013, 2414]
1310B414O29J504j094m247j953K691K565Q87j378j826k018k981j25M953K133j651
1326E03k713j069P65K02O71L375Q23l449j417K111K569R65j512o53j450k823M6
1343c056L641K829Nk738j735L70j294N72L002J265j879j885k28J962L58p47J308
1360A750o25k709r09J593K505K3k041j209r36j776J090L531J934k31k120j539
1376a669N65l53J565K578l15k020j290M02K458N24o85K05k233k526O16K843K117
1393B782o50k544p60j005p16K017L292K84k110k331k66J488l16R82J659j665k318
1410b177j76K275K591n40k018j44j264j559J890K903J675j475k983k70P61n11
1426a022J578J837l07k335k356J298K121m8k92j26j100j261N39K585J827j339
$$ y = [2414, 3043, 4547, 3453, -794, -2747, -56, 2509, 3396, 2018, 192, -1826, -4807, -4932, 21, 2154, 503, -2210, -3279, -2514, -2312, -1641, 1734, 2557, -892, -2309, -198, 2371, 3336, 1824, 1171, -279, -3102, -3056, 585, 3414, 3419, 681, -1054, -684, -1978, -1406, 1596, 2861, 982, -903, -1131, 831, 1189, 442, 1750, 1125, -1584, -2493, -900, 1605, 1628, -413, -1622, -2558, -4334, -3244, 287, 2221, 1990, -130, -1669, -1104, -1457, 108, 2686, 2371, 351, -939, -537, 1921, 2445, 1760, 1965, -268, -2794, -2178, 665, 2782, 2132, -412, -1172, -2177, -2893, -876, 2416, 2700, 590, -1741, -2007, -519, -835, 147, 1806, 141, -2177, -2353, -78, 2513, 1973, -45, -189, -1453, -3012, -1122, 1781, 3456, 1981, -1002, -1272, -511, -1022, 556, 2393, 2086, -249, -2605, -1307, 814, 766, 474, 348, -752, -2013, -1474, 1111, 2938, 1599]
1442A599k536m85n24j34K239J970N97k035k663K45J369L40R12K84j111j330o78
1459a941J896K106m47r88m57j382n07J798J932M93j993k100m19PN32K299J072
1476A901r79k113j317J535J475k55P27L35j966j069R87K782J319k030j607j30
1492d05j047j18J914J854k13k888k288J301J128L00J386L64j207k043n84K529
1508a7K284j093n81o02r20M5R07K230Q32k719k332M5M09J145J308O91p49k262
1526a379r87K040J337P11j8j014j298o40N30K268Q58j494j343j034l49O60J434
1543B82R21m68k849o91Q32N64J527J408k94j042j731M84K379Q60m57r5j248j051
1561f69j12J173K340m37k530j183N8M3J045J058O88j290k717p1K210R50O10j36
$$ y = [1599, -937, -1422, -1946, -2080, 159, 2129, 2726, 691, -1972, -1727, -358, -18, 894, 1178, 67, -1263, -1941, -45, 2061, 1614, 626, 169, -1213, -1720, 78, 2010, 2503, 510, -1590, -2009, -2002, -1470, 829, 1901, 922, -1191, -2508, -973, 502, 247, 974, 1309, -657, -1726, -739, 2043, 3362, 1332, -275, -405, -1452, -1570, 344, 2198, 1985, -903, -3191, -1890, -762, -462, 924, 1288, 81, -1962, -2546, -17, 2267, 1174, 593, -9, -929, -884, 23, 2253, 3085, 366, -1966, -1921, -1512, -367, 941, 1632, 883, -1379, -2366, -326, 1011, 1722, 1704, 690, -608, -1248, -718, 1550, 2408, 914, -429, -1463, -1812, -1152, 282, 1203, 735, -2114, -2805, -1973, -1409, 118, 1526, 1232, 190, -1541, -1057, 1322, 2182, 1725, 1630, 382, -669, -781, 392, 2732, 2295, -235, -1418, -1360, -1317, -272, 786, 1474, 184, -2533, -2604, -394, 556, 1166, 1030]
1579A030m72j197j264P03K709J39j574j092n54R6N42J213J469o64k547n53P83
1596a233J538J095L71k50q56k115J065J944P43k5r85j316q42l14R87J569n64j788
1614i76p09n70P60R89R26K25j425j833M09J762P47J191k81q80r68o86J747J948
1632B376m58p72j178p89O2J28J792J220j596k029K3P31P44Q95J37l9j793j463
1650b009R88J845M58k22r95q89n12n41J656J514o07j873r41L83R62N18J083P53
1668A571j745j507L56J635J392K37o81m12j116o06J650J500p9r38j646o55N10
1685e34N0J272M02j369j542m79O52J617N38n7j66j696q53J371J089Q34j74r39
1703A6o63o50N86J767P50o80j090j311M05P26O76J198k22j802q98N72J185J054
$$ y = [1030, 558, -639, -1903, -1200, 1509, 1648, 74, -1018, -1572, -1476, -934, 279, 1748, 1084, -1463, -2016, -1233, 305, 1400, 1771, 1521, 665, -1450, -385, 1559, 2302, 2277, 1292, -24, -866, -1180, -193, 1376, 812, -976, -1685, -2255, -1495, -506, 420, 645, -780, -2613, -2204, -442, 305, 1496, 1215, 335, -633, -1319, 428, 2376, 1918, 1146, -32, -821, -759, -631, 1161, 2381, 785, -1244, -1221, -490, 254, 1149, 1286, 1247, -546, -2009, -1021, 824, 1282, 1060, 65, -824, -1336, -1877, -221, 1293, 686, -1187, -2128, -1745, -783, -265, 818, 1571, -174, -1681, -1325, 310, 1702, 1939, 1258, 846, -270, -876, 774, 2274, 2195, 1257, -389, -1044, -534, -484, 788, 1190, -179, -1721, -2200, -1548, 69, 607, 550, 384, -1312, -2165, -794, 295, 1129, 955, 16, -647, -1297, -711, 1056, 1806, 1126, 36, -1275, -870, -144, 532, 1730, 1508, -294, -1192, -620, 565, 1619]
1721A619Q2l73o19j981k19J802R90P1j182j330r8j55N25J562j58j098j548j49
1739b259J141J186L34M29l46j538l77R94J770J054r16r25l98p69L66J484L54m01
1757A183j510r18Q57M95K37Q36p37j403o88J43J521J024j46m29q03r77N23Q15
1775B3R22J34q24r84k84l43J193J200m41q48r84r6J066M90P67N54j152j246M2
1794h11J084J398L51p03m66r75j117Q23J317L44j045j364m61N17L20P03P84o49
1812E0j335o98O28J919O15k48k04j072p73M05J228J488m26j597l60m04J77P51
1830A44N23O5p74j364M30J023N18N64l03p89q71l25R07J431M84j038m55j029l42
1849a201P12N26R39n67j398j54j26M29J072M60o52o56m91O86J222N18K28o82j261
$$ y = [1619, 1701, 1328, 709, -1272, -1491, 311, 1301, 1372, 190, -1140, -1238, -1393, -868, 694, 536, -562, -2110, -2259, -1118, 68, 402, 831, 485, -1053, -1430, -436, 1334, 2388, 1472, 547, 149, -620, -254, 1230, 1584, 1183, -327, -1245, -388, 107, 344, 1180, 443, -960, -1648, -1505, 16, 1040, 894, 465, -338, -1315, -792, 23, 945, 1079, 255, -729, -1013, -1356, -163, 1037, 596, -252, -1236, -1332, -266, 224, 991, 1545, 393, -853, -811, 273, 1671, 2022, 1319, 853, -122, -1239, -416, 901, 1245, 200, -1164, -1625, -1108, -788, -85, 699, 50, -1285, -1983, -1355, 564, 1179, 931, 727, -345, -1118, -713, 515, 2003, 1577, -20, -380, -784, -607, 144, 667, 732, -42, -1406, -976, 47, 565, 1129, 826, 37, -834, -1159, -252, 1179, 1663, 625, 170, -859, -1201, -489, 37, 976, 409, -989, -1143, -1269, -840, 232, 692, 40, -616, -1107, -421, 801, 1319, 1547, 865, -396]
1868c96n65L35J308J320r75r46n26p73J44R79Q77L1j386o88L27R49K44P96k54
1887H01j094q28K31J340J317m32r57o67p22k94Q91J150P22j257j182K35j53P44
1905a55P21j1k13j079k85Q33J174j9k08o56j056P0j7J470Q60p47q03p58m13P64
1925e28N35O54K37j049p83L64N50P32M91p80o64o91J62J340O13j13m64j151q73
1944a418K89P92J353K54j127q25j8l53J067L72M48m72j371K6R96K82O30j70r19
1963a64p01k93P49J630K85p73p63r41J08N28R54P10l49j111o43L99K43Q35k71
1982D32j47o60q52L55J089L62Mo70q05n2Q5N90J408mq38r56m92O63P31K89M51
2003I83o56r62n7P46L09M53m81p33l33L1Q45J073o9k70r54r35J91N86Q28O34p23
$$ y = [-396, -961, -626, 682, 2002, 1027, 81, -445, -1218, -1074, -95, 782, 813, -573, -1261, -934, 15, 259, 1055, 801, -293, -1121, -890, 450, 1767, 1335, 378, -289, -1011, -1305, -414, 736, 1458, 201, -981, -746, -899, -155, 566, 555, 342, -737, -1022, -189, 985, 966, 758, 102, -954, -884, -901, 569, 1429, 682, -121, -879, -1292, -528, 7, 661, 898, -151, -934, -570, -20, 712, 1203, 423, -241, -932, -770, 570, 1183, 1070, 606, -545, -1418, -1129, -337, 1016, 1270, 143, -682, -700, -1053, 14, 386, 834, 362, -1009, -983, 13, 295, 925, 755, -164, -865, -1158, -409, 1221, 1506, 733, -30, -971, -863, -335, 619, 1329, 980, -131, -774, -375, -132, 703, 432, 285, -375, -1227, -872, 217, 579, 583, -87, -892, -944, -859, -269, 1139, 1135, 297, -659, -1151, -488, 243, 532, 983, 327, -635, -692, 54, 363, 816, 335, -398, -731, -700, 145, 1218, 1149, 879, -75, -1010, -819, -233, 595, 1229, 506]
2024E06j101m44r6O00N27K26m95m41n34O37R76K08J1l47n75m73N32J099J077n35
2044A358p35q62m86M30M74N15O52j413p56j67N05P28K42k63o27j89l80Q89R36
2063H51Rl73j057m13N51J60R45M69q92q66o01R6R95L09l8N2o88k88O29M85O39
2084I74R2q76m37M6L34Q78O64o06q00j037j40K90N31O06l80o91n71o2L83P29L91
2105C18n7m00n18l9J119M40P3l51q95j18J23O15N91J33p90j056k09L23N77L83
2125B62M78m61j004O8L89P17Q15m47o96k50k94N26N12J70m94q65n96R2M47N15
2145a16M15k26p37n55J82Q76P29j00K3k36n23J49P69M45M4n01p52r2j36O08N41
2166H07l61n33n32n11M78P50J80J58l70o91K04J49N85N05n33m4n41m52N79N96
$$ y = [506, -595, -1039, -1135, -535, -8, 218, -277, -718, -1252, -615, 361, 569, 580, 233, -342, -815, -283, 816, 1893, 1358, 623, -239, -725, -295, 179, 694, 1346, -67, -823, -990, -485, 243, 485, 222, -405, -594, -974, -85, 851, 860, 487, -570, -983, -432, -272, 673, 1142, 250, -616, -1217, -1121, -126, 183, 145, 197, -491, -779, -150, 335, 974, 1066, 190, -247, -201, 133, 1011, 1675, 1069, 269, -768, -908, -618, -87, 519, 139, -552, -1123, -1185, -802, -73, 318, 261, -139, -657, -696, 423, 863, 936, 585, -310, -428, -305, 310, 901, 1034, 244, -812, -1021, -698, -121, 262, 740, 279, -725, -657, -268, 449, 1264, 817, 121, -129, -423, 103, 615, 785, 291, -574, -1170, -1078, -631, -116, 299, 73, -664, -1219, -1037, -161, 568, 468, 491, 255, -268, -119, 650, 1095, 1139, 638, -114, -206, -342, 266, 807, 446, -87, -619, -1130, -652, 98, 278, 436, 66, -625, -421, -272, 313, 818, 285, 241, -300, -752, -173, 423]
2186D23K43k06q88o34L16K20O48N34n81l64n76K95Q41L19K21Qp16o28M01M04O57
2207I37m9q47m28k53P9O77R6J32n93r02m0P32N46L18J64p25k67j03N18M20M57
2228H69m51j73p53J5N23L67J50j78p06l92J14M81N75J91l32o65l15K12P47K84
2248E63J14j93r86p3L63K74L84Ro51k79l19K78P22p4J30m03o57L52M80L98M86
2269I18l11o12l42l63P88N73L0k33l77q00N7M82N43K71n02o07J66o4L07N49K1
2290D94k91n18m46N37N08K00K04n83m59k36J86O16M14jp29j62m98Q61M9K06J37
2311D89o17n15J50K13P06L65n61m12k78l78N13N44J09k95m14m97M06M15N24J36
2331F03m13m11j05p4O23M87j65m38o21J27K19L42K84L5o12n93M0J60P76J81l52
$$ y = [423, 666, 460, -428, -1062, -746, -526, 122, 656, 75, -289, -865, -570, 271, 590, 811, 819, 103, -525, -124, 280, 937, 888, 41, -387, -640, -561, 116, 212, 344, -249, -1151, -1191, -459, 87, 405, 569, -156, -423, -526, -8, 412, 869, 418, 245, -508, -493, 30, 397, 547, 369, -337, -729, -615, -134, 441, 632, 300, -365, -680, -468, 279, 563, 677, 484, -502, -575, -212, 62, 446, 455, -196, -475, -794, -516, 206, 132, 262, -141, -798, -446, 34, 432, 918, 607, -5, -347, -710, 78, 651, 681, 448, 71, -729, -672, -190, 353, 624, 122, -485, -319, -383, -76, 473, 494, 203, -315, -761, -224, 284, 484, 688, 105, -354, -590, -404, 212, 626, 625, -104, -266, -764, 97, 146, 352, 489, -128, -643, -493, -280, 426, 791, 230, -182, -460, -838, -325, 219, 328, 33, -381, -878, -472, -57, 467, 603, 190, -221, -326, -400, 223, 710, 545, 107, -514, -387, -168, 174, 458, 493, -119, -712, -672, -512, 264, 445, 93]
2352I3j76m16P1K36N84M13k76q75k86L01J94N36J60m47l11o84J67O13O83R6n79
2373I7m54q2P1M33P16j09l44n38k20K26N49J89p5l46o47k29L31L94M50j41p98
2394e27p6l03N56O31K40r8l50m66L20K67L38L3k20l50j32k55M79L70R0k20o16
2415b89l18K34O82k00N74l46n69j25J6L43P17k76m04k07l80L07K32M68j72l80
2435i3p61l1N33L12M39j99m26l10j10L57P73J53J62n79n00K77m0L90L48m45m03
2456a53l10j10P15J35L7m12k94m58L86M23L23n3m35j37j44J99L87N55k58j00m84
2477a88k33K99K17J49J33p85j02J56K8O62L61m85k51q1k56L64O79J69j99p19j79
2498b61O7J1P87j50m03m57m03K25L98M31r3k38m94k57O52K52N99k33l98k00j65
$$ y = [93, -83, -499, -428, -192, 392, 805, 529, -346, -632, -331, -137, 399, 559, 112, -199, -883, -716, -103, 580, 676, 97, -357, -439, -368, 65, 781, 672, 328, -210, -430, -204, 345, 534, 459, 113, -534, -763, -432, -38, 412, 271, -527, -603, -906, -350, 281, 521, 423, 73, -393, -73, 194, 532, 565, 345, -5, -137, -392, 87, 457, 547, 327, -289, -607, -373, 309, 109, 683, 337, -232, -357, -341, 2, 719, 443, 39, -168, -548, -241, -9, 459, 287, -93, -854, -885, -352, -40, 399, 200, -226, -536, -646, -289, 484, 637, 799, 220, -280, -3, -43, 347, 695, 250, -153, -463, -573, 142, 277, 314, -98, -392, -850, -464, -41, 282, 229, -206, -343, -487, -288, 99, 654, 396, 296, -188, -421, -122, 95, 244, 377, -408, -510, -354, -326, 336, 697, 212, -39, -120, -376, -12, 667, 836, 637, -82, -261, -194, -183, 604, 454, 51, -406, -809, -584, -186, 245, 152, -86, -580, -837, -185, 67, 666, 433, 35, -165, -330]
2519c30Q3Q36J43j93m85m20Q8N6L52M31k79l45l61K3M15L82K27m11m22m05K58
2540c57L76L52K74m65n29j81pL95M43j16j50j86l88M2M51K35q2j23k67O4j24N88
2562B45L23q5l49n61M3M89O3K78J04o01l31m3O7N96J14k67l22r5j51L31L23K42
2584D13l20j48m63L43K36K04O9k83l27r6p1N10L45k27j35q1k07R2L96J97j35l81
2606f9j83o7R0L32L55j42l17m69l12P83K4L25p1l21m53Q7M12K96Q7j09j19m64
2628c05q7N23J16P0j92m04k00M32P7L41J4n49Nk94N0P00J01O8k84l83j90M61n7
2651A3O65m64l26k37LJ37L55K2j28p4l82p6P03Q4K17l13k06l10j99M50N68N6k80
2674B78n10p9N9L20K1K12j42m87j13J53L10L03j67k61o8j52J34M95j0K35l73m29
$$ y = [-330, -247, 589, 732, 539, 54, -366, -278, -222, 130, 561, 282, -63, -424, -401, 14, 396, 623, 212, -210, -615, -357, 19, 371, 645, 180, -349, -530, -537, -142, 301, 185, 35, -151, -539, -497, -46, 189, 107, -16, -283, -219, -343, 245, 568, 483, 134, -427, -384, 105, 168, 446, 550, -51, -382, -425, -358, 238, 352, 85, -237, -332, -483, -152, 171, 413, 93, -55, -518, -175, 61, 265, 334, 51, -276, -372, -443, 67, 412, 185, 50, -31, -238, -146, 250, 447, 312, -69, -252, -319, -229, 103, 458, 316, -1, -470, -782, 1, 25, 350, 279, -42, -495, -408, 4, 300, 387, 278, 159, -305, -392, 131, 247, 317, 125, -279, -479, -47, 30, 371, 385, -164, -159, -453, -403, 297, 398, 466, 182, -201, -391, 70, 13, 678, 214, -112, -349, -346, -209, 146, 168, 40, -34, -416, -492, 211, 295, 512, 199, -7, -317, -516, -66, 502, 558, 278, -232, -311, -252, 68, 89, 301, 159, -328, -441, -288, 22, 325, 158, -103, -171, -323, -189, 306, 296, 531, 158, -271]
2696b71M5R2K99J13J49l44l69j68L28K88K03j11m07r8O7K89L67N6m36j75k49K0
2718c12O38J63j82k33j52l73K46L4N91j24l81k76J7J29K77J22j45N5l12j6M08
2739A74K67l3j3l73l95J23J09K90K29m74j14k93o3M75K0L19j82k89j30K54j1N40
2761D30k10j49j11k28o2N58K10l1j30q60J48L07p5M98j30k59p8O9j60O67j0pl16
2784G1n67M07K26K5K14k49k10k23j06L17K61K65k99p5n32J2J56P18j3k21n37j08
2806d68J78L55J61K9k03j75l33J91L95K55N8n00l43J65M2M05L30q6m61j62j42
2827c09J45M07k8r4k07k77R0K30M90n8l40j28k45j71M17K92j41L8k56k46N0L65
2849B4K45O8k20l46O7K5M35R9L7l21n11jL37K85L8J46n08k13N4o0M23J80j88n2
$$ y = [-271, -226, -134, 165, 278, 427, 83, -286, -454, -126, 162, 365, 254, -153, -251, -184, 105, 472, 528, 92, -83, -332, -312, 326, 489, 307, 74, -78, -451, -205, -171, 420, 296, -85, -361, -344, -215, 62, 184, 39, 94, -218, -234, 174, 441, 408, 395, 22, -373, -250, -141, 149, 378, -96, -210, -503, -566, -91, -71, 248, 66, -223, -353, -99, -110, 430, 220, 71, -40, -268, -330, 228, 438, 407, 277, -583, -435, -128, -203, 295, 165, -94, -172, -103, -263, 404, 394, 387, 71, -496, -89, 137, 162, 376, 127, -83, -306, -412, -95, 166, 431, 132, 57, -475, -463, -307, 411, 398, 177, -360, -468, -290, 65, 226, 255, 52, -123, -456, -265, 130, 385, 443, -57, -400, -235, -193, 212, 542, 456, -5, -167, -309, -164, 243, 215, 121, -86, -363, -273, -43, 447, 389, 49, -79, -324, -495, -78, 214, 73, 111, -145, -391, -341, 24, 269, 337, 117, -229, -162, -137, 298, 397, 434, 113, -398, -399, -62, 223, 261, 407, -101, -314, -260, -320, 103, 283, 95, 43]
2873D3m17pK13K09J99M2m71k64J71N00K65j70j35l65j7K1L37J03m2R6n22RJ7P2
2897a13M39N3m10j26m64L11N53n5Jk79k81J51J67J46K20J02n74pj84r3O01J2m8
2920A22r7m54M9K18M01j2J49m17n1n0R5M51l8J28m67j80P1Q6L83j30j09l64j85
2943d01K02K67K62K8k97j31m45M02KK96l9N3k35k91O1M55P5k1j80l37q2P9M57
2966A80O4rm41k81L02K21J88J02k00j70k95K53P1L14j29M2l42k11K14J69K66K0
2988C28l82j65J0Q8P0L59l15o2k06L9J27K19K63km69Q8j36m3L30K59m05Q6k92
3011b11J40J83p1ml3k89j82J23K15L95J03l02j33j80o2N88J24o2j65k54k11Q3
3033b05L33k2j85O8l05pj5K23K93J35j70m54K18K27m4L69p6k70j53j51J30N78
$$ y = [43, -374, -381, -168, 41, 240, 282, -189, -453, -282, 218, 483, 313, 178, -187, -204, -183, 154, 257, 215, 311, -211, -202, -185, -113, 326, 379, -31, -157, -621, -310, 243, 188, 189, -90, -371, -220, -53, 93, 313, 415, -159, -166, -350, -443, 158, 170, 122, 25, -429, -380, -162, 239, 227, 376, -41, -92, -142, -47, 404, 366, 494, 27, -153, -82, 4, 387, 257, 148, -216, -401, -199, 68, 330, 358, 61, -70, -515, -113, -111, 185, 146, 199, -36, -327, -266, 189, 264, 243, 63, -274, -356, -277, 180, 244, 235, -206, -487, -185, 36, 224, 326, 126, -44, -339, -86, -15, 299, 170, 212, -130, -341, -127, 42, 308, 328, -54, -219, -209, -121, -51, 308, -7, -69, -275, -236, -109, 110, 373, 371, -98, -10, -146, -189, 141, 400, -5, 81, -211, -71, 112, 41, 37, 4, -285, -467, -344, -129, 266, 369, 67, -66, -246, -308, 280, 404, 342, 177, -77, -288, -205, 128, 106, -79, -11, -316, -323, -338, -115, 178, 313, 143, -311, -93, 134, 90, 459, 383, 113, -40, -191, -61, 517]
3055E17j53l67P1l62j57K40M31J24l53k86P7k02L68M59k55n3m4l68O7L26K72p5
$$ y = [517, 364, -3, 68, -294, -451, -211, 220, 344, -9, -295, -218, -420, -52, 407, 152, 99, 55, -313, -246, 80, 352, 277]
$$ [...]
8191I9
##END NTUPLES=NMR FID
##END=
