##TITLE=1H_Ser 2065-N-H
 CDCl3
 8 sc, 
 13.3.2024
##JCAMPDX= 6.0         $$ Bruker NMR JCAMP-DX V2.0
##DATA TYPE= NMR FID
##DATA CLASS= NTUPLES
##ORIGIN= UXNMR, Bruker Analytische Messtechnik GmbH
##OWNER= root
$$ XWIN-NMR		Version 3.5
$$ Wed Mar 13 15:55:09 2024 Russian Standard Time (UT+4h)  she@DPX200
##.OBSERVE FREQUENCY= 200.1313
##.OBSERVE NUCLEUS= ^1H
##.DELAY= (6, 6)
##.ACQUISITION MODE= SIMULTANEOUS
##.ACQUISITION SCHEME= undefined
##.AVERAGES= 8
##.DIGITISER RES= 18
##SPECTROMETER/DATA SYSTEM= spect
##.PULSE SEQUENCE= zg30
##.SOLVENT NAME= CDCl3
##.SHIFT REFERENCE= (INTERNAL, CDCl3, 0, 15.7039)
##AUDIT TRAIL= $$ (NUMBER, WHEN, WHO, WHERE, WHAT)
$$ ##TITLE= Audit trail, XWIN-NMR		Version 3.5
$$ ##JCAMPDX= 5.01
$$ ##ORIGIN= Bruker BioSpin GmbH
$$ ##OWNER= she
$$ F:/spectra/data/she/nmr/H-F/1/audita.txt
$$ ##AUDIT TRAIL=  $$ (NUMBER, WHEN, WHO, WHERE, WHAT)
(   1,<2024-03-13 15:53:51.87 +0400>,<she>,<DPX200>,
      <created by zg, POWCHK disabled, PULCHK disabled
       configuration hash MD5:
       00 E9 B6 7A A2 85 ED C7 34 08 36 98 17 FE 4E 26
       data hash MD5: 16K
       DA 7A 0E 2E BD B8 38 80 D5 FE 15 C1 E8 17 75 51>)
$$ ##END=
$$ 
$$ hash MD5
$$ 4A E6 2B AC 3A 09 F2 76 7C 91 27 3A 47 10 FD E1
##$RELAX= 
##$RELAX= 
##$RELAX= 
##$RELAX= 
##$RELAX= 
##$RELAX= 
$$ Bruker specific parameters
$$ --------------------------
##$DU= <F:/spectra>
##$EXPNO= 1
##$NAME= <H-F>
##$PROCNO= 1
##$TYPE= <nmr>
##$USER= <she>
##$AMP= (0..31)
100 100 100 100 100 100 100 100 100 100 100 100 100 100 100 100 100 100 
100 100 100 100 100 100 100 100 100 100 100 100 100 100 
##$AQSEQ= 0
##$AQ_mod= 1
##$AUNM= <au_zg>
##$AUTOPOS= <>
##$BF1= 200.13
##$BF2= 200.13
##$BF3= 200.13
##$BF4= 200.13
##$BF5= 200.13
##$BF6= 200.13
##$BF7= 200.13
##$BF8= 200.13
##$BYTORDA= 1
##$CFDGTYP= 0
##$CFRGTYP= 5
##$CHEMSTR= <none>
##$CNST= (0..31)
1 1 145 1 1 1 1 1 1 1 1 1 1 1 1 1 1 1 1 1 1 1 1 1 1 1 1 1 1 1 1 1 
##$CPDPRG= <>
##$CPDPRG1= <>
##$CPDPRG2= <>
##$CPDPRG3= <>
##$CPDPRG4= <mlev>
##$CPDPRG5= <mlev>
##$CPDPRG6= <mlev>
##$CPDPRG7= <mlev>
##$CPDPRG8= <mlev>
##$CPDPRGB= <>
##$CPDPRGT= <>
##$D= (0..31)
0 1.2 0 0 0 0 0 0 0 0.06 0 0.03 0 0 0 0 0.0002 0 0 0 0 0 0 0 0 0 0 0 0 
0 0 0 
##$DATE= 1710330831
##$DBL= (0..7)
120 120 120 120 120 120 120 120 
##$DBP= (0..7)
150 150 150 150 150 150 150 150 
##$DBP07= 0
##$DBPNAM0= <>
##$DBPNAM1= <>
##$DBPNAM2= <>
##$DBPNAM3= <>
##$DBPNAM4= <>
##$DBPNAM5= <>
##$DBPNAM6= <>
##$DBPNAM7= <>
##$DBPOAL= (0..7)
0.5 0.5 0.5 0.5 0.5 0.5 0.5 0.5 
##$DBPOFFS= (0..7)
0 0 0 0 0 0 0 0 
##$DE= 6
##$DECBNUC= <off>
##$DECIM= 32
##$DECNUC= <off>
##$DECSTAT= 4
##$DIGMOD= 1
##$DIGTYP= 9
##$DL= (0..7)
0 120 120 120 120 120 120 120 
##$DP= (0..7)
150 150 150 150 150 150 150 150 
##$DP07= 0
##$DPNAME0= <>
##$DPNAME1= <>
##$DPNAME2= <>
##$DPNAME3= <>
##$DPNAME4= <>
##$DPNAME5= <>
##$DPNAME6= <>
##$DPNAME7= <>
##$DPOAL= (0..7)
0.5 0.5 0.5 0.5 0.5 0.5 0.5 0.5 
##$DPOFFS= (0..7)
0 0 0 0 0 0 0 0 
##$DQDMODE= 0
##$DR= 18
##$DS= 0
##$DSLIST= <SSSSSSSSSSSSSSS>
$$ [...]
##$SUBNAM2= <"">
##$SUBNAM3= <"">
##$SUBNAM4= <"">
##$SUBNAM5= <"">
##$SUBNAM6= <"">
##$SUBNAM7= <"">
##$SUBNAM8= <"">
##$SUBNAM9= <"">
##$SW= 18.0517328524113
##$SWIBOX= (0..15)
0 0 2 0 0 0 0 0 0 0 0 0 0 0 0 0 
##$SW_h= 3612.71676300578
##$TD= 16384
##$TD0= 1
##$TE= 0
##$TE2= 300
##$TE3= 300
##$TEG= 300
##$TL= (0..7)
0 120 120 120 120 120 120 120 
##$TP= (0..7)
150 150 150 150 150 150 150 150 
##$TP07= 0
##$TPNAME0= <>
##$TPNAME1= <>
##$TPNAME2= <>
##$TPNAME3= <>
##$TPNAME4= <>
##$TPNAME5= <>
##$TPNAME6= <>
##$TPNAME7= <>
##$TPOAL= (0..7)
0.5 0.5 0.5 0.5 0.5 0.5 0.5 0.5 
##$TPOFFS= (0..7)
0 0 0 0 0 0 0 0 
##$TUNHIN= 0
##$TUNHOUT= 0
##$TUNXOUT= 0
##$USERA1= <user>
##$USERA2= <user>
##$USERA3= <user>
##$USERA4= <user>
##$USERA5= <user>
##$V9= 5
##$VALIST= <valist>
##$VCLIST= <CCCCCCCCCCCCCCC>
##$VD= 0
##$VDLIST= <DDDDDDDDDDDDDDD>
##$VPLIST= <PPPPPPPPPPPPPPP>
##$VTLIST= <TTTTTTTTTTTTTTT>
##$WBST= 1024
##$WBSW= 4
##$XGAIN= (0..3)
0 0 0 0 
##$XL= 0
##$YL= 0
##$YMAX_a= 124263
##$YMIN_a= -207310
##$ZGOPTNS= <>
##$ZL1= 120
##$ZL2= 120
##$ZL3= 120
##$ZL4= 120
##$ABSF1= 10
##$ABSF2= 0
##$ABSG= 5
##$ABSL= 3
##$ALPHA= 0
##$AQORDER= 0
##$ASSFAC= 0
##$ASSFACI= 0
##$ASSFACX= 0
##$ASSWID= 0
##$AUNMP= <proc_1d>
##$AZFE= 0.1
##$AZFW= 0.1
##$BCFW= 1
##$BC_mod= 2
##$BYTORDP= 1
##$COROFFS= 0
##$CY= 11.3945322036743
##$DATMOD= 1
##$DC= 2
##$DFILT= <>
##$DTYPP= 0
##$F1P= 15.7292609196834
##$F2P= 12.9074282941183
##$FCOR= 0.5
##$FTSIZE= 0
##$FT_mod= 4
##$GAMMA= 1
##$GB= 0.15
##$INTBC= 1
##$INTSCL= 1
##$ISEN= 128
##$LB= 0.24
##$LEV0= 0
##$LPBIN= 0
##$MAXI= 10000
##$MC2= 0
##$MEAN= 0
##$ME_mod= 0
##$MI= 1.114404
##$NCOEF= 0
##$NC_proc= 0
##$NLEV= 6
##$NOISF1= 3.799351
##$NOISF2= 2.8
##$NSP= 1
##$NTH_PI= 0
##$NZP= 0
##$OFFSET= 15.70392
##$PC= 1
##$PHC0= -25309.49
##$PHC1= 23.58731
##$PH_mod= 1
##$PKNL= yes
##$PPARMOD= 0
##$PSCAL= 0
##$PSIGN= 0
##$REVERSE= no
##$SF= 200.130013532006
##$SI= 16384
##$SIGF1= 3
##$SIGF2= 2
##$SINO= 400
##$SIOLD= 16384
##$SREGLST= <1H.CDCl3>
##$SSB= 0
##$STSI= 0
##$STSR= 0
##$SW_p= 3612.71676300578
##$SYMM= 0
##$S_DEV= 0
##$TDeff= 0
##$TDoff= 0
##$TI= <>
##$TILT= no
##$TM1= 0
##$TM2= 0
##$TOPLEV= 0
##$USERP1= <user>
##$USERP2= <user>
##$USERP3= <user>
##$USERP4= <user>
##$USERP5= <user>
##$WDW= 1
##$XDIM= 8192
##$YMAX_p= 0
##$YMIN_p= 0
$$ End of Bruker specific parameters
$$ ---------------------------------
##NTUPLES= NMR FID
##VAR_NAME=  TIME,          FID/REAL,        FID/IMAG
##SYMBOL=    X,             R,               I
##VAR_TYPE=  INDEPENDENT,   DEPENDENT,       DEPENDENT
##VAR_FORM=  AFFN,          ASDF,            ASDF
##VAR_DIM=   8192,          8192,            8192
##UNITS=     SECONDS,       ARBITRARY UNITS, ARBITRARY UNITS
##FACTOR=    0.0002768,     1,               1
##FIRST=     0,             0,               0
##LAST=      2.2672688,     0,               0
##MIN=       0,             -207310,         0
##MAX=       2.2672688,     124263,          0
$$ Real data points
##PAGE= N=1
##DATA TABLE= (X++(R..R)), XYDATA
0@%%%%%%%%%%%%%%%%%%%%%%%lRj3J5j6J6j6J6j9K4k7K9l2L6m1M5m9N5o2O8p5Q3
45D3r0R9j09J19j32J47j62J78j97K20k43K70l06L47l96M60n41O48p99J022j374
66g96J992l289O981l4531j34254J00431J38741J0534J5559K2895n5550n2779K3015
79C8949J9977j1778K1941j500q4699m1712L6929M196Q047M8401k9110r6243p472
92i4074P9685L7267j3570J3890J524n6396j6461M8103J3845m190J8334j9678n4450
105d6171q782M0252K6736o010j2970k7340l4789J9547N2728J7295J4885K0989
117E6370l3622m5767J6431M4343J4688K113J0557k4912n9318m473M6701O706k2240
130G577j0118k0053k2473O090K3939J4650o358j9331k5860q803L8694M4069Q79
$$ plain form
0 0 0 0 0 0 0 0 0 0 0 0 0 0 0 0 0 0 0 0 0 0 0 0 0 -3 6 -7 8 -8 8 -8 8 -11 13 -14 15 -17 19 -22 23 -26 29 -33 35 -40 43
45 43 -47 52 -57 62 -70 77 -85 93 -104 116 -127 143 -163 184 -212 248 -293 355 -444 578 -796
66 -796 1196 -2093 4888 -29643 -163897 -63466 75275 85809 101368 124263 68713 15934 38949
79 38949 58926 47148 69089 67589 -17110 -58822 -21893 -17697 -9650 38751 9641 -86602 -94074
92 -94074 -14389 22878 9308 23198 24722 -31674 -48135 -32 13813 9623 27957 8279 -46171
105 -46171 -54953 -14701 12035 6025 -6945 -34285 -69074 -49527 3201 20496 35381 56370
117 56370 22748 -23019 -6588 37755 52443 54556 65113 40201 -19117 -23590 23111 29817 7577
130 7577 -2541 -22594 -45067 -38977 -15038 -388 -6746 -26077 -51937 -60740 -22046 22023 22902
143B2902j439Q9l9007k5050M1822M5147r032k6613j505r271k4001J9750M1411
156C5203o179k7092j4962j4247R384L6155J5144j4954j3012q316j9954O81M4158
169B2009K2028k9031j2246J358k9190j1197L4341J6693k1038j4722K390n284K092
182b1797K8178Q254k4968n313N770j0200J3524L2957M045j5803q740r561j0314
195a3968J7676L3683m108k7910J21n360k4620J3514L5441m345k7029o809M269
208i445l102P428K1336j184k2491j3129p231O010L1331J4018j8549j0619o49j2891
222a9167j950L0042K4829k1723k9858O165Q475l482J5145J5436r912j8317r206
235a3523L912J4825J3185L78j6005j5325k504q18J2914K7140m24k7526r961N928
$$ plain form
143 22902 21463 21552 -17455 -42505 -683 44464 35432 8819 7314 -1957 -25958 -6208 35203
156 35203 29024 1932 -13030 -27277 -17893 18262 33406 18452 5440 -2876 -22830 -22149 22009
169 22009 44037 15006 2760 4118 -25072 -36269 -1928 14765 -6273 -20995 -18605 -23889 -21797
182 -21797 6381 14635 -10333 -15646 -9876 -20076 -6552 26405 30450 14647 5907 -3654 -13968
195 -13968 3708 37391 33283 5373 5494 134 -24486 -10972 24469 20124 -6905 -13714 -9445
208 -9445 -12547 -5119 16217 15033 -7458 -20587 -27818 -21808 9523 23541 4992 -5627 -6276 -19167
222 -19167 -21117 8925 33754 12031 -17827 -11662 -3187 -6669 8476 23912 14000 -4317 -13523
235 -13523 -9611 5214 18399 18777 2772 -12553 -15057 -15875 -2961 24179 23755 -3771 -13732 -7804
249g804K304L573J2449O212j7475j8266N628Q128O291J4050j463k0524j2427K000
263a7324J2528J3676N182o529j5112q021Q023P973J0862J4137r765k1379k470
276h219M796K117J0108R600q951k6902p810K1195J1644k719J633o084j4946m714
290a9252O920J4474J3300l272j2972q229K215Q831N786J0994O160k4199k2301
303b1545J2462J6738k8l417o35o090j4213k193J7734J2121j489o345j4067o125
317a7092P641Q841J1725P899j1967j7610k617J2882J2012j919l402j667j5494
330a0768r023J3017J2367L455j772q125q629l987R494J8240L637j0365r229p703
344i391J546J2037P768K901n005j3739q435L060Q793O895j714n372q983j4409
$$ plain form
249 -7804 -5500 -1927 10522 16734 -741 -19007 -13379 -5251 1040 15090 13627 -6897 -19324 -17324
263 -17324 -4796 8880 14062 7533 -7579 -15600 -7577 396 11258 25395 15630 -5749 -8219
276 -8219 -3423 -1306 8802 18402 9451 -17451 -25261 -4066 7578 4859 6492 408 -14538 -19252
290 -19252 -12332 2142 15442 12170 -802 -9031 -6816 2015 7801 18795 24955 756 -21545
303 -21545 -9083 7655 7627 4210 3575 -2515 -16728 -18921 -1187 10934 9445 3100 -10967 -17092
317 -17092 -9451 -610 11115 19014 7047 -10563 -13180 -298 11714 9795 6393 4726 -10768
330 -10768 -19791 -6774 5593 9048 7276 -849 -9478 -13465 -3971 14269 17906 7541 -1688 -9391
344 -9391 -7845 4192 11960 14861 9856 -3883 -12318 -9258 -465 6430 4716 -656 -9639 -24048
358b4048L950K3552J0054q902r471k746j13J180R318J4468l099j4867p223J436
372f511P334J0088L733L47r066j7527k933J5520J4559l285j4987n079L097n558
386a0268K179J7808P015j2152j5601l708P134O523O263N245r099j4725k166P474
400h078J3512P669p039q434m150l067K052J0196J0946n30j5608q521N592O038
414E78R530Q845q019j5597n060M964O831M086N589p22j5265r635P472R139O596
429I332J206j0109j0908m052J703R286R677J319j2362j3155O707J1455j123M833
443C809R887r082j7388M77J4679J0477j97j621n423j0439J23Q672N800M372o285
458G861j6545m289Q000K949R75Q190K390j5973j4789J2461J6519j021j581j486
$$ plain form
358 -24048 -20098 3454 13508 4606 -4865 -7611 -7724 -6544 2774 17242 14143 -724 -7947 -6511
372 -6511 823 10911 14644 14991 5925 -11602 -14535 985 15544 12259 -2728 -7807 -4710 -10268
386 -10268 -8089 9719 16734 4582 -11019 -14727 -7593 -1070 5193 10438 1339 -13386 -15552 -8078
400 -8078 5434 13103 6064 -2370 -6520 -9587 -7535 2661 13607 13077 -2531 -11052 -5460 578
414 578 10108 18953 10934 -4663 -9723 -4759 2072 6158 11747 11025 -4240 -13875 -6403 2736 9332
429 9332 10538 429 -10479 -14531 -12828 -3542 6135 7454 -4908 -18063 -11356 99 -1024 3809
443 3809 13696 4614 -12774 -12297 2382 12859 12662 11041 5618 -4821 -4698 3974 9774 14146 7861
458 7861 -8684 -12973 -4973 -2024 -1049 7141 9531 -6442 -21231 -8770 7749 6728 5147 3661
472C661j1181n307Q246Q503M143p66n613j0079m763P910P280J438L391p883j5790
487a6810L383J6348O864j73n34l692q779k89J1671N188l710O84o377j4743J097
502i872J3961O682m270j0142q135k732K591Q496M570n64p36q734p655J1634J3746
517H840K53j605o65o776q456N309J6066M52j4121k738J254m804K549Q779L710
532H047l059r176q082J993J1664R880l794n585K563o122p166J3162J1476q097
546G704q039j339m765n646P288J2213m033j2206k723r65K235J4710N628q372l921
561b231j653m274L875J4583O877q086o792K8o257Q7J6403P38j6155m478J300k264
577h299L624J0794J145j2061o070N060J219M839J2299k350j1143k372l009p61
$$ plain form
472 3661 -7520 -12827 -4581 3922 8065 7299 1686 -8393 -13156 -5246 2034 3472 6863 -1020 -16810
487 -16810 -13427 2921 9785 9612 9078 5386 -3393 -3682 7989 13177 9467 10151 3774 -10969 -9872
502 -9872 4089 10771 6501 -3641 -11776 -14508 -11917 -3421 1149 585 -151 -8885 -16540 -4906 8840
517 8840 9093 7488 6823 47 -8409 -3100 12966 13418 -703 -3441 -2187 -6991 -4442 4337 8047
532 8047 4988 -4188 -12270 -10277 1387 11267 7473 1888 4451 -1671 -8837 4325 15801 7704
546 7704 -335 -1674 -6439 -12085 -4797 7416 3383 -8823 -11546 -12511 -10276 4434 10062 1690 -2231
561 -2231 -3884 -8158 -4283 10300 17177 9091 2299 2327 -3930 -3843 12560 13298 -2857 -7335 -6035 -8299
577 -8299 -4675 6119 7264 -4797 -10867 -5807 -4588 251 12550 10200 -943 -3315 -6324 -7085
591g085J2027Q890q254j1253K335K458o350K880J2511n972j3049K559N172R18
605b213O231N672k734q453m010L061N030Q310K186j1440o082M164l849k973J1573
620D473O103j0280j0333J948M938n82N072N194q277q304M624N453M749O068j792
635I054q984o324M26L830M508O794q74j4059n616P094K738K180O757k817j1326
650f619k029Q121M782j209L358j08j1781l472R976N851J02K84o372r365j164N495
666d150M839J765K185n290r424N135R357k707q20O987n499j0971L145J1425R89
681F966m483J565k662r660J342Q800J236J046l27r270m280O130M148q03M338M194
697H280r089q706J0204Q764o305p32J801q586n493P173P150M88j417l050p628
$$ plain form
591 -7085 4942 13832 5578 -5675 -3340 -882 -7232 -4352 8159 2187 -10862 -8303 -3131 -2213
605 -2213 4018 9690 6956 -1497 -5507 -2446 2584 10894 13080 1640 -4442 -278 -4127 -7100 4473
620 4473 10576 296 -10037 -8089 -3151 -3733 1339 6533 -1744 -10048 -5424 29 4778 10846 9054
635 9054 70 -6254 -5828 -1998 2510 9304 8430 -5629 -11245 -4151 -1413 767 7524 4707 -6619
650 -6619 -8648 -527 4255 3046 6404 6296 -5485 -8957 1019 6870 6972 7256 884 -8481 -9645 -4150
666 -4150 689 2454 4639 -651 -10075 -4940 4417 1710 890 7877 2378 -8593 -5448 5977 6966
681 6966 2483 4048 1386 -8274 -6932 1868 3104 4150 3823 -5447 -9727 -3597 551 -252 4086 8280
697 8280 -809 -9515 689 9453 3148 2416 4217 -4369 -9862 -2689 4461 4949 3532 482 -7146
712g146l816Q778O362p20J683l820j0300K454J0876K921k110q77l600p086J297
727e104J0354J878o696r93l231p744L750J1194L676l685m439k840j343K468O716
742C961J927j744r53n390l603Q038N812m620l240m10l347m098L949R803j037r054
758d006j041Q49j712M671O664J437k024n395m298J348N397M550k377m205l64l900
774d406k191Q801N114o126n451o51l92K34N390P920k064p774j266l42J460Q315
790F571L205n094n010l042j156L283M539M15n462m118J644j501K041R420M59r074
806b880l629J171K284N010O172N49q279m772L387J428O40M521r15n851k818k388
822f370J823P153L254m772o497M22M291p7L447N622m825p939Q04K827J610K446
$$ plain form
712 -7146 -10962 -2184 4178 3458 5141 1321 -8979 -6525 4351 7272 5162 4285 685 -6401 -5104
727 -5104 5250 7128 432 -561 -3792 -11536 -7786 3408 7084 3399 -1040 -3880 -5223 -2755 3961
742 3961 5888 4144 3191 -2199 -5802 2236 8048 3428 188 -222 -3569 -7667 -3718 6085 5048 -4006
758 -4006 -5047 -4198 -5910 -1239 5425 6862 4838 -557 -4855 -3507 1890 6440 4063 -142 -506 -4406
774 -4406 -6597 2204 7318 1192 -4259 -4910 -5302 -5068 322 8242 6178 -1596 -2862 -3204 -1744 6571
790 6571 9776 4682 -328 -3370 -4526 -1243 3296 3711 -1751 -5869 -4225 -5726 -3685 5735 6194 -2880
806 -2880 -6509 -5338 -3054 1956 8128 8677 398 -4374 -987 441 1081 5602 4687 -1164 -3982 -6370
822 -6370 -4547 2606 5860 1088 -5409 -4987 -696 -773 2674 8296 3471 -4468 -3664 -837 773 3219
838C219K539j400o615n127K932M340L230o15o515k548L301O88J887N769Q33n286
854F32m513J003M831J871K140J206o447o371J847L716L455J570l858l817k870
869e605L08L948K484R63n89n377j534L649L195L631J726n111n335j162L436M606
885C233n38j13j384n917k045M885M062J029j045l018k070j075K396N901K131k550
901C882m469l365L280M133K42l4n41m536m862O29N028L940j987k642j377k721
917e400O63N657L886j048m619l076J740K593J385K608k30k749l674k567L923N781
933D873j033k901k411k634k86L091N015J527m394k784P79o68J772M053K08k640
949A567m045k234J915L156K649J19m587k931k17J300L982K800k407k293r09r24
$$ plain form
838 3219 5758 4358 -2257 -7384 -4452 -112 3118 2503 -4012 -6560 -3259 -2571 -684 5085 5918 632
854 632 -3881 -2878 1953 3824 5964 7170 723 -5648 -3801 -85 3370 4940 1082 -2735 -5605
869 -5605 -5297 -1349 1135 2098 1509 -3868 -5402 -1753 1442 5073 6799 1688 -3647 -4809 -1373 3233
885 3233 2695 2582 1198 -4719 -6764 -1879 2183 3212 2167 -851 -2921 -3996 -1600 4301 6432 3882
901 3882 -587 -3952 -672 3461 3703 3669 3128 -1408 -6270 -5641 -613 3327 1340 -1302 -2679 -5400
917 -5400 -4737 920 4806 3758 -861 -3937 -2197 396 1781 4389 4159 1410 -2264 -4831 -908 4873
933 4873 3840 939 -1472 -4106 -4392 -1301 3714 5241 847 -1937 -1158 -1826 -54 3999 4207 1567
949 1567 -2478 -4712 -2797 359 3008 3127 -1460 -4391 -4608 -3308 674 3474 1067 -1226 -2135 -3059
965c059J775M081L580j474o211j096K301j08K129K907k694m318k755J649M108
980H15J774k46j253l161r91M08J777N030P34n459k662J529J173R31K195J732l635
997F91o064N59M133J227J053j90l289j300q5K386M039J513j520l159k545J571
1013i80K349P66K857j218o554j593L115K036P22j53j153l055k772L003L877l94
1029H53J182n19l975n81K522L260K143j238l717k865m30L707J613j059Q24k190
1045d70m960J929M185L02J84L31j359l663r08O420L601k697r79k138k554K141
1061f35K705J04K00k280l132j897K186M192o26j357J607l056m052N087N939j654
1077C331k488r76q33n27J718L675L6k465j018l280j292M637J820k477j16j769
$$ plain form
965 -3059 -1284 2797 6377 4903 -1308 -2404 -103 -211 1918 4825 2131 -2187 -4942 -3293 815
980 815 2589 2343 1090 -2071 -3062 -2654 -877 4153 4887 -572 -3234 -1705 -532 399 2594 4326 691
997 691 -5373 -4814 -681 546 1599 1409 -1880 -3180 -3265 -879 3160 4673 3153 -6 -2551 -980
1013 -980 1369 2135 4992 3774 -2780 -4373 -1258 778 1500 1347 194 -2861 -5633 -2630 1247 853
1029 853 2035 1516 -2459 -3040 -518 2742 4885 3647 -70 -2935 -3365 342 1955 896 1720 -470
1045 -470 -5430 -3501 684 986 1170 1501 142 -3521 -4429 1991 5592 2895 1916 -222 -2776 -635
1061 -635 2070 2174 2374 94 -3038 -4935 -2749 1443 817 -540 1067 -1989 -6041 -954 4985 3331
1077 3331 843 -133 -966 -1493 225 3900 3936 1471 453 -2827 -4119 518 2338 -139 -255 -2024
1093b024l115N99N440K979k794j743Q61k309r08O026J624l030q17j436j994J211
1109a430L402J525k284k520q56j803J894N028p44k846L80j206j718L705L752j75
1125D104l496j202J64k200J301N166n14m669j671l44Q85K277J528k91k200j642
1141b804k61P57L214L847k973l004J116m86j53L672K551l051m726j42K287n52
1157g08R61K921k255k907J43k71J306L515K97k925k927P22J193M30K730J287n200
1174a688j965K645j66k93K820R99l079k762J416J559L50L132P02m229j249K657
1190H49O62N37J636j858l069kR98R1P49L022j257o162k32L054j90J681L194k729
1208I74m605n4L296J205k68J361r28l368N44R00n85K866J452m560l093K781K417
$$ plain form
1093 -2024 -5139 -4540 900 3879 1085 -658 203 -2106 -3014 3012 4636 1606 789 -647 -2641 -1430
1109 -1430 1972 3497 1213 -1307 -2163 -3966 -2072 2956 2212 -634 -254 -1460 -3178 527 4279 4104
1125 4104 608 -594 -430 -2630 -1329 3837 3323 -1346 -3017 -3361 -2476 -199 1329 1038 -1162 -2804
1141 -2804 -3065 -2308 906 4753 1780 -1224 -108 -594 -747 2925 5476 2425 -2301 -2443 -156 -708
1157 -708 253 3174 919 -1988 -1845 -2116 -810 2705 3002 77 -2850 -2128 -935 -505 2225 3512 -1688
1174 -1688 -3653 -1008 -1174 -1467 1353 2352 -727 -3489 -2073 -514 -164 2968 3670 -559 -1808 849
1190 849 1511 2048 3684 1826 -1243 -1245 -247 -156 593 3615 2358 -3804 -4036 -982 -1172 509 3703 974
1208 974 -3631 -3685 -389 816 548 1909 981 -2387 -1843 -943 -1528 1338 2790 -1770 -4863 -2082 335
1225C35J095Q03Q19l179l313L719L168j735R69R08k715k058O33J606J469m14j809
1242C01l326j299L178J616j550Q80q15l407O86K948J749K51J013J26l562j915
1258c126L341K543r01L18j111k865L69J956K10j98p94j90k044J83L089J629p30
1275A679O77k006k718K293L167L41j448l47j575k847k99L819R15k935o16j004
1291b904j714K190K364K67j85j371j349L13K765L557o15j328N08k081k559L663
1307A521K978j756k284r06r11n96J147J960j143j897O52o53L6L459P67j474o94
1324B06p94j140J262K947J025k643j830N12j918l67K998M07k091l94k64n56J240
1341a400K366J331j598j151L72l10J790L313j367k033l50j406n78J499K002q33
$$ plain form
1225 335 1430 2233 3052 -127 -3440 279 3447 1712 2681 3589 874 -1184 -551 1055 2524 2110 301
1242 301 -3025 -4324 -1146 470 -1080 -200 -1015 -4422 -3736 -788 961 1212 2225 2351 -1211 -3126
1258 -3126 215 2758 1857 2175 1064 -1801 -1432 524 734 536 -258 -448 -2492 -2309 780 2409 1679
1275 1679 2356 350 -2368 -75 3092 3433 1985 1638 63 -2784 -3083 736 1651 -1284 -1900 -2904
1291 -2904 -4618 -2428 -64 203 18 -1353 -2702 -2389 376 3933 3318 1990 2498 417 -2142 1521
1307 1521 4499 2743 459 -447 -1358 -1954 -807 1153 10 -1887 -1235 -1888 -1852 1607 2374 900 206
1324 206 -588 -1728 -466 2481 3506 863 -967 -455 -2373 -2740 258 665 -1426 -1820 -2084 -2640 -1400
1341 -1400 966 2297 699 -452 -80 -390 1400 4713 3346 1313 963 -443 -1021 478 2480 1647
1357A647k212j458Pj029J011L156j064k357M1Q78J229J526K44j69j635j270Q60
1374e95O75J996J343k911k114P1n17R81K100O11j513k163M84J333j4J118J763
1391B648j605j572j51Q68J871Q89j297j596j744j71J295L07J064r5k510n36P50
1408a585K81O28J770J43j831j239R79K375K92K33n55k243r54J780P64P17j66j571
1426a82j250j034Q47J406J099R85r43k912O41J947N88N69l52j486j278L20J713
1443F78P46p28m12n35k114J43J368J296Q72n42k282k87J194J208J519l88n03j241
1461hj242J606Q89m67k71m43j392q28M52J873J657j558j463p53r4J683J522J96
1479A359Mq20j259M05Q82J201K07j219q99p75p64J574J510q92j343p32l95J120
$$ plain form
1357 1647 -565 -2023 -2016 -3045 -2034 1122 58 -2299 -2258 -1380 -151 1375 1619 1450 -185 -1455 -595
1374 -595 80 2076 3419 508 -1606 -1535 -2052 -1071 1029 1640 127 -2036 -1552 -219 -233 885 2648
1391 2648 1043 -529 -680 188 2059 2948 1651 55 -1689 -1860 -565 -258 806 711 -1799 -2335 -1585
1408 -1585 -1304 -676 1094 1237 -594 -1833 -854 1521 1813 2046 1491 -752 -1706 74 838 1555 1389 -182
1426 -182 -1432 -2466 -1619 -213 886 1871 928 -1984 -1343 604 1192 1761 1409 -77 -1355 -1035 678
1443 678 1424 696 284 -251 -2365 -2222 -854 442 1314 772 -1510 -1797 -603 605 2124 1736 1233 -8
1461 -8 -1250 356 1245 778 507 64 -1328 -2156 -1704 169 1826 268 -1195 -1948 -2042 -359 1163 1359
1479 1359 1363 543 -716 -311 571 1772 1979 760 -139 -914 -1678 -104 1406 514 -829 -1561 -1956 -836
1497h36J104J235J57j695n37q2J18J766P99p12n26j593m93O71J107Q3o63j611
1515a708p15L37N82K028L62j232l81R6L66J083Q83R41m20k219n13R26O04N27k23
1534A324j294q94o44J20J186M72k85j252q04O49R36L20J697M04k076p36M00J149
1552F72P97j49k47j258j568O54J320j20O82o45j696J74O06O13Q91N62o97j218
1570f27m64K031P10l41R49n84k288o6O40O26K83n75r02j250m34J390R38l62M96
1589A70j090j090R35J042N38R93l13r21j057K73J647J55o4L15j865j407J381J308
1607I50P3m01p67o04m62O56J205Q48r06L3j372l83J760J88m08L32o96j313l66
1626a633J247J469q47r12q8p74k89J576J062k09n46n97p83J077J025R28o57n41
$$ plain form
1497 -836 268 1503 1660 -35 -572 -654 -536 1230 2029 1317 791 -802 -1295 -624 483 566 -97 -1708
1515 -1708 -2423 -2086 -1504 524 886 -346 -727 -631 -265 818 1701 2642 2222 3 -510 416 1020 1547 1324
1534 1324 30 -864 -1508 -1388 -202 270 -15 -1267 -2071 -1422 -486 -166 1531 1935 -141 -877 -477 672
1552 672 1469 1320 1073 -185 -1753 -1099 221 101 783 138 -1558 -1384 -778 -165 726 1288 591 -627
1570 -627 -1091 940 1650 1309 2258 1674 -614 -680 -40 586 869 294 -608 -1858 -2292 -902 36 -326 170
1589 170 -920 -2010 -1075 -33 505 1498 1185 264 -793 -520 1127 1282 1218 1533 -332 -1739 -358 950
1607 950 1023 622 -145 -749 -1211 -555 650 1498 592 625 -747 -1130 630 818 410 742 46 -1267 -1633
1626 -1633 -386 1083 236 -676 -764 -1538 -1827 -251 811 602 56 -541 -1324 -247 778 1706 1049 508
1644E08l84p98L03J694J76p06k85o37p60K26J534O77j490p23R7o60R34J209l38
1663E77j133m9m02j77M31J326k1j118o81M07k29P82J942r78j053M18j27m6O92
1682E61R55k20j445j89L84p89J080J517j300j237n0j00K57J282J58q54m18K57
1700a51k27o80K015J057j993j225Q51k2j26P18K33j186r49K77R28o3Q16K06j314
1719h35M38L55m36J199J639n87j521m11J049l6j49Q74n39j880j16M02l86M99J214
1738G73q97j391k1M79N66M60R73m87j279M59O49p8P91P3n30q53l31L98J98J90
1758A42M53j147j513R82J102j54L76M13n85m71K94Q32M97L61p2r60r24O15L74
1777F15o33J058o94j735m42Q61M91k50j97N10m69j194J541J088l1N01l93r59M74
$$ plain form
1644 508 124 -674 -371 1323 1499 793 508 -129 -889 -663 871 1548 58 -665 -568 -1228 -294 915 577
1663 577 -556 -605 -1007 -1184 -753 573 552 -566 -1247 -840 -1069 -287 1655 677 -376 42 -85 -131 561
1682 561 1516 1296 -149 -338 46 -743 337 1854 554 -683 -733 -833 -576 706 864 10 -408 -151
1700 -151 -378 -1058 957 2014 21 -1204 -353 -375 -501 217 450 -736 -1685 -1408 -480 -543 273 479 -835
1719 -835 -397 -42 -478 721 2360 1773 252 -159 890 854 705 1579 1040 -840 -956 -554 -940 -441 773
1738 773 -124 -1515 -1536 -1057 -491 -31 942 455 -824 -365 284 206 997 1070 540 -313 -644 -246 -48 142
1758 142 595 -552 -2065 -1083 19 -135 241 654 69 -402 -108 724 1221 1582 1510 550 -374 241 615
1777 615 -18 1040 346 -1389 -1831 -970 -479 -729 -926 -416 -885 -2079 -538 550 519 1020 627 -332 142
1796A42N40N54P8j39p12j174l66J514j20q44N77l46j281Q0J741J63J3j36o8q30
1816f14M24J408L4n30J28n05j485O72N79R6j32m93m28o11L71J478m81m19N50o53
1836f11m31J577O86l16Qj82l97m05L27R99n07p75J54j137k89J066N84q70L90j61
1856b90q01L09J037P35p14o52Q91o92j53J214L56o81l22p40l50M99L51N82r53
1875c74n9j60n67N59J168r8l01l40K44m5N19L78K98r15q37L05j92M09R37r96n05
1896e72K5j89k48N74R24J90j088j63N55L8O86J86p25k25L41n49j31P69L80l63
1916D15j217k55P01k84N47O73m65q15L65K41L07L08K15m34l80L00l01J21Q00r6
1936G46j412n35Q14j70J64N38K4m72p26K93R00L6O68Oq78J29K06l68O51L44o98
$$ plain form
1796 142 682 1236 1314 1175 463 -711 -1077 437 317 -527 50 -296 -1577 -1497 244 407 420 284 216 -614
1816 -614 -190 1218 1252 722 850 345 -1140 -468 111 207 75 -418 -846 -1457 -1086 392 -89 -508 42 -611
1836 -611 -1042 535 1221 905 913 731 334 -71 256 1255 748 -27 127 -1010 -1299 -233 351 -519 -129 -290
1856 -290 -1091 -782 255 990 276 -376 515 -177 -330 884 1240 559 237 -503 -853 -354 -3 579 -374
1875 -374 -433 -593 -1160 -601 567 469 168 -172 72 27 546 924 1222 307 -530 -225 -417 -8 929 -67 -572
1896 -572 -547 -736 -984 -410 514 704 -384 -547 8 46 732 918 193 -32 309 -240 -371 398 778 415
1916 415 -802 -1057 -356 -640 -93 580 115 -700 -335 -94 213 521 736 302 -78 222 -79 42 842 746
1936 746 -666 -1201 -387 -557 -393 145 169 -303 -1029 -736 164 200 868 874 -4 125 331 -37 614 958 260
1957B60n69m71N66M76l80J74q5j291J08P48K62O85j32k83j62J17N06J51j55M47
1977I72l10j195N66K22j85J43k29p68J37R3K57M04K1K39m73n44N53N25j4J76J89
1998G79m08n75K6P38j27n82k94j06m10M28J30J31Q1k3p39O6N54J078K1m00K90
2019F58m13l69K26Q81k88k55n13k07J48J16k9K53r16L38n18J68J094j26j14j68
2039c4j57JL49Q8O10n9q04k52j25q0M95N00q49O6j87k68L24K16K99k84k78M89
2061F0j7K7M86J85l7l78j47j59M20J87j11n02n06K25j31j01N52l1p63R7K33K54
2083a57K17K09J98Nr02L39L79N4P33p20o45J37j71J7L91R3K3m78o15Q00M19k79
2105D7K84L5m27j79N2N80O9N4n67k64M7M38j68J12J66n93n31M69J02L31J69j78
$$ plain form
1957 260 -309 -780 -214 262 -118 56 -29 -1320 -1212 -464 -202 483 351 68 -94 23 529 680 525 972
1977 972 662 -533 33 255 70 213 -16 -784 -647 -554 -297 107 128 367 -106 -650 -97 428 414 590 779
1998 779 371 -204 -178 560 433 -149 -443 -549 -959 -531 -401 -270 -189 -212 -951 -885 -331 747 768 368 658
2019 658 245 -124 102 983 695 440 -73 -280 -132 -16 -45 208 -708 -370 -888 -720 374 248 134 -34
2039 -34 -191 -190 159 247 857 798 -6 -258 -383 -463 32 532 -317 -251 -438 -706 -382 -166 133 -151 -429 60
2061 60 43 70 556 741 704 326 179 20 440 627 516 14 -492 -267 -398 -499 53 22 -741 -644 -411 -157
2083 -157 60 269 467 472 -430 -91 288 342 1075 355 -290 -153 -324 -307 84 177 200 -278 -893 -93 326 47
2105 47 331 366 -61 -240 -188 392 461 515 -52 -316 -269 169 1 113 279 -314 -845 -376 -274 57 226 48
2127D8l40J9L79R0j14J40L30q12k24O58j68K61M6l03k52l41L32N95k84J4M8m43
2149c21k1M98p6K41K13m29l23K4J18N19m07l06K39m27J09J6J92K26j77j21j17
2170c30J73J58N51j85k42J89n71L12O36m61l68K64l41K31n24K46M03R4l73j19
2190b57o27O50R47m73Kj19M2k52L2M20L11o71J05K8m45N6N47n09J17l60n7j55
2212f68P63K10R8j62l63O56o05M10L27o2k26l46k99J78J51K36j62j44j81m27O5
2233e51P40M9r77K23P82l55k41P20J2J20m22j27K14J62L87k75r82K23K02l91L41
2254a46L51j14n85l0K94r5L09J76L8J13l33K13k82L76L58k45l54j62L1j38j63
2275c88M75k43o10K87K21L13K23k05m7j09K00J26O3k66M96n32l62N49K34o74K16
$$ plain form
2127 48 -292 -273 106 196 82 222 552 -260 -484 174 6 267 313 10 -242 -583 -251 344 60 74 122 -321
2149 -321 -342 156 80 321 534 105 -218 -194 -76 443 36 -270 -31 -458 -349 -333 -141 85 -92 -213 -330
2170 -330 -157 1 552 367 125 314 -257 55 691 230 -138 126 -215 16 -508 -262 141 235 -138 -257
2190 -257 -884 -234 713 240 242 123 165 -87 -55 365 676 5 110 138 -307 -251 296 -213 -96 -456 -513 -668
2212 -668 95 305 403 241 -122 534 -71 339 666 604 378 32 -267 -89 62 298 136 -8 -189 -616 -551
2233 -551 189 238 -739 -516 266 -89 -330 390 402 522 100 -27 187 349 736 461 -521 -298 -96 -487 -146
2254 -146 205 91 -494 -524 -230 -325 -16 160 198 311 -22 191 -91 285 643 398 44 -118 -87 -225 -388
2275 -388 87 -156 -766 -479 -258 55 278 73 26 -83 117 243 306 40 536 4 -358 191 425 -249 -33
2296c3J60m28k24J71K33R1Q1J51k41q8L44j87L18j2l9l63K03M1J16j84l59M45
2318A96m1r78P21J11j69M72l37o01O07P4r8ML31Q7o62K7P01K55o51K79k8p01K29
2341a72N00m53L07l20j58k64K78O61m51j63Q51o62JK36J42Q7l00kk9m92M34J91
2363B22k74k8om65R9M02q5r4M17j08k52K11k20P05k15k36J89m71K04J74r0j03
2385b4j85j97O9K0L67j8l27K98J42j05j83L29M3q0J84q0k62KK39j55j58l58M98
2408E9m22l6M25n0j86QK26j16Q2J33J37l02L07m8j39L80o6j19m06l6m4O0J5L22
2432A84j62m57R9K15j88K77K59k20Q3k61K72j6K34P9k75l83O78p01L4L26k2p0
2454a5m69L81k67M30k2K7l5j39J07J80O1K83j8n31Q8R1J07j75o5J18l79l55K76
$$ plain form
2296 -33 127 -301 -525 -354 -121 -30 51 202 -39 -127 217 30 348 336 297 -66 137 178 294 110 -249 196
2318 196 155 -823 -102 9 -160 312 -25 -626 -19 55 -43 -39 292 379 -283 -256 445 700 49 328 300 -401 -172
2341 -172 328 -125 182 -138 -296 -560 -282 379 -72 -235 616 -46 -45 191 333 420 120 118 89 -403 31 222
2363 222 -52 -80 -86 -551 -452 -50 -135 -229 188 80 -172 39 -181 524 309 73 262 -209 -5 169 79 -24
2385 -24 -209 -406 -337 -317 50 32 -295 3 145 40 -143 186 229 149 333 253 -9 -7 232 77 -81 -439 59
2408 59 -363 -399 26 -24 -210 -202 24 -92 -10 123 260 -42 265 217 78 458 392 273 -133 -169 -213 -153 -138 184
2432 184 22 -435 -336 -121 -309 -32 227 7 90 -171 101 85 319 398 123 -260 418 -283 -249 77 55 -15
2454 -15 -484 -103 -370 60 38 65 30 -109 -2 178 239 522 504 -27 61 152 259 84 19 137 -242 -597 -321
2477c21L19J80K1m02k37K78k6rK41R8k53K34l04K82L78n30K62N8n11J06j22K83
2499B5N8l58j36K44k9K66j50O3K78n4m31L94K82j58J0n5l77M51o02N32m9k53J37
2522H8k84j76Q9M05k00K14k42j4J4j24N24K05l20K61k97j31K97j64j90M33k56
2543A32o49O5mO88l00j5j3n0m23Q10RJ0j02l47N1J74K03k86L37n03L06n93J83
2566c17L84j43r1j99m2K79j0K12J11m3j23j78K04O2M12m02k8l6J74l74L9J64o4
2589ik09j80K09r1J34K43M0p2p9j67J44L03j86n1L9j5j62OP2J59o6l14j06M2L88
2614G2j27j69J52P8q2mJ31n5K13J12l30K25l74K82J12l09L78m30j19M92m59p7
2636b88M39l62J56k09J71j28L26j29P1K4j51N41m52K80l67J16m20K76M0r2K47
$$ plain form
2477 -321 -2 178 199 -203 -440 -162 -188 -197 44 142 -111 123 -181 101 479 -51 211 269 -242 -136 -258 25
2499 25 83 -275 -411 -167 -196 70 -80 -17 261 207 -224 170 452 294 304 249 -128 323 -279 253 204 -49 88
2522 88 -196 -372 -283 122 -78 136 -106 -120 -106 -230 294 499 179 440 143 12 309 145 -45 388 132
2543 132 -517 -452 -456 232 -68 -83 -96 -146 -569 241 250 260 158 -189 -138 36 239 -47 290 -213 93 -500 -317
2566 -317 67 -76 -167 -366 -408 -129 -139 73 184 141 18 -160 44 106 518 116 88 52 226 -148 -109 55 -9
2589 -9 -218 -398 -189 -280 -146 97 137 65 -14 -181 -37 266 80 29 68 53 -109 -103 -31 128 62 -252 -358 -316 72
2614 72 -55 -224 -72 6 -76 -80 51 -4 209 321 -9 216 -158 124 236 -73 305 -125 -244 248 -211 -288
2636 -288 151 -211 -55 -264 -93 -221 105 -24 47 71 -80 461 9 289 -78 38 -382 -106 -66 -158 89
2657H9p3k63J91k65K89k0J28J66k69r9L76j56l8K67l76rJ39r6K55j58k39P5l24
2680d10J43K08q6J11o5J10j18j09L73nk84M6L94l12KP7J81j23k74k5m9J6J91m53
2704d61J02N15j17k18L30j91K53p6K3q8k3J34m3j35J32R0l22k38J17J73k69J57
2726a55l2k3o8J13M12k7l02RL9J11L03j56j00k83P6LJ22j79j87P1L7p6J97k4Q9
2751c0J0K25k45k05L71J23o8j24R5P4P6j72j72K53K08n34K26k11q8r2J3L10l51
2774c08J96J05K45J39j28k77l7M75m34J91j07n6L16j74l49K8R8k43J88K7j87J09
2796a83Q1J65J9l7L0m7J13J43k07l81O55l06k55K67NJ10m49j96M25j14j89J33
2818b18O8K79J60k70k1J0m6J32K97k19R3m21J05J31M4j82J6j15r3L56k54j14L10
$$ plain form
2657 89 16 -247 -56 -321 -32 -52 76 242 -27 -126 250 94 56 323 -53 -62 77 -19 236 78 -161 -86 -410
2680 -410 -267 -59 -145 -34 -99 11 -107 -216 157 152 -132 -86 308 -4 -2 75 256 133 -141 -166 -215 -199 -8 -461
2704 -461 -359 156 39 -179 151 -40 213 137 160 72 49 183 140 5 137 227 -95 -333 -216 -43 -312 -155
2726 -155 -187 -210 -278 -165 247 220 -82 -73 -34 77 380 224 124 -159 -83 -80 42 -137 -324 -253 -216 -292 -95 -119 -30
2751 -30 -20 205 -40 -245 126 249 181 57 152 226 302 130 -42 211 419 -115 111 -100 -188 -280 -267 43 -308
2774 -308 -112 -7 238 377 249 -28 -65 410 -24 167 60 4 320 146 -203 -175 -77 -320 -132 -105 -292 -183
2796 -183 -102 63 82 45 75 28 141 284 77 -304 351 45 -210 57 62 172 -277 -473 -48 -162 -351 -218
2818 -218 -150 129 289 19 -2 8 -38 94 391 172 265 -156 -51 80 124 -58 -42 -157 -250 106 -148 -262 48
2841D8j16j05K93k61K36n8J18K9k48j1n7KN9J13j1j01J38k29J3r2n1J85n1j38
2865b95M88j90j42J14nJ49r4R7L1r2n9Q9k63J75J65m17K65j83J4r8J81j26M88
2888B92k40o0L58n08M12J8m58M15Q0l80j9L8J64k95om3j12j35J73K20O8j49%J2
2912a55J31K56k75M73k14j0m16P8M76k20j92j27N09l00j67R1K07P7m57j9J74K30
2934A50o6L36n25K34r7J44l25L60k00q9r7J56j72J9K4R3k63J80M3p7M54k95M2
2957B9k0M87m04j39J70J13L9k3l90n5J93m9J52k58K37l62j7K47J39J68l28J01
2979C0M6j38J89K49j98j23j03J17J33k82k44M54r7k63R1J3NL66k53o9J1K24k45
3002h7K85K21l01j41J00l1K30j15j15R4p9j04j20j01N64k99k8k14Q0R4J2O7N2
$$ plain form
2841 48 -68 -173 120 -141 95 37 155 184 -64 -75 -132 -130 -71 42 31 -70 68 -161 -148 -240 -291 -106 -157 -295
2865 -295 193 3 -139 -25 -30 119 25 122 153 61 2 91 -172 3 168 -249 16 -167 -153 -251 -70 -196 292
2888 292 52 -8 350 -158 254 272 -186 229 309 -71 -90 -52 112 -183 -189 -232 -344 -479 -306 -86 -18 -167 -167 -155
2912 -155 -24 232 -43 430 216 206 -210 -132 344 124 -68 -195 314 14 -153 -62 145 222 -235 -254 -80 150
2934 150 84 420 -105 129 32 176 -149 211 11 -78 -175 -19 -191 -172 -148 -55 -318 -138 -95 -172 282 -13 29
2957 29 9 496 92 -47 123 236 275 252 -138 -193 0 -49 103 -155 82 -280 -297 -50 89 257 -71 30
2979 30 76 -62 127 376 178 55 -48 69 202 -80 -324 130 33 -230 -139 -126 -121 245 -8 -77 -66 158 -87
3002 -87 198 419 118 -23 77 46 276 161 46 140 61 -43 -163 -264 300 1 -27 -241 -161 -67 -55 12 64
3025F4J80j87K15j57J1j01O2j23K40l39L80l84J52J11l23J14qK04q7r0j3J93N8
3048A72n6K30l35L00j03k98L31j68N2l02m2J41q7q4j5L04j11O3K2O8J02j48k38
3071b02K23O3R8l17K52p3J18k89j7K56j2l23K00M1k3Qk03L1Q5K11P5k28J39k40
3095a27m8J82K32k58J37j6l37L15K9j57L9mr0o3J71J08k56J78Q2r3J43k34L93
3118C26k76P9j5J19l02o7O1Kk49O6J67J2L50m66R8J80J44l3j14m9L33q4k54n5
3142b7K07j03N5j87K38j69j19J35L8q1j7j2j58J12k00K70k57K38J86m8l19K46
3164B8R6q8j5L3m53L15k6n8K29l00K48l57J99M59j57k40K28k7N4k8J38j47L56
3187D87m15PJ00k92L06l40o7M03k90j83k2K29j01J22J52%Jk37O6K75R0j87p8P0
$$ plain form
3025 64 244 57 272 115 126 25 87 -36 204 -135 245 -139 13 124 -199 -85 -93 111 24 -66 -79 114 172
3048 172 116 346 11 311 208 -90 241 73 125 -177 -219 -78 -165 -249 -264 40 -71 -8 14 82 184 36 -202
3071 -202 21 84 182 -135 117 44 162 -127 -144 112 100 -223 -23 18 -5 3 -200 -169 -84 127 202 -26 113 -127
3095 -127 -175 7 239 -19 118 102 -235 80 109 -48 -9 -13 -103 -166 5 113 -143 35 117 24 167 -67 326
3118 326 50 129 114 233 -69 -136 -75 -73 -322 -256 -89 -77 273 -193 -95 85 229 196 82 33 366 282 28 -27
3142 -27 180 77 132 -55 183 14 -105 30 68 -13 -30 -42 -200 -88 -288 -18 -275 -37 149 101 -218 28
3164 28 124 36 21 54 -399 -84 -110 -168 61 -239 9 -348 -149 310 153 -87 141 114 168 140 278 131 487
3187 487 72 79 179 -113 193 -147 -214 189 -101 -284 -306 -77 -178 -56 96 96 97 -140 -74 201 291 104 26 96
3211I6k67L05j4j15J46j76k60J29K43k55M7PJ02j43K33Q5k96N76l16l3l30K95
3233E9L8m6N0l43K25k37J73P3j72j27n7J95Nj13L82k11J07L88l47J99k47K40j89
3256D5OJ13k6l47L64q2j48jj39J51j6L9J29J4oJ08k10K3L0L34m04K40j74j6k3
3281Dj24NP4O6l00Q1l4M6K30q0Ml24K68K07J86j3j16j41K56j8k59l02K50N3K4
3306D3j66N4k74L11l73Q0L44q6K40q4L0JM8r8O2Q0kk05j07j11J64p2L85l92nL29
3332A96l63J75J64j22l12L54o3j07J09R4J61j01j59K30k02J51k08M3pj11n5j80
3354c13M38m62L6K89p0K67l07m8J05J38Q0M4l29K28J25m48L14K88n02j59L84l70
3376b72K25K3k7J16j62j37L27k1J94j31P5j47l16M7K41qj97K83K4l63L44p7m10
$$ plain form
3211 96 -171 134 120 5 151 -25 -285 -156 87 -168 -121 -114 -12 -155 78 163 -133 443 127 94 -236 59
3233 59 97 51 101 -242 -17 -254 -81 -8 -180 -307 -364 -169 -164 -277 105 -106 1 389 42 241 -6 234 45
3256 45 51 164 138 -209 155 73 -75 -76 -215 -64 -80 -41 88 102 96 204 -6 17 47 381 -23 217 43 27 4
3281 4 -120 -115 -41 25 -275 -194 -228 -182 48 -32 -28 -352 -84 123 309 296 180 39 295 277 18 -284 -34 19 43
3306 43 -123 -69 -343 -32 -405 -325 19 -67 173 89 119 120 168 70 132 212 210 5 -102 -213 -49 -121 264 -128 -133 196
3332 196 -167 8 172 50 -262 92 29 -78 31 125 286 185 26 256 54 205 -3 40 33 -78 -133 -313
3354 -313 125 -337 -301 -12 -82 185 -122 -170 -65 73 153 197 -132 96 221 -227 87 375 -127 -286 98 -272
3376 -272 -47 -24 -51 65 -97 -234 93 72 266 135 210 63 -253 -206 35 27 -170 113 137 -226 118 41 -369
3399c69L82k86P2J13K9K05K4k35Q0m8P5q1P9K66k73k12K09j38L11j62l82M36o3
3422C2k05O8J48qJ02q0k8J36n9J55j97J20j25oj19J41K8m57K41j45J08K10k13
3445a53j7nK85j19l1J58L52m88k0Q1J01j83j82J57r8K36k69K22k12r4k9K97j98
3468b09J86r3J03R1k13M65l74PL2Q6n7m2J6p5K9L1j73K07O9l13L47k16q9m0M2
3493a83K88L4l43K8Q9J67J30j65J30l35m1j33L5K05N7j67L45oj50l28M36j48J64
3516A09k24P0Q0k95L37K52k27O6k70K21q9j25M3p6nk08N68n88K09K77r0k13L43
3539A65K10l88J09j34K66Q6n06L88q0O3k72L2r8J90L6j24K00k57J19j44P4K05
3561A40n4R4r4K44l45J50q6j5o0j04J57N1k37J09L3P9r0j61OJK1M0L15q4j8Q9
$$ plain form
3399 -369 13 -273 -201 -88 -59 146 170 -65 15 -33 42 -39 40 306 33 -179 30 -108 203 41 -341 95 32
3422 32 -173 -105 43 35 137 57 29 165 106 261 64 184 59 53 -66 75 103 -354 -113 -258 -150 60 -153
3445 -153 -170 -175 110 -9 -40 118 470 -18 -38 43 144 -39 -221 -64 -162 74 -195 27 -185 -279 -308 -11 -209
3468 -209 -23 -116 -13 78 -135 330 -44 -37 -5 81 24 -18 -2 -77 -48 -17 -190 17 86 -227 120 -96 -185 -225 -183
3493 -183 105 139 -204 -176 -87 80 210 45 175 -160 -201 -334 -299 -94 -37 -204 141 135 -15 -343 93 -55 109
3516 109 -115 -45 35 -260 77 329 102 168 -102 119 30 -95 -52 -128 -133 -341 227 -361 -152 125 35 -178 165
3539 165 375 -13 96 -38 228 314 -192 196 116 179 -93 -61 -159 31 67 -57 143 -114 5 -139 -65 140
3561 140 86 180 86 330 -15 135 49 34 -26 -130 27 78 -159 -50 -17 62 -28 -189 -183 -182 -161 -121 194 110 92 181
3587A81j7j5q2J74k56j95J43k7J06l0J58m64K86P7j57J3K46j06k93M83L2j69j80
3610i2J77N2k36j1j7J38J28J0k42J06k74J29J36P7j90J36j30K7R8O0N0L3k59J82
3634H8j94J42K1Q8k91JJ26L8k71M1J46N2j05J30l23K74L02j19R1k85N8j86J22
3657e4P8N1m9j13J06m0j70J1j92M26K7l07K10M3J6r8K39k17Q4P0j45M54l67J22
3681A85j33n6J92P0n45J41j55J56k6Q3PJ43l47K20J53p9K15r9J65k42J47K0j88
3704B7J57l13J69Qn5k75j47J16L20r3J08j3j02K39j17L51o5k27j03J85L8J47l73
3727a8j38k2j61R4J63lj14q9J7J5K68k50L38k0J98m01J15K01p2JQ6j44J13oj12
3752E9j65K32J00l46P3n0J03j57L4K39j51K28p8j53j5L28j8j93j68J24np5j75
$$ plain form
3587 181 164 149 67 241 -15 -210 -67 -94 12 -18 140 -324 -38 39 -118 -105 141 35 -258 225 257 88 -92
3610 -92 85 137 -99 -110 -127 11 139 149 -93 13 -261 -132 4 81 -109 27 -103 -76 22 82 132 165 -94 88
3634 88 -106 36 57 145 -146 -145 -19 19 -252 -211 -65 -13 -118 12 -311 -37 265 146 237 -48 10 -176 -54
3657 -54 24 75 26 -87 19 -21 -191 -180 -372 54 81 -226 -16 27 43 -55 184 -33 51 121 -24 430 63 185
3681 185 52 -4 188 258 -287 -146 -301 -145 -171 -88 -81 62 -285 -65 88 9 224 125 290 48 195 215 27
3704 27 184 -129 40 48 -7 -282 -429 -313 7 -86 22 9 -93 146 29 380 315 88 -15 170 208 355 -18
3727 -18 -156 -178 -339 -245 -82 -85 -199 -288 -271 -256 12 -238 100 80 278 -123 -8 193 121 122 208 64 177 171 59
3752 59 -106 126 226 -120 -47 -97 6 -151 -117 122 -29 199 121 -32 -47 281 263 70 -98 26 21 -54 -229
3775b29M2J06k83M32j34J12j51j98M4K12P7j3J12R3m14K12O9K1j8r0J78%j88%
3799hr0M3K52k07J78k41m40N89j18L22j57k83J97M3Pj73O4k6k5J73l48K11J45
3822A08j12o6k12J66L8j79K12J31l0J63n30N34l14K21j72L22l28M32n44k47K00
3843b07J60l07L14l05O2K8kK63l53N09k78J56K20j37n0q6j9K66l13J02k71K05
3865d3k16J09j36L89l34J83J76j29J1j10J28J70k37p7N28m10L4m7k06O4J32Lj34
3888a52L01Qq9j03k38O29m37p7L93l20J92j48M1K46M0l03K19m65K62k15J84J0
3910b2j24q3J36op1L5L07j9j8O1j22j04L1K33O5k71k9P4j77O2j86K01P8n09N15
3935E7j49k03K7L12j12K33l18J39j91L14Qo2M10m76L9j7Nl68J56J75k73Mj7M34
$$ plain form
3775 -229 -187 -81 -364 68 -66 46 -105 -303 -259 -47 30 17 129 222 -192 20 89 110 92 2 180 180 -8 -8
3799 -8 -98 -55 197 -10 168 -73 -513 76 -42 280 123 -160 37 80 87 -86 -22 -48 -73 100 -248 -37 108
3822 108 -4 -70 -282 -116 -78 -257 -45 86 56 219 -311 223 -91 130 -42 280 -48 384 -160 -407 -207
3843 -207 -47 -354 -40 -345 -283 -255 -257 6 -347 162 -116 40 260 123 73 -13 -32 234 -79 23 -248 -43
3865 -43 -259 -150 -286 103 -231 -48 128 -1 10 -100 28 198 -39 -116 412 2 36 -11 -217 -153 -21 -18 -152
3888 -152 149 157 68 -35 -273 356 -81 -158 235 -85 107 -41 0 246 286 -17 202 -263 -1 -216 -32 -22
3910 -22 -146 -229 -93 -99 -170 -135 172 153 135 196 74 -30 1 234 299 28 -1 73 -104 -42 -228 -27 51 -458 57
3935 57 -92 -295 -268 44 -68 165 -153 -14 -205 109 117 55 465 -11 28 11 16 -352 -196 -21 -294 -290 -307 127
3959A27l45J32P1J91l4Q2o7r3l57M15j8k48K46j27O8P1j62j32K08o6J15l43J13
3982a53K18k12K21m2M1m7p8j81N42j5j38l1K5l03J94k43J19J81l92J17N8M7K44
4005A72j21j72L9j05J33K72l00J31Q1k67J74j36J16Q5m7j17l7j28K43Q6m19%K78
4028c9n1R5Kk72K95K15j32r3K60k24j03K34m44K56J34m73J63P6K87j95K9k2j42
4051a44L16R0l38K76J17o21N53k61J29l29L65j29j11k9q4J63M7o1J20m3l85L60
4073Aj31M23l89N5J28r3nK32k08j08N06k13k07q5Q2K2K17n14Q5k16O19k84L20
4096B37k03L77k50m7K47l56J34j21J37j08Pj81L10j61k4j21OR7R9k38J82J20p0
4119G3K3jMJ9J41n1Q3l17J53P6m23K7J01p2K64j49p0J93j06O6k40J2K62J8J69
$$ plain form
3959 127 -218 -86 -15 176 142 224 157 64 -293 122 104 -144 102 -25 43 114 -48 -180 28 -38 77 -266 -153
3982 -153 65 -147 74 32 73 26 -52 -233 309 294 156 125 150 -153 41 -202 -83 98 -294 -177 -119 -72 172
4005 172 51 -121 -82 -187 -54 218 -82 49 130 -137 37 -99 17 102 55 -62 -99 -227 16 102 -317 -317 -39
4028 -39 -90 5 7 -265 30 245 113 20 280 56 -47 187 -257 -1 133 -340 -177 -101 186 -9 20 -2 -144
4051 -144 172 262 -76 200 317 -304 249 -12 117 -212 153 24 -87 -116 -200 -37 10 -51 69 26 -359 1
4073 1 -130 293 -96 -41 87 -6 -11 221 13 -95 411 198 -9 -94 -12 10 227 -287 -202 -418 201 -83 237
4096 237 34 411 161 114 361 5 139 18 155 47 54 -127 183 22 -2 -123 -117 -20 79 -159 23 143 73
4119 73 96 95 99 118 259 208 291 -26 127 203 -220 -193 -92 -164 100 -49 -119 74 -32 34 -206 -194 68 86 255
4144B55k1j61j23J25k03J02K60m44L2J80k08K31J4l60J70k0K95q4r1J62J08q8
4166A31r7R3j65K87k05k71K76j38J00K5j34k61K11k6J26p7N4J70L1l11M66k16
4188F9L1K83k98k42K94k54K41Pk27K68j71q1j70K32l48L08q9r6K92k45K95J18
4210B17J5Q1j35p0J31o4j77J10j30J31r0k45J60k16M8M3K76l40q2L16r1K92j03
4233G7J02j46J30k98J49P9Qj74j31M64m5l87L42j31j48qmJ19MJ51Rj49P4M80p79
4258b12N93k66m4j02j09J86L4k3q6n9J04l80K29k6L25r9l93K04J8J94j78K29O8
4281B07r7l9q7R0M7o9o8k2K63k44%j23J97%k21J75j1K3q8j8R9Q4l03J18J90j53
4307e0J00j2J13l8m99K21n3j10K63k6M3k1J76Q7j65k7M20n08J52J1q8J52q1k38
$$ plain form
4144 255 234 73 -50 75 -128 -26 234 -210 -178 2 -206 25 39 -321 -151 -171 124 40 -51 111 219 131
4166 131 34 127 -38 249 44 -227 49 -89 11 36 -98 -359 -148 -174 -48 -125 -71 99 130 -181 285 69
4188 69 100 383 85 -157 137 -117 124 131 -96 172 1 -80 -250 -18 -366 -58 -147 -243 49 -196 99 217
4210 217 232 313 178 108 239 175 -2 108 -22 109 19 -226 -66 -282 -234 -191 85 -255 -337 -21 -112 180 77
4233 77 179 33 163 -135 14 93 101 -73 -204 260 215 -172 170 39 -109 -117 -121 -2 2 153 162 13 87 567 -212
4258 -212 381 115 71 -31 -140 46 80 57 -29 -88 16 -364 -135 -161 164 65 -328 -124 -106 88 -90 139 207
4281 207 110 71 -16 74 121 52 -16 -38 225 -19 -19 -142 55 55 -166 9 -2 21 -67 -85 14 98 -205 -87 103 -50
4307 -50 50 38 151 113 -386 -165 -218 -328 -65 -91 -48 -69 107 194 29 2 422 -86 66 77 -11 141 60 -178
4331a78J13J37k78M70l18k32Q4J90j44N70m24p7J25P3M2J84j33l8k26O5j06k89
4353c90N63k03k89P8K11j70q2J79J06j33r2L30rL9K5P9j46J6N3j33N3M9q7j20
4377g3J40j08Q1k31K11j23l0O9j11P2K43L1J01j05j88o1L35k98L8j54o2j72K41
4400a54k01J31Q7j24n7L3p9L60k4l0K16j57k2K0o9K32j7n16M83J15j84J22k42
4423g7p7m0L5J87j56M4J66r7p0J50k34J07J95L6J25n06J26J35j48J63k19mN5j26
4447b30J39J91jJ53l67n2J79J65K9m34L57k16J20l6O6O7n8L2j06n5j13Q6Q1o1
4471f4Q8L4J2j93L81m07L69p5k58J55L7K64j72k68J67p3j0j38L55j23k07J73k15
4494a68k47J94L48Qk44J88m3R7k37L11j12J09l57n2L65l10K07j30r7J16L0l32
$$ plain form
4331 -178 -65 72 -206 264 -54 -286 -202 -12 -156 414 -10 -87 38 111 153 337 204 166 -60 5 -101 -390
4353 -390 173 -30 -319 -241 -30 -200 -282 -103 3 -130 -222 108 99 138 163 242 96 112 165 32 85 134 47 -73
4377 -73 67 -41 40 -191 20 -103 -133 -64 -175 -103 140 171 272 167 -21 -82 253 -45 -7 -161 -223 -395 -154
4400 -154 -355 -224 -137 -261 -318 -285 -364 -4 -28 -58 158 1 -21 -1 -70 162 145 -371 112 227 43 165 -77
4423 -77 -154 -194 -159 28 -128 -84 82 -15 -85 65 -169 -62 133 169 294 -212 -86 49 -99 64 -155 -159 -104 -230
4447 -230 -91 100 99 252 -115 -167 12 177 206 -228 129 -87 33 -3 63 130 72 104 -2 -57 -170 -84 -3 -64
4471 -64 24 58 70 -123 258 -149 220 145 -113 42 79 343 171 -97 70 -3 -13 -151 204 81 -126 47 -168
4494 -168 -415 -221 127 135 -109 79 36 133 -104 207 95 204 -153 -205 160 -150 57 -73 -170 -54 -24 -356
4516c56M46o0jj28J38L3J92j86O2M5j42J92l56P1K47k39r6J81k70J18J16j98K66
4539G5j14k90R4L03j43J35m9L9J82j54j5J34j5J3k53k7m9N5K67k71k9j7nrL65
4564B22q0r1p1P7l37M19j05J52P8j11j41k0k49p3K42J88m8k46k03M76j50R3j28
4587a06J69j40J34l81M29K96l99J46k65Q4J78j38L34m93J52l44J16M2L31J0m60
4608c05J80K45l8O4j56K52k65j28J22m5J26J92k30j55J47l29N8L06n9J28J97l75
4630f8j2J04J13k79L10j24K6j37QL30k70n5J40n2j11j82P7J4k5K38j13j3J25J05
4654A49j56qK28k28K46k88J06J46L0j00k64j5L23p8j89O7j13j73K87P3l9r6K12
4677A20o3o8J40N7K73j93K2J72m51J24p1J35r7J49l92P7q1q2J1J53k12M42m08
$$ plain form
4516 -356 90 30 29 -99 39 72 264 78 140 185 43 235 -121 -50 197 -42 -138 43 -227 -109 7 -191 75
4539 75 -39 -329 -235 68 -75 60 11 50 232 78 63 197 182 195 -58 -85 -134 -79 188 -83 -112 -129 -134 -143 222
4564 222 142 51 -20 57 -280 139 34 186 264 153 12 -8 -257 -330 -88 100 52 -194 -397 79 -71 22 -106
4587 -106 63 -77 57 -324 105 401 2 148 -117 -33 145 7 341 -152 0 -344 -228 -186 145 155 -305
4608 -305 -125 120 82 146 -10 242 -23 -151 -29 -74 52 244 14 -141 6 -323 -265 41 -18 110 307 -68
4630 -68 -80 24 137 -142 168 44 70 -67 -59 271 1 -54 86 34 -77 -259 -182 -168 -193 45 -68 -81 44 149
4654 149 -7 -15 213 -15 231 -57 49 195 225 125 -139 -154 169 91 -98 -31 -144 -317 -30 43 4 -92 120
4677 120 57 -11 129 186 459 266 288 460 9 133 62 197 100 249 -143 -66 -147 -229 -218 -65 -277 165 -243
4700b43L85Ql82L05k68K28O6j8J51q5k57K0J32l15K80k5J44j74j96q9L23J36J4
4723A40K5k78L73l00J14%K69o98N14j85k0K69k48J33j85J76k61P3J09k3oP5K5
4746I1n3N2J9P1j52l4J9J23o4q1Ko4j18Q7j64J66J59j87LJ27j25K2R3K06K3k91
4772g0o9j43K13K26m6j22J18Nl99J42R4Q5k75N4J80m6J67j70L42l71J39l1l5j59
4796a71K22k38K87j20nK0j62K33J4l55J30j51J81Q7%j26K29Q2m8j34R6o5J30j31
4820Er9K06l78J82J32q3j56j28K15J72k90J12L54l62J07p9p9L92P2l69N2j13J68
4843C3K37k82J64q4j26j13q3pR1J35k98L41o1N6jP8O7k22qJ87j28j3J55j47n9
4868h8k99K58p4P2J71k15M3J8n7OQ9K04K29m61j4K64j67J23k4j27O0l26K62j64
$$ plain form
4700 -243 142 150 -232 73 -195 33 99 81 232 147 -110 -90 42 -273 7 -18 126 -48 -244 -333 -10 126 140
4723 140 165 -113 260 -40 74 74 343 -355 159 -26 -46 223 -25 108 -77 99 -162 -89 20 -3 -9 66 91
4746 91 38 90 109 180 28 -6 13 136 72 -9 -7 -71 -189 -102 -266 -100 59 -128 -125 2 -123 -101 -8 198 221 -70
4772 -70 -139 -282 -69 157 111 -11 107 112 -287 -145 -51 34 -241 -187 -7 -53 114 -56 286 -85 54 23 -12 -171
4796 -171 51 -187 100 -20 -25 -5 -167 66 80 -275 -145 -296 -115 -28 -28 -154 75 157 109 -25 71 6 136 5
4820 5 -94 112 -266 -84 48 -35 -191 -319 -104 68 -222 -110 244 -118 -11 -90 -169 223 295 -74 -22 -135 33
4843 33 270 -12 152 68 -58 -171 -254 -261 -170 -35 -333 8 -53 3 2 80 147 -75 -83 104 -24 -37 118 -29 -88
4868 -88 -387 -129 -203 -131 40 -175 -132 -114 -171 -165 -76 128 357 -104 -118 146 -21 102 78 -49 11 -315 -53 -217
4892b17J00J5q3R0j5O9J3J17Q0Q1m32J7J80R4k18M3Q4j3l5l8Pj6J19k41J14J56
4918G1l65J98K46k27J85Qj22J52j75R6l77N88m77j0K76k01O8J86k86j71K14J23
4940@j87Q0P7j03p6J54L5L07l20J89k72J18J11m1Q7m59K59l63L06k2j63J8J40
4963a25J85j20k53L00L3K9n5q4K50n3J7J7J0j86qk52K74K01m05K1K17j73J14j58
4987b04M4M10j02j54P0l08L46J57j33k4o0M7k72J58j33L05k20J1P9j40K12n1L40
5010C78m02M9p9J65j16K16l12m5m6K09R1K3m5p0j36J39l28J65K2L3j30k4R9J90
5034D6m0m5J87j62j52K48j12K31j68k1M4j80l3K83m7j47m3J69l6q3J51k24L64
5057B30j60q4K6L4j20J13R7j7R2m93K48q4J68L7l65L39k32J73j86n0L85J8j39
$$ plain form
4892 -217 -117 -102 -185 -95 -110 -41 -28 89 169 250 -182 -165 15 109 -109 -66 18 5 -30 -68 -61 -77 42 -199 -85 71
4918 71 -294 -96 150 -77 108 116 -6 146 -29 67 -310 278 -199 -209 67 -134 -66 120 -166 -337 -123 0
4940 0 -187 -107 -30 -133 -209 -55 -20 287 -33 156 -116 2 113 72 159 -300 -41 -404 -98 -120 -283 -265 -125
4963 -125 60 -60 -313 -13 20 49 -6 -90 160 107 124 141 151 -35 -43 -295 -21 180 -225 -204 13 -160 -46 -204
4987 -204 -160 250 148 -6 64 -244 102 259 126 102 42 89 -183 -25 -158 147 -73 -62 17 -123 89 38 378
5010 378 -24 25 -54 111 -5 211 -101 -146 -192 17 108 131 86 16 -120 19 -309 -144 -122 -89 -219 -243 -144 46
5034 46 6 -39 148 -14 -166 82 -30 201 33 12 56 -124 -157 126 79 -68 -111 58 22 -61 90 -134 230
5057 230 70 -14 12 46 -74 39 136 119 211 -282 -34 -118 50 87 -278 61 -171 2 -184 -234 151 169 30
5080C0k56M63k72K89j43J09k82Ok0J58o9m1j48J02k6K40j04Q2J06n38J87K21k17
5103a23K13O6j94L85l41K49k64l92M92j4j70j0J34j90O5j3J17l56K41q5K81k11
5125a20N8P3J56l3k97R8J62J9j10M4j38L3J69o4k10J64j88J86j05K88m51L8J14
5148a14N0J20N0OJ14N4l53K8P1M1k30N3L1J79k54m4L48k54P7q6L52j69M5j60J21
5173G6J32k36l27J13J29L26j05l7o4l83K13J67l0J07k56k8J20J69Nk9K08l64j9
5196a13J34J42j77R8J02N1l29j18K41K94l33n4J01m9r8M1K95k16n3L7k74N09p9
5219A52k65J04J93k83q5j1L50q4m9N2M7j38j05K60j56o5o5M0Q2L28Q1j23k18K73
5243C15k14l54J89J81p4j8M8QLm39L33K06j28M2k13J38j36K24Qj84K09k58J83
$$ plain form
5080 30 -226 237 -35 254 111 220 -62 -56 -76 82 13 -28 -176 -74 -100 140 36 118 224 -314 -127 94 -123
5103 -123 90 156 -38 347 6 255 -9 -401 91 77 -93 -103 31 -159 -94 -107 10 -346 -105 -190 91 -120
5125 -120 -62 11 167 134 -163 -65 97 116 6 50 -88 -55 114 50 -160 4 -184 2 -103 185 -266 -228 -114
5148 -114 -64 56 106 112 226 280 -73 -45 26 67 -163 -110 -79 100 -154 -198 150 -104 -27 -113 239 70 115 -45 76
5173 76 208 -28 -355 -242 -113 213 108 71 7 -376 -163 4 -26 81 -175 -203 -83 86 91 62 270 -94 -113
5196 -113 21 163 -14 84 186 237 -92 -210 31 325 -8 -62 39 -10 -108 -67 228 12 -41 -4 -278 231 152
5219 152 -113 -9 184 -99 -184 -195 155 71 22 74 121 -17 -122 138 -18 -83 -148 -108 -26 302 383 260 42 315
5243 315 101 -253 -64 117 43 25 73 81 84 -355 -22 184 56 98 -115 23 -113 111 119 -65 144 -114 69
5266F9l1J15k23J81j15j96K74J08k4j41K06l32J13qQ4j78L36j71k1k5J2j99K85
5289A19k28j03K85Q5o9P1j68K03j41k30J90m0L54k15k16L49k67o9M52j39K57l65
5311A15k6p8j68MK8p1M7QL7k7J0J57k0j4j77J72K38k20N0j64L8J49n3n2K72J01
5337C56o23J11j33M14j97J87J4j39m7k07J18R5J88j0M0l2r9k31K54M5j62j12J14
5360e6o9P0j4J01k3J86l04J9L97p4n5k83K25r3j51L35k7l4k25p0J55P3o9j10p
5385a03L28m05k26N15K07k35n5q1K07k42j6M13n00M16j55M2o6j25J68q6N6k66
5407b09j15j30K38K91j91L06j52j67j51L79l27L06Q3k99K81j8j6j00m4m1oP0j87
5430a99J64r3K04j42k44N18j38l3Q1k8j14j17L04q1Qj50R4o1K8j15KJ8J67j15
$$ plain form
5266 69 38 153 -70 111 -4 -200 74 182 158 17 223 -109 4 -4 80 -98 238 67 46 21 33 -166 119
5289 119 -109 -212 73 158 89 160 -8 195 54 -176 14 -26 328 113 -103 246 -21 -90 362 223 480 115
5311 115 89 11 -157 -153 -125 -196 -149 -141 -104 -131 -121 36 16 2 -175 -3 235 15 65 -99 -61 88 35 -17 255 356
5337 356 -267 -156 -289 125 -72 115 129 -10 -57 -264 -146 -51 137 127 167 135 36 -195 59 104 -58 -170 -56
5360 -56 -125 -55 -69 32 9 195 -109 -90 307 233 178 -105 120 27 -124 211 184 150 -75 -145 10 83 14 -96 -103
5385 -103 225 -180 -406 109 316 81 26 -55 152 -90 -106 307 -193 223 68 110 44 -81 87 1 57 -209
5407 -209 -324 -454 -216 75 -116 190 38 -129 -280 99 -228 78 161 -138 143 125 109 9 -35 -76 -82 -12 -199
5430 -199 -35 -128 76 -66 -310 208 70 37 118 90 -24 -141 163 82 90 -60 34 -27 1 -114 -112 -94 73 -42
5454d2m2k58N07r6k2L0K4j0l36N8J86P2P5q1J4k61J70J25J2j58K06k62q7K67K59
5479C50k83M8r9J22K6j70J82j77K66m08j2J18j33J37J7j01j3J82K5J43k79J79
5501A20j02j78J06K05j34j62L56l48O0K38k70O1J18k13K3J19j36m9L48o7J4m09
5523c00K80p4L0P8M6j18J09j23L22k77J44J54m17J42J47k56N6L33l12p4j80L71
5545H1o6k78K14J00J32l87J02R4K50j64j35m8j49M49k33K08j17j16m3k63L05K94
5567B30j73k78K16M2k27R1K79j60j75K20q0qKM02m53J96l52K59j20J46k30K03
5589C0J37l2j50k28K35K13J53k39l1P7j53k1J84J53j10n06L41p8k00J86j74K49
5611C6m5j4l41M70m0j03L36k36q8L47l12K84l1n12L65k45K23P5K1q4l76N9l7K24
$$ plain form
5454 -42 -84 -342 165 69 47 77 101 91 -245 -187 -1 71 146 65 79 -182 -12 113 125 -33 173 -89 -176 91 350
5479 350 67 115 16 138 164 -6 176 -1 265 -143 -155 -37 -170 -33 -16 -117 -130 52 77 220 -59 120
5501 120 18 -160 -54 151 17 -145 211 -137 -77 161 -109 -48 70 -143 -120 -1 -137 -186 162 95 109 -300
5523 -300 -20 -94 -64 14 60 -58 51 -72 250 -27 117 271 -146 -4 143 -113 -57 276 -36 -110 -290 81
5545 81 15 -263 -49 51 183 -204 -102 -8 242 78 -57 -105 -254 195 -38 170 53 -63 -106 -369 -64 230
5567 230 57 -221 -5 37 -190 -99 180 20 -155 65 -15 -23 -21 381 -72 124 -228 31 -89 57 -173 30
5589 30 167 135 -15 -243 -8 205 358 119 88 165 12 -9 175 328 218 -288 53 -25 -225 -39 -213 36
5611 36 -9 -23 -364 106 66 -37 299 63 -25 322 10 294 263 -249 116 -129 94 169 190 106 -270 -211 -248 -24
5635b4K4J52j49j94L96m01L24O8O5j21k75Q1J78k30j02K35J4k66K36k12LJ16j29
5658b11j38N46l30M4J84j14J85q4k28q4L35M4J63k31k95rK34R1j77K4r6J53p0
5681f4K9O3J74k93J73JM0o5J54j98j68M53l59K42Q8l07J42j58J06j75o4L99k80
5704f7N4Lj87J1L86jJj34k33o2J64l5K08j66L49l31j72O9j1L29j19Q8J0l87J32
5729a01J12J13k84N44m14o2j40K71k4j4j91K9K18j18J52l42O21l38m4Q7k52K28
5751E1k3J21l30J68O6J86l06J06j25j62J43J02k79J77O8o7Qk3J05J79k70K98p7
5774A16k56N6O4J84k14L13j75R0p7l35n5L90J6j33j74O5K79j42N8K3j76k14M45
5797A48j76J42j4j77K08j46M4K9q5J28q1n2kNj64J02r9R2j98N9J25J64q7K2J04
$$ plain form
5635 -24 0 152 3 -191 205 -196 128 196 261 140 -135 -54 124 -106 -208 27 41 -225 11 -201 -198 -82 -211
5658 -211 -349 197 -133 -89 95 -19 166 82 -146 -230 105 149 312 81 -214 -223 11 102 -75 -51 -147 6 -64
5681 -64 -35 28 202 -91 82 83 123 58 212 14 -154 299 -60 182 270 -37 105 -53 53 -122 -186 213 -67
5704 -67 -13 -10 -197 -186 200 199 200 66 -167 -229 -65 -100 108 -58 291 -40 -212 -143 -154 175 56 144 154 -233 -101
5729 -101 11 124 -160 384 -30 -92 -232 39 15 1 -190 -161 57 -61 91 -251 370 32 -12 75 -177 51
5751 51 28 149 -181 -13 53 239 -67 39 -86 -248 -105 -3 -282 -105 -37 -104 -96 -119 -14 165 -105 193 116
5774 116 -140 -84 -20 164 -50 263 88 178 101 -234 -289 101 117 -16 -190 -125 154 12 70 93 -83 -297 148
5797 148 -28 114 100 -77 131 -15 29 58 -27 101 20 -32 -34 -29 -193 -91 -190 -98 -296 -237 -112 52 -35 -13 91
5822I1Jj04J19J92l72mJ26q9K01o1j00j13J24K02j19j22Q5J46m5J38l0l86r1K25
5846A4j12L90j28k95J08j92J63J92j67k22K83k43J79J44M2m20K72j67QJ14K45
5867B08j38j20P9N7l22O0L46n2j12o8m4K68n8J88k40j99JK31k46L62m08R4K71
5890A58p2Q9M3l80K26M2j00q0P9M4Pl81L01J51j15m09M80L93k69l87J81K6k28
5913b01P6K70M4r8Rk92L0J80k13K45j11Ljk29J32J96j53L14l12J99J3O0K8k77
5937h8K98j96j07O3J85j08j77J29l22M3L26j18J34k08J15q9K71p3l2R2P0k32J70
5960A46l25J34J59j95K26j49R8K9P1k53j77K98p1K98j83j27N7l8J33k91Q9PJ70
5983A06o5R8pm63J86K38J11k38j94K74p9J86J76j85m07K02K08rp8k2n2O8k3J64
$$ plain form
5822 91 92 -12 107 299 -73 -77 49 -40 161 100 0 -113 11 213 94 -28 57 203 158 296 266 -120 -211 14
5846 14 -98 292 164 -131 -23 -215 -52 140 -27 -249 34 -209 -30 114 156 -264 8 -159 -151 -37 208
5867 208 70 -50 29 86 -236 -176 170 118 6 -62 -106 162 104 292 52 -147 -146 85 -161 201 -207 -113 158
5890 158 86 175 218 -162 64 106 6 -74 5 49 56 -325 -24 127 12 -397 83 476 207 -180 1 27 -201
5913 -201 -125 145 189 91 100 -192 -162 18 -195 50 -61 -58 -59 -288 -156 40 -113 201 -111 88 101 161 189 -88
5937 -88 210 14 -93 -30 155 47 -130 -1 -323 -280 46 -72 62 -146 -31 -120 151 78 46 138 208 -24 146
5960 146 -179 -45 114 -81 145 -4 94 123 194 -59 -236 62 -9 289 106 -21 36 -2 131 -160 -71 -64 106
5983 106 41 139 132 -331 -145 93 204 -34 -228 46 -33 153 329 144 -263 -61 147 138 60 38 -14 54 31 195
6007A95q1J05l18J35j22J51J48j81J04p1k8K32j40m3j93J76j95O5K57j09l24L35
6029I8K05k22j6j85J97k83J6N4n2N6J83q5J9J84j59k08M7q3J71q7J65O4j06Q4
6053E7n4P2l8J01l40K38M7l28K06j65O75o62K40q0j0P0J21k20k5J41l4l05K38
6076e5lj02j49J94K79m01K20l9q2J90R8k32j52N07l79K29k26K34N5j19n2J48j63
6099@m7K64p3l20K43j94%Q1J51j45j70L65k69K55j56J9j64L96j32l20K82L6l12
6122b10K14n1J61l24K75j52M4r1K10j31L8P1o4m9k8K96k52K50k56m0K17k55j08
6145b35L38j9j08j3j42J37J22J06k85J59j82Q9n3N1R9j89J79k41K60l68J49K14
6167F8j64L8R5l33J70K65j51R4l58K86O8J70k21j3m5R3r7O6O3k64J07j05L44k8
$$ plain form
6007 195 114 219 -99 36 -86 65 213 32 136 65 37 269 129 86 -107 69 -126 -61 196 87 -237 98
6029 98 303 81 65 -120 77 -206 -190 -136 -188 -132 51 -34 -15 169 10 -198 -151 -234 -63 -150 15 79 -27 57
6053 57 3 75 37 138 -202 36 83 -245 -39 -204 471 -191 49 -31 -41 29 150 -70 -95 46 12 -293 -55
6076 -55 -58 -160 -309 -115 164 -237 -17 -56 -138 52 150 -82 -234 273 -106 123 -103 131 186 67 15 163 0
6099 0 -47 217 144 -176 67 -127 -127 -46 105 -40 -210 155 -114 141 -15 4 -160 236 104 -216 66 102 -210
6122 -210 4 -47 114 -210 65 -87 -43 -134 76 -55 -17 54 -10 -59 -87 209 -43 207 -49 -89 128 -127 -235
6145 -235 103 84 -24 -37 -179 -42 80 186 -99 60 -122 -33 -86 -35 64 -125 54 -187 73 -295 -146 68
6167 68 -96 -58 37 -296 -126 139 -12 82 -276 10 78 248 27 14 -31 62 -35 31 94 -170 -63 -168 176 148
6191A48j52j48J23R5j15j47J08K56l22K0K06p2j14J4K14r9r1L19k69n1r3J08l0
6214i2j09J86J28j35P2k24J65J96k62L03j27L9m2l0N9k57K3K43o2l1QJ56k43K38
6238B02k7j62j8P6n6K29l83J51N3j6L7K11j54m2l18K30O5k80K06k3k6k9m7J79
6262E8j11K68l30J86o8J68J9p7o0k2O1k03K83M9j05j5k88J26L5LPlM0k76Q4j6
6288a87L76l18O9J53pj75J00o6J30Q7j82J0K82k96J26O8l02J39M1q4M3J05m6P8
6312A44k53Q0L8J2l6Q7j72P3o2K06j96r4R8Q5j15J11n5P2o7l2M6m6j65N3L04M1
6338A57j13Q1j17J15q8j1j89J2L3j33J55j46K96j95J96k32J55l1O0L3N0K22l48
6361c8j29J90qo8j14M33k62J78j76O0ql81O33j13r5l5r8r9K43l9J12k6k14l4j59
$$ plain form
6191 148 -4 -152 -29 66 -49 -196 -88 168 -154 -134 72 0 -114 -100 114 15 -76 243 -26 -77 -170 -62 -92
6214 -92 -201 -15 113 -22 50 -174 -9 187 -75 228 101 140 98 68 127 -130 -107 136 74 43 51 207 -36 202
6238 202 175 13 -5 71 15 244 -139 12 65 49 86 297 143 101 -217 13 78 -202 4 -19 -45 -74 -121 58
6262 58 -53 215 -115 71 3 171 190 113 53 31 92 -111 172 221 116 101 -187 -61 -26 -23 -16 -19 21 -255 -171 -187
6288 -187 189 -129 -60 93 86 -89 11 -55 75 162 -20 -10 272 -24 102 170 -132 7 48 -36 7 112 66 144
6312 144 -109 -29 9 21 -15 72 -100 -27 -89 117 -79 -173 -75 10 -105 6 -49 23 -44 -76 -30 -76 -241 -188 116 157
6338 157 44 125 8 123 35 24 -165 -153 -120 -253 -98 -244 52 -143 53 -179 -24 -55 5 38 88 310 -38
6361 -38 -167 23 15 -53 -167 266 4 182 6 66 58 -323 310 197 102 67 -31 -130 113 74 186 160 -54 -88 -247
6386b47K83k20M50j90j88j11J28N54n68r8J31J73J61m20J01J25J03k86n2J34P0
6407C3O3O5o0m3j13P4J28j63j40P4k3J6L00j48j18J70j0m2q6n2J23ql68M62M3
6432A77n2k1k0k90J17k09J18P7j06J54J9j43J24R5K30J00o42K08J72k49J40j27
6454a28j74j9K01p8L34J12k81J07O5O8l74Q0K54j41L14l86j38L70q9l1JL1K46
6477C44k46k47M3J23J05L8k36j62N7K81j04p8J73l89J28r3N74l47m38L23M60l37
6499b8k21J40P1j07O4j07K08j89J5L13l64K99k47K83q1M8o5P0k89J46J20K8n4
6522E3J43j06l97K98l24K68R2j81M09j37k09J83J85m48K30j51l7r0p5N10k28J05
6544I3j46p9L21j19k13J28r4J79R0Ml29J50m6K43j93j00P7K33k56L76m31J76P8
$$ plain form
6386 -247 36 -184 266 76 -112 -223 -95 459 -109 -207 -76 97 258 -162 -61 64 167 -119 -171 -37 33
6407 33 96 161 101 58 -55 19 147 -16 -156 -82 -105 -89 211 63 -55 115 105 63 -23 -75 48 40 -328 134 177
6432 177 125 104 84 -206 -89 -298 -180 -103 -209 -55 -36 -179 -55 40 270 370 -272 -64 108 -141 -1 -128
6454 -128 -302 -321 -120 -198 136 248 -33 74 139 207 -167 -87 167 26 340 -46 -184 186 97 66 67 98 344
6477 344 98 -149 -106 17 122 160 -76 -238 -181 100 -4 -82 91 -298 -170 -263 311 -36 -474 -151 309 -28
6499 -28 -249 -109 -38 -145 -81 -188 20 -169 -154 159 -205 94 -153 130 49 97 32 102 -187 -41 79 107 53
6522 53 196 90 -307 -9 -333 -65 27 -154 255 118 -91 92 277 -171 59 -92 -129 -219 -294 216 -12 93
6544 93 -53 -132 189 70 -143 -15 -109 70 160 164 -165 -15 -61 182 -11 -111 -34 199 -57 319 -112 64 142
6567A42m01P7L17k45L6L1j9O0M6l3j17L04j35j41RK97j34j12R9l2P1j46P4j03
6591e5P2j54J8L56k0k09O5k28L58l24J11J1m8J24n8j54j49K04O5J83k18j14J3
6614a51K69l6j1J12k40lMK7m8lN2O0P4m5l9K07j35j53kk14L28k24K94m8P5k11
6640f1j30K35J09k09J46r9K2k40P4R9Q1o2L4n5Q2j0q5K29k59j29M10n7l56K20
6664a1j90K30J15l03L31j89K46J39j80K39m62m8j26L40k14m7J16K39k29J41m30
6685b93K17P6l03L90k5Q6r5LP1j75Q7J46Q5l33O8K27k48j30K10j31J21N9j0p9
6709B4j61J05Kj59J25J94k20K36r7k2n2O0j40p1L63Lj82M2j27K11pj37J03r0j52
6734a49L26j58Qj03L16k25J03O9Rk73K12j34j58m9l7K42j44O6l9K15j5j40k5P
$$ plain form
6567 142 -259 -182 135 -110 -74 -43 -62 -2 44 11 -106 198 63 -78 -69 228 94 -18 81 49 120 -26 48 -55
6591 -55 17 -137 -119 237 217 8 73 -155 203 -121 -10 1 -47 77 19 -135 -284 -80 -15 168 -50 -164 -151
6614 -151 118 82 71 183 -57 -60 -56 -29 -77 -80 -28 32 106 61 22 229 94 -59 -61 -275 53 -171 123 75 150 -61
6640 -61 -191 44 153 -56 90 -9 13 -227 -153 -54 27 -35 -1 -56 26 16 -69 160 -99 -228 182 125 -231 -11
6664 -11 -201 29 144 -159 172 -17 229 368 188 427 -35 -83 -209 131 -83 -130 -14 225 -4 137 -293
6685 -293 -76 0 -303 87 62 148 53 56 127 -48 39 185 270 -63 5 232 -16 -146 64 -67 54 113 103 24
6709 24 -137 -32 -30 -189 -64 130 -90 146 49 27 -25 35 -105 -176 187 190 8 50 -77 134 127 -10 93 3 -149
6734 -149 177 19 27 -76 240 15 118 187 196 -77 135 1 -157 -206 -243 -1 -145 -79 -118 97 82 -58 -83 -76
6758g6j8r2K47j44J46r5P9Q8j59p5J10o2o1J52j11J92j13j68J29Q7j07p1o9P5
6782a16K4l5p8Q1K12K2L6j46O2L0J32l05J32n0O8O4l6j33j97L28m2k21J80N8j44
6807g4l6L63k45RP6k00K36j38J52Pj62p6L89k06Q0j01l6o2J73m50J67j33J59k4
6831a32L3J65l9k85M82j13j21j02J89L0l07K39j28j26K38n9j29K9K20J59l10R3
6853B6o5J22j89lJ24j44L68j57p4k4K05m43K03J97k19M3N1j98K59k31P1l0j01
6876b09M3K13l1J10k74o2K09K11j95J6m9J28j62R7J11o5o9K8N5MM0j32p4J27k48
6901a78L4K66k83N2N1l7M8j1P7R2j88K27k51J14J6J14j26q6rJ86m50M99K08k58
6925A07k3o5K19k23j3K08p8l16K43l6k11M2L00j38K20j18j56m9J06K92m94J4J80
$$ plain form
6758 -76 -94 -186 61 -83 63 -32 47 135 -24 -99 11 -51 -112 40 -71 121 8 -160 -31 56 -51 -122 -191 -116
6782 -116 -92 -127 -205 -124 88 110 146 0 62 92 224 -81 51 1 69 133 97 -36 -233 95 53 -168 12 70 -74
6807 -74 -110 253 8 17 93 -107 129 -9 143 150 -12 -88 301 95 175 74 38 -24 149 -301 -134 -267 -108 -132
6831 -132 -99 66 27 -258 224 111 -10 -112 77 107 -200 39 -89 -215 23 -36 -165 -136 84 243 -67 26
6853 26 -39 83 -106 -109 15 -129 239 82 8 -16 189 -254 -51 146 -73 -30 21 -177 82 -149 -78 -108 -209
6876 -209 -166 47 16 126 -148 -210 -1 210 15 31 -18 110 -52 45 156 91 22 50 105 109 149 17 -57 70 -178
6901 -178 -144 122 -161 -109 -58 -95 -47 -58 19 111 -77 150 -101 13 29 143 17 -69 -78 108 -342 157 365 107
6925 107 84 19 238 15 2 210 132 -184 59 23 -188 -146 154 16 236 118 -38 -87 19 311 -183 -169 11
6948A1l1l2Lj75P5L31l33j55L46m6j30k1L42l10K31q6n4ok04L81O6J45k18j65
6972c5j6j34N2n0J70l4N7jP5j78Q7M9P8k40J20j09L1L7KL0Rk21J35RR6j36J76
6999E9j6k86L40k07J9k4no5%J36k25M8L87K9k88J84k73K48j81O5J43j86j07J49
7023e6K18j34j18o3K79L5k60J02j39r0K15k3K3R5L22m03J13k76J02p3J14l2L6
7046a3j50j13n5K31K05k7J82l89L13p9k63K38n6Mj28q9K96P9p0k49KJ42K1J9j6
7071C5j59Q6J70r4P3k63J97r7J8K9P5QP7k41K93k23q5J15r9L80l88L16l00P6O0
7096E9j89P0L26m52K69l2j82J46R5j47J62r5p8L08m99K33R0o8j06n3K0R7N4j07
7120g9k4j15K09k46M45l57l2J74N9p4o8M3J6K2r6N3k09J69J84p2j10K00J5k69
$$ plain form
6948 11 -20 -52 -49 -224 -149 182 -151 -306 40 -6 -136 -157 185 -125 106 20 -34 -40 -244 137 203 348 130 -35
6972 -35 -51 -185 -133 -183 -13 -47 10 9 84 -94 -7 42 120 -120 0 -109 -78 -41 -39 -9 0 -221 -86 -77 19 -117 59
6999 59 43 -243 97 -110 -91 -115 -120 -185 -185 -49 -274 -226 161 190 -98 86 -187 61 -120 -55 88 -98 -205 -56
7023 -56 162 28 -90 -153 126 161 -99 3 -136 -226 -11 -34 -11 84 406 3 116 -160 -58 -131 -17 -49 -13
7046 -13 -163 -276 -331 -100 105 78 260 -129 184 105 -158 80 24 28 -100 -189 107 186 116 -133 -131 11 32 51 35
7071 35 -124 -38 132 38 111 -152 45 -52 -34 -5 70 78 155 -86 207 -16 -101 14 -85 295 -93 223 -77 -1 59
7096 59 -130 -60 266 -186 83 51 -131 15 110 -37 125 30 -48 260 -239 -6 84 16 -90 -143 -123 -26 28 -79
7120 -79 -103 -218 -9 -255 190 -167 -199 -25 34 -40 -108 -65 -49 -27 -123 -70 -279 -110 74 2 -108 92 107 -162
7144a62K46k08m7K04q6M72m65n9o0J38p7r5K54j60lK50o7k27R5K57j52k31J52
7167c1j19J94m6j96K87J66j93k93P9J19k0J4R0k35J79J14R3l02J23j09L07m46
7189b25J83j41Q6R7J46l9l45L69J52m28J09j31J26P9L40l49lk02P9O4O2k6o2j78
7213b37L78L0j06j18j75L05L3k94K27k72M27k50m3P6l5J24j75J72k72o5K94O1
7235H5k76J73j43l8K81j52l4M4K40j20j7p9M4r6l4rK6J80k23J81j02Q5r7L04m89
7260b66J92N6j68m4K79o8J25k19K26R7jk55O4q2K95j97j20Q0L7R4q6r1k63L22
7284GO8o9P1j43M4O0k16P2q0J66j38L87k55R3q9K14R1J4m00J11op6j07m9K66l66
7310c30K23J71q7j29J99j00L08k26K28l10J34k88K10N9j26j07L1J68p4R7R2n8
$$ plain form
7144 -162 84 -124 -171 33 -53 419 -46 -105 -165 -27 -104 -199 55 -105 -108 142 75 -152 -57 200 48 -183 -31
7167 -31 -150 44 -2 -198 89 255 62 -231 -152 -33 -53 -39 51 -184 -5 109 202 -100 23 -86 221 -225
7189 -225 -42 -183 -97 0 146 107 -238 131 283 -145 -36 -167 -41 38 378 29 26 -176 -97 -33 29 3 -59 -237
7213 -237 141 171 65 -53 -228 77 110 -184 43 -229 198 -52 -95 -19 -54 70 -105 67 -205 -270 24 85
7235 85 -191 -18 -161 -199 82 -70 -104 -60 180 60 43 -36 8 -88 -122 -131 -105 75 -148 33 -69 16 -81 223 -266
7260 -266 -74 -18 -186 -230 49 -19 106 -113 113 210 209 -46 18 -64 231 34 -86 -6 31 125 39 -52 -315 7
7284 7 75 6 77 -66 -22 38 -178 -106 -186 -20 -158 229 -26 67 -22 192 283 297 -103 8 2 -74 -181 -230 36 -330
7310 -330 -107 64 -23 -152 47 -53 255 29 257 -53 81 -207 3 62 -64 -171 -140 28 -46 51 143 85
7332H5j45M0J4mMr0J37K43m46J77K0j95K08L96o10P8J88L0O6j80j7J53k98K26
7356H0k35o6J41K01n2M4j80J49K9O9j99O7J77k30n4KL2J32j34l3J25l89J87J01
7380c6P9J2L03l38L0O8L8J9q2Nj1r5r6q4J01K07j41R3j2j35J59j20r7J40O4J63
7406B34j51j79j26L5L5J29J1j15K97K5j61n8j26N48k27k66Q9j29O7j08M91k19
7428I6l3J03k25K04r2j32j35K43N1j42q4K15l8K15m33O0j0Q3P2j71J16J34N8l99
7452b44L66k21J82j89O0n1J90ol35L95qk74L78j7k69J35j28M5K28k50j56J48k4
7475d5n2J88J87j43p0J5P4J36m22J68K04k04J10n0P5k87J50K2j85L02k78K52k2
7498A25P3l65J75j17N2Jl7J58j20K55m58M69k85J8L8m2j3L0M4j94K69r6J0l8j05
$$ plain form
7332 85 -60 -20 -6 -10 -6 -96 41 284 -162 15 35 -160 48 444 -166 -88 100 130 196 16 -1 152 -146 80
7356 80 -155 -221 -80 121 69 113 -67 82 111 180 -19 48 225 -5 -59 -57 -25 107 -27 -60 65 -324 -137 -36
7380 -36 43 55 358 20 50 118 156 175 93 98 87 -8 -104 -188 -87 120 -21 72 60 -75 84 -36 -133 7 71 234
7406 234 83 -96 -222 -187 -152 -23 -12 -127 170 195 34 -24 -150 398 171 -95 -6 -135 -68 -176 315 96
7428 96 63 166 -59 145 53 -79 -214 29 80 -62 -146 69 31 246 -187 -127 -137 -54 18 -153 -37 97 155 -244
7452 -244 122 -99 83 -106 -46 -97 93 87 -248 147 139 -135 243 226 -43 92 -36 9 237 -13 -169 -21 -45
7475 -45 -97 91 278 135 65 80 154 290 -132 36 240 36 146 96 171 -116 34 56 -129 173 -105 147 125
7498 125 198 -167 8 -109 -57 -56 -93 65 -55 200 -258 211 -74 -56 -18 -60 -73 -43 1 -193 76 -20 -10 -48 -153
7523a53j1K93l10K25M7j6P6k07J30n2l83O10j07O1j3j12j10J51k04N7M9J1Pn6
7547a7j57K55j46J63n1kj21J76J51m52L17L6j82J99j18p6J22n1k2k5j26o5K28
7570C6N8o5P9l18K48j65J0Q8p7L3K6R6L7j65L27m02J39r1j5OR9k6K58r8k00K17
7596A35l3k84lK75J8k92J94K7jR1j28j2k50J26M8O0j9J09P2j49K53m85K36Q7K1
7621I6Qj15L4l5j89K40k25K92l02J61J44k12K90l75q1L96l0K0k66O4J99j72P3
7644A5o5j5K9P7q6k1m6R5M0r4j57L37k5j44R2j4J52l9j3k40J54L3j24J36J61k90
7670e2j26K3K59R0k57K22%m3k92K53j88j0J32j05L93l49J36j6J14k65n7J74O8
7693A04k75K8J25J59l33K40J72k43j9j20K09J92j72qL8j69K97k59o8j29J80p3
$$ plain form
7523 -153 -164 129 -181 44 91 75 151 -56 74 22 -361 249 142 203 190 78 -32 119 -85 -28 21 32 39 -17
7547 -17 -174 81 -65 98 47 45 -76 100 251 -201 116 152 -30 169 51 -25 97 46 24 -1 -127 -192 36
7570 36 94 29 108 -210 38 -127 -117 -29 -106 -73 -47 49 86 -79 248 -154 -15 -106 -121 -115 -16 -42 216 118 -82 135
7596 135 102 -182 -185 90 108 -184 10 37 36 127 -1 -13 -263 -137 -89 -29 -48 61 133 -16 237 -248 -12 75 96
7621 96 104 -11 23 -12 -201 39 -186 106 -196 -35 109 -103 187 -188 -269 127 97 117 -149 -85 114 -58 15
7644 15 -50 -65 -36 41 -45 -66 -112 -17 23 -71 -228 109 84 -60 32 18 170 131 118 -122 32 65 -59 77 238 -52
7670 -52 -178 -155 104 194 -63 159 159 116 -176 77 -111 -121 11 -94 299 -50 86 70 184 -81 -138 36 104
7693 104 -171 -143 -18 141 -192 48 220 -23 -42 -162 47 239 67 59 97 -72 225 -34 -102 -231 -51 -124
7715a24j39J93l9j57L08k22R9J8j06L2P3K21l07K40j04M7j09n8L30M0j04o7j35
7738g0J43k68P3J60j16K16O8j55o3k28L56o6M5K20l01J19K3pj90J61j37k36J91
7761f2J16k6orJ78j30j79Q0J70j24n7K62k50J64j06J13k74J11K06l12j46N64k60
7784B3Q8Nl09N3K49k18Q8l0j6LJ74L1m46L80K3m5o6k2K78n50L66P4k76L82k90
7809e1l1r9P5j16J95K27n7k56P2j84K56K3R1r6J54k25j61j9L53Q7n28K95J4k3
7833dJ07q6J64K64m87K70l76K54L9j20M9L9km3j79K30J54m7l12K03l32J80O0o2
7857c7Nk06N52j54p0L52l78n4J18j98J80j84O0o3P0l8K45j96n5Q6j00J24j62J80
7881G7k22L9N8k13M62l76R5m4R7ol0L16j26j61j94J27L0K47k37J51Q2j70J58j18
$$ plain form
7715 -124 -263 -70 -109 -266 42 -180 -81 -63 -169 -137 -64 157 -150 90 -14 33 -76 -134 196 236 132 65 -70
7738 -70 73 -195 -122 38 -78 138 206 51 -12 -240 116 50 95 315 14 133 156 149 -41 120 -17 -253 -62
7761 -62 54 28 22 13 191 61 -118 -38 132 8 -49 213 -37 127 21 134 -140 -29 177 -135 -281 283 23
7784 23 111 116 -193 -140 109 -109 -21 -51 -67 -64 110 141 -305 75 98 53 -13 -35 243 -307 59 133 -143 239 -51
7809 -51 -82 -181 -106 -222 -27 200 143 -113 -41 -225 31 54 145 49 203 -22 -183 -202 151 238 -290 5 19 -4
7833 -4 103 17 181 445 -42 228 -148 106 145 25 74 113 111 68 -111 119 273 226 -86 117 -215 -35 25 -37
7857 -37 -32 -238 314 160 90 442 64 10 128 -70 110 -74 -14 -77 -7 -45 200 4 -51 35 -65 59 -103 77
7881 77 -145 -106 -48 -261 201 -175 -80 -124 -27 -33 -63 253 127 -34 -228 -101 -71 176 -61 90 172 2 160 42
7905D2j60K91m0o4l10R0K15j65q0L1j3R1k56L10J08k14K82L9j45J13j64j07J16
7928A0R5o4j04K66P1l59q0K33n2oO7l1j6n5Pq0L9jk46L13k7K8J4o1J30k45J55
7955Aq4j13J05K40k09M18m56L0Q3k64Q5M04k43j54K87r4Nr7l51J59M15l73J14
7978i2J43r1k1O1j84K23n9J89j55j15QK61k79prN9j44J52J38m12M69j63MRM0j11
8004h6r8K72p5j84j71K59J63k60L43j31r8L3n4N3q7J30m1L7J86l34J72j35L17
8027B11l18K29j20o6J82k72K11j3q5K8J21j62j29L7K32L45m56n0n2N4k1K23p1
8050E8k27N10l53J25j26j62M71k77k02K03l14L2L7K0M07j10j75l9J29o0J81j16
8072A2J35k26K53m22q2L58m4J21j39j38K23l9n2K6j18P9n5K85k49k06J64pJ00
$$ plain form
7905 42 -118 173 133 69 -241 -151 64 -101 -181 -150 -163 -72 -328 -18 90 -124 158 197 52 165 1 -106 10
7928 10 105 41 -63 203 274 -85 -165 68 16 10 77 46 30 -25 -18 -98 -59 -60 -306 7 -20 8 22 -39 91 -154 1
7955 1 -83 -196 -91 149 -60 358 -98 -68 15 -249 -164 240 -3 -157 130 36 41 -56 -407 -248 167 -206 -92
7978 -92 51 -40 -61 0 -184 39 -20 169 14 -101 -93 168 -111 -118 -127 -68 -212 -60 78 -334 135 -28 -24 -15 25 -86
8004 -86 -184 88 13 -171 -342 -83 80 -180 163 32 -66 -33 -87 -34 -121 9 -32 5 191 -143 29 -106 211
8027 211 -107 122 2 -64 118 -154 57 44 -41 -13 108 -54 -183 -146 86 431 -25 -75 -127 -73 -94 129 58
8050 58 -169 341 -12 113 -13 -175 296 19 -183 20 -294 -262 -225 -205 202 92 -83 -122 7 -53 128 12
8072 12 147 -79 174 -248 -330 28 -16 105 -34 -172 51 12 -40 -14 -132 -53 -108 177 -72 -278 -114 -121 -21
8095b1j50K03j46m7K08N1l0P1k80L1K64l55K18J12k09K60L7o9P8j95n3%k80L08
8119Fk94J33J57nr6N3J58r5q0K9q8L7K39L2p8q3J55k31O4Q8K2j53K29ml30K07
8145G2j08j3jM2J80R4k66j07k5J57J00r8q2K83q1l94K23p7J72J95k16J98l57J08
8169ak19M33k47K3L10l68L35k45J42k17K26k63J24j8N9J4N8j68J34P8k90m
$$ plain form
8095 -21 -171 32 -114 -161 47 98 68 139 -141 -110 154 -201 17 129 -80 180 217 148 226 31 -22 -22 -302 6
8119 6 -288 -155 2 -3 -99 -46 112 17 -63 -34 -122 -85 154 186 108 25 180 -51 13 101 123 -30 199 195 -135 72
8145 72 -36 -49 -50 -8 172 266 0 -107 -132 25 125 27 -55 228 147 -247 -24 -101 71 266 50 248 -109 -1
8169 -1 -220 213 -34 -11 299 -69 266 21 163 -54 172 -91 33 15 74 88 146 -22 112 190 -100 -104
8191a04
$$ Imaginary data points
##PAGE= N=2
##DATA TABLE= (X++(I..I)), XYDATA
0@%%%%%%%%%%%qJ6j6J6k4L2l2M0n6O4p2Q8j04J20j44J69j93K24k57K97l42L88
33B06m38M95n59O28p04P88q80R80j089J210j342J485j641J812k001K206k430K676
51A402k947L248l583L959m379M853n399O030o768P648q718J0053j1771J4077j7356
66i651K2426l1388N1975j90178n0494K63300l0420k3649k3978l4704m0299Q0699
78a6361O3106J4364J817Q495o5922j5451O6203K9313k8984O348m5002q4611J0296
91e6389R9177K4655n1636k9074l692l9427J859O9785L0430k2047L426j3866m1367
104b8166O915M9912J5308l0066l1630k0073j6652K1137M4590m396k7384m524k8287
117e3316k8721L8398N9745J0564j4643r00j0704k8019K2364O7731J3515l5466
$$ plain form
0 0 0 0 0 0 0 0 0 0 0 0 0 -8 8 -8 8 -16 16 -16 24 -32 32 -40 48 -56 64 -80 89 -104 120 -137 160 -182 206
33 206 -232 263 -296 332 -372 416 -464 516 -573 637 -705 780 -861 951 -1050 1156 -1274 1402
51 1402 -1545 1703 -1880 2079 -2300 2553 -2846 3184 -3584 4064 -4654 5399 -6372 7705 -9651
66 -9651 12775 -18613 33362 -156816 -207310 55990 25570 1921 -22057 -56761 -97060 -16361
78 -16361 46745 61109 62926 71421 5499 -9952 56251 85564 56580 62928 17926 -66685 -56389
91 -56389 42788 67443 15807 -13267 -16959 -56386 -54527 15258 45688 23641 27067 13201 -28166
104 -28166 -21251 28661 43969 13903 -17727 -37800 -54452 -33315 11275 6879 -20505 -25029 -53316
117 -53316 -82037 -43639 16106 26670 12027 11127 423 -27596 -5232 62499 76014 40548
129D0548j3988q024j3609J0188J9220j479k4069k7618j6715K086L2071K7192k2724
142C079k8846l240j7546n851N0638M2434k3428l8585J333J0949n277K1115L6752
155D3527j5855m1660j0120L719J3420K9571M168k7415j7490J759K57R781L7315
168C0977J4513l8210j9257J5317o814k667L5046J1976l2680k1117P717L933l75
181a641J5692j278l3861j2350J3408j395Q200K5873l756k5710p269M574L737J9538
195C762K6795r841l2690J555J3177r674J2909L2152j1762l4711l592J4964M381
208G425L893J0641q233k8003q459R344J1890K2841N630k8788j6742O750j700J657
222a1854K3513J3078k8005l0097J4442K1986j799N846Q930j5581j8152J483J4088
$$ plain form
129 40548 26560 18536 4927 15115 34335 32856 8787 -18831 -35546 -33460 -1389 25803 3079
142 3079 -25767 -29007 -46553 -52404 -1766 40668 17240 -21345 -20012 -9063 -14340 6775 43527
155 43527 27672 -13988 -24108 -20389 -6969 22602 26770 -645 -18135 -16376 -16119 -6338 30977
168 30977 45490 7280 -11977 3340 -3474 -6141 28905 40881 8201 -12916 -5199 -1266 -1641
181 -1641 14051 12773 -21088 -33438 -20030 -21425 -13225 12648 8892 -16818 -24087 -19513 -15776 3762
195 3762 30557 20716 -11974 -10419 2758 -6916 5993 38145 26383 -8328 -11920 3044 7425
208 7425 11318 21959 13726 -14277 -22736 -13392 -1502 21339 26969 -1819 -18561 -11811 -13511 -11854
222 -11854 11659 24737 -3268 -33365 -18923 3063 1264 7110 16040 459 -17693 -16210 -2122
235b122J6046N986r038j8482j0793P465J0967J0753J6002q408l1645p564J6683
248d150P710J646N836L96j6665j3444J3433J6311J071K346o591k1494o720J2496
262g819J4466P326n807j3849j3141j823J4655J1818L108L422j1736j9940M628
275a4692J5959O047N339L690j1159j9255J116K6116J1381j4197q271o072j2362
288a6360J037J2522J0697L249j1247j5624l426R734J2350N168J753K11j9368j4425
302b3729K1721K2747m548j0331k496l407p509J973J7319O723j2958j3257q994
315a6746m60J3361J0076K887m10j3921j3802O617J7797J0226o605r360j715p329
329i384l054J6783J1828n749r350r400n294L308J0329J2196l142j6438p523K217
$$ plain form
235 -2122 13924 19910 10872 -7610 -18403 -10938 29 10782 26784 18376 -13269 -20833 -4150
248 -4150 3560 5206 11042 11438 -5227 -18671 -5238 11073 12144 14490 7899 -13595 -20315 -7819
262 -7819 6647 13973 8166 -5683 -18824 -20647 -5992 5826 8934 12356 620 -19320 -14692
275 -14692 1267 7314 12653 16343 5184 -14071 -12955 13161 24542 10345 2074 -3998 -16360
288 -16360 -15323 -2801 7896 11145 -102 -15726 -19152 -9418 2932 8100 9853 10064 -9304 -23729
302 -23729 -2008 20739 16191 5860 3364 -43 -7552 -5579 11740 18463 5505 -7752 -16746
315 -16746 -17206 -3845 6231 9118 8708 -5213 -19015 -12398 5399 15625 9020 -340 -2055 -9384
329 -9384 -12438 4345 16173 10424 1074 -8326 -13620 -10312 17 12213 9071 -7367 -14890 -12673
343a2673Q140J4477M915l904o819r948j636J0896R595K354o800r614n970n384
357a2371P137K0806J571j9655j2551J58N162M192N796P928p249j6798q32J0557
371f149J0338P642j195o341q238r799M985J9245R884r802j7045l379R953J336
385A435J265J2451P84j7682j2535L437J2571P556j02k035j0079j1413M209J2787
399B649Q944K4j2700j1226L41L132N421Q440M133o318j5129m263J2368R789L362
414H967J535j0457j3719J304J2125Q687R79j060l039j1693m189J3446J1320J85
428A4391n512j0597p968L660P628Q103L800o063j4099r618Q525J3437l448m346
442b107L816r188j4588N999J8553P641o482o721k573l832N527J2822M105l052
$$ plain form
343 -12673 -4533 9944 14859 10955 4136 -5812 -7448 3448 13043 15397 8597 -1017 -6987 -12371
357 -12371 -5234 15572 17143 -2512 -15063 -14905 -9743 -5551 245 8173 924 -15874 -16706 -6149
371 -6149 4189 11831 10636 4295 -3943 -13742 -8757 10488 20372 10570 -6475 -9854 99 1435
385 1435 2700 15151 15935 -1747 -14282 -10845 1726 9282 9180 7145 -2934 -14347 -10138 2649
399 2649 11593 11617 -1083 -12309 -11968 -8836 -3415 5025 9158 2840 -12289 -16552 -4184 5605 8967
414 8967 10502 45 -13674 -12370 -245 8442 9421 8361 5322 -6371 -10560 2886 14206 14391
428 14391 8879 -1718 -9686 -6026 1602 9705 13505 7442 -6657 -16275 -7750 5687 2239 -2107
442 -2107 1709 -7479 -22067 -16068 2485 10126 3644 -3077 -5650 -9482 -3955 8867 12972 9920
456I920o939j2122J035J4301N307l405J569k736j4651j0194J5397J7116o782j0111
470b295j240n974j129J2142R004j489n281o392m900L02J0003O765m657m481p315
485f937j1195O071J8642K190r105n115l528m135M147J3412N797o591j667r75o495
500e484N930J6492L097j0369j0534m042K533N256N311n35p960n957n335l838J1607
515c828J2639n584q422j834k827j817Q859J4941n17j5387k167Q081j128J577O957
530I543j404q288q137l635O313J0617M287q333r281K901J391k758J2608J1920
544A7744j1234j0836K828K039n69P244R142o782j5702j402M136J496P872L12j4211
559g923o725L326N51N387J1483K240j0919p520N921L069K183J3510L73j8039l955
$$ plain form
456 9920 2981 -9141 -8106 6195 11502 8097 9666 6930 -7721 -17915 -2518 14598 7816 -2295
470 -2295 -3535 -9509 -10638 1504 10508 9019 3738 -2654 -7554 -7252 2751 9516 4859 378 -6937
485 -6937 -18132 -12061 6581 8771 -334 -5449 -8977 -13112 -8965 4447 10244 3653 1986 1011 -5484
500 -5484 446 16938 20035 9666 -868 -4910 -2377 2879 8190 7655 -305 -6262 -11597 -15435 -3828
515 -3828 8811 3227 -5195 -7029 -9856 -11673 -2814 12127 11610 -3777 -5944 2137 1009 2586 9543
530 9543 8139 -149 -8286 -11921 -5608 5009 9296 963 -8318 -5417 -4026 -6784 5824 17744
544 17744 6510 -4326 -1498 541 -28 7216 16358 9576 -6126 -7528 -3392 -1896 5976 6288 -7923
559 -7923 -14648 -11322 -10771 -5384 6099 8339 -2580 -10100 -4179 -1110 1073 14583 14956 -3083 -7038
574g038Q488J522J645O532l340j3886n663Q010L974j94O780m381j2792N02N826
589d015K866R891N398j1073j0836M803P742l557j91Q491o513j5229L404R335k97
604B19J303K071o393q002r9P382O986M345p07r777m657R475K258k787Q275L349
620A3241j2567r822N435P817j222j059J295q590q047P891R110J283P33m143q913
635g558k184N769P117L544K279l120j2015l364J1189M623k912J049l986j0444
649a0013N62J0631M690m312j898R1p651n61J3691O262m503l442n154o018K571
664e054Q750L628k198k529m632p162N210R959m799n652M802k702q256N968J3117
679H450k08q431o29P49n381L020J0795J42n014k491p268l157Q748M635l256P11
$$ plain form
574 -7038 1450 2972 4617 11149 7809 -6077 -11740 -3730 244 50 6830 2449 -10343 -9841 -4015
589 -4015 -1149 8742 14140 3067 -7769 -2966 4776 1219 1028 9519 3006 -12223 -8819 516 219
604 219 1522 3593 -2800 -10802 -10901 -3519 3467 7812 7105 -2672 -7329 2146 4404 1617 9892 13241
620 13241 674 -9148 -3713 4104 2882 1823 3118 -5472 -13519 -5628 3482 4765 5498 1355 -7558
635 -7558 -9742 -3973 3144 6688 8967 5847 -6168 -9532 1657 6280 3368 4417 431 -10013
649 -10013 -9451 1180 5870 1558 -340 -249 -7900 -8461 5230 11492 6989 3547 -1607 -7625 -5054
664 -5054 3696 7324 5126 2597 -2035 -9197 -3987 5972 1173 -4479 323 -2379 -10635 -4667 8450
679 8450 8242 -189 -818 -69 -5450 -2430 8365 8507 3493 1002 -6266 -9423 -675 3960 704 1415
695A415J426p373o379J0393J0019p585n437M088l791k376R630O968l782o342l465
710b591m257r3R303N799n933l488k779o734M100J2536J275n931k393j077k388
725d651L298R978O44r903j968J069l591M331J0338j297q841o120j155K194L324
740b350N805K64m619k040j449o10Q509O104o243n101J980q29j320M230O695l332
756E694j1326j099M878j59K662M801k886n171m390n67N016O361L005l457n222
771a860P60P97m49P070L286r486o550K037K025J314L167L491m780q944N54M984
787b584K132O137J604p704m333J371L148N246K761j634o095m007L312J466M3N010
803E873k183j1290k554N306L683L263K586k650p351k889O882M750n51K089j078
$$ plain form
695 1415 2841 -4532 -10911 -518 9501 1916 -3521 567 -3224 -5600 4030 10998 7216 874 -2591
710 -2591 -6848 -6941 2362 8161 2228 -1260 -4039 -10773 -6673 5863 7138 1207 -1186 -2263 -4651
725 -4651 -1353 8625 9269 -634 -2602 -1533 -5124 -793 9545 8248 -593 -6713 -7868 -5674 -2350
740 -2350 3455 3719 -900 -2940 -4389 -4999 3510 9614 3371 -1730 250 -579 -1899 2331 9026 5694
756 5694 -5632 -6731 -1853 -2012 650 5451 2565 -2606 -6996 -7563 -2547 3814 6819 3362 -1860
771 -1860 -1100 -303 -752 6318 9604 118 -6432 -4395 -2370 -1056 2111 5602 822 -8122 -7568 -2584
787 -2584 -452 5685 7289 -415 -4748 -3377 -229 5017 7778 6144 49 -3958 -646 820 863 5873
803 5873 3690 -7600 -10154 -4848 -1165 2098 4684 2034 -5317 -8206 -1324 3426 2875 4964 3886
818C886o058j364K160K730N393k83p521n836J904N901L54k92K487m546p823L917
834d991O908J413J135Q31l144n242j748N274N318j43l364o498j922M845K028r36
850b36K375j465o102l193M273N986J728q19n40m098l863N587O138J238j028m627
866A354m141J61K038L765P92k514k732l772m19N437K900Q9p63m964l950K613N446
883A340L953j390k738j354l079o88N931L521k668l760l292p43J331K816M098J76
899C454m782l128L8M593N473p30l011n16k595k559L673N508J416m502m373m93
915b534o02Q30N265Q86m372m484j615L896M359N11J78j115k876j632M01M427N017
932F540k836n123j799l47J762L592K606j017n233k885K966J342J479K919j190
$$ plain form
818 3886 -2172 -3536 -1376 1354 6747 6464 -1057 -6893 -4989 912 1266 974 3461 -1085 -8908 -4991
834 -4991 1917 3330 4465 5296 2152 -3090 -4838 436 5754 5611 2247 -4251 -6173 -1328 700 -236
850 -236 2139 674 -5428 -8621 -4348 1638 3366 2547 2007 -2091 -5954 -367 5771 7009 5981 1354
866 1354 -2787 -2626 -588 3177 3969 1455 -1277 -5049 -5468 -31 2869 2958 2195 -2769 -6719 -4106 1340
883 1340 5293 3903 1165 -189 -3268 -3956 1975 5496 2828 -932 -4224 -4967 -3636 -820 3278 3454
899 3454 -1328 -4456 -4418 175 5648 4918 1907 1391 -1204 -3763 -90 5418 6834 2332 -2041 -2534
915 -2534 -3136 -2306 2959 3845 -527 -5011 -6626 -2730 1629 2140 2318 1203 -1673 -3305 -2904 1523 6540
932 6540 3704 -1419 -3218 -3565 -1803 1789 4395 3378 -1855 -4740 -1774 -432 1047 3966 2776
947B776l312k466M78M006L411K16k022m784k332K085K212K044P74m405l401N16
963d204P86K383L358J297k969n358J28N135J392M80J519k857l704j87K989M138
979D326L04l213k385k273k6K463J578K594l84o131j806M527K205R94P09o74k936
996a28m765K209N884K25j872j228l424q46J726K376K051o18l189k632j78L145
1012a264L718O7N71j085n480O14N519J947p15k123k287j925j269L515L512j931
1028A384j673p54l292N83M022K164K73k222l193p47K038M281J693k615r25j508
1044d91l134K178M603m41k781r57j703j858O91N991K955m761k675M51m46K944
1060E66L375r71j203j352k416J02L156L287j837l788j32j084l362M765N527l571
$$ plain form
947 2776 -536 -3002 -2524 1482 4893 5109 3087 -1697 -4029 -1944 268 2312 3086 -1319 -4720 -4204
963 -4204 -3418 -1035 2323 3620 651 -4707 -4579 556 1948 2428 3947 1090 -2614 -2801 188 4326
979 4326 4630 1417 -968 -3241 -3267 -804 774 3368 2984 -3147 -4953 -426 1779 2773 3482 2808 -128
996 -128 -4893 -2684 3200 3425 1553 325 -3099 -3945 -2219 157 2208 1590 -1599 -4231 -4409 -1264
1012 -1264 2454 2521 3092 2007 -3473 -2859 2660 4607 3892 1769 -518 -2443 -3712 -197 3315 1384
1028 1384 -289 -1043 -4335 -3752 270 2434 2707 485 -2708 -3455 -1417 2864 4557 1942 1017 -491
1044 -491 -3625 -1447 3156 2715 -66 -1023 -2726 -4584 -3893 2098 5053 292 -2383 -1932 -2378 566
1060 566 3941 2970 1767 415 -2001 -1899 1257 4544 2707 -1081 -1213 -2297 -5659 -894 4633 1062
1076A062m650J31R58R06K733K770m37l657m08k52k19M942J156m289j550j1k094
1093b909J440M191Q50m256l615J777K45k71M606J689m828j197J261m35K105L084
1109C737L40l047l274O63O42J071L335j644l922j43N32n90L153K883j632m016
1125a912j055K420K72J420L893p67n778q52J488J656J913m44j627k514j725Q98
1141b714J273J879K029l407l618K306J494N99K744J020l608l851J491M398K91
1156B326p42J708k199l900J066J631J139J932p71l527j677J519K563K91Q37L53
1172B549m302j991M144J441j716J414J5l833k070K198K512l56O47K96m164j104
1188d320M181J403o25J191j471k152Q03K547Q58k02J478j642n220L08N266j59
$$ plain form
1076 1062 -3588 -3457 -2499 -1593 1140 3910 3473 -184 -592 -844 -1063 3879 5035 746 -804 -815 -2909
1093 -2909 -1469 2722 3572 -684 -4299 -2522 -2277 -2548 2058 3747 -1081 -2278 -1017 -1452 653 3737
1109 3737 4077 1030 -2244 -1581 -939 132 3467 1823 -2099 -2242 -1710 -2300 853 3736 2104 -1912
1125 -1912 -2967 -547 -275 1145 5038 4271 -1507 -2359 -871 785 2698 2254 627 -1887 -3612 -2714
1141 -2714 -1441 438 2467 -940 -4558 -2252 -758 -159 2585 3605 -3 -3854 -2363 2035 2326
1156 2326 1584 3292 1093 -2807 -1741 -110 1029 2961 2190 -1337 -3014 -1495 1068 1359 2196 2549
1172 2549 -1753 -3744 400 1841 125 1539 1554 -2279 -4349 -2151 361 5 652 948 -3216 -4320
1188 -4320 -139 1264 639 1830 359 -1793 -990 1557 2415 2213 3691 2049 -3171 -2863 2403 2244
1204B244r12J081k565m179J302M092J392j516L9r20k829J118K628k56Q90O79m635
1221b347k296L537K913m43j733o86j884k136L988L737k394r40J698j462j177K309
1237F84K408Q15j180j765j910L84L287J657l292r26m88k952O47L299K93j227o05
1254h71q40j760r70M338K936j832j111J60j474Q79K587l6j004j239q57n11K52
1271a353K273R39k643o06m97j474K625L996q51j532n01k2p65Q82L902N64l961
1288I76j124O86j680J621J422j682k119j506m78N50K541K074j402k383M40J80
1304a884j155M524L075k488k711P29N91K00R25J379j807k775N12J98l35K304P8
1321A360l121o37O28M04J755K502N12l478j615J816K79j83K759J76l848o60K07
$$ plain form
1204 2244 1332 2413 -152 -4331 -3029 1063 2455 939 978 58 -2771 -1653 975 719 1609 2288 -2347
1221 -2347 -4643 -1106 1807 1364 -369 -1055 -2939 -5075 -1087 2650 256 -684 1014 -448 -1625 684
1237 684 3092 3907 2727 962 -948 -564 2723 4380 1088 162 -326 -3278 -2631 668 961 -266 -871
1254 -871 -1711 -3471 -4441 -103 2833 1001 -110 50 -1424 -545 2042 2006 1002 -237 -1094 -1605 -1353
1271 -1353 920 1859 -784 -1390 -1887 -3361 -736 3260 2409 877 376 354 -411 471 4373 4937 976
1288 976 -148 538 -1142 479 1901 219 -1900 -3406 -3884 -3334 -793 1281 -121 -2504 -2064 -1884
1304 -1884 -3039 1485 4560 2072 -639 90 681 881 1806 3185 1378 -1397 -885 -687 -1022 1282 1360
1321 1360 -1761 -2398 -1770 -1366 389 2891 3403 -75 -1690 126 405 222 2981 3157 -691 -1351 -1144
1338a144P6K89J106m20k404j409J192J088J192K387j379k426Q94J164L44K409
1354B959J312j438k292r12Q37J1N12J796j869l211r4J856O03K73m45r61j336k2
1372b421J682J910J084J53k393k394J587J014M16J763o67k545j790N12K063L73
1388C47n99N35j254j588J192J995J119O83j670j431j73J032J645N95j92q21k480
1405a065n12J679P7k2L93j005j776n43J685K160j79r87m68j087M5K620J124k68
1423A871o75j306j151J52J144J060L05n55j543j982O78K886M00r94k34q67n99
1440a410J264J805Q32j741m66n12j064N78J922M92o44j727k202L86J917J382R0
1457I02r02q62k62k32J828J452o07j042J18o68k5J225J169K14k389k228K40P86
$$ plain form
1338 -1144 -1068 -779 327 -93 -2497 -3906 -2714 -1626 -434 1953 574 -1852 -958 206 550 2959
1354 2959 4271 2833 541 -371 466 477 989 2785 916 -2295 -2389 -533 70 343 -102 -1063 -2399 -2421
1372 -2421 -739 1171 2255 2408 15 -2379 -792 222 638 2401 1734 -811 -2601 -2089 -26 347
1388 347 -252 283 -971 -2559 -1367 628 1747 2430 760 -671 -844 188 1833 2428 2236 1415 -1065
1405 -1065 -1577 102 179 157 550 -455 -2231 -2774 -1089 1071 892 -95 -563 -1650 -1605 1015 2139 1871
1423 1871 1196 -110 -1261 -1109 35 1095 1400 845 -698 -2680 -2002 884 1284 290 56 -811 -1410
1440 -1410 -146 1659 2491 750 284 -228 -1292 -714 1208 1700 1056 -671 -2873 -2487 -570 812 902
1457 902 0 -862 -1124 -1356 472 1924 1317 275 393 -275 -300 925 2094 2308 -81 -2309 -2069 -1283
1475a283J347R52j036p33n50j077J446J741L96j82q04o70J43J90J887R69j630
1492A106j848n34L78R26R68l73q82j622n22J091Q94J232Q45j238p23j10L00J518
1510A406Q52n41j280j305j00R76J57Q33m40k126r41P21L90J174L20l7o15j341
1528a897R16J721O87M69l71r79k96L14L53J274n71j326j077q17R24Q75NM20l45
1547B79k196n60J679J285P75n26o40k14q77J040J497l76L7q16j839K37Q82K23
1565a10N64p58j078o90J77K114J154r35k31n7j269Q82J806N04p7n49j010o08K4
1584a47J318P40j522n74p84j056J050J289k64m66o42o72o2J002J758J66j144J45
1602A35p24j005J884J463n83j074l49n40Q2Q00Q30J11j110n29m90L22J736M80
$$ plain form
1475 -1283 64 1016 -20 -753 -1303 -2380 -934 807 1203 1021 217 -453 -310 -120 1767 2736 1106
1492 1106 -742 -1276 -898 28 996 623 -259 -1881 -2403 -1312 -418 814 1659 421 -302 -412 -112 1406
1510 1406 2258 1717 437 -868 -968 8 165 998 558 -1568 -2509 -1788 -1398 -224 96 59 -556 -1897
1528 -1897 -981 740 1427 1896 1525 546 250 564 917 2191 1620 294 -783 -1600 -676 199 204 624 279
1547 279 -1917 -2477 -798 487 1262 736 96 -118 -995 45 1542 1166 1203 387 -1452 -1215 -333 -110
1565 -110 454 -304 -1382 -2072 -1895 219 1373 438 207 150 -1119 -237 1569 2073 1996 1447 437 -171 -147
1584 -147 1171 1911 389 -185 -969 -2025 -975 314 50 -416 -1058 -1730 -1792 -790 968 1134 -10 135
1602 135 -589 -1594 290 1753 1170 96 -253 -793 -711 89 919 1030 -80 -609 -1099 -777 959 1439
1620A439p62k84p7o11kJ506P27j063j551K48j26l53J315N46j073p51m96m13J150
1639f31J222J09j028o53o0J34M95K014m37j203j92l00K41N03J113M11j684p80
1657g26O14Q4N13J333o37j706L94q8J05L71O84j91j738n80J081j24N70J150j271
1676a62j517P07L38r8L67J483r86j045J04J128O7L88J037j156j500L12N97K96
1694C60Q06m68j274l89N95O12o32J393Q01j841j404J619M19j52P62j0j477p59
1712a039Q10N79l76J20p2j475l17J087k99M20J113o81j332pJ782O29k1M50L9j595
1732a85K61J317l24l9N25j175j097k34Q87M40k69r6p88r67O79J387l01K13K29
1751D63m61m66K66N61M51Rj21j092r53Q96J158n25n28n0n75l94L08J078L65k88
$$ plain form
1620 1439 677 393 316 -295 -297 1209 1936 873 -678 -430 -556 -909 406 952 -121 -872 -1368 -1781 -631
1639 -631 591 700 -328 -981 -1041 -907 -412 1602 1165 -38 -230 -530 -289 214 1327 1738 54 -726
1657 -726 -112 -28 485 1818 1181 -525 -131 -219 -114 257 941 750 -988 -1568 -487 -611 -41 1109 -162
1676 -162 -1679 -972 -634 -732 -365 1118 132 -913 -809 319 386 774 1811 655 -845 -533 64 360
1694 360 1166 698 -576 -965 -370 242 -390 1003 1804 -37 -1441 178 597 445 1207 1197 -280 -1039
1712 -1039 -229 350 -26 94 22 -1453 -1770 -683 -982 -562 551 -130 -1462 -1469 313 942 921 1371 1410 -185
1732 -185 76 1393 1069 1030 1555 380 -717 -951 -64 376 107 11 -777 -1744 -1065 322 21 234 463
1751 463 2 -464 -198 363 814 823 702 -390 -1343 -447 711 186 -342 -392 -967 -1361 -1053 25 390 102
1771A02N1n11m0Q32J060k94L51J8j532j42J129K69p39q86o2k48j114P78J306q35
1791e07j28l91n84O48J165O73j55n33j05l56O2J816m5j338mO6j147K14J173j31
1811C93o22m38j84k30M53J634k08r41K51K79n69N45J285j17q82m35k89l42J19
1830b98J180m76j608L02p0m97J169P82p62p32L67R8J57P97J052m17j036J00q4
1849B4J42J180k86r52l74P9p17L56R50r5r50l84P60r0l9J214k4m47o64Q6K44P40
1871G53K41o5r49m15J06l92L28J156n63j134n8M50K30N69M91k52q44k58Q23K17
1891D34K03N57n45r89K40k98J87L04J92J07j248l02R12R8J59N65p62m83M94L78
1911B03L99M78k17n02j131M56N34N4q6M87r76q77N19L71M22R8k73l26j23J91O27
$$ plain form
1771 102 153 -358 -398 434 1494 1200 1551 1569 37 -105 1024 1293 554 -332 -394 -642 -1756 -978 328 -507
1791 -507 -635 -1026 -1610 -962 203 876 721 188 83 -273 -211 1605 1560 222 218 284 -863 -649 524 393
1811 393 -229 -667 -851 -1081 -628 1006 798 -143 108 387 -182 363 1648 1531 649 214 -75 -417 -298
1830 -298 882 406 -1202 -900 -970 -1467 -298 484 -278 -1010 -643 -545 -388 409 1461 1044 8 108 24
1849 24 166 1346 1060 108 -266 -187 -904 -548 402 307 -643 -1027 -267 -357 -396 818 794 347 -317 -231 13 753
1871 753 994 929 -20 -435 -329 -721 -393 763 200 -934 -992 -542 -312 257 748 496 -348 -606 217 434
1891 434 637 1194 649 -340 -100 -398 -211 93 285 392 -856 -1158 -246 -148 11 576 -186 -669 -175 203
1911 203 602 1080 863 361 -770 -314 220 274 188 675 -301 -1178 -659 -288 134 232 -41 -367 -490 -299 328
1932C28k4N21l5j078m89J187J74m45J46l50n13m32J63P62K03k02j57o56M49M84
1952C6k22N35L46m49k99N8P40M20n15m78o2q24Q9P87k59j76k11j75j73K07J75
1973d50M29K05J47R6j091O00P37j95K21m32n17L35j57M52l33Jk95m31n01M82R46
1994B49j71o5P9m43K09N24L28J2l43l74K13L5J88L25p37K69o08q65L59N33L34
2015E1l39n84J62K65m37Q26O60l12L1k15J7N12lL8J24p04n5j81j86Q85r6r22K
2038d61j38k9L02N48J1J04m18j21N51n3N42j40n19j63j20m5J59J80k10m33m50
2059i03L05N09l22M21K61l79k05k1L28Q14k17k02p3p4N6P3m1J93l4q10k45N93
2081B7L8J24q4l39j79l69M56L80L87R3n10n73O66K6k02J13M22l19m56k53M28M28
$$ plain form
1932 328 304 825 790 -288 -777 410 584 139 285 -65 -578 -1010 -847 -85 118 -84 -241 -897 -448 36
1952 36 -186 349 695 246 -53 5 745 1165 650 172 110 -714 -625 162 -97 -273 -484 -659 -832 -625 -450
1973 -450 -21 184 331 427 -664 -64 673 478 699 267 -250 85 -72 380 47 48 -247 -678 -1179 -697 249
1994 249 78 13 92 -351 -142 382 710 722 379 5 218 253 441 766 29 298 -310 -1175 -816 -283 51
2015 51 -288 -872 -710 -445 -882 -56 604 292 323 108 125 637 634 672 796 92 37 -144 -330 555 459 -463 -461
2038 -461 -599 -628 -326 222 233 337 -81 -202 349 296 838 698 179 16 -104 -149 10 190 -20 -453 -903
2059 -903 -598 -89 -411 10 271 -108 -313 -334 -6 808 591 389 316 242 298 371 330 523 489 -321 -566 27
2081 27 65 189 105 -234 -413 -782 -326 54 441 534 24 -549 117 143 -59 54 476 157 -299 -552 -124 304
2103C04n00L6L5l31PK11K57K56k57N5j49O9L67J70l21J39k43o05K42N09m6k15
2125a0l42k33O03k77J58K41l28K27n48N0P05J75j40j9l32j81Q4J85K66J3l09k91
2147c03l26n9J006m76J54L14l72k25L38K38O08n66m64M28k52m7J12N5r3p4n24
2168e28q9M18M1J70j70k4j11j06N4O02J08m28Pl5L12P5l6K15k25n79J42j88J35
2191b40P02n52k01L8J1O5L10J16o8j53k15O97l69r8P39p65K31n06O1j41M50J60
2213B72o46j74J91J23k75N71L03l84l15L66KK00O85l60l68l78M15j00l25O50J1
2234D64p69k52O09j99j49K04P4j64l92L60L19J50K22j12l49O3L39l95M55j45k06
2255A27k78k00J63m4P7K39l28m75J28M59J23L78j52j39j18R3K41p8O1J72k39n89
$$ plain form
2103 304 -196 -160 -125 -456 -449 -238 19 275 18 73 -76 -7 360 530 209 348 105 -500 -258 251 205 -10
2125 -10 -352 -585 18 -259 -101 140 -188 39 -509 -459 246 421 281 262 -70 -251 -167 18 284 297 -12 -303
2147 -303 -629 -688 318 -158 -4 310 -62 -287 51 289 897 331 -133 295 43 -4 108 163 70 -4 -528
2168 -528 -617 -199 -158 12 -158 -182 -293 -399 -345 257 365 -63 -56 -91 221 296 260 475 250 -329 -187 -375 -240
2191 -240 462 -90 -291 -253 -242 -177 133 249 181 28 -187 510 141 43 782 17 248 -258 -197 -338 112 272
2213 272 -374 -548 -357 -234 -509 62 365 -19 -334 32 34 234 919 559 191 -187 228 128 -197 453 464
2234 464 -305 -557 52 -147 -296 -92 -18 -182 -574 -214 105 255 477 365 16 79 418 23 478 333 127
2255 127 -151 -351 -188 -232 -155 84 -244 -719 -591 -132 -9 369 217 78 -40 53 294 216 277 449 210 -379
2277c79L15J89j38Q9r3l90J74k83K34L62L9k7l35k35O13K72k70L24Ql84k11j13
2299b39L99M54o60J40m84l63N98J68l94L58j6l10J87K58M13j22l8l5J11o45L64
2320A44K00k12r4k41k50K22M23k67J81k63J29k22j19Q06j43m38J39N77p30K06
2340D8L85J91m71m14m7J4J67L79m92o9%l6l51N67L78M1m37K48n1k26M59N9J1m08
2364e5K48k09j07J99R9n41JK00M1k65L07L85k40l27K59l8K4M89l59J8L29l45k12
2387i9N1R4jk55l67N27l17k30K94L80l10m4L9N73r8N8P4p1k11K40k07m07N48Q5
2411C46o84Q3j29JL50j33L63l71l77M25r8K56J30p5n8L73l53J92J66K7j72o10
2433c48K9K10k5k19O08n45L0l7Q6L41k0J14j75l21P23j34l97M01K6l75k14M38
$$ plain form
2277 -379 -64 125 -13 76 -17 -407 -233 -516 -282 80 119 92 -243 -478 135 407 137 461 469 85 -126 -239
2299 -239 160 614 -46 94 -390 -753 -155 13 -381 -23 -39 -349 -162 96 509 387 349 314 425 -220 144
2320 144 344 132 38 -203 -453 -231 192 -75 106 -157 -28 -250 -369 437 294 -144 -5 572 -158 48
2340 48 433 624 153 -261 -308 -294 -127 252 -240 -309 -309 -345 -696 -129 249 290 -147 101 50 -176 283 342 353 -55
2364 -55 193 -16 -123 76 175 -366 -365 -165 -124 -389 -82 303 63 -264 -5 -43 -19 470 111 129 458 113 -99
2387 -99 -48 46 45 -210 -577 -50 -367 -597 -303 77 -233 -277 -238 335 237 295 369 298 87 327 120 -287 261 346
2411 346 -338 -255 -384 -383 -33 -166 197 -174 -551 -126 -224 32 162 87 29 402 49 241 407 434 262 -348
2433 -348 -319 -109 -134 -353 255 -290 -260 -297 -211 130 110 224 49 -272 451 317 -80 321 347 -28 -242 196
2455A96j50j06j35Q2K6m66L08j4O6K49J17o74M52Q5N9L9K86m40K98l08qL73O9
2478D04k42k85j55L5L44k07l3J46Q5n54Q1M78J89m65J73M01k09j44J03J18R2l39
2500A6l78J54N94o86K08PJ40k6o29N40K49k0k0k41R3K04o8J29K86k50r3j20p0
2523A9p9L27k43j84M0l8k77J14N08j54k86NM7J78J78M5J9rk41O0oQ7L24l90k71
2548b27L07k15j21K20Q0j50j06j31l4L58L40k76N2P9J9m4l74O03m68K08k87o0
2570b27N0J88j26Jj00j88K36O0J4K3R3j20M54m28K62o9K28k2m88k2L74L0k80j04
2594a61q1J56j59K82k4j81n3M5J48P6j83J57J23L10j10n76J77J30j10o8j44N12
2616B66k81Q3k29J84K5J45k90n5O8L66n2j41o0J65j67L01o6K16m82J6j87ko9J08
$$ plain form
2455 196 46 -60 -195 -113 -87 -553 -245 -259 -193 56 173 -501 -49 36 95 134 420 -20 278 -30 -38 335 404
2478 404 162 -123 -278 -243 101 -106 -139 7 92 -462 -381 97 286 -179 -6 395 186 42 145 263 355 16
2500 16 -362 -208 386 -300 -92 -85 55 29 -600 -60 189 169 149 -92 1 205 137 266 552 302 209 89 19
2523 19 -60 267 24 -160 -120 -158 -435 -321 187 33 -253 -248 -201 -23 155 200 219 210 -31 29 23 110 434 44 -227
2548 -227 80 -135 -256 -36 44 -106 -212 -343 -377 -19 321 45 97 176 195 151 -223 380 -88 120 -167 -227
2570 -227 -177 11 -115 -114 -214 -402 -166 -106 -92 -69 24 -96 358 -70 192 123 351 329 -159 -181 193 223 -57 -161
2594 -161 -242 -86 -245 37 13 -168 -221 -176 -28 48 -135 22 145 455 345 -231 -54 76 -34 -102 -246 266
2616 266 -15 68 -161 23 48 193 -97 -152 -84 282 230 89 29 194 27 328 262 478 -4 12 -175 -177 -246 -138
2640a38k64M43j87j4p5M4L74j60J91n5lr6L4J20K14l14q7r1k7K18j02m0j11K93
2664A67j48j44J57K80j55m49M38J5k65J26O69m64O6k51j50L08o6l3j6M1k56l66
2686d96K25M6L65l66K14n8J30n6J63p7P9J14k87L02j78J9j35J69l35N7j35m4M29
2709A45j92l3n6P7J54n0J49O0J88m18K16k60L1O2l0j8m6j31qJ06J76k3l81J32
2733a50Q5r2K37k1P7l24L83P0k4J0p1j88Pl7R8m1K3n6k07k03K06j72K06j4K28
2758C0j09j63P4L19k67M24j00k44R4Q9k51L19l54L34m48J58J19j18J30l31J88
2779a07m1k18M24J70n0J3p6q1J30p5L41l59l9Lk73K82j54j46K47j54l7K28j90
2802a62J78j13J65rP2Rj85L73Q0j79j24k27K89k63J17k21l2K10k05m4K93P3l15
$$ plain form
2640 -138 -402 41 -146 -160 -235 -191 183 23 214 159 156 60 94 214 428 114 27 -64 -91 127 25 -15 -126 167
2664 167 19 -125 32 312 157 -292 146 161 -104 22 691 227 293 42 -108 200 134 101 85 126 -130 -496
2686 -496 -271 -225 140 -226 -12 -70 60 4 167 90 169 283 -4 298 120 139 4 173 -162 -105 -240 -284 145
2709 145 -47 -80 -136 -59 95 45 194 254 442 24 240 -20 11 73 43 25 -21 -152 -160 -54 122 99 -282 -150
2733 -150 -65 -157 80 59 136 -188 195 265 241 251 180 -8 -1 -38 60 19 42 -14 -221 -424 -218 -390 -184 -198 30
2758 30 -79 -242 -168 151 -116 308 208 -36 58 147 -104 215 -139 195 -253 -95 24 -94 36 -295 -107
2779 -107 -148 -366 58 228 178 191 115 34 164 89 430 71 32 35 -238 44 -110 -256 -9 -163 -200 28 -162
2802 -162 16 -97 68 59 131 140 -45 328 408 229 105 -122 167 -96 21 -200 -232 -22 -227 -271 22 95 -220
2825b20M54j9j59k43n4M40l29K19j0o5j79J01O5k09q4J63k64J81P6O5q8j60L02
2848a7k17J2M50j42L6J83l38m8K14q0L3J13j96p3j6j0K01r0k02K89m28K16K56
2871A46Nm6l47L55j23J24k0L45n45J94q4O1j65K81p6k15K43l62K72j10J02J24
2893A59p1l2K01k15J08K11L4k37o6J29j77j42R4K58m65r6J89o0Q5j2q2lO3K14
2917H7LJ07pl1m12K02L58l41J6N6J6k71J22k0R2QL06m20n4J44k6j79P1L32J92
2942C51k51l1K1J17l31L07j00k48k05JK72J60P4l52MK54j26l4K78m5k9j74L69
2965B82l52K71k36J92j57O8K14m59O1p8R1j0j01J03K77l49M6L76k98M2K69j69
2987H3R2l19k5J80r8P4j75K64n3N8k34j03K36n2O2q0P9k74L43M21j86k92k01M01
$$ plain form
2825 -220 234 215 56 -187 -241 199 -130 89 79 14 -165 -64 1 -208 -292 -129 -393 -212 -136 -71 -159 -319 -17
2848 -17 -234 -222 228 86 122 305 -33 -81 133 53 86 199 3 -70 -86 -96 105 15 -187 102 -326 -110 146
2871 146 151 105 -242 113 -10 114 94 439 -106 88 4 65 -100 181 105 -110 133 -229 43 -67 35 159
2893 159 88 56 257 42 150 361 395 158 92 221 44 -98 -4 254 -211 -307 -118 -178 -93 -105 -187 -190 -127 87
2917 87 90 197 190 159 -253 -51 307 -34 -18 38 54 -217 -95 -115 -23 -15 291 -129 -183 -39 -65 -244 -173 159 351
2942 351 100 69 90 207 -124 183 83 -165 -370 -369 -97 63 137 -215 -211 43 -83 -117 161 116 87 -87 282
2965 282 -70 201 -35 157 0 68 282 -177 -116 -194 -103 -113 -214 -111 166 -183 -137 239 -59 -17 252 83
2987 83 175 -144 -169 11 -87 -13 -188 76 23 81 -153 -256 -20 -72 -10 -90 -11 -285 58 479 293 1 -200 201
3011B01k24L12j75R6k15j5J4l20K54l8L11m10j08L16o5J03J99k61K83k37K5K30
3033B76Rk86l4J01J43l36k42L34l5r4K2M8j44J18m1l1L95m07L07m6k64L76L3j47
3057E5QR4j66%j06L49k29j92J11M2j1J14j03RJ03j90K5kJ68M4k10O4M06k33k37
3082h7R1J33l67K70n13K86J02j37J39p5O5q0o0J32O5J88q7O6r2K7k9j15m8N5j26
3107a97M1R5p4J38l63J50N0J55j7K53j00L0O6j6n1n0Q6j66Q7j91O0j14j71L37
3131C8q8j35J51q3L7k8J5J80j83j9L11J99k92M4M2N3m93J33K22k46M52m44l3J1
3155a56M84m93j44L26N0K1k50n7J45K80k51J51o3J17k9K7l2r7J37m38J15pN5o3
$$ plain form
3011 201 -23 289 114 210 -5 -20 -6 -326 -72 -110 201 -209 -317 -1 -66 37 236 -25 258 21 46 276
3033 276 285 -1 -35 66 209 -127 -369 -35 -70 -164 -142 -94 -238 -120 -161 -192 203 -204 103 57 -207 169 202 55
3057 55 63 157 -9 -9 -115 234 5 -187 -76 -34 -45 69 -34 -25 78 -112 -87 -89 79 123 -87 -23 383 150 -87
3082 -87 4 137 -230 40 -473 -187 -85 -222 -83 -158 -93 -173 -233 -101 -36 152 65 131 39 66 37 -78 -126 -71 -197
3107 -197 -156 -61 -135 3 -360 -210 -160 -5 -22 231 131 161 227 211 160 110 196 30 117 -74 -14 -128 -299 38
3131 38 -50 -185 -34 -117 -80 -108 -93 87 -96 -115 196 395 103 147 189 242 -251 -118 104 -142 310 -134 -167 -156
3155 -156 328 -165 -309 17 67 88 -162 -219 -74 206 -45 106 43 160 131 158 126 29 166 -272 -157 -164 -109 -172
$$ [...]
8191B43
##END NTUPLES=NMR FID
##END=
