##TITLE=1H_Ser 2062
 CDCl3, 8 sc, 
 13.2.2019
##JCAMPDX= 6.0         $$ Bruker NMR JCAMP-DX V2.0
##DATA TYPE= NMR FID
##DATA CLASS= NTUPLES
##ORIGIN= UXNMR, Bruker Analytische Messtechnik GmbH
##OWNER= root
$$ XWIN-NMR		Version 3.5
$$ Wed Feb 13 14:41:23 2019 Russian Standard Time (UT+4h)  she@DPX200
##.OBSERVE FREQUENCY= 200.1313
##.OBSERVE NUCLEUS= ^1H
##.DELAY= (6, 6)
##.ACQUISITION MODE= SIMULTANEOUS
##.ACQUISITION SCHEME= undefined
##.AVERAGES= 8
##.DIGITISER RES= 18
##SPECTROMETER/DATA SYSTEM= spect
##.PULSE SEQUENCE= zg30
##.SOLVENT NAME= CDCl3
##.SHIFT REFERENCE= (INTERNAL, CDCl3, 0, 15.7039)
##AUDIT TRAIL= $$ (NUMBER, WHEN, WHO, WHERE, WHAT)
$$ ##TITLE= Audit trail, XWIN-NMR		Version 3.5
$$ ##JCAMPDX= 5.01
$$ ##ORIGIN= Bruker BioSpin GmbH
$$ ##OWNER= she
$$ F:/spectra/data/she/nmr/H-F/1/audita.txt
$$ ##AUDIT TRAIL=  $$ (NUMBER, WHEN, WHO, WHERE, WHAT)
(   1,<2019-02-13 14:40:17.18 +0400>,<she>,<DPX200>,
      <created by zg, POWCHK disabled, PULCHK disabled
       configuration hash MD5:
       00 E9 B6 7A A2 85 ED C7 34 08 36 98 17 FE 4E 26
       data hash MD5: 16K
       3F 1D 6D 1E FA 73 C7 BE 09 7D A0 F6 0F 93 E4 2E>)
$$ ##END=
$$ 
$$ hash MD5
$$ 44 6A B2 F2 A2 88 DB 1E 66 A8 D4 6B FC AE D8 DC
##$RELAX= 
##$RELAX= 
##$RELAX= 
##$RELAX= 
##$RELAX= 
##$RELAX= 
$$ Bruker specific parameters
$$ --------------------------
##$DU= <F:/spectra>
##$EXPNO= 1
##$NAME= <H-F>
##$PROCNO= 1
##$TYPE= <nmr>
##$USER= <she>
##$AMP= (0..31)
100 100 100 100 100 100 100 100 100 100 100 100 100 100 100 100 100 100 
100 100 100 100 100 100 100 100 100 100 100 100 100 100 
##$AQSEQ= 0
##$AQ_mod= 1
##$AUNM= <au_zg>
##$AUTOPOS= <>
##$BF1= 200.13
##$BF2= 200.13
##$BF3= 200.13
##$BF4= 200.13
##$BF5= 200.13
##$BF6= 200.13
##$BF7= 200.13
##$BF8= 200.13
##$BYTORDA= 1
##$CFDGTYP= 0
##$CFRGTYP= 5
##$CHEMSTR= <none>
##$CNST= (0..31)
1 1 145 1 1 1 1 1 1 1 1 1 1 1 1 1 1 1 1 1 1 1 1 1 1 1 1 1 1 1 1 1 
##$CPDPRG= <>
##$CPDPRG1= <>
##$CPDPRG2= <>
##$CPDPRG3= <>
##$CPDPRG4= <mlev>
##$CPDPRG5= <mlev>
##$CPDPRG6= <mlev>
##$CPDPRG7= <mlev>
##$CPDPRG8= <mlev>
##$CPDPRGB= <>
##$CPDPRGT= <>
##$D= (0..31)
0 1.2 0 0 0 0 0 0 0 0 0 0.03 0 0 0 0 0 0 0 0 0 0 0 0 0 0 0 0 0 0 0 0 
##$DATE= 1550054416
##$DBL= (0..7)
120 120 120 120 120 120 120 120 
##$DBP= (0..7)
150 150 150 150 150 150 150 150 
##$DBP07= 0
##$DBPNAM0= <>
##$DBPNAM1= <>
##$DBPNAM2= <>
##$DBPNAM3= <>
##$DBPNAM4= <>
##$DBPNAM5= <>
##$DBPNAM6= <>
##$DBPNAM7= <>
##$DBPOAL= (0..7)
0.5 0.5 0.5 0.5 0.5 0.5 0.5 0.5 
##$DBPOFFS= (0..7)
0 0 0 0 0 0 0 0 
##$DE= 6
##$DECBNUC= <off>
##$DECIM= 32
##$DECNUC= <off>
##$DECSTAT= 4
##$DIGMOD= 1
##$DIGTYP= 9
##$DL= (0..7)
0 120 120 120 120 120 120 120 
##$DP= (0..7)
150 150 150 150 150 150 150 150 
##$DP07= 0
##$DPNAME0= <>
##$DPNAME1= <>
##$DPNAME2= <>
##$DPNAME3= <>
##$DPNAME4= <>
##$DPNAME5= <>
##$DPNAME6= <>
##$DPNAME7= <>
##$DPOAL= (0..7)
0.5 0.5 0.5 0.5 0.5 0.5 0.5 0.5 
##$DPOFFS= (0..7)
0 0 0 0 0 0 0 0 
##$DQDMODE= 0
##$DR= 18
##$DS= 0
##$DSLIST= <SSSSSSSSSSSSSSS>
##$DSPFIRM= 0
$$ [...]
##$SUBNAM2= <"">
##$SUBNAM3= <"">
##$SUBNAM4= <"">
##$SUBNAM5= <"">
##$SUBNAM6= <"">
##$SUBNAM7= <"">
##$SUBNAM8= <"">
##$SUBNAM9= <"">
##$SW= 20.0189088683792
##$SWIBOX= (0..15)
0 0 2 0 0 0 0 0 0 0 0 0 0 0 0 0 
##$SW_h= 4006.41025641026
##$TD= 16384
##$TD0= 1
##$TE= 0
##$TE2= 300
##$TE3= 300
##$TEG= 300
##$TL= (0..7)
0 120 120 120 120 120 120 120 
##$TP= (0..7)
150 150 150 150 150 150 150 150 
##$TP07= 0
##$TPNAME0= <>
##$TPNAME1= <>
##$TPNAME2= <>
##$TPNAME3= <>
##$TPNAME4= <>
##$TPNAME5= <>
##$TPNAME6= <>
##$TPNAME7= <>
##$TPOAL= (0..7)
0.5 0.5 0.5 0.5 0.5 0.5 0.5 0.5 
##$TPOFFS= (0..7)
0 0 0 0 0 0 0 0 
##$TUNHIN= 0
##$TUNHOUT= 0
##$TUNXOUT= 0
##$USERA1= <user>
##$USERA2= <user>
##$USERA3= <user>
##$USERA4= <user>
##$USERA5= <user>
##$V9= 5
##$VALIST= <valist>
##$VCLIST= <CCCCCCCCCCCCCCC>
##$VD= 0
##$VDLIST= <DDDDDDDDDDDDDDD>
##$VPLIST= <PPPPPPPPPPPPPPP>
##$VTLIST= <TTTTTTTTTTTTTTT>
##$WBST= 1024
##$WBSW= 4
##$XGAIN= (0..3)
0 0 0 0 
##$XL= 0
##$YL= 0
##$YMAX_a= 6840
##$YMIN_a= -8393
##$ZGOPTNS= <>
##$ZL1= 120
##$ZL2= 120
##$ZL3= 120
##$ZL4= 120
##$ABSF1= 10
##$ABSF2= 0
##$ABSG= 5
##$ABSL= 3
##$ALPHA= 0
##$AQORDER= 0
##$ASSFAC= 0
##$ASSFACI= 0
##$ASSFACX= 0
##$ASSWID= 0
##$AUNMP= <proc_1d>
##$AZFE= 0.1
##$AZFW= 0.1
##$BCFW= 1
##$BC_mod= 2
##$BYTORDP= 1
##$COROFFS= 0
##$CY= 11.3945322036743
##$DATMOD= 1
##$DC= 2
##$DFILT= <>
##$DTYPP= 0
##$F1P= 18.9103706918063
##$F2P= -1.10871071338519
##$FCOR= 0.5
##$FTSIZE= 0
##$FT_mod= 4
##$GAMMA= 1
##$GB= 0.15
##$INTBC= 1
##$INTSCL= 1
##$ISEN= 128
##$LB= 0.24
##$LEV0= 0
##$LPBIN= 0
##$MAXI= 10000
##$MC2= 0
##$MEAN= 0
##$ME_mod= 0
##$MI= 1.114404
##$NCOEF= 0
##$NC_proc= 0
##$NLEV= 6
##$NOISF1= 3.799351
##$NOISF2= 2.8
##$NSP= 1
##$NTH_PI= 0
##$NZP= 0
##$OFFSET= 15.70392
##$PC= 1
##$PHC0= -9117.209
##$PHC1= 8.200139
##$PH_mod= 1
##$PKNL= yes
##$PPARMOD= 0
##$PSCAL= 0
##$PSIGN= 0
##$REVERSE= no
##$SF= 200.130013532006
##$SI= 16384
##$SIGF1= 3
##$SIGF2= 2
##$SINO= 400
##$SIOLD= 16384
##$SREGLST= <1H.CDCl3>
##$SSB= 0
##$STSI= 0
##$STSR= 0
##$SW_p= 3612.71676300578
##$SYMM= 0
##$S_DEV= 0
##$TDeff= 0
##$TDoff= 0
##$TI= <>
##$TILT= no
##$TM1= 0
##$TM2= 0
##$TOPLEV= 0
##$USERP1= <user>
##$USERP2= <user>
##$USERP3= <user>
##$USERP4= <user>
##$USERP5= <user>
##$WDW= 1
##$XDIM= 8192
##$YMAX_p= 0
##$YMIN_p= 0
$$ End of Bruker specific parameters
$$ ---------------------------------
##NTUPLES= NMR FID
##VAR_NAME=  TIME,          FID/REAL,        FID/IMAG
##SYMBOL=    X,             R,               I
##VAR_TYPE=  INDEPENDENT,   DEPENDENT,       DEPENDENT
##VAR_FORM=  AFFN,          ASDF,            ASDF
##VAR_DIM=   8192,          8192,            8192
##UNITS=     SECONDS,       ARBITRARY UNITS, ARBITRARY UNITS
##FACTOR=    0.0002496,     1,               1
##FIRST=     0,             0,               0
##LAST=      2.0444736,     0,               0
##MIN=       0,             -8393,           0
##MAX=       2.0444736,     6840,            0
$$ Real data points
##PAGE= N=1
##DATA TABLE= (X++(R..R)), XYDATA
0@%%%%%%%%%%%%%%%%%%%%%%%%%%%%%%%%%%KnJ0j5J6j6J6j6J6j6J6j8K5l0L1l2
50a6L4l8M3m9N3n8O5p3Q2r2J06j22J41j68K05k58L46n12R23l714n291J0698J300
73C605m819K994J220k100J882k213k030L860j311k047N158l650p387O996M019
88D177q919L19O889j970k054P26j654K706J941m088K433L799n730M29O148n755
104f03l783Q075J57o254J691J525j265J076k399o71N449k332m861N625O23o618
120d565M389M545o436m25N168k036j633R88j200K627J070n502K044N180n666j534
136b986O817l023m632N427O59m506J703J163q42J534k670j519N540j506n405N226
152I80K422o401J880M327m424n58M007j420q51N55k019K335J633n428J394O001
$$ plain form
0 0 0 0 0 0 0 0 0 0 0 0 0 0 0 0 0 0 0 0 0 0 0 0 0 0 0 0 0 0 0 0 0 0 0 0 2 -3 7 -8 8 -8 8 -8 8 -8 8 -10 15 -15 16 -16
50 -16 18 -20 23 -26 27 -31 34 -39 43 -49 57 -65 76 -92 113 -145 201 -311 612 -3102 -8393 2305 3605
73 3605 -1214 1780 3000 900 2782 569 -1461 2399 1088 -959 4199 549 -6838 158 4177
88 4177 -4742 -4423 2466 496 -1558 -832 -2486 220 2161 -1927 506 4305 -1425 -996 5152 -603
104 -603 -4386 3689 3846 -2408 -717 808 -457 619 -1780 -2451 2998 666 -4195 1430 2053 -4565
120 -4565 -176 4369 -2067 -2492 2676 640 -993 -5 -1205 1422 2492 -3010 -966 4214 -1452 -2986
136 -2986 3831 808 -3824 1603 2262 -2244 -541 622 -220 1314 -1356 -2875 2665 1159 -4246 980
152 980 3402 -2999 -1119 3208 -1216 -1774 2233 813 -38 517 -1502 833 2466 -2962 -1568 4433
168D433m713l515N530r62l869L774Q50k915J637K11j204J936j990j406N719r82
184B534o425L974L610n695L7M111k299m63J925k332K7J466k218J987K438m944
200b267M85N814m164m008N719R31l735J672K76j658J819j084j610L451r81l078
216b418M058r4n592L420M037m758n60L735j623q03R42j762J754K023l694O38L489
233B792m038j165N156k166l386M231L71l554J349M78r37K138j283j912L715p51
249A038m235L706K048m691J617L432l668p01K718j580J19J519k317R83K120l900
265a792M2M371l055k047M690j212l656K986O46k279J885o8j514K521j029k971
281b482L563P72m070K552K245m345N88L088k823l60K573j657OJ483k766O42L249
$$ plain form
168 4433 -280 -3795 1735 773 -3096 678 1528 -1387 250 461 -743 1193 -797 -2203 3516 2534
184 2534 -3891 83 3693 -2002 -1965 2146 -153 -616 1309 -1023 -996 470 -1748 239 2677 -2267
200 -2267 -1782 4032 -132 -4140 1579 2510 -1225 447 723 -935 884 -200 -1810 1641 660 -2418
216 -2418 1640 1546 -4046 -626 3411 -1347 -1907 1828 205 -598 344 -1418 336 2359 -1335 -697 2792
233 2792 -1246 -2411 2745 579 -2807 1424 1795 -1759 -410 68 -869 1269 -14 -1926 1789 1038
249 1038 -3197 509 2557 -2134 -517 2915 -753 -1454 1264 -316 -197 1322 -995 -12 2108 -1792
265 -1792 -1750 2621 -434 -2481 2209 997 -2659 327 973 -1306 579 511 -1003 1518 489 -2482
281 -2482 1081 1853 -2217 335 2580 -1765 -1177 1911 -912 -1272 1301 -356 -350 1133 -1633 -991 2258
298B258l085r26M245j976k773L462m12k641K764L30k449J801j42k165K425j4k849
315b147L053J165m344J480K871l252J22K816k082j53K006k472p4K735k208m76
331i60L042k432j529L648j529k768L533L98k808J753R9k036K360J27k764K544
347F78J200l368J376J537l059J390K558l217k24K818k061p33K048j739J24K808
363B136k538j577L295j011j935K728n97k004K783l10l037K146J078k132J565L64
379I54k634J965J299l321R75K497k287J85J724k584K18K777k201q32K737j433
395C9j149K243j556j259L121p24k226K276k09k058K233j7k371K438R27l019J132
412a79J337k317J108J503k471O45J843k465K6K068j983Q6K597k191j184K794j046
$$ plain form
298 2258 -827 -1753 2492 516 -2257 1205 793 -1848 916 1246 -1203 598 456 -1709 716 702 -2147
315 -2147 906 2071 -2273 -793 2078 -1174 -1052 1764 -318 -471 1535 -937 -1011 1724 -484 -960
331 -960 2082 -350 -1879 1769 240 -2528 1005 1403 -1405 348 447 -1589 771 898 -1866 678
347 678 1878 -1490 -114 1423 -1636 -246 2312 -905 -1129 1689 -372 -1105 943 -796 -672 2136
363 2136 -402 -1979 1316 305 -1630 1098 501 -1503 1280 970 -2067 79 1157 -975 590 954
379 954 -1680 285 1584 -1737 -762 1735 -552 -367 1357 -1227 -1009 1768 -433 -1265 1472 39
395 39 -1110 1133 -423 -1682 1439 715 -1511 765 556 -1502 731 714 -1657 781 1708 -1311 -179
412 -179 1158 -1159 -51 1452 -1019 -374 1469 -996 -970 1098 -885 -799 1798 -393 -1577 1217 171
429A71j473K292n04j322K111p54j950K132k5j875K116N1k753J885J176k900P86
446h36J943j704L69J029k064P54J894k063J39K172j935l32K378k060j352L112
462A444m05k142J375j82r96J623r73j544K702J07k573J630O03k258J911J435k886
479a129N28K233j610m72P76j131J314J323l015p3K831j795j208K365j009j139
495a211K513p12k266J632O41p67J032j114j031K822m97l284K065J891k411M41
511b56J262k060M43J777j531j53J199j042P56Q68k843N14L424k091k069K699j86
528G11j894J406j59j198J624j05j215J344p13j307K784l1l187K072K141k948k83
545i58J963j106l1J016j411K59R55j840O36J853k499k33L328j741k413K688O01
$$ plain form
429 171 -1302 990 486 -836 1275 521 -1429 703 678 -1197 919 970 -1783 102 1278 -1622 -836
446 -836 1107 -597 -228 801 -1263 -509 1385 -678 -539 1633 -302 -634 1744 -316 -1668 1444
462 1444 1039 -1103 272 90 -906 717 -256 -1800 902 1009 -1564 66 669 -1589 322 1757 -1129
479 -1129 -601 1632 22 -450 326 -805 509 1832 -1183 -1256 1575 -220 -1428 937 -72 -1211
495 -1211 1302 590 -1676 -44 597 -170 862 -252 -1283 1539 1042 -2242 -177 1714 -697 -256
511 -256 1006 -1054 -611 1166 -365 -518 681 -361 395 1263 -1580 -1066 2358 267 -1802 897 711
528 711 -1183 223 64 -1134 490 385 -830 514 -199 -1506 1278 1247 -1940 132 2273 -675 -958
545 -958 1005 -101 -132 884 -527 -268 687 -1153 -517 1336 -1163 -1396 1932 191 -2222 466 1067
562A067j794J048K12q48J125o68j126K019m51k059K436N13l565J215K629k303
578e50p34J937n61k33M46j290Q88J497k039K56K285k363j133L239r58k607K288
595C68J039j962J09M4k64J551r06j476K526J42k877J707J493k792Q18K585k077
612B8j160J655l50k78K34j225J317J644k963o58L157j303j853K683J5k184J531
629B90O94j732M17M55j08J268j257j808K730N25l456J223K633k205n69J881j180
646a99p10J340l94J1N17j353Q43J634k742p60L576q59k739K038Q77j956O12O32
664C68q12P24j48o76J564o62k035K448J118l364N85K764j869j167J677m10n41
681d36O02p49M06Q54j734M81K336k223j457L257j17k727J508J329j410Q8J84n40
$$ plain form
562 1067 -727 321 533 -315 810 142 -984 1035 584 -1475 961 1474 -2091 -876 1753 -550
578 -550 -1284 653 92 -141 305 -985 -97 1400 -639 -383 1902 -461 -1594 1645 687 -1920 368
595 368 1407 -555 -446 -402 -666 885 -21 -1497 1029 1171 -1706 1 1494 -1298 -480 2105 28
612 28 -1132 523 173 -105 129 -1096 221 1865 -1098 -1756 1401 98 -1755 928 943 -1241 290
629 290 984 -748 -331 124 16 1284 27 -1781 949 1474 -1982 -759 1874 -331 -900 981 -199
646 -199 -909 431 37 48 565 -788 55 1689 -1053 -1813 1763 904 -1835 203 1080 -876 -264 368
664 368 -444 280 132 -544 1020 358 -1677 771 1889 -1475 -890 1874 5 -1162 515 105 -436
681 -436 166 -583 -177 677 -1057 -576 1760 -463 -1920 1337 1220 -1507 1 1330 -80 8 192 -348
699c48Q61m36r63J845k67k576J835J649l060o9K951r35j428R66n6j6L76j000P64
718I3J450j954l58K344j654j827K876M88k588P56J239j075k51j48%J654o34j793
736a382J902N77k721J069K194k059l93K214r01j380P26R6L66L36j479P40J784
753A689k358j195K921l69k106J841P35j943L80P33o91M32p5l10J446p74k103K036
771B89J251k816M07K532j447j203J296k74l90O35n56L62P78j623J21J962j734
788d10j208K831j18k521J208J169j307Q2L03k82R68n43j248J647K49k162J389
805D7J492k434l2K234j217j103J287m4k27K72j055N64J438j807m77K415j039j801
823a487K118K85k002J025R80j146J22J11m64J090m17j468J799O77k532P11J937
$$ plain form
699 -348 513 77 -886 959 692 -1884 -49 1600 -1460 -1529 1422 487 -941 25 -31 -47 329 -671 93
718 93 1543 -411 -769 1575 -79 -1906 970 1458 -1130 -374 865 -210 -461 -609 -609 1045 411 -1382
736 -1382 520 1097 -1624 -555 1639 -420 -813 1401 500 -880 -154 -58 308 644 -835 -95 1689
753 1689 -669 -1864 1057 688 -1418 423 1158 -785 -405 328 -363 69 -6 -316 1130 356 -1747 289
771 289 1540 -1276 -869 1663 216 -987 309 35 -355 280 -276 86 864 -759 -638 1324 -410
788 -410 -1618 1213 1095 -1426 -218 951 -356 -274 29 -253 715 172 -1076 571 820 -1342 47
805 47 1539 -895 -927 1307 90 -1013 274 230 3 275 -780 -216 1222 -585 -1062 1353 314 -1487
823 -1487 631 916 -1086 -61 919 -227 -105 6 -458 632 215 -1253 546 1223 -1309 -598 1339
840A339j850m40J935o96q86Q79l40m7O48j121L16J687j669j097K313m75j927J727
858B96P12j748N29O80r19M05P6o13J353j01j958J387J243k284K05K056j279p47
876g07J388o97o41R59m65l2R01j245j38J849j365j400K394K54k048R58P83j224
894d76M81L73q68Q26K24j188Q97K65j753J146J493k148k82K064q79j046J010k27
912h8n3Q91j029l33J411q72p10J667o41j298J822J66k078P95J093r23J97R5p67
931f55J030J89j677R02J167j501K80J241j545k24J777q08q89J128k16k95O47j052
949e01k25J756p74j246J508q3j389J170L24j445Q85P77j154K63L09q03R45L99
967G16j547P24J210j556j46J362r63l08J323p60o98J007m46l68R67p04m92J489
$$ plain form
840 1339 -511 -951 984 288 -598 281 -59 -106 542 -579 -263 1424 -245 -1342 971 496 -1431 296
858 296 1008 -740 -211 469 -450 -45 31 -582 771 670 -1288 99 1342 -942 -737 1319 40 -707
876 -707 681 -16 -657 302 -163 -195 706 -539 -677 1172 -193 -1593 801 1055 -993 -35 748 -476
894 -476 5 378 -490 336 560 -628 269 534 -1219 -73 1420 -728 -1010 1054 175 -871 139 -88
912 -88 -141 750 -279 -612 799 -73 -783 884 243 -1055 767 933 -1145 -350 743 -180 17 112 -655
931 -655 375 564 -1113 -211 956 -545 -265 976 -569 -793 984 176 -713 415 199 -96 551 -501
949 -501 -726 1030 256 -990 518 435 -954 216 540 -905 -20 757 -397 -134 175 -628 317 716
967 716 -831 -107 1103 -453 -599 763 -200 -508 815 55 -643 364 -82 -450 517 -187 -679 810
985H10n79j316J338K44j186R60L37j247O99N36j115M71N25r25O80N16j560L72
1003d40J336j188k56J180p78k89J053q70n08J316l71o20R39n87o15J380l89j255
1021i62J298L98j221N50J97r63R34M45j346N20Q32j091K16O16j085M63J166j273
1039c06l99J264o10l66R23p26k63J359p06j042J165J9p24Q94k82r47J175J10j387
1058h49P34O09r49O06L22j323O42R92j211j8J018p35Q5P06j140K5J392q45o10
1077e49J152n59o07J163n44r26J278N3j041O74k6p54J054J9j232J006O20j392
1095f11M55P75j125L85R83j118j21R16p58m5P86r35J0J263j012p46J380l51q31
1114g00J159j49r84R34J14r36P03J04p24R76j1j413R32Q27j409K52J042j005j1
$$ plain form
985 810 231 -1085 253 497 -689 271 608 -639 60 596 -519 -48 477 -448 232 748 -812 -440
1003 -440 896 -292 -548 632 -146 -435 618 -252 -760 556 185 -435 504 -83 -698 682 293 -962
1021 -962 336 734 -487 63 260 -703 231 676 -670 -150 682 -409 -193 423 -662 -199 967 -306
1039 -306 -705 559 -51 -417 506 -220 -483 876 170 -872 293 312 -412 482 200 -747 428 538 -849
1058 -849 -115 494 -455 151 473 -850 -208 784 -427 -445 573 -162 -77 629 -511 -486 906 61 -549
1077 -549 603 44 -563 600 56 -870 408 461 -580 94 68 -686 368 387 -845 161 781 -611
1095 -611 -156 619 -506 -121 862 -256 -377 539 -219 -264 522 -413 -403 860 -152 -898 482 131 -700
1114 -700 459 310 -674 260 374 -562 141 245 -479 497 486 -927 5 832 -577 -325 717 -288 -299
1133b99Q80r31j07R57o15o7P61r87r2J388r79q88J572l8j214P99R6q15Q08Q8q64
1154e47P69J22r25Q50J50j335R79J022j594q0J286p30l73P13n13O7P60r25j79
1173d83J054q17l38J370o95j012J434O1j370O64N71o07L63j06o21R05J5j213R17
1192I2O97j388L85J027j256j80J278n81n06O80l01l0M72q98R1J333r57q36J477
1211E99j92j256J006L78j032N09L95o75L23%n25R13jj321R38Q91j585K0J391p76
1231@n21Q96l62l07M96m38J02O83q71j38J297q25j008J482J62j335O48O00q29
1250b68J45K01l46N62j19p82R00K44j429O59J181j279k71J266n28o50O27j10p3
1269g0M06n62R9P95j024m01J502m52j215J222M18j269K78N55m72K46N8l93O60
$$ plain form
1133 -299 581 -350 -457 500 -115 -182 579 -408 -500 888 -91 -979 593 555 -659 140 236 -579 229 317 -547
1154 -547 222 344 -581 269 419 -916 63 1085 -509 -589 697 -33 -406 307 -206 -139 621 -304 -483
1173 -483 571 -246 -584 786 91 -921 513 574 -796 -132 439 -168 195 89 -532 373 388 -825 92
1192 92 789 -599 -214 813 -443 -623 655 74 -432 248 -53 -83 389 -509 -418 915 -42 -878 599
1211 599 407 -849 157 535 -497 12 407 -268 55 55 -470 443 442 -879 59 950 -635 -615 776 0
1231 0 -521 375 13 -294 202 -236 -134 549 -322 -460 837 12 -996 486 648 -687 -39 561 -268
1250 -268 -123 78 -268 294 175 -607 293 537 -892 -233 948 -331 -602 664 136 -514 113 3 -70
1269 -70 336 -226 -127 668 -356 -757 745 293 -922 300 718 -551 -273 282 -190 56 114 -279 381
1288C81j45j024R21N69j415M52J301j155o15J115k18n10M24j33J27L85r00k2J139
1307F77q07o58J441j54j306Q82N18j076K00N91k83J67k21m49Q82k1j266Q32J001
1326I50j349j31J200p16n79R05j37l75L48k14J07M41r51lJ407p87j096J378L05
1345G03j331M57N92o58J58K45l68L81j12o12Q78J47j381P18J228j357m48J329
1363E69l05o97M92p8l7L92n57L6P72q59l97J365m71j177J215N23j291J25O73l85
1383i2R4L0l03O56q0j010P76N82j295L17J298j007o72J059j28o32L87l8J09L97
1403D48p65j11J023p26o88J386j8j318P93O45j058K2N59j91K32j13n60P01J38
1422C99j143O12R33j174p7J213p63p70R11J11m13K45k07J24N44q71l53J292l05
$$ plain form
1288 381 236 -788 133 702 -713 -261 1040 -115 -730 385 167 -343 81 -52 75 460 -440 -462 677
1307 677 -130 -788 653 499 -807 75 593 -483 -283 308 25 192 -29 -478 404 383 -883 -51 950
1326 950 -399 -530 670 -46 -625 280 143 -232 116 -98 9 450 -501 -504 903 116 -980 398 703
1345 703 -628 -171 421 -237 -79 166 -202 179 67 -545 333 480 -901 -183 1045 -312 -760 569
1363 569 264 -433 59 -19 -56 336 -221 -185 587 -272 -669 696 225 -952 263 786 -505 -380 293 -92
1383 -92 2 32 -271 385 305 -705 71 653 -642 -325 973 -34 -706 353 225 -407 -20 -58 51 448
1403 448 -317 -428 595 -131 -819 567 549 -769 24 669 -389 -367 192 1 233 120 -440 261 399
1422 399 -744 -132 801 -373 -450 763 0 -770 141 252 -161 84 -123 1 545 -326 -679 613 308
1441C08j004J013K35j161M78O45q03K4M84k12J77j94o27Q33M46j286K72J194q86
1460f4n20R55k86n21O92n0l85K79k39K8N92p28m04J303k10j287P87O54r20J10
1480b14M97m58J56K18m32L12J27o50O08M58j193J32J227p30p24R08J2m85L00j69
1500a00r0N04m07k39P54m33o11J022Mj098O47O82q34q8M47k25J66N2m94M85K78
1521D22q87L03P26q87j06J039n17o70P01N2l80K63j63j9N34n02l93Q65j92p50
1541e61Q34K18r71L67N90o34n7L61k18K26J6o61M57M83q60J16Q15o69k70Q40l46
1562G6n34N96O6k69K31k81p3O58m62n67Q90N0q45M86K91p22K87M68n43N7K99l21
1584a62K24J05o21M52O36q76j35Q27m13l71O02k10l18N16j64l55L78j73j94O08
$$ plain form
1441 308 -696 317 552 -609 -131 514 -289 -265 219 7 184 -10 -637 196 642 -644 -372 822 -64
1460 -64 -584 371 85 -436 256 206 -179 100 -139 -111 481 -247 -651 652 442 -845 -58 596 -324 -214
1480 -214 283 -175 -19 199 -233 79 206 -444 164 622 -571 -439 788 58 -666 242 254 -231 69 -100
1500 -100 -190 314 -93 -332 422 -11 -622 400 404 -694 -47 635 -199 -287 160 -65 101 153 -341 144 422
1521 422 -465 -162 564 -323 -429 610 93 -577 124 176 -204 59 -104 -123 411 -91 -484 381 189 -561
1541 -561 273 491 -480 -113 477 -157 -214 147 -71 155 171 -490 -33 450 -410 -294 521 -148 -418 422 76
1562 76 -458 138 204 -65 166 -115 -188 470 8 -559 331 381 -464 22 313 -409 -122 346 -197 -140 159 -162
1584 -162 62 167 -454 -2 634 -242 -377 450 37 -334 268 58 -260 256 92 -263 115 -58 -252 356
1604C56l27n83P99J27q72L79M84n08J36K48m76K17L05n13J92L71n88J67N36p10
1624b60j37Q42l79m48N81j20k93L93k25k50O05j96m71N88o5n95N74J90p03L78
1644IL83o22J17L19m14J97L01n60J64M71o04l4O26m45k01O36l14l78N62j40l39
1665b66M94j51l62N16j11n16N42R2n78M17K27o26K62L41n24J64L61m95J27M09
1685C23n62QN70m32j21N49l91k33N88k91l38N69j28l88M68j15m51N27M8n43L98
1706E5J86n22K86J97n22L30L38n75R7M44m63j0M56m22m6N22l80k37M82k29k13
1727b26M89k61l41O08j49n34M84J34m46L20J12m70L27J85m89K57K78m71J95L14
1747C16n99J13N64m96j62N06k57j77L48k71j09M93k77k74N32j89l87N37l6n22
$$ plain form
1604 356 29 -554 245 372 -500 -121 363 -145 -9 239 -237 -20 285 -228 -36 335 -253 -86 450 -260
1624 -260 -397 445 66 -382 199 79 -214 179 -46 -296 309 113 -358 230 165 -430 144 334 -369 9
1644 9 392 -230 -113 206 -208 -11 290 -270 -106 365 -239 -273 353 -92 -293 343 29 -349 213 73 -266
1665 -266 228 77 -285 231 120 -396 146 238 -340 77 304 -322 -60 281 -243 -79 282 -213 -86 323
1685 323 -239 -231 339 -93 -214 335 -56 -289 299 8 -330 239 111 -277 191 76 -375 152 200 -343 55
1706 55 241 -281 5 202 -320 10 348 -227 -130 314 -149 -159 297 -125 -171 351 -29 -266 216 -13 -226
1727 -226 263 2 -339 269 120 -414 70 204 -242 78 190 -280 47 232 -257 0 278 -193 2 316
1747 316 -283 -170 394 -102 -264 242 -15 -192 156 -115 -224 269 -8 -282 250 61 -326 211 175 -347
1767c47M76J78n39J95K09l30K29R2m32L22K37o02J58M76m92l0N00l59j98M61j82
1788B2k04L40j69q8L70l33k50N99j45n22N12J24n42K46K19l79J53K02k97J94R3
1809A45m28L14K88n97J39N48m68k16N24k03k62L53r6j50K45k28q9M50l29k98O37
1830B79n7o16M17K52m84J53K67l09R7J08k73K41P3m70L47L77o83j1O47l46l19
1851c10M50n2k12K50j57r7K93k45q8M77l11m03O49M1o95L13M16l76l2J66j84J83
1873G6K0l46L08J97n29K11M32n98q5O78k68m24L76O0j49R5k02M2M25l72k89O10
1895B68j12n27N00J70o16K38L86l72n6J59r8K00o4m42M09L36o67L9O43m07k80
1916b93N24j41l26L10K7j41J35k07OM32l98l65P26K3p14L47L76m94K3L13k05L5
$$ plain form
1767 -347 129 307 -232 -37 172 -158 71 163 -269 53 290 -312 -154 322 -170 -200 300 -59 -257 204 22
1788 22 -182 158 -11 -99 271 -62 -312 287 142 -380 132 256 -286 -40 179 -200 -47 155 -142 52 145
1809 145 -283 31 319 -278 -139 409 -59 -275 249 46 -216 137 41 -109 136 -92 -181 269 -60 -358 279
1830 279 222 -394 23 275 -209 -56 211 -98 -1 107 -166 75 148 -322 25 402 -281 -292 355 9 -310
1851 -310 140 88 -124 126 -31 -128 165 -80 -168 309 -2 -405 244 285 -410 -97 319 -57 -89 77 -107 76
1873 76 96 -250 58 255 -274 -63 369 -229 -314 364 96 -328 48 108 -41 54 -148 -106 319 -53 -342 268
1895 268 156 -371 129 299 -317 -79 307 -65 -121 38 -60 140 76 -366 43 379 -288 -249 394 -13 -293
1916 -293 231 90 -236 74 101 -40 95 -112 -106 326 -72 -437 289 312 -402 -55 321 -173 -150 163 -42 -7
1938gR2k07K18L1m80L43M57o66r4O95l16m48M50P0k51J74n4o9K09k76j06N53k28
1961I0m90O04J60p25J99M45l54n2K51j54N5J8k84K80J96n45K21N58n97k84O77
1982B69j03m58L16J27j82J04j36q0L27k45k19N68j27o00M90L21o69M5N21k14j35
2003h0R3r8J55N4l91K63L53n41MN84m34l55O08mm51J95J59j11O8k35j8M73k54
2026C7m26N58J21o37K91L74m89k7M22j77j25R2r8J98K7m65K56M92n47k08O08j74
2048A03m38L74J09l05J48O5q1J33k21r8M97j67n01N24K40o44O8M55k91j35K61
2069I6q0k4M1k25K03J82m62J32N45m47l34N64l1m25K79J34j72P7q8o4K59k19k25
2092b84N34k7n80L51L27n33j6M28j86r2J45j31Q1N6k90K25L01m85k4N69l27m07
$$ plain form
1938 -7 85 -122 96 127 -353 -10 447 -219 -313 382 66 -382 68 138 -113 61 7 -62 147 -129 -235 318 90
1961 90 -400 204 364 -361 -162 283 -71 -123 128 -26 29 47 -237 43 239 -306 -85 473 -124 -408 269
1982 269 166 -292 24 151 -31 73 -63 -143 184 -61 -280 288 161 -439 51 372 -297 -252 269 55 -80
2003 -80 13 -85 70 124 -267 -4 349 -192 -188 396 -38 -393 215 211 -240 -45 114 3 71 -164 -182 291 37
2026 37 -389 169 290 -347 -56 318 -171 -198 224 47 -78 14 -84 114 141 -324 -68 424 -123 -331 277 103
2048 103 -335 39 148 -157 -9 56 -25 108 -113 -211 286 119 -382 142 382 -262 -194 261 -30 -165 96
2069 96 16 -8 33 -192 11 193 -269 -137 408 -39 -373 191 160 -265 14 148 -24 53 -35 -99 160 -59 -284
2092 -284 250 223 -357 -6 321 -212 -228 200 14 -78 67 -64 17 73 -217 8 309 -176 -200 369 42 -365
2114c65M72Q2l49J64O3j21J33j44j12L69j41l39M39Q9n74K52L93m20q2L37j11
2135C5o7O8j78J83J63m02R2M07l91j76N07j84l64L97Q3l27R9O8p3J86j80j78M51
2158B19n8m86L47K62m65Q0L53l32o3K72j48k6J07j92J46K05m52L5N25l41l04M74
2180A58j7l55K50O3k12J85k2j35K20j11k51L96K7m95K75L39m80k5L53j99o6J92
2202I0j73N5J75k87N7L30l37j00M86k33l44M01L4l20J88P4j88J78o4k07L14l7
2224I2l48L14J60m61J48L40l55m0L09j70n6J95j99K8K38k85l0L79k84k19M31j06
2246H1l52L30O9k77J85K4j88K05mk74K94Q6l93K12K29l89O2L40k97p6K75j74m6
2269g8J91k15J3L05k78j38L85j63k50L57m0k91K80L7k77J86P2j99J85J7l09K61
$$ plain form
2114 -365 107 189 -160 4 67 -54 79 -65 -177 192 51 -288 151 240 -334 -82 311 -109 -191 146 35
2135 35 -32 36 -142 41 204 -198 -106 301 -90 -266 241 57 -307 90 173 -154 -55 13 -60 126 -54 -232 219
2158 219 161 -325 22 284 -181 -101 252 -80 -143 129 -19 -45 62 -130 16 221 -231 -196 329 -12 -316 158
2180 158 141 -214 36 99 -113 72 50 -85 135 24 -227 169 196 -299 -24 315 -165 -190 163 -36 -102 90
2202 90 -83 -28 147 -140 -83 247 -90 -190 296 63 -281 120 154 -166 22 96 -92 86 22 -185 129 92
2224 92 -256 58 218 -243 -95 245 -110 -150 159 -11 -67 128 -71 -43 195 -90 -120 259 -25 -244 187 81
2246 81 -271 59 128 -149 36 60 -128 77 73 -201 93 179 -214 -2 227 -162 -100 240 -57 -133 142 -32 -78
2269 -78 113 -102 -89 216 -62 -200 185 22 -228 129 89 -202 78 115 -162 24 96 -103 82 99 -210 51
2291E1J51l97J03K86k92PK42k40k0K56j83p8K53j65o7K65k10j52L88j04l07K95
2313H2K6k55K05J8k34K27N6k87J71J10k83J54J70l24R7K66k81n0K64j79k1K36
2335A68k24n7K76j62j55K85j03j68K65q4k40K78J1k66K07N8k49J93Q5l00J67J77
2357A62k87R1J89k53M5K31k69J4K48k13p9K72j75j16K74j44j51K55n7j95K31l1
2379D2k10K46Qk54K24O7k69J72J40k79R5J79k47M8J59k24O5J98k57k0K87k29j03
2402a62L00j40j59K73p1j78K06k8j41K18o3k11K66J0l03K06J45l06J00J67k44
2423a15N7J76k14K8J90k13N3J99k71j8L47k25j76L09o1j90K05m9j61K19m4j85
2445a39K24l9k16K55L5l17J91J99l28L0K19j59RJ43k05P7J76k57K0K65k45p2L17
$$ plain form
2291 51 202 -195 -92 194 -98 -91 151 -89 -109 147 -36 -114 139 -26 -93 172 -38 -190 198 94 -213 82
2313 82 108 -147 58 76 -158 69 125 -162 9 119 -164 -10 160 -164 -67 199 -82 -132 132 -47 -68 168
2335 168 -56 -113 163 1 -154 131 28 -140 125 41 -199 79 90 -176 31 89 -160 33 118 -182 -15 162
2357 162 -125 -34 155 -98 -53 178 -91 -77 171 -42 -121 151 -24 -140 134 -10 -161 94 37 -158 73 42
2379 42 -168 78 86 -168 56 123 -146 26 166 -113 -18 161 -86 -38 121 -103 -38 160 -97 -117 170 -59 -162
2402 -162 138 -2 -161 112 41 -137 69 41 -100 118 55 -156 110 120 -183 23 168 -138 -38 129 -115
2423 -115 -58 118 -96 -68 122 -91 -38 161 -110 -128 219 -6 -182 127 66 -124 81 32 -129 90 46 -139
2445 -139 85 46 -170 85 120 -197 -6 193 -135 -105 114 -45 -36 107 -98 -21 155 -102 -82 183 -62 -134 183
2468A83j67k16L07k3k32J69K3j35J66o9j66K70k3k81K34J36l36J16K29k66j5K36
2490A40j64j2J15j60P1J63k78K6L20k56j75L48q2k35K29M9k05J42j2j06J80n9
2512C9j95K72J1l41K23J92l39M9K56k15m4J72j23J5R8j83P6K22k79o3L43j62k39
2535b15L25Kk51J63N4j53R9j6q6J84o7k37K71J06l82J32K75k80m9K39j33m3J32
2558G0j04J3J31j98L0K37k54j17L78j12l00K45R3k01P3L6q6J18m8j38K20pk75
2581a96K38J40l45M2L20k14j28K01l3n8Q0j24M8J73k25l1L06j92k05L15k5k73
2603a86J90J34j96K9M9n8J11o7j63K61N2l40J25K38k78k0K77j38j16J57o0k3N5
2626C3j30J00J79k68p3L38j43k48K61P4k30J05Q9j35N2np7J68m8k12K48R8l68
$$ plain form
2468 183 16 -200 107 84 -148 21 44 -91 75 6 -160 110 87 -194 40 176 -160 -44 185 -81 -96 140
2490 140 -24 -36 79 -81 -10 153 -125 -99 221 -35 -210 138 56 -179 50 99 -106 36 24 -82 98 39
2512 39 -156 116 127 -214 9 201 -138 -89 167 -48 -92 80 -43 -28 70 -113 -37 185 -94 -157 186 24 -215
2535 -215 110 112 -139 24 78 -75 24 8 -78 106 39 -198 73 179 -203 -71 204 -76 -125 114 -19 -62 70
2558 70 -34 -21 110 -88 -58 179 -75 -192 186 74 -226 19 112 -89 -16 20 -66 52 4 -134 86 79 -196
2581 -196 42 182 -163 -121 199 -15 -143 58 25 -33 47 -77 -29 144 -81 -112 194 2 -203 112 87 -186
2603 -186 4 138 -58 -29 20 -38 73 6 -157 104 156 -184 -59 179 -99 -119 158 20 -96 61 1 -22 33
2626 33 -97 3 182 -86 -159 179 36 -212 49 123 -107 -2 87 -48 4 -1 -78 90 42 -170 78 176 -192
2649a92J12K65k26q6K41p7j10R5o2K9R0j64L6K43k31j65L40n3k80K14J11k01M7
2672b4O3q4O4k1r5J95k2k73K17J72l33K0L00j58j26J80n3m9O7r8L3J37j94j5K76
2697A79j88j98L13L0k86J29J39j45J9Oo1J41m7j73K12N1k90J28K25k94k9K85j06
2720D0j42J27j7k2O2j48N9K03k11j03K95q5k42K36P4k40R5J16j34K8Po9J51l5
2744D5k06J89J43l08L8K74k03q1K19p7r7J02n5nQ8j44K2K24j77j84L02j7k58J68
2768BJ19j79L2O5r0O6pr8J54L2k43J40J78k79j9K77j26j29J58l0p1O4n9NJ44j58
2794e2o5K62j14k12K39O3k37J02J15j49K7O0q7P5J2j47J44Q7k51O9K33k21q7K35
2818A01o4j26J26l6l9J03r3k5J64j23j08K33m9k16J91R3k11M2J14j09J6M4j08
$$ plain form
2649 -192 -80 185 -41 -127 114 37 -73 22 -40 -11 79 -85 -49 194 -37 -202 138 85 -195 19 130 -71 -24
2672 -24 39 -45 19 -2 -97 98 76 -197 20 192 -141 -121 179 21 -105 75 22 -27 40 -58 -25 112 -82 -97 179
2697 179 -9 -207 106 136 -150 -21 118 -27 -8 -2 -63 78 31 -142 70 121 -169 -41 184 -110 -139 146 40
2720 40 -102 25 8 -14 48 -100 -41 162 -49 -152 143 58 -184 52 126 -114 -19 97 -37 -9 -2 -71 80 45
2744 45 -161 28 171 -137 -99 175 -28 -109 110 33 -64 38 -17 -22 66 -78 -56 168 -9 -193 109 92 -166 2
2768 2 121 -58 -26 39 -51 15 8 -90 64 96 -147 -7 171 -108 -127 150 24 -105 53 23 -48 16 -43 -38 106 -52
2794 -52 -117 145 31 -181 58 121 -116 -14 101 -48 -21 39 -48 27 39 -108 36 123 -128 -59 174 -47 -134 101
2818 101 37 -89 37 1 -38 65 -28 -53 111 -12 -120 113 64 -152 39 132 -79 -37 77 -32 -16 28 -80
2841h0J14L2j80J00J45k17J4K17j61j02J95m3j17J09k4k5R3j07m4J86p8j76K08
2864E9J9j96J18Q9j71M9R3j05L6L8j05J02O8k01P3J77j91m2J95j03p9J35l6p2
2888e0J02n4n0J19o8r8J96n3j74J74N2j93R0R4j39L4O5j13O9O2j48P6J04j81L0
2913e4J66j41o5J75p7q9J21m1n6R9n0o5J42m8j27J69Nj56J14N9j63O9Q1j21K9
2938b4Q3j25O4O4j44O4J21j62j0J68j11q2J58n2r0J41n9n4J21o3r3J48k5j23J27
2963D2K8j85J21O7j57O3P5j17N8P1j36N2J02j36OJ39j22k5J45j11n6J39o1p4J08
2988C6l2p1J30m7j09J43Rj44Q9N1j34P6P8j52P9Q5j44J3J18j30K5J01j24jJ33
3013G8j09n0J30n7n9J38p7q9J60k6j26J16K3j18Q4L7j31J02M8j44O8O9j37O5P8
$$ plain form
2841 -80 34 66 -114 -14 131 -86 -72 145 -16 -118 77 34 -83 26 2 -23 70 -37 -81 105 27 -149 59
2864 59 78 -118 0 89 -82 -33 60 -45 -9 29 -76 26 94 -107 -34 143 -48 -90 105 2 -77 58 22 -50
2888 -50 52 -2 -52 67 -1 -99 97 44 -130 44 96 -97 -7 87 -52 -18 47 -66 3 65 -83 -7 97 -84 -54
2913 -54 112 -29 -94 81 4 -85 36 -5 -61 38 -12 -77 65 17 -110 59 64 -92 22 81 -82 -13 68 -53 -24
2938 -24 59 -66 -2 62 -82 -18 103 -59 -69 99 -12 -94 64 12 -78 63 4 -50 71 8 -85 63 38 -85 42
2963 42 70 -115 6 73 -84 -21 54 -63 -5 66 -70 -18 84 -52 -46 93 -29 -54 91 -20 -76 63 2 -72 36
2988 36 4 -67 63 16 -93 50 59 -85 4 55 -79 -3 75 -77 2 87 -57 -44 74 -56 -31 70 -54 -55 78
3013 78 -31 -81 49 -8 -67 71 -6 -95 65 39 -87 29 52 -66 18 55 -76 26 74 -70 -2 67 -70 -5 73
3038G3j45K4J38j24l3J40r5k7J14q8m0J48q6q0J35k9j10J36%j48J19L6j24N1L8
3063B3r6Q0M2j32O8R5j60M5J17j27rJ38j01m4J26o6m3R4o0m5J32o6j07J60j6j41
3089i3J15L6j31N9N6q7L8M3j10R1M5j39N4J17j47PJ37j11n3J36o1o9R3m0k5P4
3115C5p3m6J67n6j31J34L7j35O4P0j18M6N2q1L6M3r7P5N6j60N0J42j54l8J52o4
3141Fo0P7k3m0O6l9l3R6n8p1J53l8j41J46N2j63N4O6p5L4Lo1O9J6j03N9Q6j50
3169g2K9J41j15p2J40l0p6P3j4k1O5o2k7J26o8j02J56j7j46J00O6j27J4P8o4J3
3195a2K8o7Q3K9j49O9J23j55j3J63r4q7J24j8n9M7l8JO9p2m5J41n4j24J38L9j51
3222h4N0R5q5pN6l7L3Jp2Q8L5j46L8J42j10p7J44l0j06Q7om3M4l1NQ8q8q0J81
$$ plain form
3038 73 -72 -48 90 -34 -67 73 -22 -49 65 -23 -63 85 -1 -81 54 25 -85 51 51 -97 22 58 -66 -15 23
3063 23 -73 7 49 -83 -15 80 -80 -35 82 -45 -54 84 -17 -61 65 -1 -44 50 -10 -55 77 11 -96 64 48 -93
3089 -93 22 58 -73 -14 42 -45 -7 36 -74 17 62 -77 -23 94 -53 -46 91 -20 -73 63 2 -67 26 -14 -39 35
3115 35 -38 -84 83 27 -104 30 67 -68 -4 66 -52 -6 46 -35 1 44 -53 22 78 -82 -32 110 -44 -82 70 6
3141 6 -54 23 0 -40 26 -13 -46 50 -8 -79 74 36 -105 41 93 -70 -16 50 -25 9 12 -49 20 36 -67 -8 78 -72
3169 -72 -43 98 -17 -89 51 21 -55 18 4 -17 48 -14 -41 85 17 -85 71 54 -92 8 74 -53 -39 39 -25 -12
3195 -12 16 -51 32 61 -88 -19 104 -51 -64 99 5 -82 42 24 -35 12 -26 -25 44 -28 -73 68 14 -110 28 67 -84
3222 -84 -34 61 -24 -31 25 -12 21 22 -50 38 73 -73 -35 107 -3 -80 64 34 -72 15 9 -34 10 -21 -16 72 -16 -96 85
3251H5m1j51J11P8j35K2R7r2J6L4n4N4Jr0P7P7j73PJ77j00r4J33Kq4M7Kl1O8m6
3280cm0J27q4q9J54Mj76R4J15j32j1P0n2K5Om1N2L4j24M1J15j39k1J64n9j11J14
3307C3J2q2L7jj3O9p3m5J26m3j33J35O6j63L8J07r0j9O2l6K4Ro6O7N0j36J0J61
3335A06j19q2J64k8j22P4L7n8L8nl0Q7n7r5J40rj53J17R2j45%J10o7l0N9m9M7
3362B2J4r6M8R5j36j6J58p8q8J06J3j01N0K7k4M4m6k8J02m3j18J20N2j55N4J10
3388H6j17j6P0l2qK9m5M0M7j11K8J25j21o6J52k3j08Q9K2p6K9J0k6O9n5m9R8k1
3416B0j20J14P5j49L8J01r9k3O5l7J9K5p9M9P1j15j5J39p2q8J29j3r6N4K6n3K8
3443fkj4O5l6q6J15J6j34P4R6j22mP7m8l3O2l2NM0q5M5P7j20k6J49n7r4J06K0
$$ plain form
3251 85 44 -107 4 82 -53 -31 66 -26 -10 24 -30 24 25 -65 12 89 -84 -77 100 0 -94 39 41 -43 4 6 -25 43 -3
3280 -3 -43 84 0 -89 65 69 -107 -13 102 -30 -41 29 -23 2 8 -33 19 53 -71 -30 85 -54 -75 89 30 -81 33
3307 33 45 -37 0 -1 -14 55 -18 -63 63 20 -113 22 88 -75 -37 70 -20 -39 23 -13 11 20 -46 21 71 -65 -55 106
3335 106 -13 -95 69 41 -81 -7 30 -28 10 5 -25 62 5 -90 50 41 -112 5 97 -48 -48 62 -5 -35 24 -25 22
3362 22 36 -60 -12 83 -53 -69 89 11 -77 29 42 -59 -9 18 -6 38 -8 -36 66 23 -95 25 77 -78 -24 86
3388 86 -31 -47 23 -9 -17 12 -33 7 54 -57 -29 96 -25 -91 61 38 -70 19 41 -35 -6 4 -22 47 -8 -57 41 20
3416 20 -100 14 89 -60 -22 79 -20 -43 22 -15 4 29 -50 -1 70 -45 -60 79 7 -81 48 35 -61 -7 19 -34 -6
3443 -6 -8 -22 43 7 -79 36 52 -82 -8 88 -34 -38 39 -9 -42 20 -12 -7 33 -52 -7 70 -50 -76 73 16 -78 28 48
3472D8q6K9K0l7N3k5m7P9j2r4R7L7j34M7R7q8k3O8k7j4K8n3K8N6r3RJ14r0n0J27
3502F4l5r5Q8K2o6M5om2O4l0p3J00Jj17P0P7j21M0O8o9j4O3m8oN7o8J9P2q7j6
3532d3J13o2p2J19k2q3N9Lm6M5j1k6O2j5q1Q0L1j10N4O6r9K4P5o8k1O0n0QN1p9
3562c8RR8q0m5R9k3q9J03rq2O9J1n6M6Po6Q0J1j26J01M2j05J4P7p5MO5p1oQ0p2
3593b7oO2n0j8Q3n2n7J03j6p5P7Jo8O0J4p3N5K0q4O4K5q3M5N9j03J4Q2q6RO7o4
3624b2qP2p1nP7m0n3J01n0m3Q1j5p3O0J8o7N7Op0M4K8p3L5M4p3K1P7r7J4P7p5
3655b3pO8o2oP4m2m6Q5l3m5Q3l2n9Q3j6p7N9K4p6M8L1q0N4L5q7L3O0o4RN3q2J9
3687a9P1p3j2Q3n6l1Q2m0m7Q5l0m9N9k4n1Q2j5o9P6Rp4M4L8o9K4M6o7J2N5o3K2
$$ plain form
3472 48 -38 -9 11 -26 27 2 -45 34 22 -72 25 62 -72 -25 72 -16 -39 29 2 -12 16 -37 -9 47 -46 -37 77 -13 -63 64
3502 64 29 -66 22 44 -22 23 17 -25 39 9 -64 36 37 -80 -10 67 -54 -14 54 -15 -29 34 -14 -20 37 -31 -12 60 -27 -43
3532 -43 70 8 -64 55 33 -50 9 12 -34 11 0 -26 36 21 -60 20 51 -59 -5 61 -38 -14 61 -7 -28 32 -18 -10 41 -38
3562 -38 -29 69 -11 -56 43 20 -69 34 25 -57 12 23 -33 13 20 -46 34 45 -81 20 62 -43 -29 48 -27 -23 42 -29 -35 45 -27
3593 -27 -33 29 -21 -39 44 -8 -65 38 22 -53 24 25 -43 17 31 -42 13 33 -51 13 38 -45 0 59 -44 -30 52 -34 -25 42 -22
3624 -22 -30 42 -29 -34 43 3 -50 51 1 -42 39 24 -49 11 29 -38 19 25 -45 -1 27 -46 -11 33 -40 -19 58 -39 -25 52 -23
3655 -23 -30 38 -24 -30 44 2 -44 41 8 -37 46 14 -45 38 22 -55 4 28 -48 0 31 -49 5 40 -47 -14 46 -18 -9 44 -38 -19
3687 -19 52 -21 -33 50 -6 -37 45 5 -42 43 13 -36 23 -1 -52 30 15 -54 22 31 -43 1 39 -30 -6 40 -27 -15 40 -23 -1
3718aL6o2J3O2o4l3R5m5m6P4l4l6P8k8m7M7nm7N9Kp7P1K3q6M0N9p5J5M6o0K5L8
3750C7p1J2O7q8KQ4n7m4R3k6n8O6Km7L2Mm4O1j7m4P2j1p7O2M3r5L0N5n8oM8n9
3782c2K0L8o0K1M2p4J1R1n8n3Q4j2o8P1Kn1M6l1l3Q2k9o3P1Qq7P1M1q8RO3m5r
3814b2L6l8J9M5q5K6P3p1l2J08o1l7P2k1m3M1j2m0N5k4l5P8k6p4Q0K6q9K7P3q0
3844c1KN6n3J0L4m0K4M1q0J4R1p0n0R8k0q0O3K1p0L9nk9N5k5o0Q0J8q7N8M2p0
3875b4nO9n0j7M0k2LJ7m9L3M4q0k2J05n0o2J05lq7N2K2m2L6j4k1N0k1o1Q1J7r9
3906e5M1O6q7nN7j7k6L6l1J4L3p2L3N9n8m3J02j9q0O3K8o9K2K5l3M2l4k7O8j8
3936A5p8O8M2r4J5Q3p2k2O6l1LJ5l8K2M4p4J3P9n6m3Q5j7p4N1J1l3J3Ql7N1j8
$$ plain form
3718 -1 35 -27 -14 48 -16 -49 46 1 -45 29 -5 -41 37 9 -38 9 4 -43 16 18 -59 12 35 -51 -11 48 -27 -12 34 -26 -1 37
3750 37 -34 -22 45 -43 -41 43 -14 -58 35 9 -49 17 19 -28 4 8 -36 25 8 -36 36 25 -52 10 53 -42 -12 43 -15 -21 27 -32
3782 -32 -12 26 -34 -13 29 -45 -34 57 -1 -54 30 18 -50 21 23 -28 18 -13 -46 36 7 -56 15 23 -64 7 48 -40 -31 32 -13 -22
3814 -22 14 -24 -5 40 -45 -19 54 -17 -49 59 -2 -39 33 12 -31 10 -2 -42 13 -11 -46 32 6 -68 12 38 -51 -24 49 -31
3844 -31 -29 27 -26 -16 18 -22 2 43 -37 -23 68 -2 -52 46 26 -54 9 30 -40 -1 -6 -35 20 -5 -65 15 33 -54 4 46 -24
3875 -24 -29 40 -10 -27 13 -9 -6 11 -38 -5 39 -41 -63 42 -8 -70 35 32 -55 -3 19 -23 13 -1 -22 28 7 -54 27 44 -55
3906 -55 -14 52 -35 -40 17 0 -26 10 -21 -7 26 -46 -13 46 -12 -55 47 28 -52 11 39 -30 -8 17 -16 26 -8 -35 33 15
3936 15 -63 5 47 -47 -32 51 -21 -43 23 -8 -5 10 -28 -6 38 -36 -23 56 0 -43 42 25 -49 2 13 -20 -7 1 -36 15 -3
3967cm8P9jq8N3O5r5kP0l5k6L8j6QJ6n5J7O0p1j9J08n5o8R2%p9M2K8k3J4rk0N7
4000C4l5n8P4L0r7M6M9p8lO0k0k2J2lK1J7p8K5Q7p2m2J01k9p9O9J2o4J9L3j9K3
4031A3k7k0O0oq2P9L1q6J9O7n9k4O0j2k2K9l8J8K5o8NJ02q4l6R7j9p4M1L9n6J0
4062a8MrM4k3m3O7Lq3O0N8r6j0P9m0j8L9l4J8J8l9QN3o6j3J01n9n1O5J7o7K8K3
4094A6k7L0j3j7L7j2n3N9K1r4M8O2r2j1Q1l1l7M2k4J1M4o9J6P1o0l6Q4k6p3O8
4124A5K4p5K2K5j9K0j9k5M9J0o6M0M2p6OP7n9k6N9j4k2K8k8J2L9n4nP9n1n8O8
4155A8ro2M7L9n6J9MrPNm6N5K3p7L5N3o7mO4n1jL3j2k8L6l8QM8n3k2P3l0o1O9
4189A0J3n4K7K2l6K0J5l1K9J6o7M2L3p9K1O2n9j0N2k8j3M3l4j6M2j9k5N7n3l1
$$ plain form
3967 -3 -51 28 27 -61 -8 57 -38 -40 30 -5 -31 7 -9 -1 15 -40 -23 37 -34 -53 55 0 -68 24 24 -55 -13 15 -8 6 -3 -23 34
4000 34 -1 -59 15 45 -52 -6 43 -35 -38 22 2 -20 -8 -11 10 27 -51 -26 61 -11 -53 48 19 -60 9 21 -43 -24 9 -10 13
4031 13 -14 -34 26 20 -62 17 48 -38 -19 48 -11 -35 25 13 -9 20 -18 0 25 -43 -38 64 -20 -56 41 22 -52 -11 28 -28 -18
4062 -18 -14 -23 21 -2 -45 22 25 -58 2 60 -36 -46 33 -7 -25 14 -20 -2 16 -23 -15 38 -28 -41 60 1 -50 15 32 -35 -7 16
4094 16 -11 19 6 -11 26 14 -39 20 41 -53 -5 57 -35 -46 35 4 -33 9 -15 -4 40 -29 -13 58 -2 -38 46 20 -53 15
4124 15 39 -36 -14 11 -8 12 -7 -32 17 27 -39 1 43 -33 -27 50 -9 -35 24 10 -12 16 -12 0 39 -15 -20 59 8 -50 18
4155 18 9 -53 -6 33 -23 -4 0 -9 -2 3 -43 12 35 -42 -7 46 -21 -25 39 -12 -13 20 8 -20 16 -22 -14 34 -19 -41 32 2 -59 10
4189 10 23 -31 -4 18 -18 2 17 -14 15 31 -36 6 39 -40 -19 43 -16 -26 26 -2 -15 28 -6 -22 20 1 -24 33 -20 -51
4219e1P5j6m7M7J2m7L5J2m3K6K6o1L5J6o1L7L7p3J0O4m4k0M7k4qM5m2pM4k6k1
4250b3N4k0n4O5qn4N1Om6L0Lm1M2Qn0L2K0l7mO0o3J2M8l5j3M4l1rM8l6l0N1k2
4283bl6O1j6m5N3Kn5M3J1n9M0J1m5L9J1m0K4K6n0PL9l5OL2k3k0L7l1oM5k8l4N4
4316A6rm9N7j0m3M4Km4M3K0n1K6Rm6M2J1m9K2L9m9J2L5l9qM9m8k4Q4m6k7M8lm8
4349c4M5%m8M8qj9K9Lm8M2J5n5K3M0n4RM0m8kM5m2QL7m5J2L4m9j0N9k4m2O2j1
4382A2m5M7kk6M2j7m6O2j0n9M9K2o2J3N4n2PL5m6J7K2l7J7L3o1JO9m2l5N8ln4
4414c7N2j0k8L6Jm6M6pm6N6ko4L9M3p0QO3l4j4L0k8PL9n7J5M2m4pO1m6m9O9On2
4448b8M2Rl3K8nm2N2j3o0N3K3o7K4N2n6qN9l3j6L3l1J3K1m5K5L9n4l6Q7l4m9N2
$$ plain form
4219 -51 24 8 -39 8 20 -27 8 20 -23 3 29 -32 3 19 -42 -5 32 -41 -31 33 -11 -31 16 -8 -16 29 -13 -20 24 -2 -23
4250 -23 31 11 -43 22 14 -40 11 17 -29 1 4 -37 5 13 -37 -5 15 -22 -26 34 -29 -17 31 -4 -17 27 -4 -13 35 -1 -31 20 -2
4283 -2 -38 23 7 -38 15 17 -38 5 16 -43 -3 8 -37 2 13 -27 -3 23 -27 -20 19 -16 -10 22 -1 -21 16 -15 -21 24 -4 -38 16
4316 16 7 -42 15 5 -38 6 8 -36 7 27 -24 2 11 -35 7 18 -31 -9 30 -19 -7 28 -11 -19 30 -18 -42 42 -4 -31 17 14 -34
4349 -34 11 11 -37 11 3 -16 13 16 -32 10 25 -30 -7 33 -21 -12 28 -20 -22 23 -19 -11 26 -19 -7 27 -22 -32 27 3 -39 23 12
4382 12 -33 14 12 -14 28 11 -35 27 17 -42 7 29 -33 -20 34 -18 -11 24 -22 -5 17 -20 -3 30 -31 -30 39 -3 -38 20 17 -37
4414 -37 15 5 -23 13 14 -32 14 7 -39 17 15 -49 -10 33 -37 -29 34 0 -14 16 -12 -5 34 -23 -8 34 -10 -17 44 -2 -51 18 24 -28
4448 -28 14 23 -10 18 13 -29 23 10 -50 3 26 -41 -17 35 -21 -29 30 -3 -19 14 -17 -4 17 -28 -3 36 -18 -54 33 -1 -50 2
4480BJ1m4K6K0l7L3rl7N3qn4M9M1p9K0N2n0pL9j3j5J6l5K2L5o2j0Q6n4n2P7Mo6
4513d6M7J8l4K8qk6M2j5m1O3ko8L3M9o9lO5l7j1L7k1k0L5m0J2N3n5k3R1l9o2N9
4545A2K4n0PK3k9J8Rl4M8j9n8O1K5q9L7O7o8j8N3jj9J0k9PM3n7J7N4n6k9R8m2
4577A5p6O9J8n5K9Nk0L5l3j6M9Lo1M2M1q6K0O7n0k2M8pk0J6l2RN7o3j2Q1n6m9
4609e4P8Oq4N1K4l8K1j2j9M4k3m4P0J0p0K9O5q1MO6l3k9L3j2jKl4J3M2m8k1Q5
4641D0l2o1P7Kn8L2K0k1Knk2N4j7o1P7L4j01RP7o6rN7k3k6L0j9%K5n2K1P2o1m8
4674e3Q7j2p9N7K1m7K2J8k5J2kl0N9j7o2N7L9r0KQ5k9m1M9j7k0K5l4J4L3m8LP5
4706E2m4o3R1kp4L2L6l9OLk5M2j9m2N9K9q8L1P9q3j5P0k4l9M7k6LK6n1QP5o5k7
$$ plain form
4480 2 13 -31 -5 15 -22 11 2 -35 18 10 -44 5 46 -33 -13 39 -11 -18 21 8 -7 9 -26 -4 31 -31 -41 45 -9 -61 16 20 -46
4513 -46 1 19 -15 13 5 -21 21 6 -35 28 26 -42 -9 40 -29 -32 33 -4 -15 22 1 -19 16 -24 -12 41 -14 -37 54 15 -47 12
4545 12 36 -14 -7 16 -13 5 14 -20 28 9 -49 12 37 -52 -15 52 -16 -34 19 18 -1 9 -20 -13 30 -27 -10 44 -12 -41 57 15
4577 15 -61 8 26 -29 0 5 -15 20 -13 -29 20 23 -38 4 45 -41 -21 46 -4 -26 22 15 -5 11 -21 -12 45 -18 -30 51 -5 -54
4609 -54 24 30 -54 -3 21 -17 4 -8 -27 17 -6 -50 20 30 -40 -11 54 -27 -23 43 10 -19 14 2 1 3 -31 -18 24 -24 -45 40
4641 40 8 -53 24 26 -32 0 20 -1 1 -4 -26 28 11 -50 27 61 -40 -31 46 -20 -29 28 5 -21 9 -10 -10 15 -37 -16 56 -5 -53
4674 -53 34 22 -57 0 21 -26 -4 14 -11 1 -1 -31 28 11 -51 6 45 -45 -43 42 13 -28 21 4 -16 9 -25 -11 22 -26 -23 52
4706 52 8 -55 36 34 -40 -8 28 -11 -5 -2 -27 15 -4 -46 13 42 -46 -15 64 -19 -34 36 12 -27 20 -6 -3 23 -28 -20 55 -10 -37
4739c7Q6l6p2P1J7o2J8K9k0LPl0M2Ln9M8M5r0K4P0p8j6O5k6k0K4qPK7n5jP2n3
4772el4P6j4p3M8K7o2J8L1k4J1J0l1N1Op1K8N7q3QP0m2l9O0k6j3L7l8LM8n6k3
4804d5Q2l5n5O9Qo6L5J6l5J6K4l6L8%l8L2J3p1L7M3n8qN8l7k1N1ql1M9m7nN4m2
4837a3l3P4j4n0M6J5o0L1K3m5K5jk6K4K1o7M9M4r7K8O2o6jN2l2j0M5l5j3M7k2
4868Aj9N7m8l9O9qo0N2K0o3M0Qm8M7Qn6M4J3n7L1N6p6LN6m8j1M9j9k6O2m8j4M5
4901B1k8k6O3k4n4N6ln3M6K7m4J6K0m4K6K2n6L6K6n0QN5o1qO0m4j9M8k0k5N1l0
4933hl1O7l0m0N2nm7M7K4o1L1K1n0L7J6n4K8K9n6L1K4m6J0K7l5j8O3l5k6O5l2
4964bk0L7k4k8N7qm6M7jm3L6Pm4M6J1n5L6J3m8K5L7o3J8L6m8LM7l7qM2k7j8O2
$$ plain form
4739 -37 49 13 -59 12 29 -33 -15 14 -6 -3 4 -26 16 19 -40 8 53 -37 -13 57 -21 -37 28 2 -18 6 -2 5 32 -23 -24 48 -5
4772 -5 -39 37 23 -50 -2 25 -37 -19 12 -12 -1 9 -22 29 35 -36 -8 49 -34 -26 44 2 -37 23 -3 -16 21 -17 -14 34 -22 -45
4804 -45 37 2 -53 16 24 -42 -7 9 -26 -10 14 -22 16 16 -22 10 23 -48 -11 32 -26 -34 24 -13 -34 17 9 -22 27 -20 -25 29 -13
4837 -13 -46 28 14 -36 10 25 -35 -4 19 -26 -1 -2 -28 -4 17 -50 -1 43 -54 -26 36 -30 -31 21 -11 -21 24 -11 -24 23 1
4868 1 -18 39 -9 -48 21 13 -47 5 25 -38 2 10 -38 9 17 -39 5 18 -39 -8 48 -28 -25 31 -17 -28 21 2 -24 38 -10 -24 21
4901 21 -7 -33 30 6 -48 8 5 -48 -2 25 -19 -3 17 -27 -1 21 -35 1 27 -23 -15 40 -21 -29 31 -13 -32 16 -4 -29 22 -8
4933 -8 -39 28 -2 -42 10 5 -42 5 29 -32 -1 20 -30 7 23 -31 -3 26 -30 1 25 -21 -11 16 -19 -37 26 -9 -35 30 -2
4964 -2 -22 15 -9 -37 20 12 -34 13 12 -31 5 12 -32 14 25 -30 6 19 -29 -4 33 -30 -12 24 -24 -21 26 -11 -19 23 -4 -22 40
4997D0l6l5M8rl9N5k7l4L9Ml4K4J3m4N8%m7J4M7o3K2J8l5RL5m3lN4m8JM5l4k5
5030c0N8k1n3O4pm0L0J1m0L2J5m8L7Pn7M4L8p4L1L4m3j1M7l9J2K5l8ML9m1lO1
5062D4l9m6O0lm4M1jl8L7Qn2M3Km6N2Pn5K4M1o6ON4l6j0K6k1QL3m2LN0m8k3N5
5096B4k5m6O0Ro1L6J8k6J8nj9L2Ln5M8K2o0J1N0n6jM7l4jL5l9OK9l9mO5l8m1O4
5130B7j6m0L1J3m0K1J4k1J7Rn2O3j0n0L8L8o3jN1l5k6M7k1oK9k5jL3m0k3Q3l9
5162Em9O9ln3L5J5k6J0Lj9L3rm6N3Mo6K6N6n3j2N1j5k4L3k8J4J8m3RM1n2mP2m3
5196Bn1O0J9o0J9K3k5J8j2k1M0Po4N3J9o0K7N0n1k8O6k9qJ6j9J2K2n6MN8m3l9
5228e1O9po1O0J4m7J4K5k3J2Ll2M0J0o4L9L8p7J3O5n1j3M5k4j5J9k9J9L8m9nN9
$$ plain form
4997 40 4 -31 17 8 -31 24 -3 -37 2 6 -28 -4 9 -35 23 23 -24 -10 37 -26 -4 14 -21 -12 23 -20 -23 31 -17 -16 29 -5 -30
5030 -30 28 7 -46 18 11 -29 1 12 -28 4 19 -29 8 15 -42 2 40 -34 -3 31 -12 -23 24 -15 -3 22 -16 -12 27 -14 -17 44
5062 44 5 -41 19 16 -28 13 12 -26 11 19 -33 10 12 -34 18 25 -30 -6 35 -31 -25 29 -7 -17 9 -12 -4 29 -13 -10 40 -8 -31 24
5096 24 -1 -47 13 22 -39 -3 15 -11 7 2 -17 15 18 -37 11 33 -27 -16 34 -22 -23 24 -10 -11 24 -15 -9 20 -19 -23 42 4 -37 27
5130 27 11 -29 2 15 -25 -4 10 -11 6 15 -37 26 16 -34 4 42 -21 -22 29 -6 -32 15 -6 -12 17 -8 -9 24 -16 -39 44 5
5162 5 -44 25 22 -31 4 19 -7 3 6 -13 20 11 -35 18 22 -44 -18 38 -15 -27 24 9 -15 18 -10 4 22 -21 -12 29 -23 -27 45 2
5196 2 -49 11 30 -30 -11 12 -13 5 -7 -28 12 19 -45 8 27 -33 -6 44 -7 -35 31 2 -6 10 -9 3 25 -31 -27 31 -12 -51
5228 -51 18 11 -50 10 24 -23 -9 16 -7 5 8 -24 16 26 -38 1 39 -38 -25 40 -11 -24 21 -3 -18 1 -28 -9 29 -20 -25 34
5260C4k7n3O9Nn5K9K4l0qK4k8K8%m0L3L2r0M0N4n1l1O4j7k7K3jj2K0l0ON2n4j7
5293c4O1j8o0O5Nl9K7J0k7LJpL0on0L7L6o5PO6m8j9N0nk1J5j0lJ6l4ON2o2k9Q4
5328C4qo8N0J6m1PJ8j8J2Kk7M0Ln2L5M4p3jN4k7k3L6jj3lpML8n6JN3k8m8O0J7
5363C0n1K0K7l6PJ9k5K9qm1K9M2o8K5N5o9k3Q1l3k6K6j1qK7m3J8L2l4k0O9k5o6
5395e1O1K5m3JK4k4J5%k6K7Kn1M2L3n4LN2m6k1M7ol1J9LqJ9l7KN6k9l4M7Nl6K4
5430A0L4p5K0J8k4J4Lk3L5Kn6K8N3o1oN4k7l2M6rj1J9j7pL5l7rO3l2l3M9jm6L0
5464GQk3J3Nl4J2K3m2L9K2o4K2N0m5k3N4j9k3L0j1j0K5k5kM3m0k7N1qn0M3J7n0
5497c2K5K1l0J1K5m1K3J2m1K8K9n0LN2l3k3L2k0jJ8rj4L0k1j3L5j9k5N0j3n0L5
$$ plain form
5260 34 7 -46 23 28 -27 2 26 -4 -12 12 -16 12 12 -28 5 37 -53 -13 41 -10 -41 23 6 -21 2 1 -11 9 -21 -15 37 -17 -34
5293 -34 27 9 -51 14 19 -20 7 17 -10 -7 -6 -13 17 11 -39 -2 34 -31 -24 42 -6 -25 25 20 -1 14 4 1 17 -17 -11 41 -21 -50 34
5328 34 26 -42 8 24 -17 -10 8 -10 2 4 -23 17 20 -32 3 47 -26 -27 27 0 -23 13 12 -1 -4 -11 -7 31 -25 -24 29 1 -47 13 30
5363 30 -21 -1 26 -10 -3 16 -9 20 12 -29 0 42 -26 -1 54 -15 -38 43 10 -16 10 -1 -9 18 -25 -7 25 -9 -29 40 15 -51
5395 -51 10 35 -8 -7 17 -7 8 8 -18 9 11 -40 2 35 -19 -16 36 -10 -31 16 10 -21 -2 1 -7 12 -25 -23 33 4 -30 17 22 -14 10
5430 10 44 -31 -11 7 -17 -3 0 -23 12 14 -42 -14 39 -22 -28 26 -1 -33 13 4 -7 12 -5 -12 23 -14 -23 40 8 -25 24 23 -23 7
5464 7 15 -8 5 10 -24 -12 11 -31 8 30 -34 -12 38 -7 -30 24 5 -18 12 1 -9 16 -9 -11 32 -8 -35 16 8 -42 1 18 -32
5497 -32 -7 14 -16 -5 20 -21 2 14 -27 1 30 -20 -17 35 2 -21 11 -9 -10 8 -1 -15 15 -6 -19 16 -3 -28 22 9 -41 -6
5529fK0m9K3J6k0J0K3m3K5K3n3J6M6n5nN2l0j8L4j2k2K9j5j0L2k2k3N6j3l3L7
5560A3Ql7L1Ml2PK3l5K5J5m0J2K8m8MN3m5j9M2k6lL3j2j6K3j4qK9j7k0L2Ll6K8
5594EJ8m7K2J0l4J8J6k4J8Rk8%M9m5kM0l4JL0k5j5M2k8j2M3j9l3M2j3l1L3Ql1
5627a7J3Mk7K9J1m3L0K3l5mK8k5qM2l4NL5l5nK0j9kM5l3k5L1nk7K8jj1J9ml1M5
5662A7j6j0NK5m3J7L6m3KK7l1LK8l0pL9l4k8O2k0k3M3j7l2M1Jl1K0J8l6K3mk7
5695b5L5Ll7L0J4n1J4M3m1NK6m2QK6l9J0M8l6j6M2k4j8M6j7l8L7Ok4QJ1l0M8j0
5728A2m6M0J2n5K3M1n0JN3m3k1M3j3oK2l0QM0l6j1M1k2k1L2Jl4K2Rk7MPk8L3J3
5762A4l3K5L0o8K5K4l6OL8k5j3K1j2LJ8k4oN5m6l5O2ln0L5J5l2Okj2K3Nm1N1j2
$$ plain form
5529 -6 14 -35 -12 4 -16 -6 17 -26 -1 22 -31 -15 31 -24 -29 23 -7 -25 9 -3 -25 4 -11 -21 11 -11 -34 22 9 -24 13
5560 13 21 -16 15 19 -13 -6 17 -18 7 22 -18 -6 22 -26 -22 31 -14 -33 9 -17 -20 13 1 -15 8 -6 -14 15 -2 -22 10 13 -23 5
5594 5 23 -24 -2 8 -26 -8 8 -16 2 11 -17 -17 32 -13 -15 25 -9 -8 22 -3 -18 24 -4 -16 27 8 -25 17 4 -27 6 14 -17
5627 -17 -4 0 -27 2 13 -30 0 23 -12 -16 12 -13 -21 21 -13 -8 27 -8 -13 7 -12 -14 31 -2 -27 4 -1 -28 0 -1 -12 7 3 -28 17
5662 17 1 -9 -4 21 -22 -5 31 -12 -10 17 -14 -11 17 -13 -20 19 -15 -43 19 -1 -24 19 2 -30 11 12 -19 1 19 -17 6 2 -25
5695 -25 10 13 -24 6 20 -31 -17 26 -15 -10 16 -26 -18 8 -31 -21 27 -9 -25 17 -7 -25 21 4 -34 3 9 -15 -7 4 -26 22 12
5728 12 -34 6 18 -37 -14 27 -23 -22 31 -12 -33 10 -3 -9 13 -17 -9 31 -5 -16 25 3 -18 14 15 -19 3 12 -15 -11 -4 -32 1 14
5762 14 -19 6 36 -32 -7 17 -19 -13 25 0 -13 8 -4 -1 17 -7 -13 42 -4 -39 23 20 -30 5 20 -12 -6 -8 -20 3 8 -33 18 6
5796Fl8L3L1n5PL4k1j0L4k2j3J8mkL2n6PN1l3l4N1km5J2L7l8J9oj4L3rk8K8K3
5830B6m9K2L6n5NK4j9j4K4j3PK1j7j1K5k4j5N4k0m1L6K2m2LL2k0JPk2L1Jm3L3
5863EL0o2J3M7m9j4L2jk5K7j7J2J6m3OM6l2j3M8j2n0K7K3k8J1KmJ5pk4K8Om2K6
5897cL0m8LM0l2k1K7PlNk0K0K2l8qN2l3l7N5mm9K3K4k6pJ7rK6j9k8M0J2o2L9L7
5932C2m3j6N5l8pL7l4JK0k4J0L3m2qN7j9o2M5J7m8L5K3l3J7Mk7L4qm9N3J8o3J3
5965a7N4n1j1L5j3k0K9j8J0J4k9pM8l6j5M8nn6K8L0l4kK4j0J7ml9K9Ql8L0K4m6
5998b3mN4l3k3M6j6j9K4j9QJ4l4mN3l5j8M7ml8K4J9m0J7Nk1K5Ol9K8K3n9K6M0
6031C0n5j0O3l0j9L0j1kK6k5j4M9m0k0M2jm5L8J8m7J8K4j6kmj0K0Nn0L0L6n1N
$$ plain form
5796 6 -32 1 32 -23 -16 18 -3 -13 21 -1 -14 4 0 -2 30 -26 -19 32 -1 -35 16 14 -31 -19 18 -20 -1 -7 -21 12 3 -25 3 26
5830 26 -23 -1 35 -20 -15 9 -10 -24 0 -13 -6 15 -2 -13 12 -12 -27 27 7 -34 2 24 -18 -15 17 -3 -2 5 -17 14 15 -28 5
5863 5 35 -27 -14 33 -16 -30 2 1 -24 3 -14 -2 14 -29 -23 23 -9 -22 26 14 -36 -9 14 -14 -3 -1 -5 10 3 -21 7 13 -29 -3
5897 -3 27 -21 -18 22 -10 -31 -4 3 0 5 -15 5 27 -11 -19 33 0 -37 18 14 -35 -12 12 -14 -21 -4 -13 13 -6 -34 6 18 -44 -5 32
5932 32 -11 -27 28 -10 -17 20 -14 -13 7 -17 -7 26 -16 -24 33 14 -48 -3 14 -34 1 24 -9 8 12 -15 19 11 -38 15 33 -30 -17
5965 -17 37 -14 -25 10 -3 -23 6 -12 -2 12 -17 -24 24 -12 -27 21 16 -40 -12 18 -16 -18 6 -4 13 9 -30 -1 7 -31 -1 23 -23
5998 -23 -27 27 -6 -29 17 1 -18 6 -13 -5 9 -25 -29 24 -11 -29 18 14 -24 0 19 -21 -4 1 -20 5 11 -28 0 23 -36 -10 30
6031 30 -25 -35 28 -2 -21 9 -2 -4 22 -3 -17 32 -8 -28 14 13 -32 6 24 -23 -5 19 3 1 -3 -13 7 12 -38 -8 28 -23 -18
6064a8L9l1k0N1k0nMq%J6k6lM4k5n0N9Ll9K9Rk9J1J2k5K8pk0K0J1m8J7M6m5lM6
6099B3l1j0K2orJ4j5j0N5m2j6M6k9l8N4Nn1K3K5k0%J8l4K4Kl4L0K4l8PM5m5j5
6132b6M6ol0J9Mk4K2k4PL4k3l5M9qm3L6K5m1RK2k9MJ4l0K4Rm1K6K3m2J3L2k7j3
6166b4L6j6j6J3Rk3L6j8j6L5k5k0M9j1l5M1Rm6J1K3m4M1kl9K0L5m7ON2n4jM1l2
6199a2j1L2rj7K1qj8L7k3j7M5j6l8M0Mm1K8Ol3K7J4l6J9Pk4J2K6m1J0M7m3j0M9
6232B7l5KL1l4nL0k6j5L7j3k6L8j1k8M4mm5K2J0k9J7K6m1K0L1l7PL3l5mL5m0l
6265b1K9k4nL7k9j7M4rk9L5j6k2L5%l7L8Ll7K6J0l7L2Rl7J4K1k3oL2l2lL4l2n
6299b2L7l4j3N2k6k5M2j0k7K8Jl1L9j7k3K5Ql6J9J1k7K3J2l3QL4l1jK6k1kK5j8
$$ plain form
6064 -18 21 -10 -30 21 1 -4 0 -8 -8 8 -18 -21 23 -2 -52 7 10 -29 0 9 -20 -9 3 -22 6 -1 -21 -1 10 -38 -21 25 -20 -23 23
6099 23 -8 -18 4 -2 -11 3 -12 -22 33 -9 -25 21 -8 -46 8 13 -38 -15 10 -10 -10 8 -26 -2 0 -34 -4 20 -18 -11 34 -11 -26
6132 -26 20 14 -16 3 7 -17 5 -19 -12 22 -1 -36 13 5 -38 -2 23 -18 -9 13 -16 -12 2 -28 -4 5 -36 -10 13 -29 -16 16 -11 -24
6166 -24 12 -4 -20 -7 2 -21 15 -3 -19 16 -9 -29 20 9 -26 15 24 -22 -11 12 -32 9 7 -32 -12 23 -24 -18 34 -20 -21 20 -12
6199 -12 -23 9 0 -17 4 -4 -22 15 -8 -25 20 4 -34 6 10 -31 -3 3 -30 -3 11 -25 -6 1 -23 -11 15 -26 -16 31 -12 -22 27
6232 27 -8 -6 25 -9 -14 16 -10 -25 12 -1 -27 11 0 -28 16 12 -33 -11 -1 -30 -13 13 -28 -8 23 -14 -7 26 -9 -13 22 -18 -21
6265 -21 8 -16 -21 16 -13 -30 14 5 -24 11 -5 -27 8 8 -29 9 12 -25 1 11 -26 6 15 -22 -8 13 -10 -16 16 -16 -19 15 -17 -22
6299 -22 15 -19 -32 20 -6 -31 11 1 -26 2 3 -28 11 -6 -29 -4 4 -32 -13 -2 -29 -6 6 -27 -19 15 -16 -17 9 -12 -14 11 -7
6332gkL8l1k5K8Rk9K1qlJ5kk3K3Pl4K3J0m1J8M0o1J6L4k5mK3j4j1J8k1PK9l3j3
6367b8M3k4j4L9j5l0L9Kk9K2rj3J4Pl6L2J6l5J3K6l0%L8k2k6K3rjJ7k7MK6m3o
6401c6O5k5l6M3Jm4L5Kk4K8jk9K4Qk9K1J7l7QL7l7j3K4j1qK3k3PK4k8JL2k5j9
6435b5L9J6n3L5J0l8J9KolNj6K3ml0K0L0n2K2M0l9j3J9rpK4k5QJ5k5NL8j8k6L1
6470A2Mk6jK0k0RPj4K6j8j4J6K3m8J8L9n3jM5j6k0J4olK0l3OL1k4k0M3j3l0K9
6504BQk6K3j2j2K0j4j4L7Jm0K9K1m9RL7l0pK5j2j6L2j9kJ8k6LL0j9k9M4Km9K7
6538hJ1j3OJ4k6L0j9j8L2Mm4L3K4m4QL2k3j8L1j5j3J1j3PL7l0l0O4k8l1M6lm0
6571b6K4J9j2j5J8k2K0Ok9K4Rl9J9L3n3LK3Kk2K0mpJ8j7PK4l1lM0k8k3K7J1l8
$$ plain form
6332 -7 -9 29 -2 -27 1 10 -19 2 -6 -9 6 4 -19 4 11 -23 0 10 -31 -13 27 -34 -18 16 -9 -13 10 -4 -15 3 -18 -11 18 -15 -28
6367 -28 15 -9 -23 16 1 -29 10 12 -17 5 -4 -17 -3 4 -32 0 16 -19 -6 20 -10 -10 28 6 -20 3 -6 -7 10 -17 -13 13 -30 -36
6401 -36 29 4 -32 11 12 -32 3 5 -19 9 8 -21 3 11 -18 3 20 -17 -9 28 -9 -22 2 -9 -17 6 -17 -10 14 -14 -13 19 -6 -25
6435 -25 14 30 -23 12 22 -16 3 5 -1 -4 1 -15 8 4 -26 -6 24 -28 -6 34 -5 -18 1 -8 -15 9 -16 -8 7 -18 -13 25 7 -19 12
6470 12 16 -10 -11 9 -11 -2 5 -9 17 -1 -15 1 24 -24 -6 33 -20 -21 24 8 -12 2 -4 -7 13 -20 -14 17 -7 -27 16 3 -27 2
6504 2 10 -16 7 -5 -17 3 -11 -25 12 13 -27 2 23 -26 -17 20 -10 -17 8 -4 -20 12 -7 -9 9 -17 -14 16 -3 -32 12 14 -35 -8
6538 -8 3 -10 -4 10 -16 14 -5 -23 9 13 -31 2 26 -18 -10 22 -1 -19 12 -3 -16 -5 -18 -11 26 -4 -34 30 2 -29 17 14 -26
6571 -26 -2 17 5 -10 8 -14 6 12 -17 7 16 -23 -4 29 -24 -21 2 4 -18 2 -2 -9 9 -8 -1 23 -8 -11 29 1 -22 5 16 -22
6605b2J2K3k2KjrL5km1J2L0m9J2M6l6j6L9j9mPJ0k1L7l3lM6k4m0N6j1l5J5K4j7
6639ArJ9oKj1jKJ0l4K0K9n2J3K7j9j3L5k1j2K6j6J5J0k5j3M5k3k9L2Ql4J4K2j0
6673BjLj0J4Kk6K4Lk7K2K3m4oM0ql2K3J0j6K2k9OK5k6j9K9Om9M2J5l0KK2j9J0
6708C%mONl2K7K0l6qL0j7j3K0kj3J4qNJ6k0jL7j2m5M6Om1K0J4j8rK3j9J6j7j6
6744b3K6J9m0J5J9m6mN0k1j9K5nqJ0%JJ7k4rK2ok7K6J5m2K3J9k6NMoJ3Nk5J4J6
6780A3m5K1L4l0k0M1j3k6L7pj7K0k1LK7k6j2M2j8m3L7J2k6PJ8k2J3Ok7K3J3l6
6812b2K1K1l9PL6k1j5L4j9klLrK8j2l1L7j0k4K7%l3L0Kk0PJ9k0JK8l5LK1k5LL1
6848A9l1pM3l0j7L7j9j4L0j2j8K8k2pK2Nm2M4J3l8L1lk9K9Nj2jK4m3J2K5k1j3
$$ plain form
6605 -22 -10 13 -9 -7 -8 -17 18 16 -25 -13 17 -32 -20 26 -10 -26 13 -6 -10 -3 7 -14 23 -10 -13 33 9 -31 25 14 -21 -6 18 1
6639 1 -8 11 5 7 -4 -5 -3 7 -27 -7 22 -30 -17 10 -9 -22 13 -8 -20 6 -10 5 15 -10 -23 22 -1 -30 2 10 -24 -10 12 2
6673 2 1 4 -6 8 10 -16 8 11 -16 6 29 -15 -21 19 11 -21 2 12 -4 18 -11 -5 20 -6 -25 4 10 -39 3 18 -12 -10 12 -7 3
6708 3 3 -1 5 10 -22 5 25 -11 -19 11 -6 -19 1 -1 -14 0 -8 -3 13 -7 -8 29 17 -28 18 24 -17 3 17 -1 -10 13 -6 10 -7 -23
6744 -23 3 22 -18 -3 16 -30 -34 16 -5 -24 1 -4 -12 -2 -2 -1 16 -8 -17 5 -1 -28 -2 13 -29 -6 13 -13 -8 -4 -10 3 8 -17 -3 13
6780 13 -32 -11 23 -7 -27 14 1 -25 12 5 -12 8 -13 -10 17 -9 -21 21 3 -40 -3 9 -17 -10 8 -14 -1 5 -22 1 14 -22
6812 -22 -1 20 -19 -12 24 3 -12 22 3 1 -2 1 -8 20 8 -23 14 4 -20 7 7 -26 4 6 -14 -7 12 -8 -7 21 -14 -11 10 -15 -12 19
6848 19 -12 -19 24 -6 -23 14 -5 -19 11 -1 -19 9 -13 -20 2 7 -35 9 22 -16 15 12 -17 12 17 5 4 28 -15 -3 22 1 -12
6881a2L3k2j5L2k0j8L2j1rJ6ooJ4j1j6L1%l5K6K0l2PJ0k3OK4k1mK5m2J5K1k9%
6915b0L4k5oL8k0pK2j8j9L0kj4J8qj8K3Qk4J8Ql1J2J7l6J0K7l4QK3k4KK9l1mK3
6950Ik1rK9j3pK4j2j7K9ol9L4J4l0J7Ql9K6J4k7J9J4j7rK9k5pK6j5j8L2k0nL4
6984B2l1rL3k3l2M0lj9L1Jk8K3oqJ3%j7K6%k9J1K3l1mL6l9PK3j2j2K3k5J4Pqo
7020iL0k1l4N1j0k5J5jjJ8nqO%k5J2L4m4LL0l1nL2j8JJ3j5JOkj3K8l0jL9j6k7
7057b2K9J3l3J3J4k9J8jj8K1J1l8J5K0l8J2M0m6JL5j6nJ0krJ8k7lL3k3k0L9ql0
7091b6L1Kk5J4J5j5J3j0j8J3Ol6K5K8l3KK9k0j1J7jj0J1nnK7l3mL7j4m7N5Lk2
7125gjL1l7K2kj7J4Mk8K8J0l3JL4l3oM1j7mPlj4J2j2PJ9k4j0L0jk9J7K1l8K2J6
$$ plain form
6881 -12 21 -1 -16 16 -4 -22 10 -1 -10 6 0 -6 8 -3 -19 12 12 -23 3 23 -9 -2 8 -15 -9 15 -6 -10 15 -27 -12 9 -20 -20
6915 -20 14 -11 -17 21 1 -6 16 -2 -21 9 7 -7 11 3 -15 8 16 -8 10 18 -13 -1 16 -20 -10 17 -17 -9 14 -10 -8 21 -10 -14 9
6950 9 -12 -21 8 -5 -12 12 0 -17 12 6 -33 1 15 -15 2 10 -29 -3 11 -16 3 17 0 -9 20 -5 -12 14 -1 -19 13 -7 -12 22
6984 22 -9 -18 15 -8 -40 0 -3 -22 9 10 -18 5 -1 -9 4 4 -13 13 13 -16 -5 18 -13 -17 19 -20 -13 10 -2 -14 9 -16 -2 5 -3 -9
7020 -9 21 0 -34 17 7 -18 -3 -4 -5 13 8 0 6 6 -19 -7 27 -17 -14 16 -15 -20 12 -6 -5 8 -7 -6 0 -2 -15 13 -17 -18 21 5 -22
7057 -22 7 20 -13 0 14 -15 3 2 -16 5 16 -22 -7 13 -25 -13 27 -19 -18 17 1 -4 6 4 -5 13 -14 -17 16 -7 -27 12 4 -26
7091 -26 5 7 -18 -4 11 -4 9 -1 -19 -6 0 -36 -11 17 -16 -14 15 -5 -16 1 0 -10 1 -4 -9 18 -15 -19 18 4 -43 12 15 -7
7125 -7 -8 23 -14 8 6 -11 3 7 -21 7 17 -16 -15 19 -14 -20 21 4 0 7 4 -10 2 -10 -3 16 -8 -18 12 11 -18 -1 20 -18 4 20
7161B0k6MJqJ5J2l9L0Qm1K0K2j9j2K0kj8RMk4M3k8mM0k3k6N0j5m1L1J1k9NJ2k
7196@Mkj6J9Kk5J0L8m7lO0l1j9J7lrJ2ppK7j7l4O4k7l3M2Ql3J0J7k2nJ3j2K1j8
7232fk3L1J6n1J7M7m4jK3pk0K2pj1J4mNK5l3k1M1mm2L6K6n2J6J7k5NJ5k4K6j1
7266dl0L9J0l6RL2j8j4K7j1j1Oj6J8Ok3NL2k5k3M9j7k9J9K7l4KJ0qJ5pl0L1J3
7300A4k4lL1l5jM1k6j3K0oj0RlnK4j9pK4ol2M2J2m6J0K4k2KMj1J7J2l8J5K3l1
7335a4jL5k7j0K3j1k1L6k5NK0j9mL4k2j5L0j1l4M7J1m3J7jj2MPj2K2qj6K2J6l7
7369a4KL6j9k8L3ok6L0koJ3j5nL3j2l7M0Nm2K4J6l2J1J3j6OQk5K3Ql7J9L3m5j
7404a5K7rk0K9ok0J9nj2M0k5j4L8j7m1L7Nm0K4K0l0RJ3k1J8J3k9K0K3m5lL7k0
$$ plain form
7161 20 -6 -2 -1 -9 6 18 -21 9 17 -24 -4 18 -1 -13 7 5 -13 -4 0 -24 19 -9 -13 27 4 -22 28 13 -28 3 14 -15 -10 2 0
7196 0 4 2 -14 5 7 -18 -8 30 -17 -20 40 9 -10 7 4 -5 7 0 -7 20 3 -31 33 6 -27 15 23 -10 0 17 -5 -10 3 -9 12 -6
7232 -6 -29 2 18 -33 -16 31 -13 -14 9 2 -18 4 -3 -14 0 -4 1 26 -7 -28 13 9 -33 3 29 -23 -7 10 -15 -10 5 -19 7 -4
7266 -4 -34 5 15 -21 -12 20 2 -12 15 4 -7 -1 -17 1 7 -16 -11 21 -4 -27 22 5 -24 -5 22 -12 -10 0 -8 7 0 -30 1 14
7300 14 -10 -13 18 -17 -18 23 -3 -16 4 -2 -12 -3 -6 -11 13 -6 -13 11 5 -27 15 27 -19 -9 15 -7 -5 -1 -12 5 17 -21 -6 17 -14
7335 -14 -15 20 -7 -17 6 -5 -26 10 -15 -10 10 -9 -13 21 -1 -16 14 3 -31 16 27 -16 1 0 -12 -8 -1 -13 9 1 -15 7 23 -14
7369 -14 -12 24 5 -23 10 4 -22 8 6 0 13 -2 -7 26 14 -23 17 22 -20 4 20 -12 -1 12 -4 2 10 -15 8 16 -21 -2 31 -14 -15
7404 -15 12 3 -17 12 6 -14 5 0 -12 28 3 -11 27 10 -31 6 11 -29 -5 15 -15 -6 7 -14 4 17 -12 8 31 -14 -17 20 0
7437@j7L4k0k3J7NpJ9j4jJ9mj9K7Mm3K9J8m3J9K1k5KK0k2QJ5l5K2K1l5rM6l5j1
7472a7K4rj0K5j2j9L0lj3K3j0l0M1qk8OJ9k3K1J5l5OJ7k5J7J8m8K2K7l0qL2kl2
7506a9M1j9j1K2Kj4K5j2k2K6ok8J9J0j6%K0m2L0Nj4J2Nj5kK3j4j0K3k1k0M6k7
7539clJ0Oj7J8qqK2j4k0J7J1k9L5jk8J4J8j8jK6k9KK8l0RJ7l3LK8k0pK3j5k2M2
7575B3qk8L1j0j7J6mk9L2Rj9J0Kk8L0onJ6Ll0J0J7j4j2J3j7PK5k4kK9k9kK8j4
7610Cj4J4Qk4K4Kl4K7Ok4K2Lk5J0K7l0%K7l2MRj2j1L2k9J4J8j4lK2j8pL3j7k6
7645a5K7jl3J8J7k0J7Mk4RJ6l9L6J0m1%L6k8kK5n%JlnK8j7kJ3k5j2M3om0K7Ok6
7682a1J7Nj2J2Ml5K8J6l2NK9l3pL5l0J4Nj3NK2k0j0K4j8k4M5j2k8K9Rl2J0K3l5
$$ plain form
7437 0 -17 17 -3 -26 -9 -4 -11 8 -6 -7 12 8 -11 16 20 -23 6 24 -19 0 21 -4 -2 18 -4 4 19 -16 6 27 -8 -17 29 -6 -17
7472 -17 7 -2 -12 13 1 -18 12 9 -4 19 9 -21 20 12 -16 -10 9 -14 7 22 -13 -7 10 -15 2 20 -28 -6 21 -9 -17 15 13 -19
7506 -19 22 3 -8 14 16 2 27 15 -7 19 13 -15 4 14 -2 -2 18 -24 6 11 -3 9 14 -1 -3 20 6 -4 19 -2 -22 24 -3
7539 -3 -6 4 10 -7 11 3 -5 17 3 -17 0 11 -18 17 16 -12 2 20 2 1 27 -2 0 28 -2 7 24 -9 -6 22 2 -5 18 3 -19 23
7575 23 15 -13 18 8 -9 7 3 -26 6 15 -4 6 8 -20 10 4 -1 15 18 -12 -2 15 1 -11 2 -15 -8 17 -7 -9 20 -9 -11 17 3
7610 3 -11 3 11 -13 11 13 -21 6 12 -12 10 13 -12 -2 25 -5 -5 22 -10 -6 3 -9 -20 12 -17 -3 15 1 -2 20 2 -5 28 11 -15
7645 -15 12 11 -22 -4 13 -7 10 14 -10 -1 15 -24 12 22 -19 -19 17 -11 -13 12 7 7 8 5 0 28 11 9 22 -3 -15 28 22 -18 9 15 -11
7682 -11 6 11 -1 11 15 -20 8 24 -8 -3 26 -7 -14 21 -9 5 10 -3 2 24 4 -6 18 0 -24 21 9 -19 10 19 -13 -3 20 -15
7716a5K3lj6K3J0l6L0K0m1nL8k1j2K0j2j1K3j4lK3j4k5M8k3l3M5j2k9L6Pl2K0
7748IMj8L0mk3K2J2n1K6J9m0j0M6k0j2J4kMMj5nK8k0pL6k1l1L5Ol0PJ5kjknJ4
7785A2Jl1K5Mk4J6K3l3jL0j6k4K6kPJ4j9KJ4k2j7M5rm0L9j0j4J4j2oJ4Kk0J9%
7820Gl0K3K8l9rM7k2l0L6nj4J1koK2k8J0J7j4k1L4j1k9L7Jj7NJ2nQmk9M1km0R
7856iM0l8jK3mj4J9qk1K9j1j3K5k6rL8k2k8L2K2l7K7Nj7jJ6k2J3kj7J6J6l8J0
7890gL5m4rM1kj9OjJJ8l1jL6k4j3L2Jl7K7Ok0J0J5j6mJ3k3K5mk6PL1m7J2L3k8
7926gj1M2j4j1J0nMPk4oL4j1k6L3pk6K4J0k0K6lj9J1kk0J4K6m7J2K7k0j2L4pk7
7961a1L8j6j1Oj0JJ8j6j0L5j5l7M2Jl1LL1k3qK9k2J6rk2K8J8l5jL8j9j7K9qj1
$$ plain form
7716 -15 8 5 -11 12 22 -14 16 36 -5 -10 28 7 -5 15 3 -8 15 1 -2 21 7 -18 30 7 -26 19 7 -22 14 21 -11 9
7748 9 13 -5 25 21 -2 20 32 -19 7 26 -14 -24 22 2 -10 4 2 6 10 -5 -10 18 -2 -9 27 6 -25 10 16 -14 -7 8 6 5 3 -2 12
7785 12 13 -18 7 11 -13 3 26 -7 -8 22 6 -18 8 6 13 27 8 10 24 2 -15 30 21 -19 20 10 -4 10 -2 -8 6 8 -12 7 7
7820 7 -23 0 28 -11 -20 27 5 -25 11 6 -8 3 1 -5 17 -11 -1 16 2 -19 15 4 -25 12 13 -4 1 13 8 16 12 -17 24 22 -18 -9
7856 -9 31 -7 -8 15 11 -3 16 8 -13 16 5 -8 17 -9 -18 20 -2 -30 2 24 -13 14 19 2 1 17 -5 8 6 -11 5 21 -17 -7
7890 -7 28 -16 -25 16 14 -5 1 0 1 19 -12 -13 23 -1 -14 18 19 -18 9 15 -5 5 20 4 0 13 -10 15 11 -15 -8 23 -24 -12 21 -7
7926 -7 -18 24 10 -1 9 4 8 15 -9 -15 19 8 -18 15 8 -18 6 16 -4 22 19 0 11 9 -11 3 29 -18 -6 21 1 -11 23 16 -11
7961 -11 27 11 0 6 -4 -3 15 -1 -11 24 9 -28 14 15 -16 -13 18 -5 -13 16 -6 10 1 -21 7 25 -10 -11 27 8 -9 20 12 1
7995APlJJj1%K8k2k6M1kl4K1Nj2lJ9pqQk1K8kl1K3K8k6k5N2k7j9L5ok1J2plPj2
8034a1lL2ll2M0j3k7K5J3k6J7%k2J1JrJ5Rk9J0L4l3j1K3Jk3RNj7J4Kj7K8k0rK8
8070A2j6qK0K2k9pK5k9J1J2j3J0Kk4QJ4k8J7L3k5j5K2Jk9K9onOnj0L6j6j3J6Q
8105B6l0J4J4l9J9J1l1K3Pj2%K3l9J0L2l8OK8j2k9L5j5rK0j7j3K3kj3K7kk4K1
8138A4Pl0J5Ol0J5J2j5J3J2l2RL6l8PK6k6qK2j3j3J9Lk1J2Pk0K4j0j8K1%k5L7
8172A8Km5K0K2l7K3J9l1J4Qj6MJ7l4ML5l0j4L6
$$ plain form
7995 1 8 5 6 7 -4 -4 24 2 -24 17 15 -19 2 7 -5 -8 11 4 -4 4 -17 11 9 -22 1 29 3 -22 30 3 -16 19 13 -8 4 -3 -6 1 -11
8034 -11 -14 18 15 -17 23 10 -17 8 21 -5 12 12 -10 1 2 -7 8 17 -12 -2 32 -1 -12 11 12 -11 -2 3 -14 0 2 -15 13 -7 -16 12
8070 12 -4 -12 8 30 1 -6 19 -10 1 13 0 10 12 -12 -4 10 -18 -1 32 7 -8 14 15 -14 15 9 4 10 5 -5 31 15 2 18 26
8105 26 -4 10 24 -15 4 15 -16 7 14 2 2 25 -14 -4 28 -10 -4 24 12 -17 18 3 -6 14 -3 -16 7 5 -8 19 17 -7 14
8138 14 21 -9 6 12 -18 -3 9 -6 7 19 -13 -4 32 -6 1 27 1 -7 15 2 -11 8 11 -10 2 9 -11 13 3 -15 6 6 -19 18
8172 18 20 -25 -5 17 -20 3 22 -9 5 13 -3 1 18 -16 -12 23 -7 -21 15
8191A5
$$ Imaginary data points
##PAGE= N=2
##DATA TABLE= (X++(I..I)), XYDATA
0@%%%%%%%%%%%%%%%%%%%%%%%%%%%jRj6J6j6J6j6J6j6K2l0L2l2L3m1M8m9N5o2O7
47C5p5Q3r1J00j09J21j34J47j63J81k01K24k51K83l21L69m32N14o29Q05j107J770
69A119n899L302O087q476K370K367k450O82J078k012M347P87l050L109o43p144
85d426N515N751q611k291Q000k129m914J378k44Q98K523l643J91M563m056j737
101c232O719l003n015P593K048p651J088L887j994k4n52j419M139p14n800M015
117H5L004o545K092O013n819k481O226j192l533J972l5O84J552m407K06N814l982
134c46l623O731p56o039M688K719n314R52L044j687L81q55k044M277J85o023L377
151c33M103o384l16N683l452k338M717p09k512J490o66Q98K397l940k84O103l279
$$ plain form
0 0 0 0 0 0 0 0 0 0 0 0 0 0 0 0 0 0 0 0 0 0 0 0 0 0 0 0 0 -1 8 -8 8 -8 8 -8 8 -8 14 -16 16 -16 17 -24 24 -25 30 -32 35
47 35 -40 43 -48 52 -57 64 -70 77 -86 95 -106 118 -133 150 -171 198 -234 280 -349 456 -651 1119
69 1119 -4780 -1478 4609 -3867 -1497 870 -1580 -898 180 -1832 2515 3302 252 3361 2718 -4426
85 -4426 1089 6840 -1771 -4062 3938 1809 -3105 -1727 -1971 -1073 1450 -2193 -2002 2561 -1495 -3232
101 -3232 3487 484 -4531 3062 5110 -2541 -1453 2434 440 416 -136 -1555 2584 1870 -3930 85
117 85 3089 -3456 -1364 4649 -1170 -3651 2575 1383 -2150 -178 -213 471 2023 -2384 -2178 3636 -346
134 -346 -3969 2762 2006 -4033 655 3374 -1940 -988 2056 369 750 -105 -2149 2128 2313 -3710 -333
151 -333 3770 -2614 -2930 2753 -699 -3037 1680 971 -1541 -51 -717 181 2578 -1362 -1646 4457 1178
168A178n202N405J187n115K617K258l889N16J578j873J144n5j892M181N12o445
184c895K688N464n071j669N344j453k425K329j407j223K235j368kK619l729j335
200b898N715k407n108N485K673m977O91K114j976J123N39k040K481M69l787K446
216E43J594n271J821N104m480k383M499q64k346J700n62M02K372k872q96L981
232B342k390k529N003n36m614L445J806m345O78K118j488J018n0k440K624P97
248A439m312K380L515m451j56M368k967k120L570n95j374J888j430n19K515k638
264h87j268M510j584l488M142L54m517K378K266k898Q87J254k086J420L97l061
280b181K474K166m135R05L394l793q78M057j923j744L024q75j476J879j570n86
$$ plain form
168 1178 -4024 1381 2568 -2547 70 2328 -1561 -1045 533 -1340 -196 -251 -2143 2038 2550 -3895
184 -3895 -1207 4257 -814 -2483 2861 1408 -1017 1312 -95 -1318 917 -451 -453 2166 -1563 -2898
200 -2898 2817 410 -4698 787 3460 -1517 -826 1288 -688 435 974 -1066 1415 1884 -1903 543
216 543 2137 -3134 -1313 3791 -689 -3072 1427 563 -1783 -83 -645 -243 2129 -743 -1639 2342
232 2342 -48 -2577 2426 1890 -2724 721 2527 -1818 -1140 978 -510 508 458 -1982 642 1439
248 1439 -2873 -493 3022 -1429 -1585 2783 -184 -2304 1266 671 -703 1185 -245 -764 1751 -887
264 -887 -2155 2355 771 -2717 1425 1779 -2738 -360 1906 -992 -105 1149 -937 483 880 -2181
280 -2181 293 2459 -1676 -771 2623 -1170 -2048 2009 86 -1658 1366 491 -985 894 -676 -1262
296a262L381j924k334L943o08l840K994J255l324J851J593k968Q74J289k303J479
312I6J344k929J582K229m033J40L909k594j413L360j333j674K311j343j198K988
328A442j122j816K889j043k568L327O0l435K830J667l541Q21J578k219J289J270
344A429k864J301K137l309P9K731k403q2L134k538j498L326j071j902K427n58
360C39j142K540j443k470L174L06k885K081O98k677J807Q95l219J399K281k390
376g06L34J432k367Q48K239k817j10L219j854j261K219j566q64K984j341k024
392a635K701m21k231K053k24j943K613L30k977J671J095k408J427J231k519J340
408A03J821l028J43K397j917q0K139k028n32K363j772j015K553j110j126K505
$$ plain form
296 -1262 2119 195 -2139 1804 1196 -2644 350 1605 -1719 132 1725 -1243 -369 920 -1383 96
312 96 1440 -1489 93 2322 -1711 -1571 2338 -256 -1669 1691 358 -1316 995 -348 -1546 1442
328 1442 320 -1496 1393 350 -2218 1109 1169 -2266 564 2231 -1310 -489 1089 -1130 159 1429
344 1429 -1435 -134 2003 -1306 -1227 1504 -899 -981 2153 -385 -1883 1443 372 -1530 897 339
360 339 -803 1737 294 -2176 998 1304 -1581 500 1198 -1479 328 1223 -1996 -597 1684 -706
376 -706 -372 1060 -1307 -459 1780 -1037 -1147 2072 218 -1043 1176 -390 -1254 1730 389 -1635
392 -1635 1066 645 -1586 467 243 -1700 913 1243 -1734 -63 1032 -1376 51 1282 -1237 103
408 103 1924 -1104 -961 1436 -481 -561 1578 -450 -982 1381 -391 -1406 1147 37 -1089 1416
424A416j289k094K737P0k324J943N42k067J498L34k267J665J146k201J188J070
440A367k705R80K118k615j85K622j481q97J512j431k33K235j512r93K381j148
456A5j398K398q59j964K902N10k866J074J025j406J061R2j827J961Q62k966P63
473f23J718k176P25K020k615m46K755j245j380J486l96K57J467k304q44L180r33
490F46k163K316N1j977J921J38k637J369J549j408L08q3j299K062M15l261J386
507f67K806k418p68J980j448m01K148j118j030J592n77l53J148j865k64L403j329
524H39k925K559R13k501R58R05j508J032N62j695P79L34j506J861P94l193J106
541f86K858k684j181K724n08r97J291q67m87J374j162l03K051j684j255L069q50
$$ plain form
424 1416 127 -1967 770 840 -1484 459 1001 -1066 432 766 -1501 164 1310 -891 297 1367
440 1367 -1338 -358 1760 -855 -1040 1582 101 -796 716 -715 -948 1287 -225 -1218 1163 15
456 15 -1383 1015 156 -1808 1094 1604 -1262 -188 837 -569 492 584 -1243 718 1580 -1386 -623
473 -623 1095 -1081 -356 1664 -951 -1397 1358 113 -1267 219 -177 80 1547 -757 -1601 1579 646
490 646 -1517 799 850 -1127 794 932 -1705 -336 1213 -195 113 30 -1269 793 1208 -2053 -667
507 -667 2139 -279 -1047 933 -515 -916 1232 114 -916 676 99 -254 894 -971 -1235 2168 839
524 839 -2086 473 1386 -1115 -157 748 -760 272 834 -861 -82 252 -1254 607 1401 -1792 -686
541 -686 2172 -512 -1693 1031 523 -474 817 -50 -537 837 -325 -628 1423 -261 -1516 1553 703
558G03l116K393J570k417L93J069j138O18K31j277J501N28k221J474J404l204
574a489L48L276j960j745K270j15j211O81o64J75J654j516p51K360j335j845L034
591A167J50l076J813J836k390l76J050l84Q61j99j765J743R27k940Q00K414k360
608g29l01K902j620j970K083L15j007N25n45M06J595k270j370L259l16k652K163
625D68R44k665Q67J485j820J5J263m20M81m96j765K032J338l272L70L272j883
642B14j699K191m54j343J504J04p61O46p35J2J647j824j343L380n1l380J555J824
660A487k221l5J384r10J46M52q84R14J68j944J629J787l037k69L261j332k040
677a444J946K53j221O66k10k81R46j141l55K142j390k064K929P40l120R60K146
$$ plain form
558 703 -2413 -20 1550 -867 -474 595 -543 75 306 -971 530 1058 -1163 311 1715 -1489
574 -1489 -1141 2135 175 -1570 700 585 -626 55 -609 -434 1220 -296 -1047 1313 -22 -1867 1167
591 1167 1317 -1759 54 1890 -500 -876 174 -210 651 452 -1313 430 1357 -1583 -783 1631 -729
608 -729 -1030 1872 252 -1718 365 680 -327 198 -347 59 1654 -616 -1986 1273 957 -1695 468
625 468 1412 -1253 -386 1099 -721 -706 557 137 618 122 -1643 389 1727 -1545 -1175 2097 214
642 214 -1485 706 252 -1091 413 517 -244 402 -333 -321 1326 -498 -1841 1539 1488 -1892 -337 1487
660 1487 -734 -769 615 -295 -149 303 -581 333 501 -1443 186 1973 -1064 -1333 1928 596 -1444
677 -1444 502 755 -466 200 -10 -291 655 -486 -841 1301 -89 -2153 776 1516 -1604 -644 1502
694A502j618n07R22m54M80K05j091J153M29k405J027K230k607q94L162n92k329
711a387J049N96n79M32m95J22J412j379j071K297n94k165K458J237k923J92J932
728A134j106o78N82KR50k24j970J221J291k451K73K664j651j358K269l96j887
745a335J019P17k13L28r71O5J742j589j611K826M82k654J181J421k115j20J421
762E94o87n5M22n45P52j44j965J438J882k510m29K854j048j948J529L96q88O51
780B99j28k50P64j049n04J936r21j721K422N46k879P54J901j401m43R21l12L94
798C29j4j253J119R00k026N68J973k051q12K487o92j780J409M54q61L08m84K4
816d02J417j192j096K242k47k233J703J108k194M85J565j279l74P18m36N34J43
$$ plain form
694 1502 -116 -623 299 -155 325 530 -561 592 1021 -1384 -357 1873 -734 -1628 1534 942 -1387
711 -1387 -338 258 -321 111 -384 -262 1150 -229 -1300 997 403 -1762 696 1933 -990 -798 1134
728 1134 28 -650 -68 -66 884 660 -1310 -89 1202 -1249 -976 1688 37 -1321 948 552 -1335
745 -1335 -316 401 188 516 -455 -390 1352 -237 -1848 978 1460 -1194 -13 1408 -707 -827 594
762 594 -93 -148 274 -271 481 337 -1628 -190 1692 -818 -1247 1607 559 -1389 140 536 -352 299
780 299 171 -79 685 -364 -868 1068 147 -1574 848 1394 -1485 -731 1170 -231 -674 247 -65 329
798 329 315 -938 181 1081 -945 -377 1596 -455 -1267 1220 528 -1252 157 611 -250 58 -426 -402
816 -402 1015 -177 -1273 969 722 -1511 192 1300 -894 -409 1156 -123 -497 221 -215 319 462
833D62j437J098J176k311k2K395j370j224K065k19j529R51K40n33O63n48k72J527
851A112j021j559K131L46k254J204J367j922m1J274q84p3O39o40O60L60j803P16
869c88J783j926n65K370q42j488J471o1j096R98P3o21Q10o46o74J666o16j750
887a502K012Q72k374M04J474j246o3R26q06K74O77j163L26Q71j432M47J761j751
905b93r57K227l78j648J077L71o29O93n38p58J329k38j172J395Q5j626J322P93
923A055k099M24J711r84m12O17o41M65O04j483L27J563j312n26J479j035p96J823
941G80l49j416J106L24q13N49l59n08J576k67j630J236O33j612P04R26j456L26
959b50J165j212k63Q32o49L23P35j350J15J531j206p18J618m31q69J297k83j119
$$ plain form
833 462 -975 123 1299 -1012 -1034 1361 -9 -1233 832 613 -916 35 275 -258 405 -143 -415 1112
851 1112 91 -1468 663 1009 -1245 -41 1326 -596 -637 637 -247 -320 319 -321 339 699 -1104 -388
869 -388 1395 -531 -1096 1274 432 -1056 415 354 -742 256 329 -292 518 -128 -802 864 248 -1502
887 -1502 510 1382 -992 -588 886 -360 -423 503 -303 -29 648 -515 -189 682 -750 -303 1458 -293
905 -293 -1250 977 599 -1049 28 399 -230 463 -75 -833 496 258 -914 481 566 -1060 262 1055
923 1055 -1044 -620 1091 107 -305 312 -329 136 740 -743 -416 1147 -165 -691 788 -247 -1043 780
941 780 431 -985 121 445 -368 181 -178 -686 890 623 -1007 229 862 -750 -46 880 -576 -250
959 -250 915 -297 -560 272 -377 -54 681 -669 -554 977 -229 -947 671 240 -629 668 385 -734
977g34J002J13p79Q05j81q80J166n7j558J022Q65j374M03Q32j230K19J038j010
995c38jR69p92P6Q17j230r6J585q65q67J303l44q42J015l31q73J232O2j078P35
1015A37N8r04J100J61j416R22R11j403J04P89q75M10Q11j268M1J166r15l28R70
1034D71p14j15J255r57q65J381j44q81Q97j95o99J144k41j320J034N82j034M96
1052I5K91j045P89N88j385L57J110r56J4O86j095J60J279j027n44J222m66n29
1070d56Q23o64l96J420m41j079J121Pr66R85P5j140R98N26j321L63N49q58N97
1089A43M39j285N02R92j309p7J189q45j98J190q21n92J156l61n18R09m80m80J210
1108G64n73j114J288J90j214Q27L38j190N97N92j053L75O18q21M85M23j294M92
$$ plain form
977 -734 268 381 -398 407 226 -654 512 455 -1103 -81 784 -590 -187 645 -585 -366 672 -338
995 -338 -339 630 -162 -86 731 -499 -595 990 125 -742 561 217 -625 390 59 -814 418 480 -598 137
1015 137 195 -709 391 552 -864 58 969 -434 -330 459 -416 -6 805 -463 -422 744 -171 -499 471
1034 471 -243 -358 897 -60 -925 456 312 -569 328 133 -566 578 337 -983 51 633 -401 95
1052 95 386 -659 130 718 -667 -310 800 -156 -142 544 -551 -391 888 -139 -683 539 73 -456
1070 -456 367 -297 -693 727 286 -793 328 335 -631 354 429 -711 287 813 -508 -145 404 -454 143
1089 143 582 -703 -201 791 -518 -595 594 -251 -449 741 -80 -672 484 123 -395 514 34 -446 764
1108 764 191 -923 365 555 -659 168 506 -684 -87 505 -548 -173 445 -376 109 532 -762 -270
1126b70J243j251k90J337p25n69J022n40n43J064k97o00P95n13n25J329m50j214
1144i97J375M44j504M87O95r04M28N18r59L73N49r72L71O42j192M24J288j394
1162c28n71J532l75q65Q58j18l68P28n38n65J111l26p88J182j89j298J141N46
1180G69j522L70J060p69o2L18o07N41M07j125M68J052j239j74J300r09o24J381
1198F35k59r57P36M5m39M79m68k52J221n26j211J305L49j460O84Q59j120J34P40
1217D95o84nM11m95M61L48j206M63J187j362m45J610m61j003R12L8o46M94q0k65
1237b33O63n07n10J180l56j222J254O05j496K72J014q36j79N87l24K05J85p62
1255d60M90O02j263K11J405j026p65J344j97j019O93K34m08L64k57k36P51n70
$$ plain form
1126 -270 973 -278 -568 769 44 -525 497 -43 -586 478 181 -419 376 -137 -662 667 217 -997
1144 -997 378 822 -682 -195 500 -404 24 542 -417 -44 505 -467 -96 546 -646 -222 1066 -328
1162 -328 -899 633 258 -607 251 133 -235 493 -45 -610 501 175 -613 569 380 -918 223 769
1180 769 -753 -383 677 -92 -154 164 -443 98 505 -620 -152 900 -339 -513 787 -122 -746 635
1198 635 376 -581 155 200 -239 240 -228 -480 741 215 -996 309 658 -802 -118 741 -379 -245 495
1217 495 -189 -194 217 -278 183 531 -675 -212 975 -387 -832 778 317 -686 226 264 -382 112 32 -233
1237 -233 430 -77 -587 593 237 -985 269 874 -622 -350 664 -172 -351 236 -88 117 302 -460
1255 -460 30 632 -631 -420 985 -41 -806 538 341 -678 15 249 -159 205 -52 -288 463 -107
1273a07o82J372%j431Q84Q41j361k9R75m43j05L22m22K75J89r28N36R00j220q7
1293e21J444q75j004J217J69q24M18J69k22L36n34k93J111l64r87J191K49j471
1311g91N55R41j073q9Q97l33j80Q7m17N74L05j136M28J249j175o15J370l61r37
1330g01R03K00p09L25N7k16M07n33k86J268l64j342J132P29j420J13J043o51j84
1349b29N09l53P5J89n71M67M63j211K77J379j085q93J431K8j054N05K80l12L26
1368B21k53k71P37m44o52J190j2j368R03Q82j391j55J029l26k61K74k91L22J81
1387C15r16M22Q99j086j35J394p16j056J124K31q92L51K84k05K80m64l51R61k87
1406A53r09J126L62j456M43J015j010k77Q99j53j61J03m95L86M41r90K41J129
$$ plain form
1273 -107 -789 583 583 -848 36 877 -484 -513 462 19 -86 236 -186 89 278 -650 -114 786 -434 -521
1293 -521 923 48 -956 261 430 -394 24 193 -29 307 -227 -520 591 227 -760 431 680 -791
1311 -791 -236 705 -368 -457 440 107 -73 14 -403 171 476 -660 -232 1017 -158 -773 597 236 -701
1330 -701 202 402 -307 18 75 -141 266 -267 -553 715 351 -991 141 870 -550 -437 606 -45 -229
1349 -229 280 -73 2 191 -380 87 550 -661 -384 995 -90 -983 448 476 -578 -73 207 -105 221
1368 221 -32 -303 434 -10 -662 528 516 -852 51 933 -458 -613 416 90 -171 103 -188 134 315
1387 315 -601 -179 720 -366 -501 893 177 -879 245 476 -416 -65 219 14 294 -170 -521 440 153
1406 153 -756 370 732 -724 -281 734 -276 -553 346 193 32 135 -360 26 467 -523 -282 847
1424H47r33n59J249m03j052R41M27o99J30Q5j40M38n05n04J176L9j213O87O60
1443F71j187J57R68o96k80O96j89j82N7m59N09O12j112j15J310o31r02J008P9
1462C14p71N84K24o21K48Q9k17M75l47n80J091J15j384N16J018r20k56P67l69
1481b4j77M25l75L3L52n09K05O31r31k07J313m72j017R02L45p47K12J35k47L90
1501B37j47m59O27p1p68P69L52j145L63R28q09l89P16j34j17K10l98J95M68p17
1521b89j5Q75o12m61J030k25r26O60L61o11J67J07k05L82k36n32P36J20q50N61
1541C7N31r85J03Q55n60l07N65j52m7J70n11J86O28o89k22Q83m29n98Q10o3p39
1562e34N71K89m96J47Rk09N40j71o62P33L39r40K26O12o75K3O38n02k02M51k47
$$ plain form
1424 847 -86 -645 604 201 -851 90 517 -182 -52 33 -107 331 -174 -678 498 537 -676 11 671
1443 671 -516 -359 609 -87 -367 329 140 -42 15 -444 65 677 -435 -550 760 129 -773 235 314
1462 314 -457 127 351 -270 -22 67 -150 325 -22 -602 489 604 -780 -264 754 -166 -422 345 -24
1481 -24 -201 224 -151 -118 234 -275 -70 561 -370 -577 736 264 -753 149 494 -253 -41 94 -153 237
1501 237 90 -369 258 187 -581 188 540 -605 -242 686 -123 -512 204 70 -47 163 -235 -40 428 -289
1521 -289 -304 571 -41 -502 528 303 -623 37 398 -213 -46 61 -144 238 2 -530 206 326 -524 37
1541 37 568 -417 -314 541 -19 -326 239 87 40 210 -301 -115 513 -176 -398 485 56 -542 268 205 -534
1562 -534 37 326 -170 -23 -14 -223 317 146 -516 217 556 -384 -158 454 -221 -198 440 -62 -264 187 -60
1583f0o4K70m60J59O97o82m27R29j47o47N85R1n01M08Q0n00L14J19l52M09k9o82
1605d90N84L82r13J55P37n21j66M57l81k0M69m10n1N12m38j46O42m80l70Q57j42
1626B67o97N12J60m84L03M1l92M75M2o00M16K37o48L52M22o95J16O02n50j43N16
1647B52k92p6M15m31r5N96m21k99O68k12m57N99q9n60M88J26m88L57J08m82L63
1668G0J58n80L64L55o23J79M55n94J8N43m41r3N02l99j17M95l90k15O19k51l82
1689c27N52j47m35N34j2n13M81J33n41L24J74n30L63K71n82J91L92n32O2M02m54
1710a94O6M89n17j47N91l18k54N31k24k81N28j87m20M94Ql94M07k4m85M91Q9o23
1732c74L44L57n25J01L11m39J21L74m70P4M20m08l7M45m39j06O50l28l86N47o9
$$ plain form
1583 -60 -124 146 -314 -155 542 -140 -567 362 215 -432 153 244 -257 151 231 -269 45 164 -188 221 192 -490
1605 -490 94 476 -437 -282 455 -66 -232 225 -156 -176 293 -117 -168 344 -94 -240 402 -78 -448 409 267
1626 267 -430 82 242 -242 61 102 -290 185 227 -373 43 280 -368 -16 406 -289 -173 429 -121 -264 252
1647 252 -40 -116 299 -132 -227 369 -52 -351 317 105 -352 247 158 -402 86 212 -276 81 189 -293 70
1668 70 228 -352 12 367 -256 -77 378 -216 -198 345 -96 -189 313 -86 -203 292 -98 -313 306 55 -327
1689 -327 225 78 -357 177 165 -348 133 266 -275 49 223 -307 56 327 -255 -64 328 -204 -142 260 -194
1710 -194 -128 361 -156 -303 288 -30 -284 247 23 -258 270 83 -337 157 165 -229 178 154 -331 160 249 -374
1732 -374 -30 327 -198 -97 214 -225 -104 270 -200 -126 294 -114 -151 294 -145 -251 399 71 -315 232 163
1753A63m02L49m6k89M30r7m45M42N0n01M00K01n57K73L66n46L2M11k98J2K56l48
1775a44Q0L84n08n2N82l44k89N56j99l95M57Ml67L05J7k37K99j19l43N16N8n89
1797c28L48L41n79P6M06l65k1L21k67j8K36l46J09L97m76p6O24l48m12N52j0l97
1819b33L23N8k84K12n5k18L92j02m23M80J51o75K57M49m81k4M15k70q2K49k37
1840i8P1K24l76J25M46n41k26P13j86n11M55J16l73J88J3k08K76p0k29L95r4m94
1862c84N02K54p20J58N68l83k08L02j17RJ46k99J38L23m51j3N27m20k93O81q7
1883B33o00L66K34l08M3j6n5L51k04m04N18J01n89L23L91o03K8N33l44k26L18
1904I0n1PM5l61K30M31n79j64P08k59m84N18P0m63K70J79k52Q0k9j11L52j80m30
$$ plain form
1753 163 -239 110 64 -225 205 108 -337 105 155 -346 54 255 -302 -29 337 -209 -177 234 -64 -52 204 -144
1775 -144 -64 320 -188 -240 342 -2 -291 265 66 -329 128 132 -235 70 87 -150 149 30 -313 203 261 -328
1797 -328 20 361 -218 -142 264 -101 -122 199 -68 -86 150 -196 -87 310 -166 -242 382 34 -378 174 164 -233
1819 -233 90 148 -136 76 21 -197 195 93 -330 150 301 -374 -117 332 -149 -173 242 -28 -110 139 -98
1840 -98 -27 197 -179 -54 392 -149 -375 338 152 -359 96 212 -161 27 40 -168 108 38 -191 204 110 -384
1862 -384 118 372 -348 -190 378 -5 -213 89 -28 -19 127 -172 -34 289 -162 -175 352 -68 -361 320 233
1883 233 -367 -1 233 -75 -32 -48 -103 248 44 -360 158 259 -330 -7 384 -219 -191 342 -2 -228 90
1904 90 39 46 91 -270 -40 391 -188 -352 356 97 -387 131 201 -262 8 187 -65 15 -14 -125 227 47 -383
1927c83N71K07p37J53N74m69j68M51j54j50J87j55L3J83l68J42N07n22l06P28
1947C24j26n85M05K60l80Q2R7j78J56q3j93M37m2n50M42L29p04J9O41k97k54L27
1969A27q4j14J26j89J20K75m20k0N81m21m73O84J02o07K67K90k97K2K3j25K66
1990A33o3k97M12P4o44L25M79o22j05O22j76l23J85k4K6J08k89J03M10m17k14
2011b97N98k31m81N46J93n62J31K98j81j9o5q5L76q7m93M23K73o26Q6N44m15k10
2033b84M99j07k75J62j5N1J23l66R6N36m37l78O26on61L25K75l80K9J89j57O2
2055Gn5j33L66j2n19L51M03o24r5O03k06k86L10k7j31Q5j50P7K51l38p0N51l09
2078D9m77N48J37n16J89K98k63j6N1q5J84m8k78L95J14n91J91M69m70j66N15j14
$$ plain form
1927 -383 188 395 -342 -189 385 -84 -252 199 45 -105 82 -73 -40 143 -225 -83 424 -98 -404 324
1947 324 198 -387 18 278 -102 -20 77 -101 55 -28 -221 216 174 -376 66 395 -309 -290 351 54 -200 127
1969 127 43 -71 55 -134 -14 261 -159 -179 402 -19 -492 192 294 -313 -46 244 -53 -31 -8 -133 133
1990 133 70 -227 185 259 -385 -60 419 -203 -308 314 138 -185 0 -24 2 110 -179 -76 334 -83 -297
2011 -297 301 70 -411 135 328 -234 -103 195 14 -5 -70 -155 221 134 -359 64 337 -289 -203 341 -74 -284
2033 -284 215 108 -167 -5 -20 31 154 -212 -116 420 -17 -395 231 225 -336 -11 264 -116 -87 102 -55 7
2055 7 -48 -181 185 173 -346 5 408 -216 -311 292 86 -200 110 83 -48 37 -113 -36 215 -123 -193 358 49
2078 49 -428 120 257 -259 -70 228 -35 -51 0 -85 99 51 -227 168 282 -309 -118 351 -119 -285 230 116
2100A16k73J92m3m3J24k06O5L49l59k16N75j58n16M52K57m55M9K16j74M9Mj53
2122a48K80J4l94K86K31n41Q9N22l64k57M32l4k23J11n9L8K04k80p0M37k55l27
2144c08M95mm59L09K20l98K4K11j20P3l5k05L24P7n07K22M01m41r0M48k27k08
2166a98L30o4j69J66j04NK26l03j21N24k02m35M15J60m47J52K19k45P3J04j85
2187i9J38M6k73K65J67m70J26M47m05j93M36j02k25K20q0r1K12j78j00L45k02
2208a6k39M39n6m53L61K07m07J12K16k18N8P4k23K11R9l55J71K79m35oM33k94
2230d2j83L62q5k04K24q4q1K48j78j41L75j43l20L86N8m23K44K16l49N6J70k10
2252a04J03R8k71J68J97l67N9L37l17q3M07k14j95L17o8j75J96q2j12K93j57k64
$$ plain form
2100 116 -157 35 -8 -51 73 -133 -68 281 -78 -294 281 123 -393 59 316 -139 -90 126 -48 1 5 -148
2122 -148 132 146 -248 38 269 -272 -183 339 -25 -282 150 116 -107 4 -55 -17 187 -93 -163 274 19 -308
2144 -308 187 183 -276 33 253 -145 -121 90 -30 43 8 -197 127 204 -303 -81 320 -121 -211 237 10 -198
2166 -198 132 68 -101 65 -39 -34 192 -111 -232 292 90 -345 70 230 -217 -65 154 -91 -18 86 -99
2187 -99 39 85 -188 77 244 -226 -100 347 -58 -251 185 83 -142 78 -2 -93 119 -59 -159 186 -16
2208 -16 -255 184 128 -325 36 243 -164 -52 164 -54 4 78 -145 66 165 -190 -19 260 -175 -181 252 -42
2230 -42 -225 137 52 -152 72 -12 -93 155 -23 -164 211 68 -252 134 192 -231 13 229 -120 -64 106 -104
2252 -104 -1 97 -174 -6 191 -176 -117 220 -97 -180 227 13 -182 135 67 -108 88 6 -106 187 30 -234
2274b34L60ql51K86J10l50J76J79l07Q0J97k23P7J30k67J21K60l66pL73k37j55
2296a56K93j36j56K87r3j99K67p6j71K44p0k44L27K9l72K28J65k90J11J47k50
2317a15J28J52k75M1K31k41J1K37k63l7L23k09j75L03o7j79K38j10j61K79m9k39
2339a77K50M0k55K04M8k73J84J42k93R8J77k47O1J76k63M4K47k37n6K67j93p1
2361a27K79j78j05K86j27j73K62n7k05K49nk51K20M2k51J72P7k62J67J25k86J12
2383c6J84k96P5K51k50l8K67j85p0K24j50n9K37j77j31K97j10j97K60k7k40K29
2405E8L4k58J71R4k21J42N9k27J80J20l21J18K51k72j7K39j91n4K41j55r3K16
2427A14j38p8K29j74j26L38j05k82K86N9k71J67O7j91J38O3k19J50P7k41J50J51
$$ plain form
2274 -234 126 118 -233 53 163 -187 -11 168 -139 -59 138 -85 -8 122 -145 -24 236 -130 -137 236 -1 -156
2296 -156 137 1 -155 132 39 -160 107 31 -140 104 34 -210 117 146 -226 2 167 -123 -12 135 -115
2317 -115 13 165 -110 -69 162 -79 -68 169 -94 -131 192 -17 -192 111 44 -135 103 -7 -168 111 62 -177
2339 -177 73 113 -142 62 110 -163 21 163 -130 -32 145 -102 -41 135 -128 -84 163 -74 -130 137 -56 -127
2361 -127 152 -26 -131 155 28 -145 117 60 -145 104 99 -152 68 110 -141 31 108 -154 13 138 -148 -36
2383 -36 148 -148 -73 178 -72 -110 157 -28 -98 126 -24 -83 154 -23 -154 143 33 -164 96 69 -171 58
2405 58 92 -166 5 99 -122 20 79 -148 32 152 -169 -51 200 -72 -89 150 -41 -95 146 -9 -102 114
2427 114 -24 -102 127 -47 -173 165 60 -222 64 123 -148 19 86 -105 33 96 -123 27 104 -137 13 164
2449A64l26Q9K76k79q5L00j27j04J81j21n2K14j70r7K84j28k01L14m0l01K55J12
2471A58k85J09J33j83Q6L8j88J87P9l01J23K31l00j0L12k09j15K69j06j28J72
2492G2r1m2J93j78j09L30j40k54L11N8l25J83J33k45O5J14j59J09N5k28J97J11
2514A60l35J01K95k90q1L32j58j68K20m7r0J36j08l3K19j85j66L37n1l11K71J18
2536A66l03J02J58j76L3P9j14J06J4k23J71J81l42K1L41k19j63K66o1j47J56k8
2558A8p0J22j04n2K38j61k00L49Ol51J82J98k40JJ37j11M8M4j54J24R9k78J15
2581d0K38l04m6L44j57k04K35Qj28Q8o0nJ56j65j11L00r1k68K80Q4l25J24K21
2604A74k27l4J30p7O7Mj82J94J18l29O3L03k34j15K83o9j98J65J8j11Q7n2qJ70
$$ plain form
2449 164 -162 -73 203 -76 -161 139 12 -92 89 -32 -84 130 -40 -137 147 19 -182 132 92 -209 46 158
2471 158 -127 -18 115 -68 18 56 -132 55 134 -167 -44 187 -113 -123 189 -20 -135 134 28 -100 72
2492 72 -19 -61 132 -46 -155 175 35 -219 92 150 -175 8 141 -104 -39 75 -84 25 80 -148 49 160
2514 160 -175 -74 221 -69 -150 182 24 -144 76 29 -61 75 -33 -66 153 -32 -198 139 88 -223 48 166
2536 166 -137 -35 123 -53 -20 59 -55 51 65 -158 13 194 -148 -127 214 -5 -168 98 37 -110 46 18
2558 18 -52 70 -34 -86 152 -9 -209 140 146 -205 -23 175 -65 -64 73 -38 10 54 -100 24 123 -155 -40
2581 -40 198 -106 -152 192 35 -169 66 74 -54 34 -26 -31 125 -40 -151 149 58 -210 70 154 -171 -47 174
2604 174 -53 -87 43 -34 33 37 -145 49 167 -162 -99 204 -30 -145 138 69 -129 36 54 -57 30 -22 -30 140
2628A40j57j63L16l9l09K23J71k71K9J69j29k2P7o5Q6K2k04J24J80l12JL29j77
2651A9j80K59j8j88J08Mm0R8j00l6K23j34k26L04O9l30J43J99k21k7J37j01K5
2674a3M1r8J20N5k63J01K46k84p9L40r2k18J79K8j22O7j9l7J50j21j10K58q5k64
2698b20K70J35l35P2K22j62o2R9n5N8M5j74J28J33k68K0K78k10j35L06n3k26J41
2721GN4q5N4o7j8J98j40j77K69Jk67J68J67k54J1J90j30m3P9o3R8K2k02J06J95
2746A73k76m9L11j09j95K25Lj82R5L5o7Q9p2o4K09j00k23K67Q9l04J10J91j98
2769d2m5J56q8nO8j10Q4R3k24N2K39k13j19K93p3k01J69L3j45Q4Kn4J31q3j19
2794a17K11j1k53J88J45k67L5J97j50n0J31p7J8O0j28O2J37k24JK64j69j55K35
$$ plain form
2628 140 -17 -180 136 97 -212 11 182 -89 -60 109 -20 -42 35 -30 56 78 -126 -2 178 -134 -133 196 19
2651 19 -161 98 80 -108 0 4 -36 62 -38 -74 149 15 -211 93 162 -168 -25 174 -47 -74 63 -38 -13
2674 -13 28 -70 50 105 -158 -57 189 -95 -174 166 74 -144 35 63 -59 8 -11 -48 102 -19 -129 129 44 -220
2698 -220 50 185 -150 -78 144 -18 -80 19 -36 22 67 -107 21 154 -114 -94 184 -26 -161 145 92 -134 7
2721 7 61 -24 30 -37 -55 143 3 -174 95 96 -171 -3 164 -90 -79 111 -19 -62 17 -46 52 74 -128 -22 173
2746 173 -103 -152 159 50 -145 80 83 -99 -4 31 -36 53 -19 -83 126 26 -197 70 159 -145 -35 156 -42
2769 -42 -87 69 -19 -24 44 -66 18 111 -113 -61 178 -35 -154 139 66 -135 34 67 -78 6 8 -46 85 2 -117
2794 -117 94 83 -170 18 163 -104 -69 128 -22 -72 59 -18 0 60 -68 -6 131 -93 -92 172 3 -152 83
2817H3kj98J22M3r8P8j9q1J37l3j62J83N9k61J47J63k25k1J75p9n4Q0p8L9Q6j58
2843g4K2J65j54o4K21r4j64J95K1j76J06L5p1O9m0q7J68j6j82J38R7k13N6J62
2867A20j66j7J39q2m4Q4p7L3J03j66nK00j29j31K31k7j71J46J3j26Q8J1q9R9j6
2892B1j17J37K7j94J15J34k04J3J52j10k8J04q4MR5j09J2J34j34m6J89q3j18J58
2916F8j4j42J05L2j09Q8jj01J13Lj53J40N8j86P6J20j59J0J33r7l6J27r5qR6j20
2942e2JJ35j07p7J84o3j33J58lj24R1L3j02R4J6j39J06M6j53J02Q7j72M8J12j29
2967d1j6J41j03k3J02r8k1J44j12n6J59p0r5J55m6j05J26J2j35J13L2j27P9K9
2991D4j27J02O7j65N5J04j40L4R9j18oJ42j17l9J46q1n6J28p9o0J36m6j02J28
$$ plain form
2817 83 81 -117 5 48 -50 28 9 -72 65 32 -130 53 112 -149 -2 161 -64 -85 90 11 -43 37 -41 -2 84 -74
2843 -74 -52 113 -41 -105 116 22 -142 53 74 -102 4 39 -32 37 -3 -90 78 62 -120 18 115 -98 -42 120
2867 120 -46 -63 76 -6 -50 34 -43 -10 93 -73 -78 122 -7 -138 93 66 -105 41 54 -72 16 27 -62 37 21
2892 21 -96 41 68 -126 -11 123 -81 -68 84 -26 -54 50 -34 -30 65 -44 -32 102 -32 -78 111 28 -90 68
2916 68 54 -88 17 49 -60 28 27 -74 39 42 -111 29 87 -99 -23 97 -62 -52 81 -16 -52 75 -20 -28 68 -52
2942 -52 -51 84 -23 -100 84 21 -112 46 43 -81 10 43 -59 35 51 -88 18 64 -89 13 100 -72 -24 88 -41
2967 -41 -57 84 -19 -42 60 -38 -59 85 -27 -83 76 6 -89 66 20 -85 41 53 -82 31 63 -64 15 44
2991 44 -83 19 86 -79 -24 80 -60 -26 73 -45 -51 91 -26 -65 81 0 -56 72 -7 -67 69 23 -79 49
3015D9rj13J10j4j13J17L6j51Q6P4j47N8P9j43N8J14j46J5J17r7j6J17r9n3J58
3040H7q0r4J32l3o9Q6l2q4J38j7j19J20K3j42J03M6j44P7Q9j32J2R3r4J6Q1j24
3066f1L2J21j35k1J36p5r1J45m2r0J19j2q8R2k4p4J15j4j32J23N1j62Q2R1j51
3091f5L2R5q3j2P7p7QQ9j21RJ45j36m6J54n2j03J52l1r9Q9Mo6P2k1q6J23Kj59
3119a06J14P6j62M7J00j07qJ03r0nQ4q3K9P3j10j0J47r7j00J60j5j05P7J8p6O4
3145A8j1o4Q6oj07J16J2j45R8J11j75J2J22o1l7N9m7J2N4r6K6J05j18m2J60r1
3171ir3J48Oj31O4L5l9L9l1l6J02l0j12J16N1j69N9J15j12k8J00n2l1N6m7K3N9
3198E3j17K4J25j02o9J53k4j32J01M1r4M6J9l8N9l0q8J14%j45R9R8j75K1J41j03
$$ plain form
3015 49 40 -73 37 23 -90 27 63 -88 -2 72 -75 -17 62 -81 -23 91 -55 -40 77 -20 -36 81 -18 -71 87
3040 87 7 -87 45 12 -57 29 -3 -87 51 34 -85 35 58 -84 19 65 -79 -2 87 -45 -33 60 -34 -18 63 -61
3066 -61 -29 92 -43 -64 72 -3 -94 51 9 -81 38 26 -62 30 6 -68 47 33 -99 24 75 -87 -5 86 -65
3091 -65 -33 62 -21 -33 44 -33 -25 64 -57 -48 97 -39 -85 69 17 -86 66 35 -64 25 29 -37 35 14 -72 51 53 -106
3119 -106 8 84 -78 -31 69 -38 -46 57 -33 -38 46 -37 -8 65 -45 -55 92 -5 -105 55 40 -65 12 30 -46 18
3145 18 7 -57 29 23 -84 32 44 -101 -3 108 -67 -55 67 6 -31 28 -19 -7 47 -49 -23 82 -36 -78 82 -9
3171 -9 -102 46 52 -79 -15 20 -19 20 -11 -47 55 25 -87 29 80 -89 -30 85 -27 -55 45 -7 -38 18 -29 -6 53
3198 53 -64 -40 85 -17 -86 67 43 -89 12 53 -41 5 24 -14 45 15 -73 41 41 -104 -5 93 -82 -61 80 -23
3224b3n1R1j1k5M9p1M2P6j31j1J55p6j11J55nj31Q2M0p9L3Ok9P1m1r7J32J9j65
3252a06Q0J18j25k8J29q5l8R1n2K0M5p7K1R6j47l8J83n3j42J27L6j13M6M4o9N5
3278A8j1o5R1k3j03J23O3j79L9J59j28o2J14k4k8L7m6K5N6j11pJ45j08p8J91l2
3304E6j53R8O8j04J9L8k6M0k5p4J10Oj59R3J20j68lJ36p4p0Q7j5j6L3m7K0P5j15
3332e0l6J75p3j01J43K0j52M9P9p0J3Qk6N8j6r8J09K4j46N9J36j25n4J45o3n2
3358d4O1nLL0q7J5J00q5p3J61k6j38R2O4j27K6O6n1K3On5Q6j1j21J04Q0j53%J46
3387H7q3p9J11j5m6M5k1qN3p7j4J16p3p4J41J6j56O4P7q5%N2m5L1Pp1P0L5j34
3416g6N5J12j30l3J43o0p5Q7om1L8l6qR6r5l6J30l4j16J14K8j24M4P9p0RL2l9
$$ plain form
3224 -23 -74 17 6 -19 30 -41 1 77 -54 -65 90 14 -97 58 53 -78 4 44 -35 -2 4 -25 46 5 -92 40 59 -106
3252 -106 -26 92 -33 -61 68 -17 -55 36 -16 4 49 -28 -7 89 -58 -96 87 34 -108 19 55 -58 -12 32 -37 18
3278 18 7 -58 33 10 -93 30 93 -86 -47 112 -16 -78 36 12 -16 21 -25 0 56 -55 -62 83 -25 -103 88 56
3304 56 -97 1 69 -35 -16 22 -4 36 11 -63 47 53 -106 -13 107 -61 -64 72 -2 -72 15 0 -16 17 -30 -10 65 -50
3332 -50 -86 89 16 -85 58 78 -74 -25 54 -16 -3 5 -21 37 21 -77 32 56 -90 -31 105 -20 -74 71 8 -44
3358 -44 17 12 15 45 -42 -27 73 -12 -85 76 50 -88 4 68 -59 -33 33 -18 5 11 -44 42 31 -90 14 94 -59 -59 87
3387 87 4 -75 36 21 -25 20 -1 -9 44 -33 -47 69 -4 -78 63 79 -77 -13 64 -21 -21 31 -14 17 24 -47 23 58 -76
3416 -76 -21 91 -39 -72 71 11 -64 23 17 -24 14 -22 -30 66 -29 -65 65 31 -85 29 57 -67 -23 56 -14 -5 27 -12
3444a2L3kq0P1O3j39L6J16j04m1J05m3n2N9j5j3N6o5rQ6o4o2J40l2j28Q4O3j04
3472e3M1M0n8L6J4o0N8K6j13O4Q0j29J2J19o8o7R6k1n1O1l6j3P5o9l8J17n0q6
3500g3J13J3j15O0O1r8L1M0o3K4K7o7M7M5j07M3R0j09rJ05n2o6Q7j3k5M3l8k9
3528c5R0n0o2J14l4r7R4M2j20M7O1p5K1L8o1K7M5j10O2O0j07J4J09r3k8R7l4n5
3556d0P0k0l2N8m1m3R8m5q7J17Kq8P2K9j07N5M1q5K9N0o2K4N1r1L2Q5j09JR1n9
3586dl9R5n6l6Q6m6m7Q3l2m4Q5l6p3R3J6j03M2O0q4K8M9o9L0N0p5J7O2q7J2P8
3616E5q6k2R5m3m1Q0l7m6P5l3l4O9j7o0P2jp5O8K0q4M5M9q6L0O0p9K0N3p4J6N0
3647C9n2qO7o1k6P3k9m4Q0l7m2Q2k5p1P9Kp4N3J6p7O8K4p4L0M1o6K0N6p9K8O1
$$ plain form
3444 -12 21 19 -61 10 73 -66 -30 86 -18 -59 46 3 -49 10 -5 -18 38 -27 -36 50 -14 -76 64 32 -96 -12 51 -53
3472 -53 -12 28 -30 6 20 -40 18 44 -69 -5 75 -54 -42 77 9 -58 38 17 -34 27 -9 -22 53 -16 -54 63 13 -73
3500 -73 40 53 -62 -2 59 -39 -8 32 -31 -7 20 -47 0 45 -62 -19 71 -38 -47 58 6 -60 27 14 -11 32 -6 -35
3528 -35 55 5 -57 57 23 -74 20 62 -58 -11 50 -25 -4 34 -27 0 45 -65 -3 57 -50 -36 73 -20 -48 49 15 -40
3556 -40 30 10 -22 36 -5 -48 50 5 -82 35 37 -51 21 50 -57 -2 39 -46 -17 33 -29 -5 46 -45 -13 72 -37 -36 55 -4
3586 -4 -43 52 -4 -40 46 0 -47 36 4 -40 45 9 -64 29 45 -58 -16 44 -40 -12 37 -32 -2 48 -27 -10 52 -35 -23 55
3616 55 -31 -53 42 -1 -42 38 1 -45 30 -3 -37 32 15 -45 27 26 -49 19 39 -45 0 49 -37 -7 53 -26 -6 47 -27 -11 39
3647 39 -13 -21 46 -15 -41 32 3 -41 39 2 -40 42 17 -54 25 27 -47 6 22 -55 13 37 -37 -7 34 -32 -12 44 -35 -7 54
3678E4p5j1P1m9j7O3m5k2Q1n6l5P1j0n6P9k8o2P0J6p7N7Rn6L9K1p5M6N3q8J7N6
3709D1o3jN5n0j4P9n6k0O5l7m0R0m9n2R1j9o6O4J5p4N9Rn8L4K6o0M1K6p1K3N5
3740D3p4OO1n6j5O8m4qN7n4J0N1n3k1Q1l6o0P8pp7M4L7o8M4Om7M4J1o3M6L6q4
3772d4L1P8r4pQ1n5k4O4k4k7O1m9j8O7m3k7P9l4p9J04J7r4M4L1o5L2J0n4N2Qp5
3803e4O4M9j09L6P8q8k0Q2k9m3N8l5j4O4o0qP1m0o2Q8%q5O3L6p0K7M0o5L5Mm7
3834c4N8Pq0M9O1p9j7Q0n1l2O1k1k6M4j8j7N1m4k3Q6m1p5R3Qj04O2M5o0J0K0l9
3865b6M0j2m8N6K9q7L5P6p8l2R5m1m5O1Pl2L2m6LO3o5l4R7j3j04Q8K2q0K8M0m6
3896a7J7K0l4K3J1p7P5L7j00J5Q8o4m4Q6k8l2M4k1j4L3l8j6R4n6o3J02pj00P2
$$ plain form
3678 54 -21 -32 39 -10 -27 36 -9 -31 50 -6 -41 30 20 -36 43 15 -47 23 39 -38 19 28 -28 11 32 -43 3 56 -32 -15 41
3709 41 -22 -23 32 -18 -32 47 -9 -29 36 -1 -41 49 0 -52 39 20 -46 18 33 -41 18 27 -31 3 29 -31 10 36 -35 -12 43
3740 43 -31 -25 36 -20 -35 33 -11 -19 38 -16 -6 45 -8 -29 52 16 -44 34 27 -50 -6 31 -37 7 13 -34 10 21 -42 4 40 -44
3772 -44 -13 65 -29 -36 45 -10 -34 30 6 -21 40 -9 -27 40 -3 -30 49 15 -64 40 57 -37 7 38 -27 5 15 -39 13 21 -54
3803 -54 10 59 -50 -14 64 -24 -44 38 9 -34 24 -11 -25 39 -21 -29 42 2 -60 28 28 -57 6 42 -28 -1 39 -26 9 13 -34
3834 -34 24 31 -49 0 61 -18 -35 45 -6 -38 23 2 -24 20 2 -15 36 -8 -31 55 14 -61 32 40 -64 -2 43 -17 -7 13 -26
3865 -26 14 2 -46 10 39 -48 -13 63 -15 -47 48 7 -38 23 30 -2 30 -16 -13 50 -15 -49 48 35 -69 19 41 -39 -11 29 -17
3896 -17 0 20 -14 9 20 -57 18 55 -45 -30 58 -6 -50 36 8 -24 20 -1 -15 18 -20 -36 58 2 -61 41 34 -66 6
3925FM8r0J3M7l4K5kl0L0J1p6M7O0r7%Q9m7m9P1j0l1L3j8lM8n7j4Q2l3p6Q7K0
3957E0j00K9O9o4MK5l3K9Km1M6K7q9L0P9r2k7R8k2m6M4qk2K5k6rO4m9k5Q2k3q9
3989f2P6K6q6K5N1l6j0J8j7L4Kp0N2N0q6RR1p2m4Q8j0m6K7prJ9m3lP9l6o2Q3P
4022C8r2N0M0o5J5N7m9J0Rl4M4Np1M0O8r4j3Q6k6o6N9Qm7M2k2qL6m4oQ8m5p0Q2
4055B5K3r1L2N1m6j3K8j3NQm6M7L8r1K6P7o7m1P6j1m7N1j6nJ5k3k0N7l1m3R3k2
4087B6r2O8L6p0J0M6l9MJ9l7L0K0n6M2M1q5RQ8o4n2R1k1m6K4j6KM4k7k7O8l2n2
4119d8Q1rp4M8M7o9NM9k9RMk9K6L1p0J2O5o5j3O8k2n1N2kl3K9k3OK7k9l7P7j4
4152A9p2O8K4o7K3M6n3nM2l6J2J7n9M7L3p3J5O5m9m2P5j6m1M0Mk9K5j2l2O4j3
$$ plain form
3925 6 54 -36 -23 24 -10 15 13 -17 13 24 -52 -5 55 -42 -42 47 0 -49 22 12 -19 14 -4 -7 41 -16 -30 52 19 -57 30 50
3957 50 -50 -21 48 -16 -12 13 -20 9 11 -30 16 43 -46 -16 63 -29 -56 42 20 -26 18 10 -12 13 -13 -22 42 -7 -32 50 27 -62
3989 -62 14 40 -46 -21 30 -6 -16 2 -15 19 21 -49 3 53 -33 -24 67 -5 -49 39 29 -17 10 3 -6 13 -30 -33 46 10 -52 31 38
4022 38 -54 -4 36 -29 -14 43 -6 4 13 -21 23 28 -43 -3 65 -29 -42 44 18 -48 11 19 -28 14 -8 -16 20 -24 -30 58 13 -57 25
4055 25 48 -43 -11 40 -6 -19 9 -4 1 9 -37 10 48 -43 -17 60 -7 -48 28 17 -30 21 5 0 15 -8 -28 29 -2 -45 48 26
4087 26 -66 2 38 -32 -22 24 -15 -11 8 -29 1 21 -35 7 48 -37 -28 60 -4 -56 35 14 -32 -8 -24 -22 22 -5 -32 36 4 -48
4119 -48 33 24 -50 -2 45 -24 -19 30 1 10 14 -15 11 42 -28 -16 49 -16 -29 39 17 -34 18 16 -17 12 -11 -5 22 -7 -44 33 19
4152 19 -53 15 39 -28 -5 41 -12 -17 25 -11 1 18 -41 6 39 -34 -19 46 -3 -45 30 14 -27 13 17 -12 13 1 -31 33 20
4183B0o5P6j1p3N2L9o3%O0o1NL9l3K5jl8RO3o6j0P3l6l8O9j6m6N0j5l4M5k1k7
4215b9N1Jm5N1Ko7L5M1n3J3L4l5kL3m3K0K4n5NN5m7j6O0l1l5M5Nl9L5nl8M4j2
4248Bl5M8Jn1L8K5n7K5L8o3J9L4l7ML6o2K0O5p8J6M5l6k8O4l1l1O4j5m5N5k5l6
4280c1N1j2m6N1J5o9L5K9m4KN0o1J6M3m9QM7n1kO0n2oM5m2j4N8m3k6O6k6l0M7
4312A9rm6N4Nn2L2K6l7K2K0n2K0L7n3RM0m1JM0n3LN2l6k0M5l5nM0k1k8M3Mo1L9
4346BJl2L7J4n8L7J5n5M3J7m6J1M7n4LO6n6mN2l6k3M8l5j9M5k4k4O5l3n2P7kn4
4379b7M2J5m1J1J8m8L3K0n2L8J3n5K6M0o8KO7l9j6L9k8j0M1l0j0K7j1k1P0l9m7
4410d0O0Mn5L2K8m8J6K5m3J8J6n3L5L5p1K5O9o1k8P4m1j7M2j5j9K8k5oM3k6m0
$$ plain form
4183 20 -45 31 20 -53 -1 38 -25 -25 35 -26 -21 18 -15 10 9 -29 -20 43 -23 -33 40 4 -34 35 19 -27 23 8 -26 19 -2 -29
4215 -29 22 23 -22 29 31 -36 -1 40 -13 0 34 -1 -3 30 -13 7 31 -24 -19 36 -11 -27 33 2 -33 12 17 -22 13 8 -30 14 2
4248 2 -33 15 16 -35 3 28 -29 -4 34 -29 -10 24 -13 -9 27 -35 -15 50 -28 -12 33 -3 -31 33 2 -29 35 20 -25 30 5 -31
4280 -31 20 8 -38 13 28 -41 -6 23 -21 -19 31 -30 -14 29 -20 -12 35 -16 -18 42 -10 -16 29 -13 -27 31 -12 -38 28 2 -28 19
4312 19 10 -36 18 23 -29 3 29 -8 14 34 -18 2 39 -14 -5 35 -6 -5 35 -18 -15 37 1 -19 26 -9 -14 26 5 -23 20 24 -37 2
4346 2 3 -29 8 22 -36 1 16 -39 4 21 -25 -14 33 -21 -18 48 -8 -12 40 4 -19 29 -6 -25 20 -4 -28 37 4 -48 29 27 -27
4379 -27 15 30 -11 0 18 -30 3 23 -29 9 22 -33 -7 33 -35 -33 34 -5 -21 18 -10 -20 21 -9 -19 8 -3 -24 46 7 -40
4410 -40 20 24 -31 1 29 -19 -3 22 -21 -3 13 -40 -5 30 -41 -16 53 -8 -36 38 -3 -20 22 7 -12 16 -9 -15 28 2 -38
4441c8P3j7o1N8K8p1J4M4l0KNj8RJ6m4L0M4p0QO0m9k2O1k4l1L6j6j9M5l7j1P0
4473D5l8m9O6J0o5L1L6n9J4L3m0J9Pm3M6J1o3L2N0o5j5Q2l3n4O1j3j9J8oj1M2
4504C0l2l3P4k5o2N6L1q1L2N5n7lK1l8M2jm1M3L2q4K5O1o0k4O8k5l9M9nk6J9j6
4536a4qN6m1l7P8j8p5N0M3o0J5K6k5J9%j9J8J3m5K3M2p9NQ8n9l4O1J0m4K3lk1
4568a2L9k8j5N8m7m0P7no8L1M0m6rL6k2J0Jl6M3K1o7K0N2o0j4Q9m2n2N8%l1L2
4600A3j6JL9n6k0Q8l3o6Q0J8q7K1N8m2j2J9k2K2Qm0L5K5p2K1O7n3l8Q3j6n7L5
4631CJ1l6K8j6j3O7m9m1P1jp9N6M0o6NN3m4KK1k6L2J0o0L1N9j00lR0l7m8P0k0
4663A0m5M5jj9L3k7nO0m8n4R1Mp9L5M0n6oL7k4OPl0K4K7o0J3P0o8k9R2k4o0O4
$$ plain form
4441 -38 35 18 -43 15 43 -28 -14 30 0 2 7 -11 -2 14 -30 0 44 -26 -18 42 -7 -29 32 8 -23 13 -3 -22 23 -14 -25 45
4473 45 7 -42 24 34 -31 0 36 -23 -9 24 -16 3 10 -33 13 24 -39 -7 43 -22 -37 45 12 -42 19 6 -13 5 -1 -12 30
4504 30 -2 -35 39 14 -48 8 39 -42 -10 45 -12 -15 6 -32 10 9 -32 11 43 -41 -16 45 -15 -39 29 4 -35 14 9 -17 2 -14
4536 -14 -22 34 -7 -44 34 16 -59 -9 34 -26 -11 15 -10 9 9 -10 8 21 -24 -1 41 -38 -33 55 -4 -38 23 33 -11 12 9 -12
4568 -12 27 -1 -16 42 -5 -45 32 27 -41 -10 30 -16 -25 11 -11 -1 0 -36 7 28 -39 -19 33 -27 -41 48 6 -46 12 12 -19 13
4600 13 -3 -2 37 -19 -39 49 16 -50 30 48 -39 -18 40 -2 -14 5 -17 5 13 -27 8 33 -39 -18 49 -4 -42 41 25 -32 3
4631 3 14 -22 6 -10 -23 44 -5 -46 25 24 -55 1 41 -25 -20 33 -11 -9 12 -14 18 28 -32 -1 58 -42 -45 45 8 -40 30 10
4663 10 -35 10 9 -10 23 -4 -9 51 3 -51 40 44 -35 0 40 -16 -22 15 -9 -3 4 -26 -2 25 -35 -22 48 -20 -49 43 19 -41 23
4696B3jl2K3j1rL8l2k8P3k9p5Q0K9r2L5N2n8mL1l1K3Rk9L2L0p1NP6o6l4Q0j9n0
4729c2L6lj9K0j4j3N7l3m2O9jp9N1M7p9J9M9m1qL4k4J4J1l2RM4o1oO3l0m8Q2p
4762C3n8K1Pj0L5k7k7N8j6o1P3J1q9L8M9n8OL5k4j0K0l2K9L1o9J7O0o2j7P1k8
4793Fl5M8km3L5lk0M0k8l0N9jp5N5L2o7J6N2n5%M2l4PL4p1L2M8o2KO8m4m5P4j2
4827B3o2N7pl2M5l2k6N9k2l7N4Pp1L9N3q2K6L2l3oL0j9PK4n6J9N8o5j4O8l3m3
4859c9O4j2l4L0Rk8K3km0N8k0o3P1J7p1K6M7m4ML0l5JK6m1J0M5n2PM5l4l0N9j8
4892Im7O0rl9M9j7k7M6j0m4M2J3o0L9L6p1L3M1p2K6L1m7J2L8n2PM8n8kM6l0l0
4924c9O2k2l3N7ml7L3kn8N3ln5N9K6p0L9K4o0K5M3n0LM4l7JK5m0rO2m2j0N3l0
$$ plain form
4696 23 22 -10 13 2 -7 31 -1 -29 44 15 -60 20 49 -43 -8 44 -14 -18 13 -18 5 14 -15 17 47 -24 -19 57 -9 -43 37 18 -32
4729 -32 4 1 -18 2 -12 -25 32 -1 -43 26 25 -54 -3 44 -35 -16 33 -8 -16 18 -6 8 19 -13 -4 40 -21 -27 36 6 -42 40 33
4762 33 -25 -4 3 -7 28 1 -26 32 16 -45 28 39 -50 -12 37 -21 -15 20 -4 -14 6 -26 3 34 -35 -18 42 -20 -37 34 6
4793 6 -29 19 17 -26 9 6 -14 26 -2 -32 27 26 -49 6 38 -29 -13 39 -16 -16 26 -8 -1 33 -38 -6 42 -20 -18 50 6 -39 35 23
4827 23 -39 18 11 -21 24 -8 -34 25 3 -34 20 27 -44 -5 48 -34 -8 24 -9 -15 15 -4 3 27 -29 -10 48 -17 -31 37 4 -39
4859 -39 25 13 -21 9 18 -10 13 11 -29 29 9 -54 17 34 -37 -11 36 -8 -4 26 -9 -8 18 -23 -13 32 -20 -13 32 -2 -32 27 9
4892 9 -38 22 13 -26 23 6 -21 25 15 -29 13 26 -34 5 41 -30 3 44 -28 -2 29 -18 -6 32 -20 -13 35 -23 -25 21 -9 -39
4924 -39 23 1 -32 25 21 -16 17 15 -43 10 7 -48 11 37 -33 6 30 -30 -5 38 -12 -9 35 -2 -1 24 -16 -25 37 -5 -15 38 8
4957Hl5O5k2m5N4rm2M5j7l7M5Pm6L2L8p5L7L2n6K7K4n0j2N4k6rN0n5OL7j8k8M9
4990B8j0l4N1l1k5N9k1n6N8J1n3L1Pm2K8L1n1J6L2m7K0M8p4%N2l9rN3l4k4M3j9
5022ak9N9k4l3N4k1l6M5Nn4M7J6n8L1J9m2K1K9l9J3K4n6K4L7n2oO6l8k5M7k4j7
5054a8L9j2j8L2k7k5N4j7l8L6K9o6K1L6l8QJ0k4K4Rl5PM1n8J2N7n4j3N8k6l9M4
5086Irj4K4j8k0N2j9l9M1J4m3L3K7n8K5L1m9J5J8k8K5Mm5K4M0o2KM4k0l9N9j1
5118A3k4K9j5j7L1j6l3O8k3p0P5J2n5K2L6n6K3K3l8RK6l4J7L2o9K3N8n8k3O9k6
5149Il6M7jk6K2j3j9L7k8j8M8j2n3N5K2o6K2N0m6OJ0k6K2J1l2K1L1o5JQ0n8l0
5181c5N4j0l4K6Mk0L0k0k4O2l0l5P5qp3L5M4o2JN0k3rJ1k6K2J4m8K8K9n6JO6m0
$$ plain form
4957 8 -27 38 16 -29 25 16 -26 19 2 -35 10 17 -29 3 41 -34 3 35 -21 6 30 -20 -32 22 -4 -13 37 -18 -12 25 7 -21 28
4990 28 18 -16 35 4 -21 38 17 -39 19 30 -23 8 15 -27 1 32 -19 -3 29 -18 2 50 -24 -24 28 -11 -20 33 -1 -25 18 -1
5022 -1 -30 29 5 -28 26 5 -31 14 19 -35 12 28 -30 1 20 -22 -1 28 -11 2 26 -30 -6 31 -21 -27 39 1 -24 23 -1 -18
5054 -18 21 9 -9 23 -4 -29 25 8 -30 6 35 -31 -10 26 -12 -4 6 -18 6 15 -20 -13 28 -30 -18 39 -15 -28 30 4 -35 9
5086 9 0 -14 10 -8 -28 24 5 -34 7 21 -22 11 38 -20 5 36 -13 2 20 -8 17 21 -24 0 40 -22 -20 24 4 -35 24 13
5118 13 -11 18 3 -14 17 1 -32 36 13 -57 18 30 -25 -3 33 -23 0 23 -15 -6 20 -14 3 35 -34 -11 47 -11 -34 35 9
5149 9 -27 20 19 -7 15 2 -17 20 -8 -26 22 10 -43 12 34 -32 -10 40 -6 0 10 -16 6 17 -15 6 37 -28 -27 53 -5 -35
5181 -35 19 9 -25 1 5 -15 15 -5 -29 33 3 -32 43 35 -38 -3 41 -21 -20 30 7 -2 9 -17 5 19 -29 -1 28 -28 -27 39 -1
5214am9P5ll8K5nqK6k2k7N9k1n4N5J4o1L0L6m5pL7j5LPm0L5K5o0K3O1n7k6P0k5
5248A7m8M6%l7L5mk3L9k8l0N8oo5N9L6p7K1L8k9j1K7l1K4Mm2K0M4n2oN7l7l6N8
5281B1mm7L1J8k4Rj4OM4l5l8O5Po4K9L0m9mM9l7KJ6rJ4Nn0K3M7n1k8P3l7l5O1
5315B4j3l4K1Nj4K4j7jL0po1O5J6p0K4M8n5rM4k9MJ4j7J3L0o4J4N8l7l5N9qn4
5348c2M3Rm1K5j4JK2j3k8N0j1m7M2K7n6J6K8l6%K5k0J8Mm1K9K1m4LN9m4l9O7k1
5381Bl7L8J1k7J6j0lL6k2k7N5Jo6L9L5n7OL3k3JLoK1No2L8M2n6pN5m1k4M7rk9
5416b2J9OpJ4pk6N1j9m8N7K1o6K4L8n4LL5l0QJ5k4K7J2m5kN8k6l7O7j8n6M6J2
5449B6m4L4pl0K8j5j6N4mo9N7K2n8J2L7l7KK4k6NJ3l0J6L4m8JN9m5k1M5qk8K4
$$ plain form
5214 -1 -50 25 22 -16 9 4 -4 22 0 -27 32 11 -43 12 26 -35 -5 31 -14 -21 16 1 4 11 -29 6 31 -29 -6 55 -2 -28 42 17
5248 17 -31 15 15 -22 13 9 -14 25 -3 -33 25 19 -46 13 49 -28 -7 31 2 -9 18 -13 11 15 -27 -7 37 -15 -21 36 -1 -37 21
5281 21 17 -30 1 19 -5 4 -10 -4 40 5 -33 32 39 -25 4 34 -15 -19 30 -7 -5 11 2 16 21 -29 -6 41 -10 -38 35 -2 -37 24
5315 24 11 -23 -2 3 -11 13 -4 -5 25 18 -43 22 38 -32 -8 40 -15 -24 20 -9 -5 9 -8 5 35 -29 -15 43 6 -29 30 22 -32
5348 -32 11 20 -21 4 -10 -9 13 0 -28 22 11 -36 6 33 -23 -7 21 -15 -15 10 -10 8 12 -29 0 21 -23 -20 39 -5 -44 23 2
5381 2 -35 3 14 -13 3 -7 -10 26 4 -23 32 33 -33 6 41 -16 -10 23 0 1 4 -2 19 24 -38 0 42 -14 -21 34 -7 -31 16 7 -22
5416 -22 -3 3 -4 10 3 -23 28 9 -39 18 39 -27 -3 35 -19 -16 19 -11 -3 12 -12 15 27 -18 -20 38 12 -25 42 24 -32 14 26
5449 26 -18 16 9 -21 7 -8 -24 30 26 -43 14 36 -22 -10 27 -10 -8 16 -10 -5 8 -22 -6 28 -20 -19 40 -5 -26 19 11 -17 7
5482GOl6M4rk1K5j4k6L6J4n0L1L5n0nL8l5J2K3k8pL1l5QL4m5j0O5l8l1M8ml2J8
5516anmK9j3k7L3Lm7N2Pn0K1K4m1J4RmmK7l9J3L2m1j0M6l9j2M3j3l6M7%l4L0m
5551Fj1K1oj9K2Mm5L0K4m7J2L3l6KL7l6jL0k4oL1k7j4M3j3l1M0j6k6L2jk4L6j5
5585Ek6K5J6m3K0K6m4K0L2n1J2K1k0JK8l5lL9l2oL5k8j8L3Ml6L6qk8M0Kl6L1o
5619Fk5J7J9n1L4K3m0PK2l4L0K0l8qM0k2j3L8j9j6L0j5k2M7j7k3L1k4j1L4pl5
5651b2L3J6m7K3J2m1K5K1l8RL4l5kK4l5J1L2k9oL2j6j1L0j5j9M2k1k6L1mk8L4
5683A4kl5L1J4l8K5Rm2L1J7l3RK7l7lL4k3j7L9j6k3K5j1j1L2k8lK7j3k0M2j0l3
5716b2L6Qm7J6L5l0lJ5k1RLk6K6L5m9J2K6l1rM8j9l3L5j1j2J7j3%K9k1m0N1ml7
$$ plain form
5482 7 13 -23 21 12 -9 16 2 -24 12 26 -24 7 42 -8 -13 25 -10 2 25 -3 -10 21 -14 -6 28 -17 -27 38 0 -31 17 13 -19 -1
5516 -1 -6 -10 19 6 -21 12 15 -32 20 27 -23 -2 22 -19 -5 4 0 -4 23 -16 -3 29 -12 -22 24 -15 -27 16 3 -33 14 14 -20 10 6
5551 6 -5 16 10 -9 13 17 -28 2 26 -21 -9 24 -12 -10 27 -9 -10 20 -4 -10 21 -6 -20 23 10 -21 19 3 -23 9 8 -16 20 5
5585 5 -21 4 20 -23 -3 23 -21 -1 31 -20 -8 13 -7 -6 22 -13 -16 23 -9 -15 20 -8 -26 7 11 -25 11 3 -25 15 17 -19 12 6
5619 6 -19 -2 17 -34 0 23 -17 -10 12 -22 8 28 -10 -18 22 0 -13 25 6 -10 20 5 -17 30 13 -10 21 -3 -14 20 13 -22
5651 -22 11 27 -20 3 15 -26 -1 20 -18 -9 25 -10 -12 12 -23 -12 20 -9 -15 17 1 -10 20 5 -14 28 7 -19 12 8 -20 14
5683 14 12 -23 8 22 -16 9 18 -24 7 24 -9 0 27 -10 -13 21 -2 -19 20 4 -19 6 -5 -16 16 -12 -15 12 -1 -21 21 11 -22
5716 -22 14 22 -25 -9 26 -4 -7 8 -13 -4 -1 -27 -1 34 -15 -3 23 -8 -17 31 12 -21 14 3 -9 8 -5 -5 24 3 -37 14 10 -27
5750b7L2J1m6K5J6k9PJ6j5J2K3m5K2K4m3OM5j7l5L6j2k0K9j3j2L2k5j4M8k0l2
5781b1M6jn0K2K7l6MK6k3J0J1k2J6J6n0J6M7m5j9N9k5l6M5pj1Ok3PL4l2j1L9j0
$$ plain form
5750 -27 5 16 -30 -5 11 -18 -11 5 -10 2 25 -20 2 26 -17 -11 34 17 -18 18 6 -14 15 2 -10 22 -3 -17 31 11 -21
5781 -21 25 24 -26 -4 23 -13 -9 17 -6 4 15 -7 9 25 -25 -9 38 -7 -26 33 8 -28 17 10 -1 5 -18 -11 23 -9 -20 19 9
$$ [...]
8190A8r
8191I
##END NTUPLES=NMR FID
##END=
