##TITLE=1H_Ser 2062-NEA
 CDCl3
 8 sc, 
 8.2.2024
##JCAMPDX= 6.0         $$ Bruker NMR JCAMP-DX V2.0
##DATA TYPE= NMR FID
##DATA CLASS= NTUPLES
##ORIGIN= UXNMR, Bruker Analytische Messtechnik GmbH
##OWNER= root
$$ XWIN-NMR		Version 3.5
$$ Thu Feb  8 14:50:40 2024 Russian Standard Time (UT+4h)  she@DPX200
##.OBSERVE FREQUENCY= 200.1313
##.OBSERVE NUCLEUS= ^1H
##.DELAY= (6, 6)
##.ACQUISITION MODE= SIMULTANEOUS
##.ACQUISITION SCHEME= undefined
##.AVERAGES= 8
##.DIGITISER RES= 18
##SPECTROMETER/DATA SYSTEM= spect
##.PULSE SEQUENCE= zg30
##.SOLVENT NAME= CDCl3
##.SHIFT REFERENCE= (INTERNAL, CDCl3, 0, 15.7039)
##AUDIT TRAIL= $$ (NUMBER, WHEN, WHO, WHERE, WHAT)
$$ ##TITLE= Audit trail, XWIN-NMR		Version 3.5
$$ ##JCAMPDX= 5.01
$$ ##ORIGIN= Bruker BioSpin GmbH
$$ ##OWNER= she
$$ F:/spectra/data/she/nmr/H-F/1/audita.txt
$$ ##AUDIT TRAIL=  $$ (NUMBER, WHEN, WHO, WHERE, WHAT)
(   1,<2024-02-08 14:49:25.92 +0400>,<she>,<DPX200>,
      <created by zg, POWCHK disabled, PULCHK disabled
       configuration hash MD5:
       00 E9 B6 7A A2 85 ED C7 34 08 36 98 17 FE 4E 26
       data hash MD5: 16K
       00 BB DA 00 E5 78 E0 F1 72 52 F1 E0 3C 55 68 6F>)
$$ ##END=
$$ 
$$ hash MD5
$$ BC C2 76 CA 33 9B C0 B5 B5 F8 01 A8 94 61 D1 1C
##$RELAX= 
##$RELAX= 
##$RELAX= 
##$RELAX= 
##$RELAX= 
##$RELAX= 
$$ Bruker specific parameters
$$ --------------------------
##$DU= <F:/spectra>
##$EXPNO= 1
##$NAME= <H-F>
##$PROCNO= 1
##$TYPE= <nmr>
##$USER= <she>
##$AMP= (0..31)
100 100 100 100 100 100 100 100 100 100 100 100 100 100 100 100 100 100 
100 100 100 100 100 100 100 100 100 100 100 100 100 100 
##$AQSEQ= 0
##$AQ_mod= 1
##$AUNM= <au_zg>
##$AUTOPOS= <>
##$BF1= 200.13
##$BF2= 200.13
##$BF3= 200.13
##$BF4= 200.13
##$BF5= 200.13
##$BF6= 200.13
##$BF7= 200.13
##$BF8= 200.13
##$BYTORDA= 1
##$CFDGTYP= 0
##$CFRGTYP= 5
##$CHEMSTR= <none>
##$CNST= (0..31)
1 1 145 1 1 1 1 1 1 1 1 1 1 1 1 1 1 1 1 1 1 1 1 1 1 1 1 1 1 1 1 1 
##$CPDPRG= <>
##$CPDPRG1= <>
##$CPDPRG2= <>
##$CPDPRG3= <>
##$CPDPRG4= <mlev>
##$CPDPRG5= <mlev>
##$CPDPRG6= <mlev>
##$CPDPRG7= <mlev>
##$CPDPRG8= <mlev>
##$CPDPRGB= <>
##$CPDPRGT= <>
##$D= (0..31)
0 1.2 0 0 0 0 0 0 0 0.06 0 0.03 0 0 0 0 0.0002 0 0 0 0 0 0 0 0 0 0 0 0 
0 0 0 
##$DATE= 1707389365
##$DBL= (0..7)
120 120 120 120 120 120 120 120 
##$DBP= (0..7)
150 150 150 150 150 150 150 150 
##$DBP07= 0
##$DBPNAM0= <>
##$DBPNAM1= <>
##$DBPNAM2= <>
##$DBPNAM3= <>
##$DBPNAM4= <>
##$DBPNAM5= <>
##$DBPNAM6= <>
##$DBPNAM7= <>
##$DBPOAL= (0..7)
0.5 0.5 0.5 0.5 0.5 0.5 0.5 0.5 
##$DBPOFFS= (0..7)
0 0 0 0 0 0 0 0 
##$DE= 6
##$DECBNUC= <off>
##$DECIM= 32
##$DECNUC= <off>
##$DECSTAT= 4
##$DIGMOD= 1
##$DIGTYP= 9
##$DL= (0..7)
0 120 120 120 120 120 120 120 
##$DP= (0..7)
150 150 150 150 150 150 150 150 
##$DP07= 0
##$DPNAME0= <>
##$DPNAME1= <>
##$DPNAME2= <>
##$DPNAME3= <>
##$DPNAME4= <>
##$DPNAME5= <>
##$DPNAME6= <>
##$DPNAME7= <>
##$DPOAL= (0..7)
0.5 0.5 0.5 0.5 0.5 0.5 0.5 0.5 
##$DPOFFS= (0..7)
0 0 0 0 0 0 0 0 
##$DQDMODE= 0
##$DR= 18
##$DS= 0
##$DSLIST= <SSSSSSSSSSSSSSS>
$$ [...]
##$SUBNAM2= <"">
##$SUBNAM3= <"">
##$SUBNAM4= <"">
##$SUBNAM5= <"">
##$SUBNAM6= <"">
##$SUBNAM7= <"">
##$SUBNAM8= <"">
##$SUBNAM9= <"">
##$SW= 18.0517328524113
##$SWIBOX= (0..15)
0 0 2 0 0 0 0 0 0 0 0 0 0 0 0 0 
##$SW_h= 3612.71676300578
##$TD= 16384
##$TD0= 1
##$TE= 0
##$TE2= 300
##$TE3= 300
##$TEG= 300
##$TL= (0..7)
0 120 120 120 120 120 120 120 
##$TP= (0..7)
150 150 150 150 150 150 150 150 
##$TP07= 0
##$TPNAME0= <>
##$TPNAME1= <>
##$TPNAME2= <>
##$TPNAME3= <>
##$TPNAME4= <>
##$TPNAME5= <>
##$TPNAME6= <>
##$TPNAME7= <>
##$TPOAL= (0..7)
0.5 0.5 0.5 0.5 0.5 0.5 0.5 0.5 
##$TPOFFS= (0..7)
0 0 0 0 0 0 0 0 
##$TUNHIN= 0
##$TUNHOUT= 0
##$TUNXOUT= 0
##$USERA1= <user>
##$USERA2= <user>
##$USERA3= <user>
##$USERA4= <user>
##$USERA5= <user>
##$V9= 5
##$VALIST= <valist>
##$VCLIST= <CCCCCCCCCCCCCCC>
##$VD= 0
##$VDLIST= <DDDDDDDDDDDDDDD>
##$VPLIST= <PPPPPPPPPPPPPPP>
##$VTLIST= <TTTTTTTTTTTTTTT>
##$WBST= 1024
##$WBSW= 4
##$XGAIN= (0..3)
0 0 0 0 
##$XL= 0
##$YL= 0
##$YMAX_a= 58142
##$YMIN_a= -79255
##$ZGOPTNS= <>
##$ZL1= 120
##$ZL2= 120
##$ZL3= 120
##$ZL4= 120
##$ABSF1= 10
##$ABSF2= 0
##$ABSG= 5
##$ABSL= 3
##$ALPHA= 0
##$AQORDER= 0
##$ASSFAC= 0
##$ASSFACI= 0
##$ASSFACX= 0
##$ASSWID= 0
##$AUNMP= <proc_1d>
##$AZFE= 0.1
##$AZFW= 0.1
##$BCFW= 1
##$BC_mod= 2
##$BYTORDP= 1
##$COROFFS= 0
##$CY= 11.3945322036743
##$DATMOD= 1
##$DC= 2
##$DFILT= <>
##$DTYPP= 0
##$F1P= 15.7292609196834
##$F2P= 12.9074282941183
##$FCOR= 0.5
##$FTSIZE= 0
##$FT_mod= 4
##$GAMMA= 1
##$GB= 0.15
##$INTBC= 1
##$INTSCL= 1
##$ISEN= 128
##$LB= 0.24
##$LEV0= 0
##$LPBIN= 0
##$MAXI= 10000
##$MC2= 0
##$MEAN= 0
##$ME_mod= 0
##$MI= 1.114404
##$NCOEF= 0
##$NC_proc= 0
##$NLEV= 6
##$NOISF1= 3.799351
##$NOISF2= 2.8
##$NSP= 1
##$NTH_PI= 0
##$NZP= 0
##$OFFSET= 15.70392
##$PC= 1
##$PHC0= -24596.95
##$PHC1= 17.05268
##$PH_mod= 1
##$PKNL= yes
##$PPARMOD= 0
##$PSCAL= 0
##$PSIGN= 0
##$REVERSE= no
##$SF= 200.130013532006
##$SI= 16384
##$SIGF1= 3
##$SIGF2= 2
##$SINO= 400
##$SIOLD= 16384
##$SREGLST= <1H.CDCl3>
##$SSB= 0
##$STSI= 0
##$STSR= 0
##$SW_p= 3612.71676300578
##$SYMM= 0
##$S_DEV= 0
##$TDeff= 0
##$TDoff= 0
##$TI= <>
##$TILT= no
##$TM1= 0
##$TM2= 0
##$TOPLEV= 0
##$USERP1= <user>
##$USERP2= <user>
##$USERP3= <user>
##$USERP4= <user>
##$USERP5= <user>
##$WDW= 1
##$XDIM= 8192
##$YMAX_p= 0
##$YMIN_p= 0
$$ End of Bruker specific parameters
$$ ---------------------------------
##NTUPLES= NMR FID
##VAR_NAME=  TIME,          FID/REAL,        FID/IMAG
##SYMBOL=    X,             R,               I
##VAR_TYPE=  INDEPENDENT,   DEPENDENT,       DEPENDENT
##VAR_FORM=  AFFN,          ASDF,            ASDF
##VAR_DIM=   8192,          8192,            8192
##UNITS=     SECONDS,       ARBITRARY UNITS, ARBITRARY UNITS
##FACTOR=    0.0002768,     1,               1
##FIRST=     0,             0,               0
##LAST=      2.2672688,     0,               0
##MIN=       0,             -79255,          0
##MAX=       2.2672688,     58142,           0
$$ Real data points
##PAGE= N=1
##DATA TABLE= (X++(R..R)), XYDATA
$$ [...]
2645g18R77p68Q43n74N70r93r3O27K52N15j025O38K51p10p21R93m16J55L07J75
2665B85m71l0J978k305n14M52n57J343j358J935j158R2o15L13J098j540J137J062
2683A147j370O19k7j319R89k63l39N00N85r16J06J180j685J006m26P2j8N52n69
2702a76Ql05Q66l10m40P98R1l84k95R92q60j1m99K53O6j007M36K4J355m25k65
2723h8k60o72J958n65J45L63m65l68j20M84J01p50P52j513O70k97P14m13J150
2742H26j233L33j9l57J324o39L23j420R25q96R62n13L96r85J697r28J84J064n78
2761D66l26J015k84N72j886K91km43K83O79l10L72p50P75n72N46m44P6o57J135
2781E36p07J044N32k041M38O6M14n95N67n99P60p49M32K77j64O32j271%K32N2
$$ plain form
2645 -718 259 -509 334 -240 330 -663 -756 -129 123 638 -387 251 502 -208 -929 64 -352 -197 110 285
2665 285 -186 -216 1762 -543 -1057 -605 -1162 181 -1177 758 -400 -308 -923 -610 488 -1052 85 1147
2683 1147 -223 396 369 -950 39 -224 -563 -63 522 -394 -288 892 -793 213 -213 -141 -159 393 -176
2702 -176 -168 -473 393 83 -357 441 532 148 -147 845 -15 -26 -525 -272 -206 -1213 -777 -753 602 177 -88
2723 -88 -348 -1020 938 373 518 881 416 48 -72 412 513 -237 515 -998 -328 -625 89 -324 826
2742 826 -407 -74 -93 -450 874 235 558 -862 63 -833 129 -384 12 -973 724 -204 -20 1044 466
2761 466 140 1155 871 1443 -443 -152 -154 -597 -314 365 55 427 -323 452 -120 426 -18 58 -599 536
2781 536 -171 873 1405 -636 -198 -132 282 -313 254 -345 415 -334 98 375 211 843 -428 -428 -196 -144
2801a44q0l96J292j082O49J18q66L65j75J42O19k55j36M62l52K87m00l83P76m80
2821c9M2j03L76l41l28P67l24n4n40P68l18K90j83j74j22M60k42qJ18k65P20q92
2843c92k51L63K36N66q47N06k74l5K78l18j47N31Q5n81P16j95m62M18k42J3L40
2864C08n52O05k79J4L52j14J0m54J86o0j76n5K75M55r56R06m52J6J84j45j21J85
2886A32jL36m75l08j2O6L61M95p22K01o3j3Oj86oL7P82p38j23P74j491R88J91
2909B31p30M2O67k93M46m37L59j09m18R83o43N87L78j479J144J19j144J025j142
2928d14n28P76J080j115P18r34M79K46j146J418p07P05m49n98Q56J20l07K64q64
2947d00P86j082J235l87n5m80O90l84O06j59l33R0n01P09o54j26L64O3L6o2j48
$$ plain form
2801 -144 -224 -620 672 -410 239 357 -509 -144 -319 -177 442 187 51 513 161 448 48 -335 441 -39
2821 -39 3 -100 276 -65 -393 374 50 -4 -544 224 -94 196 13 -161 -283 177 -65 -73 45 -220 500 -392
2843 -392 -643 -280 -44 522 -325 181 -93 -128 150 -168 -315 216 301 -280 436 241 -221 197 -45 -32 308
2864 308 -244 361 82 96 448 334 344 -110 76 16 -160 -215 60 515 -441 465 13 29 213 68 -53 132
2886 132 131 467 -8 -316 -328 -262 99 594 -128 73 10 -3 3 -183 -189 -152 630 -108 -231 543 -948 40 231
2909 231 -499 -457 210 -83 363 -74 285 176 -242 741 98 685 1063 -416 728 847 -297 728 -414
2928 -414 -942 -166 914 -201 517 -417 62 308 -838 580 -127 578 129 -469 387 507 200 464 -400
2947 -400 386 -696 539 152 97 -383 307 -77 529 370 37 127 -374 335 -319 -445 -81 -18 18 -44 -192
2968a92Q38k99p69r7R46n2q2L70l10m76J21J94o84J235j379L09R94l99mN40k58
2989E46l59m37R3P15n92L4K20J5k42M22k11n96O28n65R7J872k155j01J59J204
3009G47j513O90R12r25K80P81k57k74k12kj696K014N26j865L84q9L11L28k49P77
3029F68j146P70J81j95K95j81p16L50j089P83J120j386P73M31l87o55P56J77j46
3048D03j47K64m19M29j024Q42q12Q25K5k31m97n92R12o40j74J749j077l1l49Q2
3068d62P72nO73q77J8k51Q77j562J129N07r60j17l19K55N0J271n55J85j089J095
3088F35m8o85N80L37j33l62n83M60L76j083k29p41J923l56j405J569m72J558q16
3107E25j549L82P36n09R19n73M47o36L60K50K96l7n65N81n07R12r59q39J502o32
$$ plain form
2968 -192 646 347 -422 -519 427 375 293 663 353 -123 -2 192 -492 743 -636 -327 667 268 264 804 546
2989 546 187 -250 -157 558 -34 0 220 235 -7 415 204 -392 236 -329 -232 1640 -515 -616 -457 747
3009 747 -766 -76 836 -89 191 972 715 441 229 227 -1469 545 1071 -794 -410 -499 -188 140 -109 668
3029 668 -478 292 473 278 573 392 -324 26 -1063 -280 840 -546 227 658 271 -384 372 549 403
3048 403 256 520 101 530 -494 348 -464 361 386 155 -342 -934 -22 -662 -836 913 -164 -195 -544 -462
3068 -462 310 305 978 101 119 -132 745 -817 312 819 -141 -258 -577 -322 -272 999 444 629 -460 635
3088 635 587 -98 482 819 686 324 -259 201 577 -506 -735 -1476 447 91 -1314 255 -217 1341 525
3107 525 -1024 -642 94 -415 504 -69 378 -258 102 352 648 611 46 627 120 1032 73 -766 736 104
3127A04K26J90o13l7M2L87k49j17K52k84k99M62P20j004m57Q54k34J88l90M59
3147B00p81P46j33R0K95q03N24M88n80m76O14k27N29o86L58m2R4q22J067q79L30
3168i4qJ5l07O60j07R1j735J398l69n70J559n49L14K36l97M20l49J88j166P83
3188A3M82o56n72n74O20O41l48l38Q10k8l62M92k63M80m45N94k59L59k13P96j593
3209c64K51k6J07Q5M86m26l64N1j69Q81m69J04J4k94J419j172j45P86j634P09
3229a70m25N96M06q11O7n15j55M79K49K18j20M39J82j080M29M75j097J093O06
3248H66j363Q65j40L01l52k7m70P26n6j72j05R69j702J338L47j714Q72l0j27Q12
3268H38j101Q98r80M15o64J08p43p58J605L1k08J024P12j346l47M52M71k10N26
$$ plain form
3127 104 330 520 -93 -130 -88 299 50 -67 185 -99 -398 64 784 -220 -677 177 -57 131 -259 200
3147 200 -581 165 32 122 417 -386 138 626 46 -430 184 -43 486 -200 158 116 210 -612 455 -424 -94
3168 -94 -102 -87 -394 266 159 250 -1485 -87 -456 -1026 533 -16 298 534 137 557 208 396 -770 13
3188 13 495 -161 -733 -1307 -687 -46 -394 -732 78 50 -312 180 -83 397 -48 546 287 646 433 1229 -364
3209 -364 -113 -139 -32 53 539 113 -251 -200 -369 512 43 147 161 -133 1286 114 -31 755 -879 -170
3229 -170 -595 1 407 -404 -337 -852 -1007 -528 -279 -61 -181 258 440 -640 -211 264 -833 260 866
3248 866 -497 368 228 529 177 150 -320 406 350 178 73 1042 -660 678 1025 -689 183 153 26 838
3268 838 -263 635 -345 70 -594 -486 -1229 -1987 -382 -351 -559 465 1177 -169 -516 -64 407 197 723
3287G23j188J42k00J325j829R87r50J422q01K90K13Q0J06N6o76J387j338M10j330
3306a171Q23P16r25l05P19k74J69K34j729K645l43N14q50j46N6J80M88J90j137
3325a46j22n08P71N6R6m97L30J04lk87N23k59l4k20M8n13J011Q8l79m33O59m51
3347a66Q70n00m30M11j703J538l95P64K54j503J776n48j451J213q79J382q74k81
3365e22P14o13q4J296p53p9L12q31O21k34P99j831J103J14n0q16R82J105j186
3384D7R23l57J69j106J166r05k79N92j167P53j094J955m80q51K02R9o4k61J6J637
3404I95j262p56R97j73n77k60J417j350J162O34j121m32L86J308O43q14j22l25
3422C50o99o54P28L82k335M18J136n80K050j155M45k70K66r50J827m12q99J724
$$ plain form
3287 723 -465 -323 -523 802 -1027 -40 -990 432 -369 -79 134 214 320 376 -300 1087 -251 159 -1171
3306 -1171 -348 368 -557 -862 -143 -417 -248 -14 -1743 902 559 1073 223 77 133 313 801 991 -146
3325 -146 -268 -776 -5 51 147 -350 -20 84 81 -206 317 58 24 -196 -148 -661 350 438 59 -374 285 -166
3347 -166 704 204 -226 185 -1518 20 -375 389 643 -860 916 368 -1083 130 -749 633 -241 -522
3365 -522 192 -421 -505 791 38 -41 271 -560 61 -173 626 -1205 -102 12 -38 -854 128 1233 47
3384 47 970 613 782 -324 842 -63 -342 250 -917 -164 -1258 697 217 -634 -432 -333 -397 -658 -642 995
3404 995 -267 -1023 -26 -199 -776 -1036 381 -969 193 827 -294 -726 -340 968 1611 797 675 350
3422 350 -349 -1003 -275 107 -2228 -1810 -674 -1254 796 -359 86 -184 82 -868 959 547 -352 1372
3440A372j933M25K98j82m31L5k43K90O31j057N28O11o71O53k60q37k53J896P5
3459I47r91l69K07R32j063L69K98J36r5lo85o1K7R39K69q18N9j35M99k5n23n37
3481f23L27K24J207j744K08L83K35j50o45J433j580J089J09j002R61q51J057j36
3499E02O44l44j317K015m29j359K71o16M82K63n7l22r2Q71j265P65K86o26K57
3518g1l48j5J094q79J94K34O8k64j62L57J88k63K8m79R41j68p23j11N91o0%l04
3540a52M44m29RL70j29j31o6j58j88P64q12o64J227K8L52p47j68M33J85K93p0
3561C91l27J95j38m33K8j43J411j612N49J76l8J37j47q2k7p2K17n66L60K43M8
3582A70o6j13Q2m46M82k71J75K03j61k71P02j184M73Q62o01J66m40k07M28j75
$$ plain form
3440 1372 -561 -136 162 -20 -451 -416 -659 -369 262 -795 -267 344 -327 326 66 -771 -1024 872 947
3459 947 -44 -413 -206 726 -337 32 330 466 371 368 -317 -378 -351 588 857 39 98 -37 462 437 -86 -623
3481 -623 -296 -72 1135 -609 -401 -18 217 67 -578 855 -725 364 473 -529 432 -419 638 502
3499 502 1146 802 -515 1500 1071 -288 -17 -633 -151 112 55 -267 -359 512 -753 12 298 -328 -71
3518 -71 -419 -434 660 -219 -25 209 277 13 -149 208 396 133 161 -318 623 455 -268 -379 212 152 152 -152
3540 -152 292 -137 -128 242 113 -18 -84 -242 -430 334 -478 -1142 85 113 465 -282 -450 -17 168 461 391
3561 391 64 259 121 -312 -284 -427 984 -628 -79 97 59 196 49 -33 -60 -132 85 -481 -121 122 170
3582 170 104 -9 73 -373 109 -162 13 216 55 -216 486 -698 -225 637 36 202 -238 -445 -17 -192
3602a92L43m65N37p0m24L34K94o58J85j77L24J42J83n12K19l28j0L86m05J11j25
3623c08L03J79l09J24J94j75k68P2M30n33L93j52nQ2K23k94R7J97j11r1R5k3n21
3646d01N46k95O0J27l34K00K81l49N07p20P46o29K14R8K96k89j89K41r2j09L15
3667B24j47j31m17O48j49J17n07j72K73K56M54l30m02L37j76N21k39k81J06L52
3687C37l94N89n57K16K22L02J82q00K62M01k79p28O19m26M58j273J066o16L53
3706f6j63J27o9L37k48K25j18K54k65NK20j13j16M9J16k70K07J54k72j81L29n47
3728d05L77O8l58M47j32K36n67J77J70k5J58j52k23K37j71Q0K07j35L6k00K23
3749D8q3K43O1k42L6J60l14L57k79K34l22q5J72OM7j93J02q4Q6n1J0J48k52L26
$$ plain form
3602 -192 151 -314 223 153 -271 63 357 -301 -116 -293 31 173 356 -156 63 -265 -275 111 -294 -183 -308
3623 -308 -5 174 -135 -11 183 8 -260 -188 242 -291 102 -50 -55 27 250 -44 53 250 139 48 143 120 -401
3646 -401 145 -150 -90 37 -297 -97 184 -165 342 -378 368 -261 -47 51 347 58 -131 110 18 -91 224
3667 224 77 -54 -471 177 28 145 -362 -534 -261 -5 449 119 -283 54 -122 399 160 -121 -15 337
3687 337 -57 532 -25 191 413 715 897 97 359 760 481 -247 372 -54 404 -869 197 -419 -66
3706 -66 -229 -102 -171 166 -82 143 25 279 14 19 239 126 10 59 175 -95 112 266 -6 -187 142 -405
3728 -405 -28 40 -318 129 -3 233 -334 -157 13 -12 146 -6 -229 8 -163 -83 124 -11 25 -175 48
3749 48 -35 208 269 27 63 223 -91 266 -13 221 -101 -186 -14 -8 39 -154 -52 -136 -50 -101 -91 57 -195 131
3773A31k9PK3RRj30K41o27R8J21K19l28k24M57K5O72n29m43L85o09J272j592M66
3796c76J98L83n4r87J297j52M1K25j35q51k29J243o41n49J63L67m06L46j04M50
3816B29r05J148Q1p00l34M64q3J65K7j03N5J20p93N97q4Q88j379Q47o80P54n61
3837b47o05O71M10K63m19%l93M67LO35j003J357o49L41r95J19l57M92J52Q46r89
3858I9l72P24j9p77n63J064P1j77j65K37m06L09k19L81M43p03k63j86P44L1o35
3879c82J33J016O82j470j11o9K32J64K29n61R9M91l96Q17m76o72Q73r84K97K49
3899A61J73J68o60P95j240P09P0M20l88j7l22m75%O48l80j94N07m06P43j87Q1
3920B06l36l87J008r93j52O92O19P7j208L21L43n16j51kK43J28l86N66l75M98
$$ plain form
3773 131 102 109 132 141 150 20 261 -366 -268 -147 72 -256 -480 -23 2 674 145 -298 87 -522 750 -842 -376
3796 -376 -178 205 151 -836 461 309 350 575 440 -411 -640 603 -38 -587 -424 -57 -463 -117 -221 229
3816 229 -676 472 553 -147 -481 -17 -100 65 92 -11 44 164 -629 -32 -116 772 -607 240 -440 314 -247
3837 -247 -852 -181 229 492 73 73 -320 147 150 785 -218 1139 490 831 -164 -45 -402 90 242 1088 99
3858 99 -273 451 432 -345 -908 156 227 50 -115 122 -284 25 -194 187 630 -73 -336 -522 222 253 -382
3879 -382 -249 767 1449 -21 -132 -201 31 195 424 -137 -38 453 57 874 398 -274 599 -385 -88 161
3899 161 334 502 -158 637 -603 106 176 596 208 191 -131 -606 -606 42 -338 -532 -25 -431 312 125 206
3920 206 -130 -517 491 -502 -654 38 657 734 -474 -153 190 -326 -477 -479 -236 -108 -494 72 -303 195
3940A95K96J97j094M96J31l01n4M3L98p78J114q91j11M12m81O72J07m43j94J18
3960a68L70N79o92Oj36m84L23O1Q01p84J189j111K59J95p12O47O13n93r1R6l38
3981C0k18K07L85p65M62n48M87m62P51j03k82J02k49L2K45nJ24M93m79L1J47n92
4003b07M95l7k43J26k70m45M26O7k88P97k54k29L07l9m73K08N33O60j306o4N41
4024C05n46J114l21k02n04k67L40N1M40r1k87J70j21K60j01l30M1mM18P93j410
4045b52o32J634J16o18R80j317j71L25K48p05N17L48j140J987j387J75j31o54
4063f77J427j132J64R27j225R47m57P49k91q67L46j70K13n70L62k15j7K38l96
4082f44k94K082j084r2j97q1l30J072m09j57J323l1k048J546k494P76J175M04
$$ plain form
3940 195 491 688 -406 90 221 -80 -134 -91 307 -471 643 -248 -359 53 -428 244 351 -92 -286 -168
3960 -168 202 781 89 95 -41 -525 -202 -141 660 -124 1065 -46 213 408 -304 343 956 363 272 368 30
3981 30 -188 19 404 -361 101 -447 40 -422 329 226 -56 46 -203 -171 74 69 193 686 207 238 385 -207
4003 -207 288 251 8 134 -136 -581 -155 -88 -376 421 167 -62 245 206 -267 -59 474 1134 -172 -236 305
4024 305 -241 873 552 350 -154 -421 -81 -30 410 319 32 202 81 341 240 -90 -49 -53 365 1158 -252
4045 -252 -884 750 866 248 1228 -89 -260 65 313 -392 125 473 -667 1320 -67 108 -23 -677
4063 -677 750 -382 -218 709 -516 431 -26 723 432 -435 -89 -259 -46 -616 -254 -469 -486 -248 -644
4082 -644 -938 1144 60 -32 -229 -310 -640 432 23 -134 1189 1158 -890 656 -1838 -1062 113 517
4100E17j471K006l40n93l0J50K12j015n3k74J158O75j793J186o0r70J230k61J27
4119D01m39J9P72q31L45j33o6Q22m94n29n45N35J4J15j61J10o89J31O79m57R59
4140E58r72N87n50M37o28L48J308j276K23M79p66J09l26M8J35R94r81K78J23l53
4160b25K26J5k61P4J18J80N9M78j087K53n4J472j396N01l80j4L30o52L22N94k89
4181B64k30n7J22J36l37L86m55L73P80j32l29k34j057K24L79P17n88p7Q10j422
4201g27K13L80O42n98K44O4%l10m01K80o62J031l99J206j052J02J74k24j7q49
4221i03Q74K31K15r2J1M77r76n40M06L52O57p93L88M5J54q33L29J182m3r58n11
4242c28J217j132K24l1n89O75J50q76J521q82j31M27m44o0k63N58J03k91L66M49
$$ plain form
4100 517 -954 1052 712 119 89 239 451 -564 -617 -891 267 942 -851 335 275 -695 535 274 401
4119 401 -38 -19 753 -78 267 134 68 890 396 -133 -678 -143 -129 -14 -175 -65 -754 -623 56 -401 558
4140 558 -414 173 -377 60 -568 -220 1088 -188 35 514 -252 -143 -469 -421 -286 708 -273 5 128 -225
4160 -225 1 16 -245 -171 -53 127 186 664 -423 -170 -224 1248 -148 353 -27 -41 289 -363 -41 553 264
4181 264 34 -23 99 235 -102 284 -171 202 982 850 521 287 -770 -546 -167 550 -38 -115 695 -727
4201 -727 -514 -134 508 -90 154 218 218 -92 -493 -213 -875 156 -243 963 -89 13 187 -37 -54 -903
4221 -903 -29 202 417 325 336 813 -163 -703 -297 55 712 -81 307 352 506 -327 2 1184 1141 183 -328
4242 -328 889 -243 -19 -50 -639 36 186 -690 831 -51 -182 245 -199 -259 -522 36 139 -152 214 663
4262F63j07N24j281N72J80q84J37M20l93J70N5N26J86j383M23k51P15o51J79q8
4282b88k72O16p80J264l00J97L14o60P82k08K07N8p35j045M19LR48L94j673P79
4302B0K75o24k4M94j42n40L20P52l32L1P91j034j81L64j60m17M33L83o19k20K95
4323a35M16N20l37m70K03n80J401q74m35J77m06J126n80j21L5k07L86n51l21L50
4343d03M67l38j43M68J30q1J63L52n18l58m41N54k2N23n4J60r58M75K38k79P4
4364Il9J81n62k71J464Jj087O70L34n00j38K73j82q9O48k75l79j26O9L28k43j90
4386a04K55j648K236o15L11m73M47j637M77O28L53R44j070P88j076J27P5p06k55
4405i43Q62R95j672P24L14k95K08p67p58J012J251m16K25l83o57J8K84J88k69
$$ plain form
4262 663 556 1080 -201 371 551 -333 -196 224 -169 1 56 582 768 -615 -192 -443 272 -379 -200 -288
4282 -288 -560 56 -724 540 240 437 751 91 873 665 872 930 195 -850 -431 -428 520 914 -759 20
4302 20 295 -329 -353 141 -1 -541 -221 531 199 230 1021 -13 -194 170 10 -407 26 409 -210 -430 -135
4323 -135 281 801 464 -6 197 -383 1018 144 -291 -114 -520 606 26 -95 -60 -267 119 -432 -753 -403
4343 -403 64 -274 -417 51 181 100 263 615 97 -261 -702 -148 -170 353 299 459 -499 -24 214 -65 9
4364 9 -30 151 -411 -682 782 783 -304 366 700 200 62 335 153 64 712 437 58 -68 1 329 86 -104
4386 -104 151 -1497 739 124 435 -38 409 -1228 -751 -123 230 1174 104 892 -184 -57 18 -688 -943
4405 -943 -81 914 -758 -34 280 -15 193 -574 -1332 -320 931 515 740 357 -300 -282 2 190 -79
4424g9J23K55K41M1n14j5k55N51n29N54J308j299l67P52j475J539j060M56P31
4443I58j6j012K81o46o75J264l24J71n85J051n14k32K87J69o76J221p38r1N64
4462D57k39Q44q24j098L02M94K27oL81m52l88l85J043l50j75O26j013J410p59
4481I5j47m31O56l70j44Q74j167R91o50L56L13j095M34o3m9P45N34j083N23o77
4501c55N93L06k48M09k49m37J202j766P66j50Q04j448J406n42p51j062J881r35
4519e76j29J104n87j44n72J718p99N74j582J384n84j11Q30j141l02J030k70L35
4537A78n08j000P77j20Q92k94q64O12L58J024m96J30j204J554m52j333J121O18
4555I93j571N92K43j074k42J285n5K7j94K21J12J212k178K18O40j530K113n12
$$ plain form
4424 -79 44 299 540 581 67 52 -203 348 -181 373 1681 382 15 767 -708 831 -229 227 958
4443 958 942 -70 211 -435 -1110 154 -170 1 -584 467 -47 -279 8 177 -499 722 -16 -107 457
4462 457 218 1062 238 -860 -558 -64 163 157 538 86 -302 -687 356 6 -169 457 -556 854 95
4481 95 -52 -483 173 -197 -341 533 -634 357 -293 63 376 -719 -285 -348 -397 348 882 -201 322 -355
4501 -355 238 544 296 705 456 19 1221 -545 221 71 875 -573 833 291 -460 -1522 359 -576
4519 -576 -705 399 -188 -332 -904 814 15 589 -993 391 -193 -304 526 -615 -917 113 -157 178
4537 178 -330 -1330 -553 -673 219 -75 -939 -327 31 1055 559 689 -515 1039 587 -746 375 993
4555 993 -578 14 257 -817 -1059 226 171 198 4 225 337 1549 -629 -411 229 -1301 812 300
4573C00j264L41m55j273O56J862J46N34lj250K17L20O76j075Q41j323R71p95J326
4592G52p47j099L07n7N70j52O76j133J555l16o68J396j492R04k89R8K04q10R4
4611b07K58N51j481M11L40K46P01l22l25o4j25L82p37L91R8M1l20O02j89p59J249
4632G41r04N50j426J219P16j388J015j026P37L86k63j229R24n57L74k82k43M66
4650a90P13m40P1m23N5j54n76J630l7O78j349j156J714m72q77R59l69j97m19J344
4670E05j172L24l46O43N43L65p38N86j11r19P22m05L30J048j71o49m93O30j11
4689E81j14j05J00j156R70l2P67r12p66R33j015J924j701J539k728K166J48o11
4707a2N39l90K68J88p09m2J007m18j25j330J277m74L87l0n54J24Q29q69q43J190
$$ plain form
4573 300 -964 -623 -1078 -2351 -1695 167 313 847 844 -406 -189 131 807 -268 573 -750 221 -574 752
4592 752 5 -1094 -787 -844 -274 -426 250 -883 672 356 -312 1084 -408 496 207 305 509 -301 -207
4611 -207 51 602 -879 -468 -128 118 819 497 172 108 -17 365 -372 19 117 158 -162 440 251 -508 741
4632 741 -163 387 -1039 180 896 -492 523 -503 234 620 357 -872 52 -505 -131 -413 -656 -190
4650 -190 523 83 154 -269 -214 -368 -944 686 649 1327 -22 -1178 536 64 -813 146 -223 -420 -839 505
4670 505 -667 -343 -689 -46 497 862 124 710 599 -320 402 -3 327 1375 1204 555 62 692 581
4689 581 467 362 462 -694 276 244 1011 99 -667 266 -749 1175 -526 1013 -1715 451 599 -12
4707 -12 527 137 405 593 -116 -158 849 431 306 -1024 253 -221 166 136 -418 -294 535 -334 -1177 13
4727A3p2q86J831j113j39O18r72K50Q07r07J468p9j264J75J6J7N86M37P9q55k36
4748b26Nl43R50m25o09M98M86q30R47n02o22N84R9m30L94J95K32l38n43L62p77
4769h93R60l5n97O96j6n08Q06j28m60K52j56k17M31j25o6j64N47m61J10p7nm0
4791a46L5j75M61k38L5r9k36J48M94M26j511L11O67N5J62R0l77p89N20P32n70
4812en36M52k27K18q43J202l15P32j706J407K59n58l9j01N51j058N36K68j17L11
4832D31N75j406j05J248j049K16K37J7j41m95m64R25j0K03J74n29L10O31q62O78
4852E84p05L00K1K17j050M41n8L39L57n25o0ML05k12L2p4R4k5m64P94j92J70m96
4875b03k6L02J68k87j84L85k74j97l64M12j62M34m90M27R5p70R26j65Q7m38P32
$$ plain form
4727 13 -59 -945 886 -227 -366 252 -720 -470 337 -570 898 819 -445 -270 -254 -237 349 786 865 10 -226
4748 -226 -221 -564 386 -39 -648 -150 336 -494 453 -49 -671 -87 12 -418 -24 171 403 65 -478 -116 -893
4769 -893 67 32 -565 131 115 -393 413 285 -175 77 -79 -296 135 10 -56 -220 327 -134 -24 -101 -106 -146
4791 -146 -111 -286 175 -63 -28 -127 -363 -215 279 705 -806 -495 172 227 389 479 102 -687 -167 565 -5
4812 -5 -541 -89 -316 -98 -941 261 -54 678 -1028 379 638 80 41 -60 491 -567 -31 237 120 431
4832 431 1006 -400 -505 743 -306 -90 147 164 23 -472 -936 -11 -21 182 356 -173 137 768 -94 584
4852 584 -121 179 200 417 -633 -192 -250 89 446 -79 -139 -135 170 -42 -10 -84 10 -15 -479 315 123 293 -203
4875 -203 -229 73 241 -46 -230 155 -119 -316 -680 -268 -430 4 -486 -59 36 -734 192 27 114 -324 408
4896D08l81l9m23j66L96n54m54J656j040R93n03O14K97j437j74R91o7l15J155
4915I57r31m94P75k48L38J61m49j41M11n39M77J21q94J58O0m43O04K50p8m79P86
4936D02k60m83N06N65j525R73N1n03l62Q10m24N48k82L62j165J112J167j449L98
4955D41m94M11m35P0K01L6o35J405o19p88j62K6M29J112p49n49N77M93j057l10
4975e97O84k53N23o58j74J04J335r54K57P4l78m8M04j76O57j051RL56k09k81m0
4996d16k6J29M29l60p75J566j560J098K1q37O93j81N37L80j113P30O59r99K22
5015A97J44o23O41p29J17l96O40j39P8j12L83j080J053j17J18R4m19N21o19J632
5035A384k586M97R42j93P8K35m67j31j74K46Q3p52J040p65K02J307j270N21J38
$$ plain form
4896 408 27 -12 -435 -601 -205 -759 -1213 443 -597 396 -107 507 804 -633 -807 184 117 -198 957
4915 957 26 -468 307 59 397 558 109 -32 379 -160 317 438 -456 -298 -238 -681 -77 173 95 -384 402
4936 402 142 -341 165 730 -795 178 229 -274 -636 174 -250 298 16 378 -787 325 1492 43 441
4955 441 -53 358 -77 -7 194 230 -405 1000 381 -407 -569 -543 -114 998 249 -300 277 770 -287 -597
4975 -597 87 -166 357 -301 -475 -371 964 10 267 341 -37 -85 319 143 800 -251 -242 114 -95 -376 -416
4996 -416 -442 -313 116 -244 -1019 547 -1013 85 106 -731 -38 -219 318 698 -415 315 974 -25 197
5015 197 341 -282 359 -370 -253 -649 -9 -148 -70 -182 201 -879 174 57 175 269 -150 371 -248 1384
5035 1384 -1202 -705 237 44 122 357 -110 -241 -415 -169 -86 -838 202 -563 -361 946 -324 197 335
5054C35k92j1K7m42K49K38n04K27k92L26J63J48l51m97N70J15j9l37M37P9n09
5075c40O05l85l39K04K33K16l55k60N45p09O15k20M09L01o76O3L92j68M1m63N44
5096B53M07l58p6K30q90J223j37q96L14k91J76L7k31Q72r53M54n0q37J243l98
5116I2j14l22O07K78m39L27j40l17k05K56l14N07m62o0N15r4k65J20q0q8l0N28
5138C00k78J12J40K09r4o80M12o33L98N43n48K24j49j62rp7L79l52K82J62l47
5159a68j81K93n53J422o23O0l99J67M00j294N82O51j36m69M91p05P41j25j96K
5179d0l0K80j44m16K15L32p18M82l89O49m81N94q75N46m10J020J01n94k46k50
5199c74R08q24K19k96O93m16O46r72Q39p4j194l1O82k11M14j056J672n64P3p8
$$ plain form
5054 335 43 32 59 -383 -134 104 -400 -173 -465 -139 24 172 -179 -676 -106 9 -10 -347 90 169 -340
5075 -340 265 -120 -459 -255 -22 194 -161 -421 124 -585 30 -190 219 520 -156 -93 299 131 172 -291 253
5096 253 660 302 226 456 -434 789 652 -244 70 -221 -45 -8 -239 633 -320 134 84 -753 490 92
5116 92 -22 -344 263 541 102 429 289 -28 -233 23 -291 216 -246 -306 209 115 -150 -30 -110 -198 -228 300
5138 300 22 134 274 483 389 -291 121 -512 -114 429 -119 105 -44 -206 -215 -292 87 -265 17 179 -168
5159 -168 -349 -56 -609 813 190 250 -149 18 418 -876 -294 357 221 -248 243 -462 279 154 -42 -40
5179 -40 -70 210 66 -350 -135 197 -521 -39 -428 221 -260 334 -541 5 -405 615 716 122 -124 -374
5199 -374 534 -290 -71 -367 326 -90 556 -416 423 349 -845 -876 -194 -405 9 -1047 625 61 134 56
5219E6O55r73N96n28P64o99r98L10J096L01j404N85P0r61J195J72o88K11J36j02
5239b06j72J131j1k76j482J922p17O51k47N80j284O14q26P62P3j190O68K60q05
5258e55Q84j17J146K18j56J69j242L71j57n64j48Q10j28M01q41n71p70J844M34
5277A028k074J245L08q55O84L59K35m17m70o2P56l04O6P38j738L68n12M51p9k34
5297e07R51m79L93j429J225k8l2j32P50q10k51O24n36L76n19J114j83m92n01N90
5317A24O5k14l22M66k26K4n95J162lk39k9J8k27j76K33L57r22M49K45k85J41J04
5339A50r3J03k83P1J68M35o67M5j70J15J41l73M26k82J27k22K41j04O57k97j88
5360@n40L60N16r12J054p58O38K36m15k60J84j49O17n02m50p76J396M31j258j11
$$ plain form
5219 56 711 -262 334 -194 570 -129 -1127 -817 279 580 -824 -239 -169 -1130 65 237 -451 -240 -104 -206
5239 -206 -378 753 742 466 -1016 906 189 840 593 1173 -111 503 -323 439 512 -678 -10 250 -555
5258 -555 329 212 1358 1576 1420 1589 347 718 561 -3 -151 659 531 932 91 -480 -1250 594 1028
5277 1028 -1046 199 507 -348 336 695 930 513 43 -19 737 433 499 1237 -501 -133 -645 -194 -273 -507
5297 -507 444 -35 358 -1071 154 126 94 -38 712 -98 -349 275 -261 115 -404 710 527 35 -466 124
5317 124 189 -25 -347 119 -107 -83 -678 484 481 242 213 231 4 -172 61 418 -504 -55 190 -95 46 150
5339 150 57 160 -123 -52 116 551 -116 -71 -241 -126 15 -358 68 -214 -87 -309 -68 -172 485 188 0
5360 0 -540 -180 336 -576 478 -280 358 594 179 -81 103 -46 571 69 -381 -1157 239 670 -588 -699
5380f99R04J97j079P17k13K52J84m99p47J407o43JM41Ml65o9Q4k48J87P22j434
5401h96L43Q06l4p95m99J951n6j390P43K22j239J063J85p14J011k82p94J02L35
5420F2K64o63m06L45K17P41q39K54l04M26J66n04R81n23l83J87l35J1o05k04J300
5441A88q22K71M84K72k14p28K34K83j79N62p77R60m73Q10p55K74M61j144o94J036
5461D9P0n23N78k92l03n36J481j105M25M39K03O34j082M25k18r01P10L09k44O07
5481G26j364N51L6k31r52J379L96k58N45j118J659j265j18J004p09l80J23j430
5499a406l95J415O18j10j10l28J13O25R7m93p20j76K787k419O89R11m91k69Q83
5518A221r16j377J65P21Q41j409L73J40J99p11qL92j14q81R51N25j623K274l84
$$ plain form
5380 -699 205 402 -677 40 -173 79 263 -236 -983 424 -219 -218 223 227 -138 -207 -123 -371 -184 538 -896
5401 -896 -553 253 219 -576 -1075 876 820 -570 173 395 -844 219 404 -310 701 419 -375 -273 62
5420 62 326 -337 -743 -398 -181 560 -279 -25 -329 97 263 -241 740 217 -166 21 -314 -303 -908 -1112 188
5441 188 -634 -363 121 393 179 -549 -315 -32 -211 351 -426 534 61 871 116 390 851 -293 -987 49
5461 49 119 -404 174 -118 -421 -957 524 -581 -156 283 486 1120 38 463 245 -656 54 363 119 726
5481 726 -638 -87 -51 -282 -1234 145 541 283 828 -290 1369 104 -14 990 281 -99 24 -1406
5499 -1406 -1801 -386 232 122 12 -316 -203 422 519 26 -694 -870 1917 -502 187 1098 607 338 1221
5518 1221 305 -1072 -907 -186 655 -754 -381 -241 -42 -753 -761 -369 -483 -1364 -413 112 -1511 763 379
5537C79o47J84M14J099j793J309j486K45M36o42Q95p56m1O95j125L75l34J502
5555G09q36N44j025P07M55j497L29J205j233M63L96R7j31o74N91J102j217k79
5573b94J092K4n51M62n78j326J414qq39M81On33J226j280N10P09k96L78j146L9
5593e10j49O62p16Q70k26O0K98o04P32K21j070K0P06k8O04j122M78j53K45k31
5613H7j26k0o0qM93l45J49m70J171k54k51l96N49j64k44l84J363m55j259J489
5633H65j149J099q53J34K5J00m86n49k08J046r7n55J357q44M46n53JJ9P37K95
5653H30o31K32j001L96j8N27n50P25p07K58K52j031L73Q87j39j78k31K1p9J25
5673F1l87O29r39J385r06l3J21M4rN7m12O1O44j16q74L05N15k04j96M51J35m20
$$ plain form
5537 379 -268 -84 330 1429 -364 945 -541 -296 140 -502 393 -363 -404 291 -834 -459 -793 709
5555 709 -127 417 -608 99 554 -943 -614 591 -642 -179 217 314 183 -491 100 1202 -15 -294
5573 -294 798 822 271 733 155 -1171 243 235 -604 -123 -117 -650 576 -704 -194 515 219 597 -549 -510
5593 -510 -659 3 -713 157 -69 -9 289 -315 417 638 -432 -412 294 266 870 -252 226 73 318 87
5613 87 -39 -59 -119 -127 366 21 170 -300 871 617 366 -30 519 355 111 -273 1090 635 -624 865
5633 865 -284 815 -38 96 121 221 -265 -814 -1022 24 -73 -628 729 -115 331 -222 -221 -202 535 830
5653 830 199 431 -570 -174 -192 335 -215 510 -197 61 313 -718 -345 542 403 225 -6 15 -64 61
5673 61 -326 303 -636 749 -157 -190 -69 -25 -34 23 -389 -328 316 200 -674 -369 146 -58 -254 197 332 -88
5695h8m9L8k58j56R08j26k81K48o53J82K12K20k09j06j02M07M7k83L3o82M05J031
5717G38o42j58P47j070J59K10K96J03q54K33L21j20K20o12P86o73N44o08k4R9
5737c05M95q94O8P66L15n86n10R86j114L14K36N1M25j2j25o40P18M03p22p6j39
5758c46M86M06n0j130P48K02R12j350q3J32N69p91Q05J114j527J55N9J53j45n84
5778b65m1Q39k43O94p94l55q50J027R2l59l60J383p99m8j91K18k36N96j62N43
5798F89P08j006j19l03J05k42k21J656j51q09L45N32l87r94M07R90j410J179j295
5817c26L24o8J36m63J162l28J25j292J501p99j533J533J32k46M5M49L86j022L92
5836A08l76j01j5L05N41j82j86K99j467K095j380K123j132j083J527m7j081K74
$$ plain form
5695 -88 -137 -99 -357 -513 395 269 -12 236 -417 -235 -23 197 -12 -118 -220 187 234 -49 -16 -698 -293 738
5717 738 96 -62 685 -385 -226 -16 280 383 -471 -238 83 -37 183 -429 357 -316 228 -380 -404 -305
5737 -305 190 -704 -636 130 445 -141 -651 335 -779 -465 -229 -178 247 235 110 -530 188 591 -131 -207 -346
5758 -346 140 546 496 -634 114 316 1228 -122 -205 -73 496 -295 510 1624 97 252 311 464 319 -265
5778 -265 -306 533 290 984 190 -165 -1015 12 104 -255 -615 768 -31 -79 -270 -52 -288 308 146 689
5798 689 1397 391 272 -31 74 -168 -389 1267 1116 307 652 1184 797 -197 210 1200 -210 969 -326
5817 -326 -2 -70 66 -397 765 437 562 -730 771 -28 -1561 -28 104 -142 -97 352 738 -284 108
5836 108 -268 -369 -384 -79 462 280 94 393 -1074 1021 -359 1764 632 -451 1076 1029 -52 222
5854B22l72Q1Q92k245J565q2j378J418r32J135r46J486J60j599N18J316l80m68
5872C91M01l51j679Q3O48M66N42K4o52m98J531p72m15J13k41p7R03m47j289J594
5892B75q82Q80o57J58J025o90m66n74R21k22Q27o64j303J209n16J472%J96k38
5911G51k20q10k4l29O53M62N18r68L65m93p32q08J068J923q82K62k04k08P8j92
5931B10J97M12j400Q14l27Q32q82P51k21r7j051n67J806j612J681j9l8o86q76
5950a073M62n12K010l71j848J060l2K31N66j080P50L85k73j89p20J43k04N77j95
5969c13R5N72j78L38M03j524N30j39r78J406q11Lk75R83K73o32J660j64j849L16
5989b84n39J336m33J693o79k712K328l74p44J541k225J342k66N99K10k89M7o30
$$ plain form
5854 222 -150 -69 823 -1422 143 61 -1317 101 -831 304 -642 844 1004 -595 -77 1239 859 391
5872 391 792 441 -1238 -1155 -507 -41 501 525 -127 -625 906 134 -281 -168 -409 -486 417 -30 -1319 275
5892 275 -607 273 -384 -226 799 109 -357 -931 -10 -232 595 -69 -1372 -163 -679 793 793 989 751
5911 751 531 -279 -303 -632 21 483 1001 33 398 -95 -827 -1635 -567 1356 474 736 532 324 402 210
5931 210 407 819 -581 233 -94 738 -144 607 386 289 -762 -1329 477 -1135 546 527 489 -197 -1073
5950 -1073 -611 -1123 887 516 -1332 -272 -304 -73 493 -587 163 548 275 86 -634 -491 -695 -118 -313
5969 -313 -218 354 176 514 917 -607 -77 -216 -1194 212 -599 -596 -871 112 385 -247 1413 1249 -600 -284
5989 -284 -823 513 80 1773 1094 -1618 710 336 -408 1133 -1092 250 -16 583 793 504 551 -79
6007g9J000j345j15j19K455r03K12j717L25M13J86J392k092K39q9J416j453N14
6025B40N91j8q96Q12o94k240J972j163K436j18j000m86N50J75o48N16j413K896
6043A512j107l95P18j463J105Q33n74J37j108n89J014r33R67O03j513M59P34j373
6061i73J076j689P50J146Q22J034l115J495q10N02M01J43j092O26j603O76l16
6078i27J000N87j356M69M12K91n63j1q8K19Q5n12J495k17n70n85J450p41L13q50
6098i9N51M06r62O95J88j022j39M36J3K84n01O35j338J905j092m72J614r40L22
6117D84RK6p38P27p22L43r46O96p9m36m18J262l25Q89oK19k065Q4K041j209L59
6138A95m13P19j72l89l08M43k90K79M65k38m17mN84o96N57j215j83J525M78j173
$$ plain form
6007 -79 921 -424 -539 -658 1797 894 1106 -611 -286 127 313 1705 -387 -148 -237 1179 -274 240
6025 240 831 813 -83 729 35 -2205 -233 -1396 1040 922 -78 -564 -14 161 -487 29 -1384 1512
6043 1512 405 10 728 -735 370 1203 629 766 -342 -931 83 -850 117 720 -793 -334 400 -973
6061 -973 103 -1586 -836 310 1132 2166 -949 546 -264 238 639 782 -310 316 -1287 -611 -927
6078 -927 73 660 -696 -227 185 476 -87 -98 -186 33 118 -394 1101 884 314 -271 1179 438 751 -99
6098 -99 452 858 -104 591 779 -243 -382 54 67 351 -150 485 -853 1052 -40 -512 1102 162 484
6117 484 493 519 -219 508 -214 129 -817 -121 -200 -636 -1054 208 -117 772 766 985 -1080 -996 1045 -164 195
6138 195 -218 501 329 -60 -368 75 -215 64 529 291 -126 -130 454 -242 315 -900 -1083 442 920 -253
6158b53j070J572q0R87l84L32j328n26j95R62l7k09k8J582p90p3K99r94R57j33
6178E91j783J345p19J6N26M70j092O81J563j898Q36n1O9j125L77J371r20j013
6196g56J331n37N96n62r28R94P8n59J358p41j080M50R21n84O09j76J57q95o49
6215i73P29O18j712R00J134o38k28j65N07J83o61o3j24L56J69q56R49M10j468
6234i33J493k67p37m74j55J93P48P36j51k50o93P75p1p97P74L1L58q06L28l77
6254b75k2Q80k21j89M97j046M36K13J59l62L44J8k37L7k65j51K72j052K80J211
6274E27q80N36n86q6J174r14R34j63r88J271j717P31R1K8J384j027n38Q84J021
6293A682j914R72j705Q67n13J249p97J51L54p88J300o47N86j055j35J090m12j185
$$ plain form
6158 -253 -1323 249 169 1156 772 1104 -224 -750 -945 17 -20 -229 -257 1325 535 462 761 -233 724 591
6178 591 -1192 153 -566 -550 -24 446 -646 35 1598 -300 536 485 554 -571 -194 1177 257 -756
6196 -756 575 38 634 72 -856 138 216 -343 1015 274 -806 -356 565 -19 590 414 571 -324 -973
6215 -973 -244 374 -1338 -438 696 58 -170 -335 172 355 -306 -369 -493 -137 32 -824 125 535 -933
6234 -933 560 293 -444 -918 -1073 -880 -132 604 453 203 -490 285 214 -583 191 222 580 -226 102 -275
6254 -275 -297 583 362 173 670 -376 60 273 432 70 414 432 195 232 -33 -184 88 -964 -684 527
6274 527 -353 183 -403 -489 685 -229 705 542 -446 825 -892 -161 -70 -42 1342 315 -223 661 1682
6293 1682 -232 740 -965 -98 -611 638 -159 -8 346 -442 858 211 797 -258 -393 697 285 -900
6311i00J866L53j292J589j935O80n67Q35o48P93l25n58k22Q06K30o02j828Q52
6329h73P57p47J43J26J397n32N63k176J031K93M29j471K113j569o06J498j352
6346i76Q13p09J239L12k489J513L22j130N60p72N04J572j260P73K68r18J41L15
6364G8Q18k480J543j360J486J445j970O27k75o27N64K15P63l82K18j237M64k9
6382a39N10j141N33j28J76k28J66m98M80j96K69N28j159J344K07j359P55K08m23
6401i5J55J16O9K05j190Q73j115J164M9J38l33r27O87L25j86n65j65R96j7j037
6421h53Q64N39l64j255J477P48j278j049J629l53k58O51n60j38N46l12L46n79
6439a99N8K75L6l96J213r51q06J146Q99r88p39P86j50L62r76J660j249O19M07
$$ plain form
6311 -900 966 1319 27 1616 -319 361 -206 629 -19 774 449 -109 -331 475 705 103 -1725 -873
6329 -873 -116 -863 -720 -594 803 271 834 -1342 -311 -18 411 -1060 1053 -516 -1122 376 -976
6346 -976 -163 -872 367 679 -1810 -297 25 -1105 -545 -1317 -813 759 -501 272 540 -378 -237 78
6364 78 896 -1584 -41 -1401 85 1530 -440 187 -88 -715 -151 64 827 445 663 -574 -110 -139
6382 -139 371 -770 -237 -365 -189 -417 -251 -749 -269 -465 -196 332 -827 517 724 -635 120 328 -95
6401 -95 60 176 245 450 -740 133 -982 182 231 369 36 -891 -204 121 -65 -630 -795 201 184 -853
6421 -853 11 550 186 -1069 408 1156 -122 -1171 458 105 -153 498 -62 -200 346 34 380 -199
6439 -199 -141 134 170 -226 987 36 -770 376 1275 287 -452 334 184 546 -430 1230 -19 600 1007
6458A007j645n6J453n59J61j251J115O19r15Q11J00r33q46J461r13J006m50p21
6476e56R30j189O42L2R31k05j557J975j245j345J708K77l74J222j989R96O13j539
6494f73J396o11m26j59K56M90n27M51l08L50q70P02j73J16L99K07k470J322R61
6513D33p57J19j58K95Q62q79R27j959J447r15K80O90j407J807o99k09n86J375
6531F66j71l0l21r6q33P40K45p50R0l07J062l94K79j24m56l5L58K82l9J007q8
6552A085p90r34O17o6r80K042j313P3N98M29j480N89K94q65J189j16r45J12J093
6571F32j782J620K23j854R05L24K81J06m75J030o20j77m38q92J071o29J201k86
6589B40J076j004K49r41j71J63P53J03q62L0L26l7p71M95J79M55L08j722J537
$$ plain form
6458 1007 -638 -694 759 200 361 -890 225 844 -71 740 840 -93 -939 522 -391 615 165 -556
6476 -556 374 -815 -173 -141 790 585 -972 1003 -242 -1587 121 398 24 1246 -743 253 866 -673
6494 -673 723 112 -314 -473 -217 273 -254 197 -111 239 -631 71 -102 14 413 620 -1850 -528 433
6513 433 -324 -205 -363 -68 794 -85 842 -1117 330 -585 -305 385 -1022 785 86 -123 -709 666
6531 666 495 465 144 48 -785 -45 200 -550 -460 -767 295 -99 180 56 -400 -435 -77 205 166 1173 1085
6552 1085 295 -639 -22 -88 -1068 974 -339 -266 332 761 -719 -130 164 -701 488 372 -573 -461 632
6571 632 -1150 470 693 -1161 -256 68 349 455 -20 1010 390 213 -225 -1117 -46 -675 526 240
6589 240 1316 312 561 -380 -551 -388 365 468 -394 -364 -38 -75 -846 -351 -172 283 591 -1131 406
6608D06Q95j120J268n50l96m97Pr37J376l68l89K35j46N86j26O09j686Q23Q10
6627H00q69R43j053J84J082j227r46J765q96m71M01r1P70j68j070P93j8j53O7
6646a57J67J49j41l48L2M73J66N49j075q7m65O34K08j62R20K56m12j312L06R34
6666F35K50p82K32J63p45m91P87n52J218M23j774P02p8l04n7P3q04K041j5j593
6686f71J233n83p12M7K76J010l40J289j033p94p1K30p2m62J151o93j31L47q18
6705g97O70L74J78k1L52N0l50o95K54J10r67J29J585j425N03j119J376j21l77
6724b91K022j982O48o54m4j66Q14j301J003P97j718J67J343j042L95Q40l29k82
6742B20R1r19J106q59N88J64j426j66O30L50R80j064K30l69j95J16Q69J014m19
$$ plain form
6608 406 1301 181 1449 899 503 6 13 -924 452 84 -305 -70 -216 370 244 853 -833 -10 800
6627 800 -69 874 -179 5 1087 -140 -1086 679 -217 -688 -287 -378 392 224 -846 -53 -71 -224 -157
6646 -157 10 159 18 -330 -298 175 341 890 -185 -272 -737 -103 105 -57 863 1119 707 -605 -299 635
6666 635 885 103 335 498 -247 -738 49 -503 715 1138 -636 66 -12 -316 -373 -300 -1104 937 922 -671
6686 -671 562 -21 -733 -686 -410 600 260 1549 516 -278 -349 -119 -191 -653 498 -195 -326 21 -797
6705 -797 -127 247 425 404 756 806 456 -239 15 125 -842 -713 872 -553 -50 -1169 207 86 -291
6724 -291 1731 -251 397 -257 -301 -467 347 -954 49 846 -872 -705 638 -404 -9 831 502 220
6742 220 311 -608 498 -361 227 391 -1035 -1201 -571 -221 759 -305 -75 -444 -639 -523 346 1360 941
6761I41j687Q94l12L8O65n11L65j278P44l41K94J453r15m46J009j02r12Q8n93
6780f06R44P27j949J840J622m678K997j84p61o88J629j438m03J814j907J203j016
6797h54J936p96P3j726O39N40M24L16Q64j892K086j244Q84j201k31j471N09L849
6815B705k010n18o14Q19O20j801N75o9o29L57P23J758j276J374k398P10J267j236
6833C57r16J7J141J80k60K05j286J130p56J72Q00k093K731j833P76n79O6r7L54
6852A09p7O7Q84o38j02J27L7Q33j376q7N59o40J39J112j669R02q66m22m22J429
6872a01K00N28l83j094j24J730K58p71P9K46P9m64j051K224j529L95m76p55R35
6891g4o87j102J865P58L58m39k09L19K80q55j771J823j11j12M12j98j151J126
$$ plain form
6761 941 -746 148 -164 -126 539 28 393 -885 -141 -482 -188 1265 350 -96 913 811 -101 -13 -606
6780 -606 338 1065 -884 956 2578 -2100 897 713 -48 -736 893 -545 -948 866 -1041 162 -854
6797 -854 1082 286 359 -1367 -728 -188 236 552 1416 -476 1610 366 1250 49 -182 -1653 -1144 2705
6815 2705 695 177 -437 382 1002 -799 -224 -293 -922 -565 158 1916 640 2014 -384 326 1593 357
6833 357 -559 -542 599 779 519 724 -562 568 -188 -16 784 -1309 1422 -411 365 -214 -148 -245 109
6852 109 32 99 983 345 243 370 407 1240 -136 -223 336 -304 -165 947 -722 180 -686 -1108 -1530 -101
6872 -101 99 627 244 -850 -974 756 1014 243 322 568 647 183 -868 1356 -173 222 -254 -1009 -74
6891 -74 -761 -1863 2 760 1118 679 470 789 1069 214 -1557 266 155 43 455 257 -894 232
6909B32J72J97o20l16M49o12J125l33M46j361L76Q7O83j54m96J34J71Q94o28r4
6929C52p6P93KN5j913q4O01N39Q75r74o1j3J681j476p53j14M39j315J199o4p05
6950a012J477j93K30j281J309L06r52K44L34j120J095q13K97n70J447j261J70
6967b93l1J95L46L29j339J642j385J95K93P89j95j053J419j306J78j4J03l11P83
6986C45J88j880J968j126R63j420R44j11R15q52M72K6r49J256j735O27l62N31
7004b00R83o68N63j91N91q51o7o66o4J71L03N85K63o30J98K89L56m76j317J458
7024F30j445m8j72R95l68J28q48J406j750J294n80k83J526o57J15q10J393j729
7042a203J122J59J147j598j41o6R70j065M57L11J05o05J009j00n78o18J460j602
$$ plain form
6909 232 404 601 -19 -335 114 -498 627 294 740 -621 -245 -158 525 371 -125 9 180 1074 446 352
6929 352 276 1069 1071 1126 -787 -871 -270 269 1144 170 109 96 1777 301 -452 -566 -127 -1442 -243 -307 -1012
6950 -1012 465 272 502 -779 530 836 -116 128 462 -658 437 -376 -79 -649 798 -463 -293
6967 -293 -324 -129 217 546 -793 849 -536 -341 -48 741 546 -507 912 -394 -216 -230 -127 -438 345
6986 345 533 -1347 621 -505 458 -962 -18 -129 786 -66 406 432 -517 739 -996 -369 -731 -200
7004 -200 783 115 678 487 1078 227 160 -506 -570 -399 -96 489 752 122 320 609 965 489 -828 630
7024 630 -815 -863 -1035 -40 -408 -280 -1128 278 -1472 -178 -758 -1041 485 -172 -57 -867 526 -1203
7042 -1203 -81 78 1225 -373 -514 -580 390 -675 -218 93 198 -407 602 502 -76 -694 766 -836
7060h36J148q47l71J460Q4j17j512R29M1L73p02N72m84O28m10k58P44o81J317
7079A078r32j71l64R45j157R77p5p51j26O95N89p11m47n46J527p45K24P33j441
7098f98J087n66m84R06L43q69k44o3J022P27j032M4q38Q55j038O50J61O00j334
7117g71k18Q58q24J342P36j36k451R12R94m09O97J45j240l2K74P94j191J230Q05
7136A515j951J195p83P96k126O97Q88M44j54j106L69l33N22k67j72K36p05r1R68
7155e8m79O92j34q4j08O40m69O25O8l87K86j205M27k32n8K92J14n11R25k85L28
7176C87o74J88J20N3j28k34P58j08k60k30M37L76K87m43n11P6q15M59J182j148
7196b28p47P97o28N83m90M14J51N1m96M33n03L47k89J225p00k99J573j297N54
$$ plain form
7060 -836 312 -535 -906 554 638 521 -991 -62 -21 352 -350 222 -262 366 -44 -302 442 -239 1078
7079 1078 146 -25 -389 556 -601 376 301 -450 -576 119 708 -3 -450 -996 531 -214 10 743 -698
7098 -698 389 -177 -661 245 588 -281 -525 -588 434 1161 129 173 -665 190 -848 -198 -37 563 -771
7117 -771 -989 -131 -955 387 1123 987 -1464 -552 442 33 730 875 -365 -397 -123 671 -520 710 1515
7136 1515 -436 759 -24 772 -1354 -657 231 675 521 -585 -216 -549 -27 -294 -466 -230 -935 -1026 -58
7155 -58 -537 155 21 -63 -171 469 0 625 693 306 592 -613 -186 -418 -476 -184 -70 -581 344 59 387
7176 387 -287 -99 21 74 -54 -288 470 362 102 -128 309 685 972 529 18 94 -721 -262 920 -228
7196 -228 -975 -178 -806 -223 -713 -299 -148 -97 -593 -160 -663 -316 -605 620 -80 -379 1194 -103 451
7215D51j31l47L4j44Q9l60L30N36Rn10m58J98P9K87P12j113o75P71j26Q40r43
7236d71M11M23m12K8J76N59j126j51L15M40k8m6k94N87n88l06l26R96m00L65l09
7257a57K62Jj90l99M33J80j147R99K84j253J258L16l18q19M23j105J483j086J56
7276f79L64k66M74R7n00J038o32j49J4k03M84m53j80M48j51L10k20P54j521J325
7296C54r54L06L61J7K96q40J82M60L60r5l94o07M77m61P19P5j483J078K85J6m84
7317c32L76J92P6J06n38l6p63J325r05Q40k67o45R39M31o92k84J57L45p13N48
7337A60k90L03r45J00L26J213j628N09L00O32q45O76j720K440j606m43J203j308
7355i23J085Pl76n61J096j469R83P9M6M55l48N10q12j36k08j463J192j62J266
$$ plain form
7215 451 320 -27 7 -137 -48 -408 -78 458 467 -43 -501 -303 -224 63 775 -338 -1013 -242 -368 472 -471
7236 -471 -60 363 -49 -21 155 714 -412 -563 -248 192 164 118 -176 411 -177 -483 -809 187 -213 152 -157
7257 -157 105 106 -84 -483 -50 130 -1017 -18 266 -987 271 587 269 -550 -127 -1232 251 -835 -679
7276 -679 -315 -581 -107 -10 -510 528 -104 -253 -239 -442 42 -411 -591 -143 -294 16 -204 550 -971 354
7296 354 -600 -294 67 84 380 -460 -278 182 542 447 53 -554 -77 -538 181 256 -1227 -149 136 152 -332
7317 -332 44 236 312 418 -120 -156 -919 406 -499 341 74 -571 368 799 107 -177 -20 325 -388 160
7337 160 -130 173 -772 -672 -346 867 -761 -252 48 680 -165 511 -1209 1231 -375 -818 385 -923
7355 -923 162 169 -207 -768 328 -1141 -158 -79 -33 422 74 584 -228 -364 -572 -2035 -843 -1005 261
7374B61K36j533k1J753m90l31L15j015J160J284j764J587k699O22o8P39P70j0
7392G96K89r81R93r46L16q53P76j952J714J477k116O22R99n76j60q63J280l57
7410D58j204n2J024q79K82M53O39k11K29j212O13J309j561q89M26j99L79Q10p86
7429c71k90Q1J375j650j32K49J200n08K64k47O18j80l54M76N09q83r55K417j912
7448b93O40N46p8l36j06j58L54l46K58r33P98M24n21p77R08K36j005M6P94J71
7468F22P33j030j76m76n07m57K099n13k96J54j084r3L13J253j15k02l39k75K22
7487a67N96k64l46L93Q3j62K3N51o73l92n00Q41L24m30P7M10Q4q04J259o40o63
7508d00L69K46N25k19j168O33j31J77J06%PJ60J47l44j27j05r4J18J10l39N65
$$ plain form
7374 261 497 -1036 -1057 696 206 -125 190 -825 335 1619 -145 1442 -1257 -635 -703 36 806 796
7392 796 1085 104 1097 151 467 -386 390 -1562 152 1629 -487 135 1134 558 398 -465 815 458
7410 458 -746 -798 226 -653 -371 82 721 510 739 -473 140 1449 -112 -1001 -575 -774 -395 415 -371
7429 -371 -661 -580 795 -855 -987 -738 462 -46 218 -29 589 409 55 531 1040 157 -798 1619 -293
7448 -293 347 893 815 479 373 215 569 223 481 -452 346 770 249 -528 380 616 -389 -343 451 622
7468 622 1355 325 149 -327 -834 -1291 808 295 -1 153 -931 -1024 -711 542 427 225 -114 -389 -167
7487 -167 429 165 -181 212 295 133 156 707 34 -358 -858 -17 307 -123 -46 364 448 -356 903 263 -400
7508 -400 -31 215 740 521 -647 -14 -145 32 138 138 145 305 452 108 -19 -124 -218 -100 10 -329 236
7529B36r2J35j76J33j98q5J1R2j4J26l61J51J31k27L39N0O7l53J48j25l2J64Q
7552A28P8L7m84K18K19k82p8J62l2l93O83j38j53L73M98p17K59o26M6O32o52O41
7574D19n37R5L03k68K22J39n80j03K53m37M38j53M92m02M49l68R9L46j91l48K84
7595A52L48o14L70o2m68L06K6J28m00k22Q38n26J73l53J79M85l35j88J051j531
7615f43J06L26O82o31N13O77r87q0J60j23J8J93j20L08k48K68m65k74L25L45j25
7636B25L00j085O46l16K21j15R12n19j35n3n88P01j2p4P6j28m42M10n05O66k16
7657c1J96k15J88O7l06K87k67n3M41l80O25m3l71m59L60Q67p73o83J176P4p07
7678gJ97m46n63P31K84p72M79o9r53J596j374P64k18P08p19l11J211q14J449n43
$$ plain form
7529 236 144 279 103 236 38 -47 -36 56 42 168 -193 -42 89 -138 201 251 318 -35 113 -12 -44 120 128
7552 128 206 243 -241 -23 196 -86 -164 -2 -34 -427 256 118 -35 338 836 119 378 -248 -202 430 -222 419
7574 419 -118 -23 280 12 234 373 -207 -310 -57 -494 -56 -209 283 -119 330 -38 61 407 216 -132 152
7595 152 500 -114 256 194 -274 32 58 186 -214 -436 402 -124 49 -304 -125 360 25 -163 888 -643
7615 -643 -537 -211 471 -160 353 1030 43 -37 123 0 18 211 91 399 151 419 -46 -320 5 350 225
7636 225 525 -560 86 -230 -9 -124 788 269 134 81 -507 194 182 108 184 56 -386 24 -481 185 -31
7657 -31 165 -50 138 205 -101 186 -81 -134 307 -73 552 509 138 -321 39 906 133 -550 626 700 -7
7678 -7 190 -256 -819 -88 196 -576 -97 -166 -1119 477 -897 -133 -351 357 -362 -673 538 -276 1173 630
7698F30o46N05k36P8k98j88J034r98N9Q7m76M49o90P04M55K93j1j135N99K15n60
7719a30k20J46n13Q45J81n29L00m80Q8K93M84q9k55m3J26n00Q08k53j67k55J247
7740A084j445P90k79l60O49K39j100o7Q33m69Mk18O14p94J073q38O79o27J47K9
7760e6K17l00L79J04j064P69o92Q00O27m77o02M90k13P88n47m76N53j002J149
7779D47o72O22j222J930r63m2j46j29Q99m92K97J55m90j1L6o13K95l15J35N19
7799B40j311J375n42J168j393j05J450r39L77o12J008j076J037k14n55J117r32
7816I3P53n86R89j460M68J68l83L79K35j030P12Q41j468M79R71j414J241j469
7834d81R78J10l75n59m24P69p8L42r30M32R93j120J106j109J688q05j334Q38M5
$$ plain form
7698 630 -16 489 253 331 33 -155 879 -119 -60 27 -449 0 -690 14 469 762 751 -384 215 430 -130
7719 -130 -350 -204 -717 128 309 -220 80 -400 -312 -19 465 376 121 78 204 -296 512 259 92 -163 1084
7740 1084 -361 429 150 -210 439 678 -422 -489 344 -125 -121 -339 275 -519 554 -284 395 -232 -85 -56
7760 -56 161 -139 240 344 -720 49 -643 157 784 307 -295 195 -18 770 223 -253 300 -702 447
7779 447 -225 397 -825 1105 142 100 -46 -175 724 232 529 684 194 183 219 -394 -99 -414 -279 240
7799 240 -1071 304 -238 930 -463 -568 882 -57 320 -292 716 -360 677 463 -92 1025 93
7816 93 846 260 1249 -211 257 425 42 421 656 -374 338 1179 -289 190 1161 -253 988 -481
7834 -481 497 607 232 -327 -751 18 -60 282 -648 -216 777 -343 763 -346 1342 537 -797 41 86
7853H6P29m92m82l87O36l22N55q06P52m07P31q10J725j202j420K303j520J125
7871G94K49k688J781j072J151n74L00J74K68n12j64M55L30J7r6o92J124o10n22
7890b87P19p36q3l01l13R70l10L81J20k53M35M21J1j512J042j764M75J947j328
7909c66k98J655p31j40K43r88J401o50k68K5P84k1p53P0O41j95m91O1P37J23o67
7930A72O17n01n28L71L37o80N35o53J67q22P69N97k6k18o62P50j37M36j93o12
7950b81p25R95j028J479k05q34N93K74K62j126J213p37O05q55RP19P46j531N77
7969A50n73O06L13q98O78k80P1j282J849p5L32o56j89O30n53Q14r56l71J315j054
7989a29J005p45j298J174R64r23j182R26O0m61K86k84P34p67K73J264j136J73
$$ plain form
7853 86 815 323 -159 -546 90 -232 323 -483 269 -138 593 -217 1508 306 -1114 1189 -331 794
7871 794 1043 -1645 136 -936 215 -359 -59 115 383 -129 -293 162 492 509 413 -279 845 235 -287
7890 -287 432 -304 -387 -688 -1001 -31 -341 40 160 -93 342 763 774 -738 304 -1460 -985 962 -366
7909 -366 -664 991 260 120 363 -625 776 126 -142 -117 667 646 -107 -37 604 409 -82 -21 716 839 172
7930 172 789 288 -240 131 468 -212 323 -330 -163 -985 -216 381 355 137 -525 225 88 524 331 -281
7950 -281 -1006 -11 -1039 440 235 -599 -6 268 530 -596 617 -120 485 -370 -361 358 1104 -427 150
7969 150 -423 183 496 -402 276 -4 67 -1215 634 559 891 235 46 676 123 937 -19 -390 925 -129
7989 -129 876 131 -1167 7 971 48 -1134 -208 -148 -609 -323 -607 127 -640 -367 897 -239 -66
8007f6j6N19m69O72j146K62P65N74p48N73k689K025r0N18r29o6j45O19J384j496
8027E1K69k02O15J42n56j318J459K01j529P69o00O46p91k32J115p15M96P42j514
8046i52J338k3k17j433J190J91j632J690J315k666J246J123l078Q27J639l8k1
8063D99o11p46L1J282j389J241j090j465J801J129K16j084Q3J88j234O21L95J668
8081A535j144L04j35r04Q4K83j71O85J45k70R9j329K58P50j26p5M92O95j175m48
8101d47O94N87n5j708R19Q50k256J637N02P87k688J524k06L95N5J013j276j536
8119a209K157m2k303K109j95n12Jp63L02O23l9m90J061j859J022n32J204m09j83
8138e7m58j2J140l9j34n11O30O19j228J2L63j62L66j317Q47n65p6Q10Q82k002
$$ plain form
8007 -66 -82 437 -32 640 -506 -244 521 1095 347 920 -1769 256 166 684 -245 -311 -456 163 1547 51
8027 51 320 118 733 875 319 -999 460 661 -868 -99 -699 -53 -844 -1076 39 -676 -180 562 -952
8046 -952 386 363 146 -1287 -97 94 -1538 152 1467 -1199 47 1170 -1908 -1081 558 520 499
8063 499 -112 -858 -827 455 -934 307 -783 -2248 -447 682 898 -186 -103 85 -1149 -528 -133 1535
8081 1535 391 695 560 -344 -260 23 -148 537 682 412 511 -818 -560 190 64 -11 481 1176 1 -447
8101 -447 247 834 779 -929 -10 840 -1416 221 723 1510 -1178 346 140 535 590 1603 327 -1209
8119 -1209 948 906 -1397 712 517 5 6 -757 -455 168 129 -361 700 -1159 -137 -669 535 126 -57
8138 -57 -515 -527 613 574 440 -71 559 1178 -50 -38 325 163 529 -788 59 -506 -582 228 1110 -892
8158h92nJ028Rm86O77Q86p47j065J10J244j237n3J169j842O12J746m67r52Q36
8177E71o8o19P64j22K61j34j47p06K38n96K36P32o68l36
$$ plain form
8158 -892 -897 131 140 -346 331 1217 470 -595 -485 759 -478 -531 638 -1204 -592 1154 687 -265 571
8177 571 503 -116 648 526 787 653 506 -200 38 -558 -322 410 -258 -594
8191e94
$$ Imaginary data points
##PAGE= N=2
##DATA TABLE= (X++(I..I)), XYDATA
0@%%%%%%%%%%%%%%Lj1J6j6J6j7K4l1L4m1M8n6O8p7Q6j00J15j31J50j72J95k19
36a16K46k75L09l45L84m27M74n26N83o45P13p88Q66r53J051j159J276j406J553
55H15j717J905k120K367k658L002l417L938m609N507o783Q754j2235K0244p6951
70f3958j5297Q6015j2570K435N756J2316k3294j0368L5221K7444l7641j3835K9630
83B1854L4666n777k9195j6109p1l1179o838L8059K1222k2535l3448r084J8610
96a9825o764j0938K3148J7146q606L432K5305K2252j5767m0604j028J8273o189
109a65K235J8373P149j8087k7757N566K5837j3367k1506R467J3262j271j0427
122a0691Q336J9636j9104k6382J7298K7250K279j0035k481O611j1469k4522R235
$$ plain form
0 0 0 0 0 0 0 0 0 0 0 0 0 0 0 0 3 -8 8 -8 8 -9 15 -16 18 -23 25 -31 37 -40 46 -54 61 -70 80 -92 103 -116
36 -116 130 -145 164 -181 203 -224 250 -276 307 -338 375 -413 453 -500 551 -608 668 -738 815
55 815 -902 1003 -1117 1250 -1408 1594 -1823 2115 -2494 3013 -3770 4984 -7251 12993 -63958
70 -63958 -79255 6760 -5810 -3375 2381 14697 -8597 -18965 16256 43700 6059 -7776 21854
83 21854 56520 50743 21548 5439 5368 -25811 -32649 5410 26632 4097 -29351 -38435 -19825
96 -19825 -26589 -37527 -14379 2767 -5839 -2407 22898 45150 29383 -11221 -12249 6024 -165
109 -165 2070 20443 27592 9505 -18252 -12686 13151 -216 -21722 -12255 1007 -264 -10691
122 -10691 -2355 17281 -1823 -28205 -10907 16343 18622 8587 6106 12717 1248 -23274 -14039
135a4039K1532j2349j5149Q203K1501P407j5032J479J4133j6946j7141J4293J8547
148A6439q39j8352l290J8351n072j8918Q017J1298j1014j6706R22K1657L178k1920
162a6249J056J5143m616o498J1123K2596N413k1654l184J8500n890j8807k458
175e525N927M54j2953K508K3856k679k5271n128R101J189o950R52J8504M292j7754
190i477L788J9647J134j2333m357J2066R236j3370k721J2654r682k3792n297J3386
204i118J2069q203n529J7159J394j6254j653J0731J893j2364n033K0155J2853
217A8100j2039l307Q840j857j1880o341J2541J1043j8167r686J2221J157r899
230i274l628R458J0144r234n265J8068O452j4842r281N129N037o237o908J4811
$$ plain form
135 -14039 7493 -4856 -20005 -11802 9699 17106 2074 3553 17686 740 -16401 -2108 16439
148 16439 15600 -2752 -6042 12309 7237 -11681 -3664 7634 -3380 -20086 -19164 2493 5671 -16249
162 -16249 -15193 -50 -4666 -11164 -41 22555 27968 6314 3130 21630 15740 -3067 -5525
175 -5525 402 856 -12097 -9589 14267 11588 -13683 -18811 -9710 -8521 -15471 -14519 3985 8277 -9477
190 -9477 -5689 13958 15092 2759 -1598 10468 19704 6334 3613 16267 6585 -17207 -22504 -9118
204 -9118 2951 -5252 -10781 6378 7772 -8482 -10135 596 2489 -9875 -14908 5247 18100
217 18100 6061 2754 11594 9737 -2143 -8484 4057 15100 -3067 -12753 -532 625 -9274
230 -9274 -12902 -3444 6700 -2534 -7799 10269 16721 1879 -7402 -2273 2764 -3473 -10381 4430
244D430J0357j4013o370J0190M202r170j1930O925J1087j0573o999J2952N235
257F323p582n760O429J2014n903j0935J0065N607j1569p406N282Q317o760j0492
271a2370J0717J2822q870o171O330M699p378j1310N723J2958q114q061J0521P818
285I314m587q016L065J1208q032j3401Q239Q443o074r338L388J1170k278j2593
299i492P515J3203p067p851K838O278k824j2094J655J3561m373r174P092Q366
313G633k020p741j640J0265l515j2398M321Q641k877o309J288J0817l69j1723
327e627L637R977n744p925J145O580N05j1381J877J3952l011q423M459P751n20
342G252r897k851J1580j504j3230K381R696n6o803j343J0605J584j2389j040J0616
$$ plain form
244 4430 14787 774 -5596 4594 8796 -374 -12304 -5379 5708 -4865 -11864 1088 6323
257 6323 -1259 -7019 -590 11424 5521 -5414 4651 10258 -1311 -8717 -3435 4882 -1878 -12370
271 -12370 -1653 11169 2299 -3872 2458 7157 -221 -11531 -5808 7150 -964 -9025 1496 9314
285 9314 4727 -3289 -224 10984 2952 -10449 -2210 6233 159 -9179 -5791 5379 3101 -9492
299 -9492 -1977 11226 4159 -3692 -854 5424 2600 -9494 -7839 5722 1349 -7825 -733 7633
313 7633 5613 -2128 -3768 6497 2982 -9416 -5095 3546 669 -5640 -4352 6465 6096 -5627
327 -5627 -1990 7987 2243 -5682 -4537 2043 2548 -8833 -6956 6996 3985 -4438 21 7772 7252
342 7252 -2645 -5496 6084 4580 -8650 -6269 3427 3371 -3432 -4775 5830 7414 -4975 -6015 4601
357D601j546q972j270Q222L754r713J55J2844r90p974J496M790K207r457n006
372f859J0471R4j1089J501P645K316o307m402R460L217j1609j274Q053J231o597
387d149k659P774O920q738k499J1150J871q597l289M695L246p599o461R143L339
402D147q367r41N831M717o667n616O499M624q831l203P852K325m134l608P130
417A758P115p115m022Q656J636p264m745L852N047o906o527R147M880p181k734
432d403N197M776m999p993O189N154p862m207O488M643k086n237N190Q205o370
447B685n986O020L309n044n504K193P451l728o644O821N717o207k825J423M433
462D114l930p962L655O174m867m446M555M954k094m235K904R190n123n947L893
$$ plain form
357 4601 3055 -5917 -7187 1035 4789 -4924 -4769 8075 7085 -889 607 5397 7604 -1853 -6859
372 -6859 3612 3706 -7383 -5882 1763 4079 -2228 -6630 2830 6047 -5562 -6836 1217 2448 -4149
387 -4149 -6808 966 7886 -852 -3351 7799 9670 1073 -2216 2479 5725 -1874 -8335 808 4147
402 4147 -4220 -5161 670 5387 -1280 -6896 -397 4227 -4604 -7807 45 2370 -1764 -5372 1758
417 1758 8873 1758 -2264 6392 8028 764 -3981 -129 4918 -1988 -8515 632 5512 -1669 -4403
432 -4403 794 5570 571 -7422 -1233 3921 -3941 -8148 -1660 2983 897 -4340 850 9055 2685
447 2685 -3301 2719 6028 984 -4520 -2327 5124 1396 -5248 1573 7290 1083 -1742 -319 4114
462 4114 184 -7778 -4123 2051 -2816 -7262 -2707 2247 153 -4082 -1178 8012 2889 -3058 835
477H35L758l092m556J419P792k893n517M847M878m139o272o48L554j170p815L269
493e750P372l300m808K884N382J336o858K164Q070k487n507L171L872j407o015
508a881j095R157N3o917K150L891l719p192j804N948M96q189J867P974J36l375
524b500Q30M823Q37p652J094Q471m53n756j0L585P59m812o22O470o54o334j185
541c109O345j216n176l381L303K386n765L095P297O13m451k201M185K697o414
556a792j350N861j359m245J170N675K553o639m369O456J477m770p57M259J03n186
572b913l576O450M043o527j550N019J594j939j488L659J042q400l790O780L859
587B263j996r54K968L202m451k885N319J021o749k622M068M680j182m378K111
$$ plain form
477 835 4593 1501 -3055 -1636 6156 3263 -2254 2593 7471 3332 -2940 -3588 -34 -1204 -9019 -5750
493 -5750 1622 -1678 -6486 -3602 1780 3116 -3742 -1578 6492 4005 -1502 1669 5541 4134 -1881
508 -1881 -2976 6181 6234 -683 1467 5358 1639 -5553 -7357 -1409 -913 -9102 -7235 739 875 -2500
524 -2500 -1670 3153 3990 -3662 -2568 5903 5450 -306 -316 3269 4028 -784 -1406 5064 4410 -1924 -3109
541 -3109 3236 2020 -3156 -6537 -3234 -848 -6613 -3518 3779 4392 -59 -2260 1925 4622 -1792
556 -1792 -3142 2719 1360 -2885 -1715 3960 6513 -126 -4495 1961 3438 -1332 -2089 2170 2273 -2913
572 -2913 -6489 -39 4004 -2523 -4073 946 2540 601 -887 2772 3814 -4586 -8376 -1596 2263
587 2263 267 -687 2281 5483 1032 -1853 3466 4487 -2262 -4884 -816 3864 2682 -1696 415
602D15J555o484j083O319L348l250m098J278M080l929l453M378J740j764k33M262
618C081O394l856p444Q37J143l366q2M214L062k673n947L218N217m827l346J655
634b720J743K64j009L734M058o473n737L800M261O40n66J128K674m490n590L319
650i64L232m496l032J672M612K274l426K886J502o325m367K995N676J993n572
665a340J02M207j840l705J928L092j341m220J012O586j047m911q12K036k590j318
681d161L301N874o38n577P27L366k088l247N25k12M69j369K322N635q41n674m64
698b052J739P64k003J068M167k811m733J998M662j652k489k006L709K473l895
713a061K174L616m791m547m71L797L231j998o83M460j538k547L50K774j214m975
$$ plain form
602 415 1970 -4514 -5597 722 4070 820 -3278 -2000 2080 -1849 -5302 -924 816 -948 -1181 3081
618 3081 9475 5619 -1825 -988 155 -3211 -3293 921 3983 1310 -4637 -1419 3798 -1029 -4375 -2720
634 -2720 -977 -713 -1722 2012 6070 -403 -6140 -2340 1921 2561 1995 3123 5797 1307 -4283 -964
650 -964 2268 -2228 -5260 -3588 1024 3298 -128 2758 4260 -2065 -6432 -3437 2239 4232 -1340
665 -1340 -1238 2969 1129 -2576 -648 2444 1103 -3117 -2105 4481 3434 -1477 -2289 -253 -2843 -4161
681 -4161 -860 5014 4376 -1201 -474 2892 804 -2443 -1918 -2130 -1661 -3030 -708 4927 4086 -1588 -2052
698 -2052 -313 451 -1552 -484 3683 872 -3861 -1863 2799 1147 -1342 -3348 361 2834 -1061
713 -1061 1113 4729 -62 -4609 -5080 -1283 1948 -50 -733 3727 2189 -358 -8 2766 1552 -3423
729c423j615O236J749k651Q46O44j548k953l56M610J519m037j309L315J89j359
745a43j383J472K194l716l7N925Q30l269k478n58K00k642j190N449Q01k460q1
762a086K564J723k610l062J703J863k909J399K564J253k150l977K093K738k587
777d81j097K765o7k304j049J046J778k898k859M076L253j339J380K111k80l358
793F77l697K734L151l824o75K236J070q76l016J780J339l407j858K812K673p25
809C94j520M9K333j508j842M101K312j970j473L80K115k133m327J616J515k102
825b060j099K670J824m82l599R94K595j602k281K245K551j10j540K72L623j908
841B093k700J627J080j178j306R0K134k192l745J354K795j489q69J164K444N92
$$ plain form
729 -3423 -5038 1198 2947 296 1142 1786 238 -2715 -3071 1539 3058 -979 -2288 1027 1216 -143
745 -143 -1526 -54 2140 -1576 -1613 4312 5142 1873 -605 -1163 -963 -3605 -4795 654 1455 -1005 -1086
762 -1086 1478 3201 591 -2471 -768 1095 -1814 -415 2149 3402 1252 -2725 -632 2106 -481
777 -481 -1578 1187 1120 -1184 -2233 -1187 591 -2307 -5166 -1090 2163 824 2204 4315 4035 677
793 677 -3020 -286 2865 -959 -1634 602 1672 796 -2220 -440 899 -2508 -4366 -1554 1119 394
809 394 -1126 -1077 1256 -252 -2094 2007 4319 2349 876 1256 3371 1238 -3089 -1473 42 -2060
825 -2060 -3159 -489 1335 853 -2746 -1752 843 -759 -3040 -795 1756 1646 106 378 4001 2093
841 2093 -607 1020 2100 922 -384 -294 1840 -352 -4097 -2743 52 -1437 -2306 -1142 1302 1894
857A894k590J24L701l170j696J025K113R4k354P68K594j527k794O17J466j116
873h51q39j24L111K88l595K051K337r18j605o26K438J054l111n91K295q69l408
890b963J479L90J359j407o71L438p59k539J605R00P3j379k76K964N75k095j50
907E44J806l30k444n58J399L18k818j11J844j299j477J533P73J643j458L9L416
924B820L68k596Q8J266Q8L26k163J833J826l571r18K492j815j414p34k24J648
941f80j701j048L347o01j172Q46J289K122j413j409L309l18j947p96J637K58j278
958D45k043J882J550k687n47J493O5j408j893J496J879j476n41K578R01p57j237
975c00J326J721j684k166J714J043k245k28j32J732r32k030K287J135j351r87
$$ plain form
857 1894 -696 -572 3129 -41 -1737 -712 1401 1495 -859 -91 2503 976 -1818 -1201 265 -851
873 -851 -1690 -1814 1297 1585 -2010 41 2378 1460 -145 -771 1667 2721 -390 -981 1314 445 -2963
890 -2963 -1484 -1094 265 -1142 -1813 1625 866 -1673 -68 832 905 -474 -750 2214 2789 694 544
907 544 2350 2020 -424 -982 417 735 -2083 -2194 -350 -1649 -3126 -1593 -820 823 -635 -596 2820
924 2820 3188 592 680 1946 2034 2360 197 2030 3856 285 -633 1859 44 -1370 -2104 -2328 -680
941 -680 -2381 -3429 -82 -683 -1855 -1009 280 2402 989 -420 2889 2571 624 -172 1465 1723 445
958 445 -1598 284 1834 -853 -1400 93 158 -1250 -3143 -1647 232 -1244 -1785 793 1694 937 -300
975 -300 1026 2747 1063 -1103 611 1654 -591 -819 -951 781 -151 -2181 106 1241 -110 -1097
991a097J402M0m13j789J556K192k121j009K206Q15j113j136P24O95j053j999J589
1008e11J128j071n04L72J501J43k108J131K121j966r29J190L9O9j912J81K384
1025A258j031j201Q56J123m43k404R71J885q56k848K657J346j414M27l44J499
1041A481j0j869lJ926j804o32K37N74P47j620n2K193j560p87J035M08K77j489
1059i48J34J868r52o84O78L52J520j242j250K490j619j924J033J040p0j335L67
1076e42o87J880k617K69K656l17K55j580R18M04q27m55J899j070n47J48M18O18
1094H23j306K71N65R56k160o16N30N05m10m7J220J113j967r6K027k11j467j94
1112d64PJ357p23r41J538K26j059o85R49J350j199j879J732M04j537j284J952
$$ plain form
991 -1097 305 345 -68 -1857 -301 1891 -230 -1239 967 1782 669 -467 257 952 -101 -2100 -511
1008 -511 617 -454 -958 -586 915 1058 -1050 81 2202 236 -693 497 536 605 -1307 -1126 1258
1025 1258 227 -974 -118 1005 562 -1842 -871 1014 158 -2690 -33 1313 -101 326 -18 1481
1041 1481 1471 -398 -401 1525 -279 -911 -674 -100 647 -973 -1025 1168 -392 -1179 -144 264 541 -948
1059 -948 -814 1054 102 -582 96 448 1968 726 -524 1966 347 -1577 -544 496 426 -909 -542
1076 -542 -1229 651 -1966 -1697 959 642 897 -683 235 639 -188 -643 1256 186 -361 -213 205 823
1094 823 -483 -212 353 1309 -851 -1467 -937 -432 -842 -889 331 1444 -523 -619 1408 1197 -270 -464
1112 -464 -457 900 177 -764 774 1000 -59 -744 205 1555 356 -1523 209 613 -924 -2208 -256
1129b56M0K27j155J305J554r08r65L74M92j344O6L17J442j008j271J748M56j238
1147a24l04K86N50l69j305J535R50j853l08P38Q29o11k50K45J051j338k51Q64
1165C35R8p31p99L68J557k34p02Q65Q33j585r91R34Q18K11j978O51K002j602J90
1184B40k34L25m32j226J021J689p76j128O56m6k55o82M09J472p25p62O29Q07m96
1203D86p78m56Q81l7j452J237J303p13j068K3J77Q17j191O80J090m99j101L46
1221b55Q24j24j131L0R81N8p29J195j52m73j853K37J379P53j427O33Q88k05l63
1240B66j72L58L32j493k69J388P39r29j23j83L44p52o40J458r1r05J27R00J65
1259E20k00r45J167J89j234L55J675j9r34k30l32K66j162q5J014P0m37n25J10
$$ plain form
1129 -256 -216 11 -1144 161 1715 807 -158 216 708 -636 -570 -253 1189 181 -1090 658 1114 -124
1147 -124 -428 -142 408 39 -1266 269 1219 -634 -942 -204 625 14 -236 9 1060 -278 -529 335
1165 335 433 -298 -1097 -729 828 594 -108 757 1590 5 -986 -52 766 977 -1001 -350 1652 50 240
1184 240 6 331 -101 -1327 -306 1383 607 -521 135 89 -166 -848 -439 1033 308 -454 175 982 486
1203 486 -292 -748 133 96 -1356 -119 1184 471 -597 -574 -397 420 -771 -91 999 500 -601 -255
1221 -255 569 445 -686 -656 325 383 -346 849 697 224 -1629 -1392 -13 740 -687 -54 834 629 266
1240 266 94 452 784 -709 -978 410 1149 220 97 -86 258 -494 -1134 324 233 -672 -545 355 520
1259 520 320 -625 542 731 -503 -148 1527 1508 574 344 12 278 -884 -969 45 115 -322 -847 -737
1278g37R62p49p95O71J093j725J399R46q13J91p70Q07O71j089L85N81o03L0k61
1297A94N46p2j004r44J560n69l68N99J2M74p36j097J332P30r94M3J04J104p21
1316A93l18N42K2j545K89Q03N26J40j284P39q7l94m45P25N76l20o09J03J168n0
1336G74j349J69k91r1k01N10O81J189j008j85m12r7l46J251M07j65n28J69L63
1355H40n92n2p26L46j56j93O92j57O33j098L67k64J30j68n24P66R29q23O60M76
1375A086j785L01Q81J11J01n34O65J70q19o46l0M08K74r46k5J488m00j249J057
1394A08o6r36K28N89O69J156j749J12P91j239n01N05Q43P73j208M3O2p3o56L8
1414e11l52qJ44mJ683j340P52o49J045q66R1R86r52M7k95P4J127j464O14j222
$$ plain form
1278 -737 225 -524 -1319 -648 445 -1280 119 1065 252 443 -327 480 1151 62 447 1028 425 455 194
1297 194 740 668 -336 -1280 280 -289 -657 -58 -46 428 -308 -1405 -73 657 -337 -294 -190 914 193
1316 193 -125 417 439 -1106 -817 -14 512 652 -632 107 20 -374 -819 -94 482 162 -447 -344 824 774
1336 774 -575 -406 -697 -788 -989 -479 202 1391 383 198 -214 -311 -657 594 1001 836 308 477 840
1355 840 248 196 -530 -184 -340 -533 159 2 635 -463 -96 -360 -230 -398 -922 -156 773 -50 610 1086
1375 1086 -699 -398 483 594 695 161 826 996 177 -469 -499 -91 183 -763 -788 700 300 -949 108
1394 108 42 -894 -666 -77 592 1748 -1 111 902 -337 -838 -333 510 1283 75 118 180 107 -549 -511
1414 -511 -863 -871 -727 -731 952 -388 364 -285 760 -106 -15 971 19 66 -229 -155 972 -492 122 -1100
1434a100J104L71J73q66R65k93n27Q3p53Q64n87l39J217J54q71O64N17m14j082
1453g20N05M65K1q34L25J197l71p49m16Q63L58k29j85K32op66J15J20K42k26l93
1474d52N07L91o02M47m1P0j74o31N50O18r31O0J07R4l04Rr0Q15q58j09O64J7m1
1497A16l10l26M51k17l93Q99M13n78J39lK41m08n30K57M48J20k44o4L17l74j61
1518b07p21J756j304m03J361k96m05Q37k13k29K32j228J105M37r60Q31l46m52
1536b05k70J057j372J95N75Q2k94J035m64q08O33m8l96l42Q44j080N33j05L05
1555a25P82P6j340L88K03p10J306j406k41J114N91q76j0J94J92L2j11L56M2p21
1575b64Q41j060L90j06L80q56J349p66J172j419q37J272q76J504r67Q63j24m59
$$ plain form
1434 -1100 4 375 548 -318 647 354 -173 -90 -843 21 -566 -905 312 466 -405 259 776 362 -720
1453 -720 -215 250 271 -563 -238 959 588 -161 -577 286 644 415 230 462 456 -310 -195 -75 167 -59 -452
1474 -452 55 446 -156 291 250 320 146 -485 65 683 -248 -188 -81 13 -291 -282 -372 443 -415 -524 140 157 116
1497 116 -194 -520 -69 -286 -679 220 633 55 194 191 432 24 -506 -249 199 319 75 11 328 -46 -207
1518 -207 -928 828 -476 -879 482 186 -219 618 405 176 408 -820 285 722 -238 593 247 -205
1536 -205 -475 582 -790 -595 -20 62 -232 803 339 -469 164 116 -280 -622 222 -858 -325 -430 -125
1555 -125 657 733 -607 -219 -16 -726 580 -826 -1067 47 638 -238 -248 -54 138 170 59 415 457 -264
1575 -264 577 -483 -93 -199 181 -675 674 -92 1080 -339 -1176 96 -780 724 -243 620 496 37
1593C7k02P09Jq58L78J26n8L45r84m5L90j02j72k07M52L44r27N07J90N6l70N10
1615A20L05m65K05K09k15L09l47J70m9n5n11k52L96N06j072J9Q15o96O78r5R2
1636F7M06J69m94O3K51J90q43M86n53k6J90K1n14L04j05p62J117j90N50r21Q05
1657B11K89K52m56L3p17P32k43q73J157k21o57R98n02K27n47qo74l14O17J32K71
1678b93j67R16o21J59p13N39n61P15M50R55j147K04j098M73P93l51r47J53n0P97
1698B06R3k09N20p35n55R55m35l50M88k77M71l82J026l83k79o7j20m73M25m73
1718e54J353j075J8k23k36M21mO7J598j621J92l30K72j2J54j16k90J239r26J66
1738I3k68L99j333J047p5J93Q30j588O09L44l00K10l01l55O07o28K90J064q29
$$ plain form
1593 37 -165 544 545 -313 65 191 133 478 -506 -551 -161 -263 -435 -642 -190 154 -773 -266 -76 -20 -390 120
1615 120 425 -40 165 374 159 468 121 291 242 187 -324 -576 -180 326 -746 -727 88 -608 70 -25 67
1636 67 473 642 148 211 462 652 -191 295 -258 -284 -94 -73 -587 -283 -388 -1150 -33 -223 327 -594 211
1657 211 500 752 296 329 -388 344 101 -772 385 164 -493 505 3 230 -317 -325 -999 -1313 -696 -564 -293
1678 -293 -460 456 -165 -6 -719 -180 -741 -26 424 1379 232 436 -662 -189 604 253 -694 -541 -591 206
1698 206 299 90 610 -125 -680 275 -160 -510 -22 -299 172 -210 816 433 154 87 -33 -506 -81 -554
1718 -554 799 -276 -258 -481 -717 -296 -300 -233 1365 -256 -64 -394 -122 -134 20 -96 -386 853 -73 93
1738 93 -175 224 -1109 -62 -137 56 886 -702 -93 251 -49 161 -140 -495 112 -516 -226 838 9
1757IJ40j356P98j19m55J042j039R30N12j774O18J939j425o91J254m88L43j182
1775i44K175j580j98Q82r02J031j057N07J11K26p80k46J39J036j466O60J75M3
1793a88j19N13K73o09O85o34N70K09k97j56r20J018M14q30q00R06K98P90r22l29
1813a28N01j84J073j151l6O57l68j109J081j14k49J04j311O77L54k7n25J210o42
1832a87l32j6M19M1j86o0P06o93k2N45p83K54L12K34r9r23P86L11j018J281j66
1853D04j287L07M05l35R22k84Q96j583R29j16L72j170J070j92k24K4L35m01K50
1872C22J49n19M89k6j99n74M17j94j6j13k19O56j41K48j22n81O98N6k46j01j01
1893a17K58l6k25Q1j02k33o20P39J67l89k10J17J130o01k99J14lr4J90j17P76
$$ plain form
1757 9 149 -1207 -409 -528 -983 59 -980 -50 462 -1312 -694 1245 -180 -871 383 -105 238 -944
1775 -944 1231 -349 -547 335 -567 464 -593 -86 25 251 -529 -775 -636 400 -1066 -406 -231 -188
1793 -188 -307 206 479 -130 555 -79 491 700 403 247 -673 345 759 -71 -871 35 333 1123 201 -128
1813 -128 373 189 1262 111 75 732 364 -745 336 222 -27 77 -1234 -557 -203 -230 -755 455 -187
1832 -187 -519 -535 -116 -75 -261 -321 385 -308 -330 215 -568 -314 -2 232 133 -790 -4 307 -711 570 404
1853 404 -883 -576 -171 -506 416 132 1028 -555 374 258 630 -540 530 338 114 138 473 72 322
1872 322 471 -48 441 415 216 -358 59 -135 -151 -264 -483 173 32 280 158 -423 275 331 85 -16 -117
1893 -117 141 105 -120 -39 -141 -374 -994 -255 -88 -477 -687 -570 560 -41 -340 -226 -229 -323 -133 -250 526
1914E26p47O25j50J1K37j291M36J038r37M72l27K12m11P83l90r0N7m64N83N20
1934F93j44m73k64M86l39k41K56M52l92L32q13O75o3k98J001r20oN36j18k77o41
1955e58L24l76m6R52J15m93k46J60m54J206j413P03n58R06r04J257j180j54J784
1974A025n05R1p41K75n96M11P90j352M75K18J251p46j940K061j89l13M04j275
1992f56R00l16n95R39q93J291j555pJ990p38L6R41j473L28K13l5q75O12p76J049
2012C80q43J26Q29m37k65J221J477k631m47J183Q05j552R51j002M69j14L42j068
2030e76J867k463J320r9r4n61O82R60j405Q18j508K054j607J399n68K68n20l64
2048c97K20Q7J26L07l01L68K08j730Q99J24N49r05K49p1m76O13L46N19j419K97
$$ plain form
1914 526 -221 404 254 265 502 -789 -353 685 -252 220 -107 105 -306 477 87 -3 54 -410 173 693
1934 693 549 76 -188 298 -41 -282 -26 426 34 366 -447 228 165 -133 868 -52 -58 478 360 83 -558
1955 -558 -234 -610 -656 296 411 -82 -328 -168 -622 584 -829 -126 -684 222 -682 575 -605 -759 1025
1974 1025 520 611 -130 145 -451 -40 750 -602 -127 91 1342 596 -1344 717 528 215 619 -656
1992 -656 244 -72 -667 272 -621 670 -885 -892 1098 360 396 1337 -136 192 405 370 -505 107 -669 380
2012 380 -463 -337 492 55 -210 1011 2488 -143 -590 593 1398 -154 797 -205 264 150 492 -576
2030 -576 1291 -1172 148 49 -45 -606 76 1036 -369 449 -1059 995 -612 787 219 487 -33 -397
2048 -397 -177 -90 36 343 42 410 618 -1112 -213 -89 460 -445 -196 -267 -743 -130 216 735 -684 -387
2068c87K13K95O42l62L87j211K80J83J045j198o48M2k11l76J448J9j62N03j557
2087a055J075L68k17R20j147N69l31M8r63P69k15J373n29k169J263k87J404j992
2105a116J35L05R39L3NO62j768N11J40P23J898k815N40M44j075J90L65N70N44
2124A230Q0j629R87Q06k253P28j13L79l02L74M4o57j642K072K98j204O63l2j28
2143b99J450q29o05K21r56O59P1k50N5Q96j136J659j498k93J079k2p6k80k79Q80
2163D47m79l67J161j54K81j181M46j92L7k80O47l66r21K40N18l85J094M20q76
2182I0m65N06o25Q05J12o1K78l68l59k23L33n09Q06p44K35M51J27l22M0j20p40
2203g53J502j42p5j26r58R64k12O37j369O23n20N80p63O64L06l65QN62q12Q4O89
$$ plain form
2068 -387 -174 121 763 401 788 -423 -143 40 1085 -113 -761 -719 -930 -1306 142 161 -1 502 -1055
2087 -1055 20 388 171 1091 -56 513 182 230 -733 36 -179 1194 665 -1504 -241 -528 876 -1116
2105 -1116 -981 -676 263 296 301 963 -805 -294 -154 569 2467 -348 192 636 -439 -249 116 686 1230
2124 1230 1310 -319 668 1474 -779 -51 -164 215 -87 287 331 -326 -1968 104 402 -802 -139 -171 -299
2143 -299 1151 322 -283 -62 -1018 -359 -288 -538 -483 413 -723 936 -562 -855 224 202 126 -154 -433 447
2163 447 -32 -399 762 608 889 -292 154 -38 -1 -281 366 0 -921 -681 -163 -548 546 966 90
2182 90 -375 131 -494 311 423 362 640 272 -87 -310 23 -486 320 -424 -189 262 389 67 107 -13 -753
2203 -753 749 607 532 406 -552 412 200 837 -532 91 -429 151 -612 52 358 -7 1 563 -249 -165 524
2224E24l35J219j043N21q31M27q27O41o19J546n47j66J023q73j261J082m25j0
2242D6M23j31J78m50p61J081L6L96o07l13k50M38q74K068j514M33j15J12o4j140
2262a008n43J586k51j87J4N03m17J428o86j271P4J480L53L31p45N1L20K92j493
2281a69K74n91J73J196j591Q14Q3j76j359K338k129J164Q46j060l99P13j55L67
2299C39M38j586J69L1o37K149m65r90M70N37l22k52M59j435J515J15q1r31M03
2318g4K61%o14M16p59J390j127N08l80J35N32l41K10m1N06p81M17J09J84o01M25
2339C75M7j258J226j90k99P77j291N36K26J034j254P18j054M76n57O41J86j011
2357f72n5Q27n51l2O78k42P73j63o1j232k67J085J87M48k5q2N63p57n58R68j772
$$ plain form
2224 524 189 1408 365 886 55 482 -345 296 -323 1223 676 510 1533 660 -601 481 56 46
2242 46 469 338 516 66 -695 386 422 818 211 -102 -352 86 -788 1280 -234 199 84 196 132 -1008
2262 -1008 -1551 35 -216 -403 -389 114 -303 1125 439 -832 -758 722 1075 1406 661 712 1032 1324 -169
2281 -169 105 -486 -313 883 -708 106 189 13 -1346 992 -1137 27 873 -187 -586 127 -28 339
2299 339 777 -809 -640 -609 -1246 903 438 -552 -82 455 133 -119 340 -1095 420 535 454 -477 -74
2318 -74 187 187 -427 -11 -770 620 -507 1 -379 -244 288 -53 157 116 622 -159 258 367 551 -50 375
2339 375 422 -836 390 200 -99 678 -613 -77 149 1183 -71 647 -407 69 -488 153 339 -672
2357 -672 -727 100 -451 -483 195 -47 726 563 502 -730 -997 88 275 723 698 616 1179 422 -136 832 -940
2378i40K92K03l93N51J630j246q68J126j6p85r44J402r67K442k044K93Q9M12p13
2397d76L90J586k667J624j464N43N83N44M57r62l19k32J137n60J72p92Q08k83
2415H9j46K40j069R83m82k67L74l80L36J786j253M34j178O63r66J532k96K38p42
2434a04K14J52m88m81J093p0j236J483j223J591l52j14r34M45NL67q74M10m28
2453e44Q96l88k96K32R1o0q2K61J55m99L7k90M61J11o59o52J293k12K16k69n77
2474g75J326m45o57J048j304J147p41J158j951K76L89J85J031r33k12j65L14O
2492c03J015j48l49p32N10l63M01o86M0R58p60L67N7k33j90L89l31M51k87P36
2512E42j278Q61J43l02K18Q4J70p60K23K15k37R02m85j212P52j89L70j049O16
$$ plain form
2378 -940 -648 -445 -838 -287 1343 97 -771 355 339 -446 -1390 12 -955 1487 -557 -264 -175 237 -476
2397 -476 -86 1500 -1167 457 -1007 -464 119 663 1120 158 -161 -393 744 184 356 -436 372 89
2415 89 -57 183 -886 97 -385 -652 -278 -658 -322 1464 211 645 -533 130 -836 696 400 638 -104
2434 -104 110 262 -226 -707 386 316 -920 563 -660 931 579 465 -469 -24 -19 348 -526 -116 -544
2453 -544 352 -36 -332 -100 -9 -69 -151 110 265 -234 -197 -487 -26 85 -574 -1226 67 -145 71 -198 -775
2474 -775 551 106 -551 497 -807 340 -401 757 -1194 -918 -529 -344 687 -246 -458 -623 -309 -303
2492 -303 712 564 215 -517 -7 -370 31 -655 -615 343 -417 -50 7 -226 -416 -27 -358 93 -194 542
2512 542 -736 125 268 -34 184 268 438 -322 -99 116 -121 781 296 -916 -164 -353 17 -1032 -416
2531d16l39J311q84M6J81l73K87n20K76l88K91L18J83J129j782K61k72Q50l50
2550a91k57P16Q1k88k3o05Q30K03j045O62k76K90P1n45k84M43J77M13m77L57r65
2571g13P99o94L49M16j33j67O01j23o55K93L70l90M5M12m12l07J32N01n67n4p2
2592c69k54Q52k54l10O64l71L14n85R67j208P89O2l22k49J38O9J43L4o2J22m07
2613b37K92M85o27j92K02j35k83M05Q16O5m67M2p27j46N62P80m61p06L79j38K84
2634A93n53L14m93J344j501J18p4J108p00L23N58m06J4j74k08K93n24Mo34J581
2654E83k92R7L0l76l33j0k31N44L87j075J65J588j373P53K74l37Q5j054m40O70
2674c45K18q68R31Q21o5j046R40o5l11j067M82N3P03m00j60Lr17P88r89J76J367
$$ plain form
2531 -416 -755 556 -328 -282 -101 -474 -187 -707 -431 -819 -528 -210 -27 1102 -680 -419 -691 159 -191
2550 -191 -448 268 349 61 38 -567 263 466 -579 83 -193 97 168 -377 -661 -218 -41 372 -105 252 -713
2571 -713 86 -608 -259 157 24 -143 458 335 -320 -27 343 -47 -2 410 -2 -309 -177 324 -243 -297 -369
2592 -369 -623 229 -25 -335 329 -42 272 -313 654 -554 235 297 -25 -274 -136 -67 76 110 48 170 -237
2613 -237 55 540 -87 -279 -77 -212 -495 -90 726 791 324 366 -361 -507 55 835 374 -332 47 -91 193
2634 193 -360 -46 -539 805 -696 -578 -652 456 -244 79 637 231 245 71 -137 156 -368 -364 -998 583
2654 583 291 388 418 42 -291 -301 -532 12 399 -676 -511 1077 -296 457 731 394 479 -575 -1015 -345
2674 -345 -127 -995 -64 757 692 -354 586 521 210 -857 -375 -322 381 -19 -179 -176 -1093 -305 -1294 -1118 249
2695B49q88J034m40K37K74r14L85j105J154jP08j611J192j230M87o7P90n51N41
2714B44o27L64j110J038K82q42O63K55o70Q38m11%q38O87O83n99O68P0o75J77
2734A97n80O30o63l09L97P37n93J399k43qj143r07J340k59L77r07j569K036K55
2753A87m95k33K94r40N76J545o14j003J105j77j56q1J98j372N12J138L4L32j960
2772a110J098n14P02j67N45o73p20J358p51M11r52P63K27J96r49L90J25n27L30
2791b18P51q18P12n52j14L69N6n98N88q27K80K97K80q48N98k47R62q09Q82k29
2811E15j279L82j15m79O55Q32r01J206l86m79M78r43R89p68K35L41l70k11M28
2830A30k71L84N5j72Q8j68J08l49J00K37M37r86j3K36M52l45K04r4M4l53M38l7
$$ plain form
2695 249 -639 395 -45 192 466 -448 -63 -1168 -14 -15 693 -918 274 -956 -469 -536 254 -297 244
2714 244 -383 -19 -1129 -91 191 -651 12 267 -403 435 24 24 -814 -127 556 -43 625 695 20 197
2734 197 -383 247 -416 -725 -328 409 -184 1215 972 964 -179 -1086 254 -5 372 -535 -2104 -68 187
2753 187 -308 -541 -247 -1187 -611 934 320 -683 422 245 89 8 206 -1166 -654 484 518 850 -1110
2772 -1110 -12 -526 176 9 554 -119 -839 519 -232 179 -773 -10 217 413 -536 -146 -21 -548 -218
2791 -218 533 -285 427 -125 -239 130 186 -412 176 -651 -371 -74 206 -642 -44 -291 671 -138 744 515
2811 515 -764 -382 -497 -976 -321 511 -390 816 430 -49 429 -514 475 -293 -58 283 -87 -298 130
2830 130 -141 243 298 126 214 46 154 -195 -95 142 579 -407 -420 -184 268 -77 127 33 77 -276 162 125
2852A25k82j02M05j7P0l84r0P15p68k9O78J18q56K23O31l00L3M3j90J75p36J10
2874d28P35l42rnk74J91L4n8m08M98J39q4L79k42L80r61P80M5r4pj72l99K90K35
2898B23k67L63o21M55k38L52p87J179n32j404J155Q43j366J555r82O6o42O12R00
2917H64p99p21N34k20m0l65J713n74r91J300j144N98p14L50L62k40l78O85p82
2936e62K32M15j76l27k01N13M28J20q80J67K79q1O47j002P47p54L79K3M80l13
2956A34J72m76J360j948M96N95m52o39O99n05N56N33j316J421k18j69j168P18
2974b07K05R7o1J08p10R62n89p43J175J7n09P58k46l0n05M68o00J230j011N7j28
2995b62J85M96l38L51q97N3O76j77M91q91J99J52J65j538J651Q3l17k63o28k92
$$ plain form
2852 125 -157 -259 146 129 199 -185 -275 440 -328 -357 321 439 -417 -194 437 137 170 213 23 198 -538 -428
2874 -428 307 -35 -44 -49 -323 -132 -98 -156 -564 -66 73 -11 368 126 506 -455 325 370 276 269 97 -302 -12 223
2898 223 -44 319 -302 153 -85 267 -520 659 127 -1277 -122 721 -645 910 -72 -6 -648 -36 864
2917 864 65 -656 -122 -342 -382 -747 966 392 -599 701 -443 155 -559 -209 153 -87 -465 220 -562
2936 -562 -330 85 -91 -418 -619 -106 322 442 -438 -271 8 -73 574 -428 319 -435 -56 -33 447 134
2956 134 306 -170 1190 -758 -262 333 -119 -758 -59 -564 -8 525 -791 630 412 243 -925 -207
2974 -207 -2 95 34 142 -568 394 -195 -938 237 254 -255 503 257 227 -278 190 -410 820 -191 -134 -262
2995 -262 -77 419 81 432 -465 -412 264 87 578 -313 -114 38 203 -1335 316 399 82 -181 -809 -1101
3015a101P45q80Q51J214J31k42n75J34k48P72j175J146K08l70p58J070j197K71
3033dJ94p99J145j028M26P39k78m15N50L92k062J562q69Q51m12K16o6j33O52j104
3053d43N2M21k74P63j025N18O27o19j96N0M42o21N98m28M37n62l62R91m7K06j97
3074C31j162J130J7j482J385l99N09k32j81O7q77J824j003O03p28J6q92J561r23
3093d36O61p3J84k13K82J17m23n16K46j90P24j28K46K43j265J082n54l87p87J010
3113a77J0M57j053R07k81K03K61N9J93o16q90M17J789j874k32P3P56p9k40J13
3133b04L00R8j61j4O67n77R5M8l11L91M69J86j22p09k25q76J501l23M73k79p80
3154c53R08o87l73O34k9j2n09M91n35O54O4M37j089K71N75p59l38P97j672K320
$$ plain form
3015 -1101 -356 -1236 -385 829 960 718 143 277 29 801 -374 772 980 610 -148 922 -275 -4
3033 -4 190 -609 536 -492 -66 673 395 -20 530 922 -1140 422 -447 404 -8 208 142 9 661 -443
3053 -443 -391 30 -244 519 -506 12 639 20 -176 -126 316 -305 293 -135 302 -260 -622 369 322 528 331
3074 331 -831 299 316 -1166 219 -180 329 97 -84 -17 -894 930 -73 530 -198 -182 -1074 487 -436
3093 -436 225 152 336 123 405 522 99 -417 -171 -361 363 235 481 724 -541 541 -13 -400 -1187 -177
3113 -177 -167 290 -763 144 -137 66 327 386 579 -37 -927 -510 1279 -595 -827 -754 2 -77 -317 -204
3133 -204 96 194 33 19 686 109 204 252 -59 332 801 987 865 156 -69 -945 556 233 706 427 -353
3154 -353 555 -132 -505 129 100 88 -421 70 -465 189 253 690 -399 -128 447 -312 -650 147 -1525 795
3174G95p62N3l0p51P98j13o57M11K35N44p46K59K96j279Q59k11p64N77k49J46
3194e89N63nL9j21L10j173P87k12J619m97j247L37L89o32K84J86j98l33L60K06
3214G3j42L97J29j249N62q8N13l21N26L63j076N34m3K23j48l38M50L8M0o51K37
3235B9k99P41r53M53O29r5o58k10R9K3J76o53N8M83r8J34O63P57j451j016J776
3256E88K47j197O96r21J411j213N26P56j121j12K38P90L52p37r81J332m01l92
3274a39j110J210O89M73j101J60M29q77l2o23L77J87K74K43j033P32J431j914
3292f24O68L91%j70L92j596J062j03L52k91L35m18J58O9k76L23r28J744j670J410
3312H28j003n93J484j53m30j41j284R96J13o85l11J762k42n12R5O80q96J79J0
$$ plain form
3174 795 33 86 56 -695 103 -10 -667 -256 -21 523 -223 36 332 -947 -88 -299 -1063 -486 -735 -589
3194 -589 -26 -31 8 -113 197 -976 -189 -401 1218 721 -526 -189 200 -432 -148 38 -160 -493 -133 73
3214 73 -69 328 457 -792 -230 -318 195 -126 400 763 -313 221 178 401 253 -85 365 403 443 -208 29
3235 29 -270 471 -482 -29 600 505 -153 -363 -264 -241 -65 -718 -660 -177 -275 -141 522 1279 -172 -1188 588
3256 588 835 -362 334 -587 824 -389 137 893 -228 -340 -102 688 1040 303 -678 654 253 -139
3274 -139 -1249 -39 650 1123 22 182 611 -266 -298 -921 -544 -357 -83 160 -873 -141 1290 -624
3292 -624 44 435 435 265 657 -939 123 20 372 81 416 -2 156 225 -51 272 -656 1088 -582 828
3312 828 -175 -768 716 563 133 -8 -1292 -296 -183 -868 -1179 583 341 -171 -76 604 -292 -113 -103
3331a03K93O9n78N6J521o32n14L09m07m13M43O32l25J96l96O2o25M88J39J23o59
3352c21k22N09J327j725L55j271J563o37l84J211o27j49N82o96o24J001Q00M38
3370A130j081J206j991K147j818j83M44j80m73O71J1j750J658k12L22p96J614
3387G19p19j032M70N96m30l51J250j053P30O60j300O6L51r2M76J86l16k93K61
3406A79j450M54J140L8k55o16J94R08J75Ok48r96q8J066j689J207R95q29j479
3425a288P31K22l17M84l35O68Jj91q47N56J93K96n82K12K61j020N99M76J060j542
3445c63P98m44k8J18J505j188r19J60q18R31m73L19o49J711j706J404K70r61k55
3464e88K58O01N49o40j65N32O10j755l53J234o93J417P4q34L53J147j107k023
$$ plain form
3331 -103 190 259 -319 -263 1258 626 112 421 14 -399 44 676 351 547 151 213 -412 76 215 338 -321
3352 -321 -543 -34 1293 -432 -77 -1348 215 -422 -806 405 -222 -371 211 -485 -1109 -108 692 1130
3370 1130 49 1255 -736 1411 -407 -590 -146 -326 -799 -128 -117 -1867 -209 -421 -99 -895 719
3387 719 0 -1032 -562 34 -396 -747 503 -550 180 840 -460 -394 -43 -135 341 527 211 -82 179
3406 179 -1271 -817 323 361 106 -510 -316 592 767 773 525 -471 -559 507 -1182 25 1020 191 -1288
3425 -1288 -557 -335 -652 -168 -503 165 166 -25 -872 -316 -123 173 -409 -197 64 -956 -357 119 1179 -363
3445 -363 435 -9 -37 81 1586 398 -521 -361 -1179 -248 -721 -402 -1051 660 -1046 358 628 -333 -588
3464 -588 -330 271 820 180 15 547 1157 -598 -951 283 -410 1007 1081 247 600 1747 640 -1383
3482a383J579P65j221Q60j170J019o01L74l98N99j00J72j132j59R40m85N20q59
3500f80L80L67N58q72l51N11J23K07n67L44l27Q09q05k13N83r9k2N26o00K24J186
3521A282j864M87P16j273R59j26O6j68Q9J77m20O81j623Q87Q22n61J66o00N59
3540B56K47r74M4K45M91K56o97O90r83M72J74k93k17N9NQ61m96J89j33Q3o75K82
3562a14k97K87L95m97m1J36P3J85j24L33j89j88R9k15L66n80J91L71k39J87o9
3583G0j03K64k75j10L31q8l41N49m49J68Ql00o7K43o7P85q01K26MK2l37K34O85
3606F51m67l48kK32l24J02K79k97J36j48j76J36K86N5m21M91j17K66n73J09P7
3627e3k49L06n8J87k48L20k26Q2k14J23J2q8M5P8K22q9p25J068l41o92J129n46
$$ plain form
3482 -1383 196 961 -260 600 -570 449 -152 222 -176 423 323 495 -637 -796 144 -341 179 -680
3500 -680 -300 67 625 -247 -598 -87 36 243 -324 20 -307 502 -303 -516 67 -32 -54 472 -128 96 1282
3521 1282 -582 -95 621 -652 307 181 247 79 168 345 -75 606 -1017 -130 692 131 297 -303 256
3540 256 503 -471 -427 -182 309 565 -132 558 -425 47 221 -72 -289 -230 -225 636 140 329 196 279 -396 -114
3562 -114 -411 -124 271 -226 -267 -131 -58 127 3 336 147 -41 58 -157 209 -371 -180 191 -48 139 70
3583 70 -33 231 -44 -154 177 89 -252 297 -152 16 24 -276 -343 -100 -167 618 -183 43 47 69 -268 -34 651
3606 651 184 -164 -166 66 -258 -156 123 -174 -38 -186 -362 -226 60 115 -306 185 68 334 -239 -130 -53
3627 -53 -302 4 -54 133 -115 205 -21 61 -153 -30 -18 -106 -61 17 239 150 -575 493 152 -540 589 43
3649D3l8M2K95n88K57R4m7n24O84J00o7l91K74j46J18k72K42j94O9j04j83J40
3671a96p5L40k03M70q09N75P37m48J89m54o40P45m27J72O34k36J49p20k25Q61
3691D39n66O93k24J10l04o14K19N72m27R6k1m7j8K17K59p93J60L70RK16k76j92
3713a22N7M7J41l3l55K74j9j36q2L44k62J02K0P4k50p8L34k41K0K12m7j48J90
3736D2j21J38J03k64LJ52j37K05K06j2l11k42K51l9J14o7j5j64J17n3L77j71J16
3759B28k33N1j49nJ62n4m7k39K08j9L5MK20n7J33m45J51K23k1R8m73M27l10k91
3783d03J06L16K33l46J48j29p51J223J06m35M17l80o00K74K99L57l66k62N3k57
3803c97R6o4Q36q14Q16k44N50j323O43j52l68j24J232m45n69N18K96r36k63P55
$$ plain form
3649 43 5 47 342 -246 11 105 58 -466 218 318 251 -140 134 -12 106 -166 76 -118 -49 -153 -336 -196
3671 -196 -271 69 -134 336 -473 102 839 391 580 126 -514 231 -196 -24 610 374 523 -197 -422 439
3691 439 -127 566 342 452 148 -466 -247 325 -102 -6 -27 -74 -92 125 384 -409 -249 121 130 346 70 -122
3713 -122 -65 -18 123 90 -265 9 -10 -146 -228 116 -146 -44 -24 50 -200 -278 56 -185 -165 47 0 -148 42
3736 42 -79 59 162 -102 -99 53 -84 121 327 315 4 -238 13 -26 88 21 6 -158 -41 -94 283 112 228
3759 228 -5 46 -103 -108 54 0 -47 -286 -78 -97 -62 -58 162 105 238 -207 -56 167 146 244 -229 198 -112 -403
3783 -403 -297 19 252 -94 54 -75 -826 397 503 68 485 105 -495 -221 78 435 69 -193 -140 -397
3803 -397 -301 -365 471 -343 473 229 779 -544 99 -53 -421 -545 687 242 -327 191 487 -449 -712 43
3823D3K88n92J051j440P85j82K11p07J09j21J37K85N64M04m66N15r66O97k88N18
3843H45j545Q80k22Q81l35k14j447J495r94J218m84k18K49L78p27R2P25j89k59
3862A29j87L61n73n5l31J090l44R9K91l69m53N18m86j51L42J334q43Rl03K01L78
3883F57p07J231j791Q00r71N93N9n16K068j115K26o18J659j984K08n4K65Q57m22
3902D45l56J92j92k46n4N96p80M78j76m04O23n20O61n35K49m26L33M7J33R9K40
3923D07l23o45o8J105l99p17N81N19k52r34O19n1r5j59O37n42K10j65J88P1R0
3944G7O10l69K90n50J74l03M2r58J321n02p16N58P44k32L24n71r54R83n89Q77
3964B56l95p5L32P38j368J207o40j54j77L19m45R16J24j180M00R2J68j6q10Q10
$$ plain form
3823 43 331 -261 790 -650 135 -47 164 -543 -434 -555 -418 -133 431 835 369 884 -82 615 327 845
3843 845 -700 180 -42 839 504 290 -1157 338 -656 562 78 -140 109 487 -240 -148 577 388 129
3862 129 -58 303 -270 -325 -656 434 90 189 480 111 -342 176 -310 -461 -119 1215 372 381 78 279 657
3883 657 -50 1181 -610 190 -781 -188 -129 -645 1423 308 534 -84 1575 -409 -201 -255 10 867 445
3902 445 89 281 89 -157 -211 385 -395 83 -93 -497 126 -394 267 -268 -19 -445 -112 -65 68 167 407
3923 407 84 -561 -629 476 77 -640 -59 460 208 -726 -107 -158 -253 -412 225 -317 -107 -272 -84 -13 77
3944 77 687 318 608 58 232 -71 -29 -987 334 -168 -884 -326 418 186 510 -61 -1015 -32 -621 256
3964 256 -139 -214 118 856 -512 695 55 -99 -276 43 -402 514 638 -542 -142 -50 118 102 -708 102
3984A02j85M25j58m23L78j70j42N96n52l86J010k42k52n35J94M06q7J16R8l13
4004a20J39K1m01J83P82q01l53L89K66p07R37j5l69l88Q62j03l74l0n83M16O68
4025D19m39K88j47oM5j002J150k92j91q15Q56M94j65j115J054m14L41n86P33k74
4045f6m9J49L28j126J322j140j00O61j21O48k57p02J018p45nj86j94R37j376J724
4065G20j821J564n54Q1M95j078R67l95o00P52M01j50m62j88k49R19j303J073r92
4084h20J419k07j729J490L62M52j285J6m92R7N58r14O16n15m72Q42L44l95J395
4103G62l48q53J454j682q33J394j16J048q43K3N77j119M39R00j359K12k02O65
4121A19o29K10k04R41p84P00n61l49n72J767J01j213P85p9r87R16r40R82l80K71
$$ plain form
3984 102 -83 342 184 -239 139 -31 -173 423 -129 -515 495 253 1 -534 -340 66 -21 95 193 -120
4004 -120 19 40 -361 -178 604 -197 -550 -161 105 -602 335 320 -49 -437 425 322 -52 -82 -665 -249 419
4025 419 -20 268 121 115 160 -842 308 16 -175 -990 -134 360 195 -920 134 -280 61 -525 208 -66
4045 -66 -115 34 362 -764 558 -582 -682 -21 -142 506 249 -453 565 -180 -185 -371 -565 372 -1004 720
4065 720 -1101 463 -91 -10 485 -593 374 -21 -621 131 532 382 -80 -268 -517 402 -901 172 -820
4084 -820 599 392 -1337 153 515 967 -318 -302 -794 -697 -139 -1053 -437 -952 -1424 -582 -238 -633 762
4103 762 414 -439 1015 -667 -1500 -106 -222 826 -17 6 583 -536 -97 803 -556 -344 -546 119
4121 119 -510 -300 -504 437 -347 353 -208 -557 -1129 638 739 -474 311 232 -755 161 -779 203 -177 94
4141I4l27N77j95K92l50j74n7P05r57o30P25J35M51o85l63J297l09k44L55j13
4161B27M7p4M86j333L66K0o11J107m73k49M31J067r69j0J96k67L59K73M34q10
4181B17l7k94l74K6O89j76j16k64j20J48l31P88o27R03o41m4j60kJ61n0K57l35
4203c82M40p65J566j004Q54k06o23J09M13M11o22q4K02J90o63J59M2k04J335j144
4223B4O98m70J88j27l60%qK07n61Q96n45J6N81r62M93K74k65k91j37N71n63R39
4245E98p85p4R24o23J74L84m52l43m97M19k73J151j105K5J2Q32J53k79L75r48
4265c32K79P2L44n78k99J29L85k4J54J210j306p78M47M91q53J097q69M34J6J83
4285B02L56j365P61J43N37q88L69k55L12k12m22L22R24j019N92P53p94j17N65
$$ plain form
4141 94 -233 344 149 441 91 -83 -140 565 -392 -1022 -297 -162 289 -396 -759 538 229 -15 340 227
4161 227 274 200 686 -647 -281 -261 -872 235 -238 -487 -56 1011 42 32 228 -39 320 593 1027 217
4181 217 180 -114 -488 -462 227 51 -65 -329 -449 -301 -632 156 -471 432 -209 -253 -413 -415 -254 -304 -47 -382
4203 -382 58 -707 859 -145 709 503 -120 -11 402 813 191 107 309 499 -164 -5 37 -167 1168 24
4223 24 722 252 440 313 -47 -47 -55 152 -409 487 -58 -42 539 -423 70 344 79 -212 -349 222 -341 598
4245 598 -187 -261 663 40 214 598 146 -197 -694 -275 -548 603 -502 -477 -465 367 520 241 616 -332
4265 -332 -53 19 363 -215 -514 -385 0 -24 130 1340 34 -744 -297 194 -659 438 -431 3 19 202
4285 202 558 -807 -46 97 634 -254 115 -140 172 -40 -462 -140 784 -235 357 1110 316 199 764
4304G64n41R35j139r23J572m92q63J417K63q54j14j629J289J56K10MN78k44j129
4323g40J043k39k52l53Q17m73K11R94r16M16l23q69R71J58l89L10j14o78L23L39
4343B36q28k08J232K05o01p00k26K72J052K51j483J484J30k47p91P7p02J329J22
4362F04n17L90n3K28l5o89j10n8J499r9j407K63m31J55m13P50k47mj092J474o4
4383A44P04j458N52O92q50J45m69J020n57Q7k90J77p77L89N43J60j86l86K056
4402A696k025J48J09o71k05K309q25M65q25O8j42N25r94P16N60j464M29j176K137
4421H35j382m41J535m56q63J263j72n38J601j557L35M62n56k46L18J58j329Q85
4439a48q0q62J729p40j83O98q61Q38r53N31K84O79j27m48n74N4O81m43n55R94
$$ plain form
4304 764 223 1158 19 -904 668 176 -687 730 993 139 25 -1604 -315 -159 51 55 633 389 -740
4323 -740 303 64 -188 -541 276 -197 14 1008 92 508 185 -684 287 445 56 366 252 -426 -103 236
4343 236 -592 -800 432 637 36 -664 -890 -618 434 685 -798 686 816 569 -222 -145 -847 482 604
4362 604 87 477 424 652 617 -72 -182 -240 1259 1160 -247 16 -415 -260 -673 77 -170 -174 -1266 208 144
4383 144 848 -610 -58 634 -216 -71 -540 480 -77 10 -280 -103 -880 -491 52 212 26 -360 1696
4402 1696 -329 -181 -72 -743 -948 1361 536 1001 176 244 102 627 -367 349 909 -555 -126 -1302 835
4421 835 -547 -988 547 91 -772 491 319 -219 1382 -175 160 622 66 -180 138 296 -1033 -148
4439 -148 -228 -1090 639 -101 -284 414 -447 391 -562 -31 253 932 805 357 -217 -163 518 75 -480 514
4459E14O61j071l04Q5J11L04j206O83L33K08o12M37N5M20j125M84p42K30J236
4478G01j387o7J690j114L99Q30j005K61m34l30J522q75J32p06K08N16o25Q3l39
4497e40J080q20L21Q13k347O39N97O61K81r78M4m64j22J563P2j493P10l0M09q28
4517d32M99j223P40J196j442J85J057r70J51L73l76N74n91J84j49J696j033j212
4535g73k70N24J272r6k66N68r71l85m30J03J073k1q1q90k74K709r85j92p58j56
4555b99M77K11m73J943m25q11r7K60p68J832k469M90N78J6J001j147p03J616n78
4574F54p52m98J5N8l59J261o65m99J244m33j45O78l2p17j60K82P0N07j43O20r12
4595G4M78j272O40k42K29J289j497O34l64M15K45N60l79n31l8l43j116N17J390
$$ plain form
4459 514 1175 104 -200 -115 -4 300 -906 -223 110 318 -294 143 198 618 -507 -23 -765 -535 701
4478 701 -686 -753 937 -177 222 1052 47 308 -126 -456 1066 191 323 -383 -175 341 -284 -201 -540
4497 -540 540 -280 41 854 -1493 -854 -257 404 685 -293 -249 -713 -835 728 800 -693 17 -13 396 -432
4517 -432 67 -1156 -416 780 -662 -477 580 -390 -239 134 -242 332 -259 -75 -224 1472 439 -773
4535 -773 -1043 -519 753 657 391 959 -12 -397 -827 -724 349 328 247 -643 -917 1792 807 615 -143 -299
4555 -299 178 389 -84 1859 1434 623 526 786 18 1850 -619 -129 449 465 1466 319 -384 1232 654
4574 654 -98 -596 -581 -523 -882 379 -286 -785 459 26 -119 559 527 -190 -350 -68 2 509 366 986 74
4595 74 552 -720 -80 -322 -93 1196 -301 333 -31 384 629 1189 810 279 241 -102 -1218 -701 689
4614F89o33Q85l3q05q46o2M82O97r22J613j468O60m88M48j21l92q31J016N68j069
4634f12R10j76L33p04L8J59j95n09K46N43l14R19j486J434K30j052m35l20J051
4653F0q19n2J299M81p90k42j518K098K08n38M41P5j572Q26p97J013Q37j917K047
4672A140j880P46q60L55m49K98Q84N63L19p57n7q30J363l78l35R21j128L3n5M44
4692C37M06l56j18q60L57m40m14J262Q05j056l34J050k407J154J719k605J503
4709Cj21k69Q59m95Q33k001J396j051N47n99J441j933Q01j30O67N35n46L17k6
4728B28l18k53n27N02p2m54J559n57o97P02m83J2k59K17P2J525j926j58R4J078
4748B85m32M89j536J219k16J343j280L88j40r43J376j036J51L01N68J64Qq16k6
$$ plain form
4614 689 56 941 908 103 -743 -805 -323 374 -548 1065 -403 257 -231 217 96 -296 -1127 -111 457 -612
4634 -612 298 122 455 -249 -211 -52 -247 -756 -510 33 -281 638 -848 586 816 -236 -671 -991 60
4653 60 -759 -811 488 969 179 -63 -1581 517 725 187 628 703 -869 -43 -840 173 1010 -907 1140
4672 1140 -740 6 -854 -499 -948 -650 234 797 1116 359 302 -528 835 457 122 1043 -85 -52 -107 337
4692 337 743 387 269 -591 -234 -674 -1088 174 979 -77 -411 639 -1768 -614 1105 -1500 3
4709 3 -118 -387 472 -23 810 -1191 205 -846 -299 -898 543 -1390 -589 -719 -52 483 -63 254 228
4728 228 -90 -343 -870 -368 -440 -894 665 108 -589 113 -370 -358 -617 -400 -328 1197 -729 -887 -793 285
4748 285 -147 342 -1194 25 -191 1152 -128 260 120 -823 553 -483 -332 -31 537 701 709 -107 -133
4767a33J80l47o98J342L72r9o27M91l33l22M74R3o68K42P8L53K4m27l47R63p68
4788a57j24K8L82m2K03l48R41o67k67Q9q52Q65N46o31Q49m92j95k90j85P26M15
4809G94p35m81J005m01L86j068P61j324J501l50m70J75K02L07l36N02q07K03n93
4828g29P2J498j34p41L2M53K31j438O27N05q6o1l71o12J026o05Q16K54j122L87
4848BK9m37L62K10n59r0M35j29Q4K31P5Jn4n94O07k69N89o81N67j79J54q89J01
4871d34R78j83j9l86m8m69Q90n57r7J30N54m42P12r3P8o35Q7K70j67k65L80o64
4893c80O51m00Q8L07Q8o81M61J04n23J50k09J337j29q87k30L34O94j027M94R3
4913C35p95l50L5J903j887N05L66o46n41J315l87p3L91J71o90O90P37o62N01j432
$$ plain form
4767 -133 47 -300 -998 344 716 617 -10 481 148 -174 300 393 -275 -33 45 398 422 -5 -352 611 -157
4788 -157 -281 -253 129 87 290 -58 883 216 -51 38 -814 51 597 -34 815 323 128 -162 -347 379 794
4809 794 59 -422 583 182 568 -500 261 -1063 438 88 -382 -207 -5 302 -34 468 -339 -136 -729
4828 -729 -657 841 707 -34 -2 451 682 -756 -129 376 290 229 -142 -754 272 -333 483 737 -385 2
4848 2 31 -406 -44 166 -393 -483 -48 -177 -93 138 213 214 160 -434 173 -96 493 -188 379 200 354 -535 -434
4871 -434 544 361 342 -44 -92 -561 329 -228 -325 -195 359 -83 629 536 614 -21 66 336 169 -96 284 -380
4893 -380 271 -129 -41 266 354 -327 134 238 -285 -135 -344 993 864 -23 -253 81 775 -252 242 335
4913 335 -460 -810 -775 1128 -759 -254 112 -534 -1075 240 -147 -220 171 342 -348 342 1079 417 918 -514
4933e14O57R9M2K87m79J108j585P95L38j710L25Q68K46l20L53p76k53m78N45J082
4953F30j267Q83k72N72j296Q06N08n53L39j563K716k703Q10M70k5J85j45j07O46
4972F34o70M27L42o71l57k72k8p8Q81r32O58m38J362p24L62m53k28o12O89L75
4992B67k04l70J019q19N2o31J75L48m29N05l07j67J599j051k52Q92q19M38m90
5011b44R41r42L62n88R08l84J84L14n19O8Q11r35m56O9O26n52P17n27P77k6O2
5032F66n72p99J518j247m99J067J46k02M93n36j176J502k70M55j175Q13k85J43
5050D2m62O59m28M26o71M47L22P0o18O67o43l20L10m2J0K61o0j40j73J2L26n18
5072e23O47n7L93n65R3N7j62K95K30p44M94k14K10J67j9m96M11n22J64O18l88
$$ plain form
4933 -514 143 242 284 571 92 1200 -385 410 748 -962 -637 231 477 157 510 -266 -519 -997 -452 630
4953 630 -637 246 -26 546 -750 56 564 11 350 -1213 1503 -1200 -390 80 55 240 95 -12 634
4972 634 -36 391 733 62 -295 -567 -595 -673 208 -724 -66 -504 858 134 496 43 -185 -797 -108 267
4992 267 63 -307 712 -107 -55 -686 -511 -163 -592 -87 -394 -561 1038 -13 -265 627 -192 246 -244
5011 -244 697 -245 117 -471 437 53 237 551 32 100 911 -24 -480 -411 215 -337 380 -147 630 604 666
5032 666 94 -705 813 -434 -933 134 280 78 571 35 -1141 361 91 546 -629 184 -101 42
5050 42 -420 239 -189 237 -434 13 335 405 -213 454 -189 -509 -199 -241 -231 30 -30 -170 -343 -331 -5 -523
5072 -523 124 67 460 -105 -12 45 -117 178 408 -336 158 -56 154 321 302 -194 217 -305 -141 477 89
5093H9j25p9N27J30n66M27q3n62L50K48r37Q85o3l04J86m27L76M08q40M09J99
5114B48m98K94j71L12j99j72K80l83K53N7J4Q6k20nJ1L41j55K35j83J17k02j31
5136g1k53R0K60J52m87J48M91n78k56p1Q30m42j81R1j30Q4L39lj51k4L5J99n6
5159A6N26m16K74m31K68j41L45l28o91Q69K17r08N00l88JJ76K32J37l06L39n01
5180b10K87m7K42k99R2k8j01l73L97M72L3m69J71n45O63l74n2J87k74M57j96l86
5202c53K6N90r71M27J023m50p8k02L92l64K52p80K34L29j94Q5m19n53K341j166
5222A69j24j0j399J589k33N64L25j294O81q63N02l86Q9N80N7M28J468j878n43
5241b78l89M55J239j507M43M08m63P80k189J163N17J03m25l52J011m80l87Q63
$$ plain form
5093 89 -36 -115 412 542 -24 403 320 -242 108 356 -581 304 241 -63 123 -304 72 480 -360 49 248
5114 248 -250 44 -127 185 -14 -186 94 -289 -36 21 35 121 -99 -104 -93 248 93 328 145 262 60 -71
5136 -71 -324 -234 26 178 -309 -161 330 -248 -504 -575 255 -187 -368 -277 -407 -323 16 13 -138 -162 -127 72 16
5159 16 542 126 400 -31 237 96 441 113 -578 291 508 -400 100 -288 -287 -111 121 258 -48 291 -210
5180 -210 77 30 272 -27 65 37 -64 -437 -40 432 465 -4 167 -378 285 -89 -141 46 -228 229 33 -353
5202 -353 -327 263 -708 -281 742 292 214 12 404 40 292 -488 -254 75 -119 -34 -453 -1006 1335 169
5222 169 45 35 -1364 225 -8 556 881 -413 268 -595 -93 -479 -390 190 247 675 2143 265 -278
5241 -278 -667 -212 1027 -480 -37 371 -92 688 -1501 -338 179 282 -143 -495 516 36 -351 512
5259E12j55p13J344j424J375l24j484N78p10M57J211j55J02l26jP85j133Rm46
5278d98q53J258j749K146J60j1o94M9L05o43O15p27K78K71q34N81K09L03l88J12
5298a10k82K14r2M45o5o81J15l2M82O23j266j24kJ042j15K19n29m9n16J292j533
5319i64P88k73P64k64K1K40J58q50L97R5Q68r36j54j52l66K97K64J81j10o5J63
5340A02l97O45q30L7N00M06m14j32l67N07m46J80N66k84N68p53O83q91K54o05
5360f71K10L06P65o11J01P5J04k36m98L72P48p29L07M4k98o5K43r4P66o64K57
5381D32l59k2m91k97M89M38m02N48k39l56M71l96n35J077m54j16l14J053q65N72
5401B34J21m80M15o49M46l43J457r40L66j95p75P60o89K4L86o87L69M56M7l97
$$ plain form
5259 512 357 -356 988 -436 939 615 -869 -291 -1001 -544 667 512 614 288 287 1072 -61 -52 -498
5278 -498 -1351 -93 -1842 304 464 453 -241 -192 113 -530 85 -642 -364 -93 -927 -346 -137 166 -222 -110
5298 -110 -392 -178 -270 175 110 -571 -456 -488 -6 617 -649 -773 -775 267 152 371 -158 -207 -723 569 -964
5319 -964 -176 -449 315 51 72 312 470 -380 17 112 980 44 -110 -262 -628 -331 -67 114 4 -61 102
5340 102 -295 350 -480 -443 57 463 49 -83 -450 57 -389 -209 357 73 641 -112 571 -320 -66 -671
5360 -671 -461 -155 610 -1 100 175 279 43 -455 -83 665 -64 243 287 -11 -76 167 73 839 175 432
5381 432 73 51 -440 -737 -248 190 -212 336 97 -259 212 -184 -719 358 -96 -212 -526 527 -338 234
5401 234 355 -125 290 -359 87 -256 1201 261 627 432 -343 417 -272 -248 138 -549 -180 276 323 -74
5421g4o26J306n21L7N22j332O84K57K61r08P05J81m27p07J87R10m11p61O56m52
5441e13O24j68j29L09o41nL27M17q44J76P15J13p41Q50r5p8L47j395J028o18N67
5462B46p89L43n49Q19N9L29j96M34j741J228m58O27m1j870J428p1J066j306P97
5481C55p91M20K32j062p2N57m23k81P81k7O63O69j116N48l32J004j470p97L39
5500h03Q77R4J07o96L60j9n1J73o78J61P77j223J053k02j314J016R41o50j75l01
5520e53J99K54l9m79K82P95k098K454j160Q0O95j2r11J033j044N22j76k05O85
$$ plain form
5421 -74 -700 606 85 122 644 -688 -4 253 514 -394 311 492 65 -642 -455 455 44 -717 -61 -513
5441 -513 111 -57 -186 123 -518 -523 -196 221 -623 -447 268 381 -360 490 395 317 664 -731 297 -321 246
5462 246 -543 -200 -749 70 129 458 262 696 -1045 183 -275 352 311 -1559 -131 -202 864 -442 355
5481 355 -436 -16 216 -846 -918 -361 -784 -1065 -284 -311 352 1021 -95 453 121 1125 -345 -1142 -803
5500 -803 74 168 275 -421 -61 -80 -131 42 -636 -475 302 -921 132 -70 -1384 -368 573 -77 -252 -553
5520 -553 -354 -100 -139 -618 -336 459 -1639 815 -345 -265 430 418 -493 540 -504 18 -158 -363 322
$$ [...]
8191C57
##END NTUPLES=NMR FID
##END=
