##TITLE=1H_Ser 2062-EA
 DMSO
 8 sc, 
 8.4.2024
##JCAMPDX= 6.0         $$ Bruker NMR JCAMP-DX V2.0
##DATA TYPE= NMR FID
##DATA CLASS= NTUPLES
##ORIGIN= UXNMR, Bruker Analytische Messtechnik GmbH
##OWNER= root
$$ XWIN-NMR		Version 3.5
$$ Mon Apr  8 15:04:43 2024 Russian Standard Time (UT+4h)  she@DPX200
##.OBSERVE FREQUENCY= 200.1309
##.OBSERVE NUCLEUS= ^1H
##.DELAY= (6, 6)
##.ACQUISITION MODE= SIMULTANEOUS
##.ACQUISITION SCHEME= undefined
##.AVERAGES= 8
##.DIGITISER RES= 18
##SPECTROMETER/DATA SYSTEM= spect
##.PULSE SEQUENCE= zg30
##.SOLVENT NAME= CDCl3
##.SHIFT REFERENCE= (INTERNAL, CDCl3, 0, 15.7039)
##AUDIT TRAIL= $$ (NUMBER, WHEN, WHO, WHERE, WHAT)
$$ ##TITLE= Audit trail, XWIN-NMR		Version 3.5
$$ ##JCAMPDX= 5.01
$$ ##ORIGIN= Bruker BioSpin GmbH
$$ ##OWNER= she
$$ F:/spectra/data/she/nmr/H-F/1/audita.txt
$$ ##AUDIT TRAIL=  $$ (NUMBER, WHEN, WHO, WHERE, WHAT)
(   1,<2024-04-08 15:03:47.37 +0400>,<she>,<DPX200>,
      <created by zg, POWCHK disabled, PULCHK disabled
       configuration hash MD5:
       00 E9 B6 7A A2 85 ED C7 34 08 36 98 17 FE 4E 26
       data hash MD5: 16K
       55 B3 28 F4 9D 1F FF A5 B4 1D 8F AC AD F3 CF 08>)
$$ ##END=
$$ 
$$ hash MD5
$$ ED 39 71 51 79 29 79 BD FE 04 88 B2 A0 93 F5 31
##$RELAX= 
##$RELAX= 
##$RELAX= 
##$RELAX= 
##$RELAX= 
##$RELAX= 
$$ Bruker specific parameters
$$ --------------------------
##$DU= <F:/spectra>
##$EXPNO= 1
##$NAME= <H-F>
##$PROCNO= 1
##$TYPE= <nmr>
##$USER= <she>
##$AMP= (0..31)
100 100 100 100 100 100 100 100 100 100 100 100 100 100 100 100 100 100 
100 100 100 100 100 100 100 100 100 100 100 100 100 100 
##$AQSEQ= 0
##$AQ_mod= 1
##$AUNM= <au_zg>
##$AUTOPOS= <>
##$BF1= 200.13
##$BF2= 200.13
##$BF3= 200.13
##$BF4= 200.13
##$BF5= 200.13
##$BF6= 200.13
##$BF7= 200.13
##$BF8= 200.13
##$BYTORDA= 1
##$CFDGTYP= 0
##$CFRGTYP= 5
##$CHEMSTR= <none>
##$CNST= (0..31)
1 1 145 1 1 1 1 1 1 1 1 1 1 1 1 1 1 1 1 1 1 1 1 1 1 1 1 1 1 1 1 1 
##$CPDPRG= <>
##$CPDPRG1= <>
##$CPDPRG2= <>
##$CPDPRG3= <>
##$CPDPRG4= <mlev>
##$CPDPRG5= <mlev>
##$CPDPRG6= <mlev>
##$CPDPRG7= <mlev>
##$CPDPRG8= <mlev>
##$CPDPRGB= <>
##$CPDPRGT= <>
##$D= (0..31)
0 1.2 0 0 0 0 0 0 0 0.06 0 0.03 0 0 0 0 0.0002 0 0 0 0 0 0 0 0 0 0 0 0 
0 0 0 
##$DATE= 1712574226
##$DBL= (0..7)
120 120 120 120 120 120 120 120 
##$DBP= (0..7)
150 150 150 150 150 150 150 150 
##$DBP07= 0
##$DBPNAM0= <>
##$DBPNAM1= <>
##$DBPNAM2= <>
##$DBPNAM3= <>
##$DBPNAM4= <>
##$DBPNAM5= <>
##$DBPNAM6= <>
##$DBPNAM7= <>
##$DBPOAL= (0..7)
0.5 0.5 0.5 0.5 0.5 0.5 0.5 0.5 
##$DBPOFFS= (0..7)
0 0 0 0 0 0 0 0 
##$DE= 6
##$DECBNUC= <off>
##$DECIM= 32
##$DECNUC= <off>
##$DECSTAT= 4
##$DIGMOD= 1
##$DIGTYP= 9
##$DL= (0..7)
0 120 120 120 120 120 120 120 
##$DP= (0..7)
150 150 150 150 150 150 150 150 
##$DP07= 0
##$DPNAME0= <>
##$DPNAME1= <>
##$DPNAME2= <>
##$DPNAME3= <>
##$DPNAME4= <>
##$DPNAME5= <>
##$DPNAME6= <>
##$DPNAME7= <>
##$DPOAL= (0..7)
0.5 0.5 0.5 0.5 0.5 0.5 0.5 0.5 
##$DPOFFS= (0..7)
0 0 0 0 0 0 0 0 
##$DQDMODE= 0
##$DR= 18
##$DS= 0
##$DSLIST= <SSSSSSSSSSSSSSS>
$$ [...]
##$SUBNAM2= <"">
##$SUBNAM3= <"">
##$SUBNAM4= <"">
##$SUBNAM5= <"">
##$SUBNAM6= <"">
##$SUBNAM7= <"">
##$SUBNAM8= <"">
##$SUBNAM9= <"">
##$SW= 18.0517689322627
##$SWIBOX= (0..15)
0 0 2 0 0 0 0 0 0 0 0 0 0 0 0 0 
##$SW_h= 3612.71676300578
##$TD= 16384
##$TD0= 1
##$TE= 0
##$TE2= 300
##$TE3= 300
##$TEG= 300
##$TL= (0..7)
0 120 120 120 120 120 120 120 
##$TP= (0..7)
150 150 150 150 150 150 150 150 
##$TP07= 0
##$TPNAME0= <>
##$TPNAME1= <>
##$TPNAME2= <>
##$TPNAME3= <>
##$TPNAME4= <>
##$TPNAME5= <>
##$TPNAME6= <>
##$TPNAME7= <>
##$TPOAL= (0..7)
0.5 0.5 0.5 0.5 0.5 0.5 0.5 0.5 
##$TPOFFS= (0..7)
0 0 0 0 0 0 0 0 
##$TUNHIN= 0
##$TUNHOUT= 0
##$TUNXOUT= 0
##$USERA1= <user>
##$USERA2= <user>
##$USERA3= <user>
##$USERA4= <user>
##$USERA5= <user>
##$V9= 5
##$VALIST= <valist>
##$VCLIST= <CCCCCCCCCCCCCCC>
##$VD= 0
##$VDLIST= <DDDDDDDDDDDDDDD>
##$VPLIST= <PPPPPPPPPPPPPPP>
##$VTLIST= <TTTTTTTTTTTTTTT>
##$WBST= 1024
##$WBSW= 4
##$XGAIN= (0..3)
0 0 0 0 
##$XL= 0
##$YL= 0
##$YMAX_a= 120677
##$YMIN_a= -219189
##$ZGOPTNS= <>
##$ZL1= 120
##$ZL2= 120
##$ZL3= 120
##$ZL4= 120
##$ABSF1= 10
##$ABSF2= 0
##$ABSG= 5
##$ABSL= 3
##$ALPHA= 0
##$AQORDER= 0
##$ASSFAC= 0
##$ASSFACI= 0
##$ASSFACX= 0
##$ASSWID= 0
##$AUNMP= <proc_1d>
##$AZFE= 0.1
##$AZFW= 0.1
##$BCFW= 1
##$BC_mod= 2
##$BYTORDP= 1
##$COROFFS= 0
##$CY= 11.3945322036743
##$DATMOD= 1
##$DC= 2
##$DFILT= <>
##$DTYPP= 0
##$F1P= 15.7292609196834
##$F2P= 12.9074282941183
##$FCOR= 0.5
##$FTSIZE= 0
##$FT_mod= 4
##$GAMMA= 1
##$GB= 0.15
##$INTBC= 1
##$INTSCL= 1
##$ISEN= 128
##$LB= 0.24
##$LEV0= 0
##$LPBIN= 0
##$MAXI= 10000
##$MC2= 0
##$MEAN= 0
##$ME_mod= 0
##$MI= 1.114404
##$NCOEF= 0
##$NC_proc= 0
##$NLEV= 6
##$NOISF1= 3.799351
##$NOISF2= 2.8
##$NSP= 1
##$NTH_PI= 0
##$NZP= 0
##$OFFSET= 15.70392
##$PC= 1
##$PHC0= -25304.18
##$PHC1= 15.18731
##$PH_mod= 1
##$PKNL= yes
##$PPARMOD= 0
##$PSCAL= 0
##$PSIGN= 0
##$REVERSE= no
##$SF= 200.130013532006
##$SI= 16384
##$SIGF1= 3
##$SIGF2= 2
##$SINO= 400
##$SIOLD= 16384
##$SREGLST= <1H.CDCl3>
##$SSB= 0
##$STSI= 0
##$STSR= 0
##$SW_p= 3612.71676300578
##$SYMM= 0
##$S_DEV= 0
##$TDeff= 0
##$TDoff= 0
##$TI= <>
##$TILT= no
##$TM1= 0
##$TM2= 0
##$TOPLEV= 0
##$USERP1= <user>
##$USERP2= <user>
##$USERP3= <user>
##$USERP4= <user>
##$USERP5= <user>
##$WDW= 1
##$XDIM= 8192
##$YMAX_p= 0
##$YMIN_p= 0
$$ End of Bruker specific parameters
$$ ---------------------------------
##NTUPLES= NMR FID
##VAR_NAME=  TIME,          FID/REAL,        FID/IMAG
##SYMBOL=    X,             R,               I
##VAR_TYPE=  INDEPENDENT,   DEPENDENT,       DEPENDENT
##VAR_FORM=  AFFN,          ASDF,            ASDF
##VAR_DIM=   8192,          8192,            8192
##UNITS=     SECONDS,       ARBITRARY UNITS, ARBITRARY UNITS
##FACTOR=    0.0002768,     1,               1
##FIRST=     0,             0,               0
##LAST=      2.2672688,     0,               0
##MIN=       0,             -219189,         0
##MAX=       2.2672688,     120677,          0
$$ Real data points
##PAGE= N=1
##DATA TABLE= (X++(R..R)), XYDATA
$$ plain form
0 0 0 0 0 0 0 0 0 0 0 0 0 0 0 0 0 0 0 0 0 0 0 0 0 -1 3 -5 7 -7 8 -8 8 -9 11 -12 15 -15 18 -19 21 -26 26 -30 34 -36 39
45 39 -44 49 -53 60 -65 73 -80 89 -99 107 -118 132 -150 169 -191 221 -256 303 -366 457 -604
66 -604 861 -1409 3070 -17741 -98426 -63404 54607 120677 65939 -28271 -62846 -52589 -65771
79 -65771 -80559 -25493 72671 94301 17613 -40831 -5868 50804 46010 9633 -235 -10405 -57578
92 -57578 -87274 -32679 52170 59489 -9553 -50944 -23765 4769 -16256 -33982 10129 74405
104 74405 74163 11641 -27095 -178 30202 2517 -52171 -63598 -30576 -15325 -35354 -38452 9091
117 9091 62696 68733 41798 27713 22021 -12541 -60664 -58250 278 38974 9670 -34269 -25491
130 -25491 12655 17261 -4611 4119 38608 30748 -33493 -73570 -27414 52851 72302 22744 -21458
$$ packed form
0@%%%%%%%%%%%%%%%%%%%%%%%jMqJ2j4J5j6J6j7K0k3K7l0L3l7M0m7N2n6O4p0P5
45C9q3R3j02J13j25J38j53J69j88K06k25K50k82L19l60M12m77N59o69Q23j061
66f04J465k270M479k0811q0685L5022J18011O6070n4738r4210l4575J0257j3182
79f5771j4788N5066R8164K1630p6688n8444L4963N6672m794l6377r868j0170m7173
92e7578k9696N4595Q4849P319o9042m1391K7179K8534k1025j7726M4111O4276
104G4405k42o2522l8736K6917L0380k7685n4688j1427L3022J5251k0029l098M7543
117I091N3605O037k6935j4085n692l4562m8123K414N8528L8696k9304m3939Q778
130b5491L8146M606k1872Q730L4489p860o4241m0077M6156Q0265J9451m9558m4202
$$ plain form
143 -21458 -19843 -5009 -10166 -16052 2383 19631 4878 -21127 -15766 18146 33447 13982 -8562
156 -8562 -11059 -12381 -26300 -25069 11670 47534 32590 -12285 -19875 22547 46221 7192 -44297
169 -44297 -42620 -6627 -2140 -30295 -29131 21531 59618 35771 -12384 -17359 16036 27951 -530
182 -530 -24241 -14022 1535 -8014 -22328 -10631 12043 10791 -7597 -9138 7264 9264 -9319
195 -9319 -12754 14897 37470 20576 -12114 -15092 3709 587 -28778 -36762 -2816 26786 9359
208 9359 -25982 -23124 16781 38716 19767 -4206 -2918 3069 -10410 -25695 -10699 19379 21010
221 21010 -6844 -21771 -5940 9838 -676 -13426 -827 15746 3776 -21789 -15530 21685
233 21685 38424 10078 -21636 -13582 14438 13770 -14574 -25446 -3302 14311 -1000 -20696 -9125
$$ packed form
143b1458J615J4834n157n886J8435J7248j4753k6005N361L3912J5301j9465k2544
156h562k497j322j3919J231L6739L5864j4944m4875p590M2422K3674l9029n1489
169d4297J677L5993M487k8155J164N0662L8087k3847m8155m975L3395J1915k8481
182e30k3711J0219J5557r549j4314J1697K2674j252j8388j541J6402K000j8583
195i319l435K7651K2573j6894l2690k978J8801l122k9365p984L3946K9602j7427
208I359l5341K858L9905K1935j8949k3973J288N987j3479j5285J4996L0078J631
221B1010k7854j4927J5831J5778j0514j2750J2599J6573j1970k5565O259L7215
233B1685J6739k8346l1714Q054K8020o68k8344j0872K2144J7613j5311j9696J1571
$$ plain form
246 -9125 17908 20956 -309 -11141 860 11325 4901 -1040 6319 11080 -2441 -17122 -8874
259 -8874 8611 5551 -14496 -17499 3839 15379 -2171 -17503 233 29135 25499 -6599 -19529
272 -19529 3362 22374 5322 -22570 -18455 8540 13694 -10261 -24848 -7484 14854 11114 -4820
285 -4820 -3754 10598 11411 -2143 -5546 7884 13974 545 -11803 -5741 4100 -3517 -16780 -10693
299 -10693 8209 9702 -9625 -18111 2005 22692 14710 -6111 -5872 12571 16042 -4057 -17342
312 -17342 -5429 9342 734 -17322 -15497 3039 9408 -2859 -8476 3648 12823 2967 -8213
325 -8213 -64 15809 11572 -6923 -10606 5802 13718 -2406 -19159 -10295 7984 4874 -15521
338 -15521 -18903 3315 19021 7640 -8607 -2296 15908 16688 -454 -8493 1700 8606 -1311
$$ packed form
246i125K7033L048k1265j0832J2001J0465o424n941P359M761j3521j4681Q248
259h874J7485l060k0047l003K1338J1540j7550j5332J7736K8902l636l2098j2930
272a9529K2891J9012j7052k7892M115K6995N154k3955j4587J7364K2338l740j5934
285d820J066J4352Q13j3554l403J3430O090j3429j2348O062R841p617j3263O087
299a0693J8902J493j9327q486K0116K0687p982k0821K39J8443L471k0099j3285
312a7342J1913J4771q608j8056J825J8536O369j2267n617J2124R175r856j1180
325h213Q149J5873m237j8495l683J6408P916j6124j6753Q864J8279l110k0395
338a5521l382K2218J5706j1381j6247O311J8204P80j7142q039J0193O906r917
$$ plain form
351 -1311 -13341 -9002 806 -1607 -10312 -7878 3327 4996 -4126 -3601 11103 19317 7445 -5866
365 -5866 798 14280 7998 -13605 -20640 -4494 7172 -5479 -20969 -11184 12607 17491 581
378 581 -7541 6500 19204 9303 -8687 -8790 4562 6643 -6871 -13278 -2853 5558 -677 -8683
392 -8683 -3027 7639 5699 -4322 -4436 6754 9601 -1763 -9020 202 10656 3931 -9594 -7873
406 -7873 6882 10350 -2757 -10643 -1128 9015 1950 -11702 -10415 2871 6614 -3631 -7339 4098
420 4098 13769 7206 -2528 800 10702 7285 -8020 -13262 -3360 2241 -8019 -17118 -7340 8918
434 8918 9243 -2385 -3340 11587 19910 8085 -5886 -3350 6996 3938 -11951 -17779 -7647 1139
448 1139 -3770 -9756 -2666 9726 11134 3887 2660 9764 10397 743 -6303 -2548 798 -6723 -14787
$$ packed form
351a311j2030M339R808k413q705K434J1205J669r122N25J4704Q214j1872j3311
365e866O664J3482o282k1603p035J6146J1666j2651j5490R785K3791M884j6910
378E81q122J4041J2704r901j7990j03J3352K081j3514o407J0425Q411o235q006
392h683N656J0666j940j0021j14J1190K847j1364p257R222J0454o725j3525J721
406g873J4755L468j3107p886R515J0143p065j3652J287J3286L743j0245l708J1437
420D098R671o563r734L328R902l417j5305n242R902N601j0260r099R778J6258
434H918L25j1628r55J4927Q323j1825j3971K536J0346l058j5889n828J0132Q786
448A139m909n986P090J2392J408p247j227P104O33r654p046L755L346p521q064
$$ plain form
463 -14787 -8731 3636 4725 -4672 -6001 7058 14415 5119 -5983 -487 11163 7978 -8460 -14496
477 -14496 -3079 7302 586 -9936 -5543 6998 9193 -1570 -5904 3634 10829 2837 -8477
490 -8477 -7136 1360 1697 -5691 -5904 3823 9261 3128 -2991 1832 8611 4028 -7270 -8716 -361
505 -361 1206 -7021 -10789 -1970 7703 5614 -1290 1492 10424 10568 -81 -6485 -997 4501 -2066
520 -2066 -11332 -9058 471 1020 -6835 -7316 4152 11973 5603 -1684 3297 12182 8960 -4379 -9317
535 -9317 -1763 2661 -5654 -14547 -9734 1758 3971 -2477 -2264 8951 15629 7099 -3433 -2658 3639
550 3639 2678 -4782 -7006 -1614 285 -5208 -8001 -828 7451 6075 -1372 -2580 2531 3350 -1993 -2385
566 -2385 5402 8351 -534 -9077 -5296 4908 5472 -3198 -7167 134 5241 126 -6320 -2133 6570
$$ packed form
463a4787O056J2367J089r397j329J3059P357r296j1102N496J1650l185j6438o036
477a4496J1417J0381o716j0522M393J2541K195j0763m334R538P195p992j1314
490h477J341Q496L37p388k13R727N438o133o119M823O779m583j1298j446Q355
505c61J567q227l768Q819R673k089o904K782Q932J44j0649o404N488N498o567
520b066r266K274R529N49p855m81J1468P821o370p287M981Q885l222j3339m938
535i317P554M424q315q893M813J1492K213o448K13J1215O678q530j0532P75O297
550C639r61p460k224N392J899n493k793P173Q279j376p447j208N111Q19n343l92
566b385P787K949q885q543L781J0204N64q670l969P301N107n115o446M187Q703
$$ plain form
581 6570 4860 -5236 -8222 1627 8725 3108 -4695 -2019 6551 7046 -421 -4330 -12 1669 -4886
596 -4886 -10876 -6183 2946 3734 -1767 -2226 4913 8417 3945 -720 2645 6203 1159 -6766 -6944 -833
612 -833 880 -4325 -6983 -1007 4272 1463 -3969 -1776 4987 6170 69 -839 5941 7799 47 -8771
628 -8771 -6577 1819 2682 -3824 -6939 -1893 1499 -2107 -4476 2766 11879 8821 -3018 -8231 -1958
643 -1958 5870 3792 -1180 -1477 1375 -1598 -7059 -5587 2660 6317 -127 -6704 -4833 2106 4093
658 4093 1516 1795 5017 4451 -1584 -3857 1049 4056 -322 -6224 -5549 299 1718 -2400 -3310 1478
674 1478 4654 517 -3883 178 7024 6366 -1390 -4784 1016 5190 481 -5256 -3360 1835 1090 -4920
690 -4920 -5921 800 5277 1278 -3546 -539 6140 5793 -283 -3071 437 3421 274 -3023 -1259
$$ packed form
581F570j710j0096k986R849P098n617p803K676Q570M95p467l909M318J681o555
596d886n990M693R129P88n501m59P139L504m472m665L365L558n044p925j78O111
612h33J713n205k658N976N279k809n432K193O763J183o101r08O780J858p752q818
628h771K194Q396Q63o506l115N046L392l606k369P242R113l058j1839n213O273
643a958P828k078m972k97K852k973n461J472Q247L657o444o577J871O939J987
658D093k577K79L222n66o035k273M906L007m378n902O75N848J419m118r10M788
674A478L176m137m400M061O846o58p756l394N800M174m709n737J896N195p45o010
690d920j001O721M477l999m824L007O679l47o076k788L508K984l147l297J764
$$ plain form
705 -1259 1195 -1747 -6373 -5004 2721 6044 1867 -3011 -1990 1377 1485 604 2717 5574 2137 -5690
721 -5690 -7697 -549 4900 2963 -2870 -4230 -935 -1242 -3851 -1605 5217 7355 1838 -4991 -2852
736 -2852 3964 4662 -768 -3845 -781 1351 -2151 -5072 -1623 4078 3104 -2095 -3573 729 3757 854
752 854 -2876 -1348 3170 2544 -622 -769 2355 2851 -1737 -4767 -1855 1098 -271 -3526 -2924 1369
768 1369 3362 876 375 3135 4311 482 -3797 -1976 2441 1908 -3220 -4932 -578 3085 926 -2984
784 -2984 -1606 2076 1186 -2510 -1524 4267 7511 3129 -2890 -2520 1604 1874 -2422 -4594 -2201 -735
800 -735 -3037 -3624 1250 6959 6256 1066 -1693 296 1533 -739 -2556 -1113 733 -1130 -3478 -1765
816 -1765 2858 3842 -36 -2421 -755 1251 -990 -2238 -492 3161 3068 -696 -1898 1184 2972 -138
$$ packed form
705a259K454k942m626J369P725L323m177m878J021L367J08q81K113K857l437p827
721e690k007P148N449j937n833j360L295l07k609K246O822K138n517o829K139
736b852O816O98n430l077L064K132l502k921L449N701r74n199j478M302L028k903
752H54l730J528M518o26l166j47L124M96m588l030K912K953j369l255O02M293
768A369J993k486n01K760J176l829m279J821M417n33n128j712M354L663k159l910
784b984J378L682q90l696R86N791L244m382o019L70M124K70m296k172K393J466
800g35k302n87M874N709p03n190k759J989J237k272j817J443J846j863k348J713
816a765M623R84l878k385J666K006k241j248J746L653r3l764j202L082J788l110
$$ plain form
832 -138 -4102 -2639 1579 1831 -1283 -2159 1836 3496 -90 -4107 -2184 1604 880 -2229 -2547 1916
848 1916 5291 3369 429 399 1714 62 -4499 -5478 -2780 -567 -1976 -2511 594 4839 4935 2192 1097
865 1097 2296 1768 -1283 -3044 -1463 185 -1645 -3919 -2216 1471 2026 -926 -2184 395 2295 1481
881 1481 -486 1581 4792 3668 -1038 -3212 -1028 268 -2109 -5199 -3106 716 1446 -340 206 3745
897 3745 5413 1943 -1858 -1809 81 -270 -2625 -2578 713 2298 968 -533 583 2308 1075 -2189
913 -2189 -2938 -804 313 -1065 -1703 800 3189 2098 -110 72 1683 1322 -1262 -2065 16 1418
929 1418 60 -2208 -1122 1259 597 -2426 -2735 348 2465 867 -428 1230 3926 3242 -605 -2115
945 -2115 -388 1 -2145 -4732 -3490 72 1005 -182 177 2871 4469 2222 -621 -346 954 494
$$ packed form
832a38l964J463M218K52l114q76L995J660l586m017J923L788p24l109l18M463
848A916L375j922k940l0J315j652m561r79K698K213j409n35L105M245R6k743j095
865A097J199n28l051j761J581J648j830k274J703L687N55k952j258K579J900q14
881A481j967K067L211j124m706k174K184J296k377l090K093L822P30j786N46L539
897C745J668l470l801M9J890l51k355M7L291J585j330j501J116J725j233l264
913b189p49K134J117j378o38K503K389j091k208J82J611l61k584q03K081J402
929A418j358k268J086K381o62l023l09L083K117j598j295J658K696o84l847j510
945b115J727L89k146k587J242L562R33j187L59K694J598k247k843K75J300m60
$$ plain form
961 494 -2327 -2394 -484 526 -972 -1888 -406 1183 675 -1124 -654 1235 1543 -278 -767 1181 2182
978 2182 649 -2020 -1134 531 622 -1799 -2306 215 1856 377 -1385 -197 1825 1681 -1213 -1939 11
995 11 1788 321 -1253 -435 2160 1613 -907 -1762 177 992 -690 -2295 -1200 935 876 -560 -397
1012 -397 1580 2277 366 -940 34 1006 121 -1389 -1124 -18 468 -702 -1313 27 1536 403 -1018
1029 -1018 92 1720 1494 -215 -787 703 1147 -61 -1630 -882 750 604 -1601 -1870 90 1157
1045 1157 111 -1289 -257 1894 1551 -437 -1237 395 1373 -113 -1697 -831 603 543 -1167 -1326 327
1062 327 1046 -16 -850 -103 913 713 -754 -450 1092 1062 -355 -995 107 746 -202 -1693 -1020 589
1080 589 382 -794 -837 669 2193 960 -349 215 1358 956 -1003 -1483 -71 661 -309 -1539 -855
$$ packed form
961D94k821o7J910J010j498r16J482J589n08j799M70J889L08j821m89J948J001
978B182j533k669Q86J665R1k421n07K521J641j479j762J188K022j44k894p26J950
995A1J777j467j574Q18K595n47k520q55J939Q15j682j605J095K135n9j436J63
1012c97J977O97j911j306R74R72q85j510K65J106M86j170o11J340J509j133j421
1029a018J110J628k26j709n72J490M44j208j569P48J632j46k205k69J960J067
1045A157j046j400J032K151l43j988q00J632R78j486j584Q66J434o0j710j59J653
1062C27P19j062q34P47J016k00j467L04J542l0j417o40J102O39r48j491O73J609
1080E89k07j176m3J506J524j233j309N64J143m02j959m80J412P32r70j230O84
$$ plain form
1097 -855 1319 865 -614 -986 771 1599 472 -1007 19 1097 1012 -217 -891 356 735 -288 -1707
1114 -1707 -927 131 339 -905 -598 1000 989 125 -445 370 1027 211 -612 -523 273 426 -717 -1282 -174
1133 -174 334 -398 -1151 -475 1168 811 -616 -513 986 1978 368 -628 -172 671 280 -1211 -1419 189
1151 189 964 -115 -1237 -544 1275 1047 -521 -594 318 823 -204 -995 -414 782 284 -290 -606 253
1169 253 731 -530 -1101 -174 492 202 -964 -336 464 333 26 -121 857 1414 211 -505 -62 379 269
1188 269 -904 -1124 -109 295 -632 -1177 -685 1280 1285 56 -290 1006 1390 565 -510 -684 187 61 -1532
1207 -1532 -1497 -358 335 32 -898 -130 1094 1185 240 431 745 822 -192 -623 -528 47 -501 -1655 -1109 -52
1227 -52 415 92 108 1038 1213 309 -390 127 523 246 -1079 -1041 -342 509 -326 -503 -212 736 635 -837
$$ packed form
1097h55K174m54j479l72J757Q28j127j479J026J078q5j229o74J247L79j023j419
1114a707P80J058K08j244L07J598j1q64n70Q15O57q16q23Q9P96J53j143n65J108
1133a74N08p32p53O76J643l57j427J03J499R92j610r96M56Q43l91j491k08J608
1151A89P75j079j122O93J819k28j568p3R12N05j027p91N81J196m98n74l16Q59
1169B53M78j261n71R27O66k90j166O28Q00j31l07j47R78N57j203p16M43M41j10
1188B69j173k20J015M04r27n45M92J965Nj229l46J296L84q25j075j74Q71j26j593
1207a532L5J139O93l03r30P68J224R1r45J91L14P7j014m31R5N75n48j154N46J057
1227e2M67l23J6R30J75r04o99N17L96k77j325L8O99Q51q35j77K91R48j01j472
$$ plain form
1247 -837 -849 133 794 -229 -1058 -498 609 524 -361 -831 330 1095 107 -614 -153 846 226 -699 -904 -320
1267 -320 110 -616 -526 -571 331 125 289 681 965 1272 284 -495 -403 206 -706 -1355 -891 -247 -196 -393 229
1288 229 1113 1326 632 -91 31 756 492 -545 -1118 -350 -117 -581 -829 -209 562 131 -545 -406 627
1307 627 1410 1023 -276 -112 429 -23 -751 -795 19 53 -265 -903 163 692 936 294 30 581 167 -515
1327 -515 -675 -428 198 -172 -296 212 409 818 110 -117 319 324 -135 -743 -526 153 103 -530 -279 391 1003
1348 1003 400 -243 -123 415 413 -368 -367 237 506 -425 -1118 -146 386 385 -404 -420 176 735 726 109 153 286 37
1371 37 -651 -658 -342 14 -420 -833 -155 308 569 313 278 602 388 206 -635 76 475 -231 -757 -275 242
1392 242 64 -122 -335 400 457 89 -519 -257 544 401 34 -169 173 445 -15 -319 -78 158 146 -404 -542
$$ packed form
1247h37j2R82O61j023q29N60J107q5q85m70J161P65r88p21M61R99o20r25k05N84
1267c20M30p26R0m5R02k06J64L92K84L07r88p79R2O09r12o49M64O44N1j97O22
1288B29Q84K13o94p23J22P25k64j037n73P68K33m64k48O20P71m31o76J39J033
1307F27P83l87j299J64N41m52p28m4Q14L4l18o38J066N29K44o42k64N51m14o82
1327e15j60K47O26l70j24N08J97M09p08k27M36Nm59o08K17O79n0o33K51O70O12
1348A003o03o43J20N38kp81JO04K69r31o93R72N32jp89j6N96N59ro17M4J33k49
1371C7o88pL16L56m34m13O78M63K61k56l5L24k14j82q41P11L99p06n26M82N17
1392B42j78j86k13P35N7l68o08K62Q01j43l67k03L42K72m60l04K41K36j2n50j38
$$ plain form
1413 -542 -152 413 228 -449 14 347 229 -39 -367 260 274 -211 -307 161 27 -9 -567 -530 147 114 -69 -50
1435 -50 241 176 364 0 214 598 380 -168 -366 141 242 -83 -354 -492 306 -169 -225 -309 435 678 263
1456 263 -349 -492 471 87 22 -41 -74 437 252 -220 -47 154 76 -209 -373 -562 123 -83 -312 52 282
1477 282 313 -82 148 150 248 -350 -191 -210 -11 -156 -203 -152 185 204 -165 -213 323 337 268 -7 -152 515 135 -73
1501 -73 -311 83 311 -110 -368 -448 63 -71 -132 -180 492 372 150 56 176 58 187 -374 -349 -124 296 7
1523 7 -416 -258 429 334 -236 -420 -1 184 -75 -178 496 698 354 -78 -225 235 -110 -410 -571 62 136
1544 136 120 -399 99 578 84 -267 -302 147 142 -249 -564 -173 31 252 50 -173 253 177 84 -436 -366 -135
1566 -135 -73 79 73 219 265 340 -251 -249 76 -341 -415 -297 42 100 25 119 359 75 22 -147 -303 72 -1 -131
$$ packed form
1413e42L90N65j85o77M63L33j18k68l28O27J4m85r6M68j34l6n58L7O77l3j83J9
1435e0K91o5J88l64K14L84k18n48j98N07J01l25k71j38P98m75n6q4P44K43m15
1456B63o12j43R63l84o5o3l3N11j85m72J73K01p8k85j64j89O85k06k29L64K30
1477B82L1l95K30KR8n98J59j9J99j45m7N1L37J9l69m8N36J4o9k75j45O67l80k08
1501g3k38L94K28m21k58q0N11j34o1m8O72j20k22r4J20j18J29n61K5K25M20k89
1523Gm23J58O87r5n70j84M19J85k59j03O74K02l44m32j47M60l45l00j61O33P4
1544A36j6n19M98M79m94l51l5M49nl91l15L91K04K21k02k23M26p6r3n20P0K31
1566a35O2J52oJ46M6P5n91KL25m17p4J18L39N8p5R4K40k84n3j69j56L75p3j30
$$ plain form
1590 -131 -223 207 385 192 33 79 179 -98 -396 -577 -208 144 -313 -59 92 276 363 291 -213 5 227
1611 227 -147 -189 -201 -20 183 -338 -282 -88 183 -224 -493 -247 64 259 102 0 100 319 198 -201 -307
1632 -307 -133 -347 -263 -310 388 141 382 489 348 304 100 -25 -40 -152 4 -242 -413 117 499 264 -201
1653 -201 0 205 116 -218 -190 -11 232 298 15 141 164 361 -210 -672 -244 -76 -179 34 276 -5 233
1674 233 49 193 -134 -179 -614 -228 -68 -139 31 400 355 362 458 208 -83 -168 -152 -330 -471 -696 -179 119 244
1697 244 127 167 450 313 94 28 -286 -15 -106 -53 13 105 141 -222 107 251 -38 -269 -115 168 88 409 58
1720 58 82 310 265 -505 -483 -392 -236 -22 65 78 120 381 396 293 -95 249 -83 -251 -152 -356 34 -18 67 279
1744 279 -142 -204 166 73 56 -257 -110 -156 -163 71 -133 -241 -44 305 3 -90 -60 -27 293 -336 -326 -242 150 106
$$ packed form
1590a31r2M30J78j93j59M6J00k77k98j81L69L52m57K54J51J84Q7p2n04K18K22
1611B27l74m2j2J81K03n21N6J94K71m07k69K46L11J95j57j02J00K19j21l99j06
1632c07J74k14Q4m7O98k47K41J07j41m4k04j25j5j12J56k46j71N30L82k35m65
1653b01K01K05q9l34K8J79K43O6k83J26K3J97n71m62M28J68j03K13K42k81K38
1674B33j84J44l27m5m35L86J60p1J70L69m5PR6k50k91q5J6j78j41k25N17K98J25
1697B44j17M0K83j37k19o6l14K71r1N3O6R2L6l63L29J44k89k31J54K83q0L21l51
1720E8K4K28m5p70K2R1J56K14Q7J3M2K61J5j03l88L44l32j68R9k04L90n2Q5K12
1744B79m21o2L70r3j7l13J47m6pK34k04j08J97L49l02r3L0L3L20o29J0Q4L92m4
$$ plain form
1768 106 -171 -286 -368 -171 104 165 234 388 170 243 103 149 -45 -273 -345 -221 -183 -97 -60 -100 125 85 104 51
1792 51 32 232 23 -148 30 -193 -138 -35 -253 -412 -37 -192 -18 3 -157 6 -95 19 186 236 -174 -116
1814 -116 182 23 -221 -233 -230 43 148 -94 -403 180 117 367 -82 -273 167 161 40 -192 129 -135 145 142 -40
1837 -40 -68 278 78 76 -379 -163 -118 -156 370 17 -206 -96 -4 150 -226 161 -45 -27 208 33 -116 -19 -52
1860 -52 157 -35 -200 121 182 77 68 108 68 232 42 -47 -276 109 118 -72 -120 -36 70 155 -53 123 126 144 -26
1885 -26 -70 159 259 117 -25 24 150 -30 -16 -271 78 252 -178 -226 161 146 241 -54 148 -80 79 128 6
1908 6 -146 -30 -71 -40 17 -327 -85 -220 -26 140 280 120 34 -147 -21 -116 -304 -187 -12 160 -190 -225 -39
1931 -39 340 183 -110 -80 -41 266 200 249 211 144 4 240 156 -174 41 104 -95 218 -79 -430 -340 104 171 5
$$ packed form
1768A06k77j15q2J97K75O1O9J54k18P3j40M6j94k28p2J24L8Q6L7m0K25m0J9n3
1792E1j9K00k09j71J78k23N5J03k18j59L75j55J74K1j60J63j01J14J67N0m10N8
1814a16K98j59k44j2LK73J05k42l09N83o3K50m49j91M40oj21k32L21k64K80lj82
1837d0k8L46k00km55K16M5l8N26l53k23J10R2J54l76L87k06J8K35j75j49R7l3
1860e2K09j92j65L21O1j05rM0m0J64j90q9k29L85Rj90m8Q4J06Q5k08J76LJ8j70
1885b6m4K29J00j42j42M9J26j80J4k55L49J74m30m8L87j5R5k95K02k28J59M9j22
1908Fj52J16m1L1N7l44K42j35J94J66J40j60q6j81J26r5j88J17J75J72l50l5J86
1931c9L79j57k93L0L9L07o6M9l8o7j40K36q4l30K15O3j99L13k97l51R0M44O7j66
$$ plain form
1955 5 -113 -23 -132 119 240 -156 -63 65 -13 -196 -15 172 -14 -190 -33 45 -85 57 -15 -75 -16 50 139 -126
1979 -126 -20 -129 -152 -134 -119 289 -69 27 -24 -107 42 150 -171 -127 -106 265 -117 -304 199 -43 -16 -305 -74
2002 -74 20 -4 167 256 284 -70 21 -57 -125 275 -167 89 107 120 -39 -100 -240 247 362 40 -393 -43 -68 97
2026 97 -156 -172 -68 -8 202 259 93 -121 80 -16 316 173 -5 126 -218 -101 -154 -78 -25 -9 38 12 360 -416
2050 -416 -90 58 -116 -190 167 -43 -8 -152 -218 141 29 -224 124 -98 179 96 314 158 -32 -149 83
2071 83 320 -123 9 -123 -36 81 94 321 -137 -100 -101 149 -120 -45 -179 -182 -143 189 -113 161 126 -70 153 45
2095 45 58 -145 -255 46 -87 -9 -26 -224 -291 -197 339 -241 -170 -164 355 -185 21 -86 -84 8 -157 -389 70 63 86
2120 86 6 79 149 23 -126 -148 147 -80 -130 -118 -261 14 14 152 50 -240 -59 154 102 100 -248 257 -14 391
$$ packed form
1955Ej18R0j09K51J21l96R3J28p8j83J81J87j86j76J57P8j30J42p2o0N9O6Q9k65
1979a26J06j09k3J8J5M08l58R6n1q3J49J08l21M4K1L71l82j87N03k42K7k89K31
2002g4R4k4J71Q9K8l54R1p8o8M00m42K56J8J3j59o1j40M87J15l22m33L50k5J65
2026I7k53j6J04O0K10N7j66k14K01r6L32j43j78J31l44J17n3P6N3J6M7k6L48p76
2050d16L26J48j74p4L57k10L5j44o6L59j12k53L48k22K77q3K18j56j90j17K32
2071H3K37m43J32j32Q7J17J3K27m58L7jK50k69P5j34lL9L32l02K74l5j96K23j08
2095D5J3k03j10L01j33P8j7j98o7R4N36n80P1ON19n40K06j07KR2j65k32M59pK3
2120H6q0P3P0j26j49k2K95k27n0J2j43K75%J38j02k90J81K13n2kl48N05k71M05
$$ plain form
2144 391 17 13 -270 -97 -92 -43 -15 0 -230 60 20 172 -53 25 -121 -58 85 -312 -148 28 139 -251 8
2167 8 -32 164 139 246 123 30 -239 -35 224 109 -12 -17 17 340 -10 -164 -169 73 -96 103 -114 -4 -35 273
2191 273 -60 -61 202 156 12 -2 -198 97 -46 236 194 -93 75 -204 -52 252 -25 -30 236 -119 9 -18 -151
2214 -151 -184 152 46 323 -201 44 -329 182 -169 36 -158 -49 -92 -336 -420 155 228 -66 228 140 43 84
2236 84 86 9 -152 -116 245 -46 -93 103 -106 110 49 32 -312 -106 145 131 136 104 -161 12 41 34 265 -46 -52 88
2262 88 95 -176 210 -264 -65 136 -151 -100 40 134 -25 -120 -25 156 207 -225 -141 77 -22 -200 198 -6 -47 -126
2286 -126 5 52 68 147 172 -231 144 34 6 176 -29 83 -46 87 -25 -16 151 12 -140 -190 -328 -64 -79
2309 -79 -333 14 39 119 143 199 -340 -64 -161 167 74 -36 73 -77 156 57 -78 -113 75 -69 132 152 441
$$ packed form
2144C91l74mk83J73NM9K8J5k30K90m0J52k25P8j46O3J43l97J64J76J11l90K59
2167Hm0J96k5J07j23r3k69K04K59j15j21nL4L23l50j54nK42j69J99k17J10l1L08
2191B73l33jK63m6j44j4j96K95j43K82m2k87J68k79J52L04k77nK66l55J28k7j33
2214a51l3L36j06K77n24K45l73N11l51K05j94J09m3k44q4N75P3k94K94q8r7M1
2236H4Kp7j61L6L61k91m7J96k09K16o1j7l44K06K51j4Nl2k65J73K9pK31l11oJ40
2262H8Pk71L86m74J99K01k87N1J40R4j59r5R5J81N1m32Q4K18r9j78L98k04m1p9
2286a26J31M7J6P9K5m03L75j10k8J70k05J12j29J33j12RJ67j39j52n0j38K64j5
2309g9k54L47K5Q0K4N6n39K76r7L28r3j10J09j50K33r9j35l5J88j44K01K0K89
$$ plain form
2332 441 -1 19 64 8 57 34 -45 124 -154 -129 119 220 74 241 202 -14 -288 107 -24 10 22 -26 118 70
2356 70 174 -127 41 88 72 -83 -157 -30 51 -171 92 -143 -44 -181 -128 -113 -113 108 -125 -108 -55 -54 -312 -44 -152
2381 -152 189 80 -197 -132 133 26 -197 141 -48 110 9 -135 -216 -72 -20 21 -81 -39 35 353 293 153
2403 153 37 -102 -69 181 5 -110 -65 150 46 33 0 74 -40 90 207 107 -253 -13 -157 -163 114 249
2425 249 1 140 182 -554 -220 -33 -56 -230 10 31 104 31 26 -155 16 -47 -214 -183 -86 108 138 -82 -112 -23
2449 -23 -53 -309 146 -155 -168 -46 48 -139 -71 114 160 -86 56 103 -276 -67 -171 195 -101 54 -108 109
2471 109 -48 -167 -322 214 -72 -55 13 -14 -196 -137 -257 -196 11 -5 -128 2 -37 24 52 -67 -20 -126 -43 -161
2495 -161 146 33 -119 -467 -15 -81 75 117 -11 -42 -109 -41 109 53 -158 149 -193 120 -31 -132 -171 83
$$ packed form
2332D41m42K0M5n6M9k3p9J69k78K5K48J01j46J67l9k16k74L95j31L4J2m8J44m8
2356G0J04l01J68M7j6j55p4J27Q1k22K63k35R9j37N3J5%K21k33J7N3Jk58K68j08
2381a52L41j09k77O5K65j07k23L38j89J58j01j44q1J44N2M1j02M2P4L18o0j40
2403A53j16j39L3K50j76j15M5K15j04j3l3P4j14J30J17j00l60K40j44oK77J35
2425B49k48J39M2p36L34J87k3j74K40K1P3p3nj81J71o3j67L1R7J94L0k20l0Q9
2449b3l0k56M55l01j3J22R4j87O8J85M6k46J42M7l79K09j04L66k96J55j62K17
2471A09j57j19j55N36k86J7O8k7j82N9j20O1K07j6j23J30l9O1K8j19M7j06Q3j18
2495a61L07j13j52l48M52o6J56M2j28l1o7O8J50n6k11L07l42L13j51j01l9K54
$$ plain form
2517 83 283 92 20 -25 -282 72 -204 -115 -123 -28 54 -228 51 -29 182 86 -93 47 30 -59 -101 80 -21 -118 -15
2542 -15 -76 33 114 -209 136 -240 119 291 28 173 -211 46 12 -159 26 -64 257 -6 -189 155 -6 3
2564 3 182 -88 -45 -211 -33 56 30 -125 128 -297 -227 -43 -7 152 104 -48 -61 25 147 -76 77 113 28 61
2588 61 -47 73 -221 61 257 -346 -117 221 110 8 110 249 -32 -127 -117 6 -16 3 86 -81 121 -98
2610 -98 -68 29 -55 246 -175 61 74 4 -58 74 -137 -5 116 202 -60 -60 -58 -235 -15 83 51 14 -130 298 -202
2635 -202 96 140 -1 -14 -305 -2 113 -23 -3 3 88 247 -25 84 -126 -43 379 15 -83 -145 -135 -163 -13 36
2659 36 -19 -115 -9 45 322 25 -29 -61 149 2 -10 -284 81 -98 -34 -21 -129 -6 -39 -50 195 75 -81 -74
2683 -74 55 118 -98 -37 -15 -99 149 -25 63 99 127 38 300 -80 -100 82 -320 -168 96 14 47 -58 75 -4
$$ packed form
2517H3K00j91p2m5k57L54k76Q9qR5Q2k82K79q0K11r6j79J40j7q9m2J81j01r7J03
2542a5o1J09Q1l23L45l76L59J72k63J45l84K57l4j71J85r0L21k63j83L44j61R
2564CJ79k70M3j66J78Q9k6j55K53m25P0J84L6J59m8j52j3Q6J22k23J53L6q5L3
2588F1j08J20k94K82J96o03K29L38j11j02J02J39k81r5J0J23k2J9Q3j67K02k19
2610i8L0R7q4L01m21K36J3p0o2J32k11J32J21Q6k62%Kj77K20R8l2l7j44M28n00
2635b02K98M4j41j3k91L03J15j36K0OQ5J59k72J09k10Q3M22l64r8o2J0k8J50M9
2659C6n5r6J06N4K77k97n4l2K10j47j2k74L65j79O4J3j08J23l3j1K45j20j56P
2683g4J29O3k16O1K2q4K48j74Q8L6K8q9K62l80k0J82m02J52K64q2L3j05J33p9
$$ plain form
2707 -4 -103 16 142 -17 -9 -235 16 13 119 -272 -15 -90 189 -345 -96 86 127 -53 -30 65 -37 80 208 6
2731 6 -46 103 -59 73 -62 184 75 0 162 -84 152 -60 -44 35 -283 135 -72 -108 -135 -61 -35 -89 183 -281
2755 -281 83 -71 -134 234 -240 -164 -227 29 35 196 45 -97 -21 -36 2 -93 193 91 67 227 -81 29 -295
2778 -295 -137 36 96 77 -9 -68 124 -241 -18 -169 -233 24 -97 280 168 24 23 82 -130 -116 46 30 -199
2801 -199 92 33 55 132 -62 168 -73 50 -43 8 225 396 -115 -4 112 -67 39 114 -9 65 46 -68 163
2824 163 -250 -196 234 14 -137 -178 -54 74 -76 -183 -224 -150 -38 188 -3 -5 -33 -120 -118 195 9 140 66 -22
2848 -22 164 104 88 -131 73 10 226 -188 -92 171 223 243 -246 -33 82 134 159 94 -37 210 193 24 119 36
2872 36 69 -72 -149 123 128 63 -40 -24 13 204 -110 2 -21 -121 -29 129 -230 -51 -159 -106 50 -101 -3 255
$$ packed form
2707dr9J19J26j59Qk26K51lJ06l91K57p5K79n34K49J82M1j80K3R5j02J17J28k02
2731Fn2J49j62J32j35K46j09p5J62k46K36k12J6P9l18M18k07l6k7P4K6n4K72m64
2755b81L64j54o3L68m74P6o3K56OJ61j51j42P6j5L8r5K86j02k4J60l08J10l24
2778b95J58J73O0j9q6n9J92l65K23j51o4K57j21L77j12j44jN9k12J4J62j6k29
2801a99K91n9K2P7j94K30k41J23r3N1K17J71n11J11J16j79J06P5j23P4j9j14K31
2824A63m13N4M30k20j51m1J24J28j50j07m1P4J12K26j91kk8q7KL13j86J31p4q8
2848b2J86o0j6k19K04o3K16m14R6K63N2K0m89K13J15N2K5o5j31K47j7j69R5q3
2872C6L3j41p7K72No5j03J6L7J91l14J12k3j00R2J58l59J79j08N3J56j51R8K58
$$ plain form
2896 255 48 198 123 -75 133 -35 -21 -96 -133 102 -202 181 -97 -34 38 -44 37 144 -225 38 94 9 -117
2919 -117 -164 -138 208 98 81 -63 -20 59 289 -180 -106 -128 -90 -25 21 -94 -210 -89 193 -181 -189 -166 13 -276
2943 -276 191 -5 -126 49 124 -119 46 83 -70 -71 155 67 301 289 -2 55 -19 51 -30 -60 -181 37 159 7
2967 7 32 -33 84 -176 -126 35 33 -43 -52 -140 -31 -158 -164 138 84 16 79 -6 -125 -144 5 -22 -104 137 -165 -54 -31
2994 -31 -254 -155 128 -149 96 74 190 99 -41 27 -290 -257 105 -39 -59 -214 151 223 -47 -117 87 4 95 17
3018 17 208 -375 69 199 2 334 -84 -309 -122 61 16 44 31 -26 240 80 -214 186 -178 129 210 52
3040 52 119 -102 -274 -75 -117 87 -80 -23 -118 171 18 19 58 4 -98 -64 -16 49 -28 66 -112 -105 -40 172 -356 179
3066 179 103 -261 169 272 -13 90 -83 142 184 216 60 -179 110 -164 32 -75 94 -241 235 68 -206
$$ packed form
2896B55k07J50p5j98K08j68J4p5l7K35l04L83k78O3P2q2Q1J07l69K63N6q5j26
2919a17m7K6L46j10j7j44M3P9K30m69P4k2L8O5M6j15j16J21K82l74qK3J79k89
2943b76M67j96j21J75P5k43J65L7j53jK26q8K34j2k91N7p4P0q1l0j21K18J22j52
2967GK5o5J17k60N0J61kp6rq8J09j27oL02n4o8O3q5j19j9J49k7q2K41l02J11K3
2994c1k23R9K83k77K45k2J16r1j40O8l17L3L62j44k0j55L65P2k70p0K04q3R1p8
3018A7J91n83M44J30j97L32m18k25J87J83m5K8j3n7K66j60k94M00l64L07Q1j58
3040E2O7k21j72J99m2K04j67N7r5K89j53JL9n4j02L4M8O5p7R4j78PO5K12n28N35
3066A79p6l64M30J03k85J03j73K25M2L2j56k39K89k74J96j07J69l35M76j67k74
$$ plain form
3087 -206 219 98 128 129 -114 388 -40 -312 56 -408 20 26 -174 -209 20 -269 -144 230 92 -167 89 -55
3109 -55 151 94 47 -22 30 63 -194 -54 108 57 -5 143 -3 -143 10 174 55 135 -202 68 -151 108 -20
3132 -20 -65 114 24 156 94 -106 21 -5 -239 -197 69 -53 69 41 -22 23 5 250 -17 -185 13 -250 128
3155 128 -119 164 258 -33 6 55 -163 -189 160 189 264 -119 52 317 -126 26 -16 357 -12 -264 178 75
3177 75 132 111 -134 61 51 -193 76 50 30 33 190 130 -70 -2 -76 320 145 27 80 -182 26 -42 -151 115
3201 115 -120 -112 54 53 -9 69 -308 28 22 -280 -164 22 -20 -10 51 95 147 31 -53 -34 -132 299 75 -251 25
3226 25 -169 245 -30 -141 -48 -97 -208 97 -94 143 -67 225 -12 -178 -151 237 -199 -33 -130 -89 183 -88
3248 -88 159 -71 286 129 95 -45 -82 225 238 -38 53 130 -66 -3 39 -157 -32 -211 213 -45 -281 -62 6
$$ packed form
3087b06M25j21L0Jk43N02m28k72L68m64M28Ok00l5K29k89J25L74j38k59K56j44
3109e5K06n7m7o9N2L3k57J40J62n1o2J48j46j40J53J64j19Q0l37K70k19K59j28
3132b0m5J79r0J32o2k00J27k6k34M2K66j22J22k8o3M5j8K45k67j68J98k63L78
3155A28k47K83R4k91L9M9k18k6L49K9P5l83J71K65m43J52m2L73l69k52M42j03
3177G5N7k1k45J95j0k44K69k6k0LJ57o0k00O8p4L96j75j18N3k62K08o8j09K66
3201A15k35QJ66jo2P8l77L36ol02J16J86m2J0O1M4N2j16q4J9r8M31k24l26K76
3226B5j94M14k75j11R3m9j11L05j91K37k10K92k37j66K7L88m36J66r7M1K72k71
3248h8K47k30L57j57l4j40l7L07J3k76R1P7j96O3M2j96J25j79M24k58k36K19O8
$$ plain form
3271 6 -15 119 -296 -117 169 121 5 198 -117 -135 19 -105 115 -22 156 -118 -62 446 -64 -3 -66 -8 58
3294 58 107 -10 -126 -44 165 56 -120 -20 1 210 175 -99 48 69 163 -12 200 151 -14 0 7 28 132 58
3318 58 133 40 330 -423 -172 -70 -17 74 -25 59 -75 -71 204 233 -219 105 10 -136 48 -123 35 -162 -80 -52
3342 -52 263 -147 24 69 190 44 -117 -122 76 117 -10 -169 -219 100 -190 47 116 -46 84 -78 -13 -209 -123
3365 -123 -252 143 -196 -268 157 285 -29 -282 6 215 278 -94 -47 24 -135 51 -26 -170 -4 102 131 -17
3387 -17 -35 -23 149 -163 -130 -232 -18 -236 -184 92 299 -132 50 45 182 144 -142 21 168 -78 10 189 -12
3410 -12 91 33 54 262 -297 -48 -57 287 231 -5 -17 -21 166 -55 175 -17 37 142 -100 -64 -153 83 -17 134
3434 134 2 -29 -38 26 188 -46 -38 329 211 -99 -168 -168 48 77 165 158 -142 111 -57 12 186 -235 72 19 94
$$ packed form
3271Fk1J34m15J79K86m8j16J93l15j8J54j24K20j37J78k74N6N08n10O1o3N8O6
3294E8M9j17j16Q2K09j09j76J00K1K09l5k74J47K1R4j75K12m9j65J4PK1J04p4
3318E8P5r3K90p53K51J02N3R1r9Q4j34MK75K9m52L24r5j46J84j71J58j97Q2K8
3342e2L15m10J71M5J21j46j61nJ98M1j27j59n0L19k90K37O9j62J30j62O5j96Q6
3365a23j29L95l39p2M25J28l14k53K88K09O3l72M7P1j59J86p7j44J66J06K9j48
3387a7j8J2J72l12L3j02K14k18N2K76K07m31J82nJ37l8k86J63J47k46Q8J79k01
3410a2J03n8K1K08n59K49rL44n6k36j2mJ87k21K30j92N4J05k42L6q9K36j00J51
3434A34j32l1rO4J62k34QL67j18l10o9%K16K9Q8pl00K53j68O9J74m21L07n3P5
$$ plain form
3459 94 173 64 7 -126 -222 -192 -96 200 58 -166 -89 224 -78 63 66 65 163 149 19 -2 -208 85 100 -7 -28
3484 -28 -2 156 179 -120 -49 -81 0 203 252 -124 -122 65 -160 384 -138 120 -50 95 -88 -16 -94 44 -4 -175
3508 -175 -55 119 -206 -6 -78 51 38 182 -86 24 -7 -181 150 -38 71 -259 42 107 129 -143 -19 -135
3530 -135 -58 76 -89 -41 -57 -112 -139 -265 -171 174 -16 41 105 -259 -33 -50 115 22 -130 -112 235 132 39 79
3554 79 13 -117 -62 22 -43 202 -51 -165 -44 -91 183 154 -245 164 -51 57 179 124 -59 109 101 -272 -38
3577 -38 91 -32 31 48 -186 109 52 -140 -121 -74 12 164 311 -99 23 -113 59 171 54 -54 73 -317
3599 -317 -94 298 -194 -140 243 -40 140 -126 -22 180 -2 -371 -33 -93 121 -104 -69 228 -28 -232 -202
3620 -202 121 -43 -111 22 14 0 -214 -137 403 251 332 -137 -175 -32 29 200 -96 -192 84 -109 -172 52 29 -256
$$ packed form
3459I4P9j09n7j33r6L0R6K96j42k24P7L13l02J41LjR8j4j30k1k06K93J5j07k1
3484b8K6J58K3k99P1l2Q1K03M9l76KJ87k25N44n22K58j70J45j83P2p8J38m8j71
3508a75J20J74l25K00p2J29j3J44k68J10l1j74L31j88J09l30L01O5K2k72J24j16
3530a35P7J34j65M8j6n5k7j26R4L45j90N7O4l64K26j7J65r3j52J8L47j03r3M0
3554G9o6j30N5Q4o5K45k53j14J21m7K74k9l99M09k15J08J22n5j83J68ql73K34
3577c8J29j23O3J7k34K95n7j92J9M7Q6J52J47m10J22j36J72J12j17j08J27l90
3599c17K23L92m92N4L83k83J80k66J04K02j82l69L38o0K14k25L5K97k56k04L0
3620b02L23j64o8J33qj4k14P7N40j52Q1m69l8J43O1J71k96r6K76j93o3K24k3k85
$$ plain form
3644 -256 -220 258 105 18 30 40 22 59 154 -74 -51 348 169 -134 -167 -192 -58 -193 -175 161 -39 120 4 284
3668 284 59 -43 121 -62 36 48 -71 54 132 -58 -133 1 68 45 -54 -144 68 83 144 48 -139 -141 -64 -246 -103
3693 -103 91 107 -31 83 119 -32 -125 218 -87 -190 122 -14 -304 -121 -13 72 -142 -67 222 -246 -86 -56
3715 -56 27 48 139 -27 -93 67 -193 -264 -14 23 49 -135 65 -5 -63 44 -84 104 -214 32 -57 -203 281 -55
3739 -55 -160 -104 -152 -179 -66 63 -341 -6 64 117 156 24 68 34 181 112 83 -30 160 173 16 95 92 110 -15
3764 -15 -20 76 31 155 -184 -128 -136 131 36 143 -67 -203 208 109 52 78 116 -59 63 268 -82 162 133 10 -46
3789 -46 -212 107 -25 119 -73 -63 -20 87 -205 -311 -312 121 142 23 39 46 -118 68 -78 23 126 11 -186
3812 -186 -357 213 71 -113 29 -63 -73 77 -103 -187 210 41 -266 -42 141 46 195 215 95 104 -42 -37 -212
$$ packed form
3644b56L6M78j53q7J2J0j8L7R5k28K3L99j79l03l3k5J34j35J8L36k00J59j16K80
3668B84k25j02J64j83R8J2j19J25P8j90p5J34O7k3r9r0K12J5O1r6j87kP7j82J43
3693a03J94J6j38J14L6j51r3L43l05j03L12j36k90J83J08Q5k14P5K89m68J60L0
3715e6Q3K1R1j66o6J60k60p1K50L7K6j84K00p0n8J07j28J88l18K46q9j46M84l36
3739e5j05N6m8k7J13J29m04L35P0N3L9j32M4l4J47o9k9j13J90J3j57P9lJ8j25
3764a5nR6m5J24l39N6qK67r5J07k10j36M11r9n7K6L8j75J22K05l50K44k9j23n6
3789d6j66L19j32J44j92J0M3J07k92j06jM33K1j19J6Pj64J86j46J01J03j15j97
3812a86j71N70j42j84J42r2j0J50j80q4L97j69l07K24J83r5J49K0j20Rj46Nj75
$$ plain form
3835 -212 -62 236 112 97 -4 -6 -33 -219 -185 220 -71 101 -90 67 -189 -138 32 24 -235 221 -375 -103 -84
3858 -84 -76 89 -254 -243 -105 38 23 -100 -53 62 -14 54 -29 5 -127 -181 61 -13 6 61 -254 120 384 128 312
3883 312 -243 185 42 -218 -150 -215 110 54 -36 171 -88 186 81 -249 -147 103 -74 -143 105 -117 12 117
3905 117 56 -89 -47 5 205 -89 69 199 -208 8 -57 -75 34 80 21 84 130 53 109 -57 94 101 -130 -128 -97
3930 -97 44 159 -172 -176 -49 -3 -188 -476 129 102 186 324 93 55 -110 -8 -104 96 -191 47 -20 103 -143
3953 -143 -80 -115 47 -12 -148 49 -32 121 0 -221 -151 86 68 87 -100 -163 5 86 -212 25 133 -57 31
3976 31 -37 -83 -133 -78 186 -221 -108 -114 229 -229 -295 -61 99 17 -99 -39 -252 100 134 48 54 -82 198 65 38
4001 38 104 0 -12 -76 102 97 -91 -62 -106 -35 -154 -111 -85 -34 -97 39 -211 361 145 35 -97 72 161 -26 -23
$$ packed form
3835b12J50K98j24j5j01kk7j86L4M05k91J72j91J57k56N1J70qk59M56n96K72J9
3858h4QJ65l43J1J38J43j5j23M7J15p6O8q3L4j32n4K42p4J9N5l15L74K64k56J84
3883C12n55M28j43k60O8o5L25n6r0K07k59K74j05l30J02K50j77o9K48k22J29J05
3905A17o1j45M2N2K00k94J58J30m07K16o5j8J09M6n9O3M6p7N6j66J51Pk31KL1
3930i7J41J15l31mJ27M6j85k88O05k7Q4J38k31l8j65J02r6K00k87K38o7J23k46
3953a43O3l5J62n9j36J97q1J53j21k21P0K37j8J9j87o3J68Q1k98K37J08j90Q8
3976C1o8m6n0N5K64m07J13oL43m58o6K34J60q2j16O0k13L52L4q6Oj36K80j33k7
4001C8O6j04j2o4J78nj88K9m4P1j19M3K6N1o3J36k50N72k16j10j32J69Q9j87L
$$ plain form
4026 -23 165 13 35 -221 9 223 -122 -78 79 195 148 64 25 112 5 -64 46 -53 423 105 78 -93 66
4049 66 -270 -22 -50 -199 -38 -45 -7 216 -179 -230 201 -132 33 -96 -48 -68 19 -181 -49 -109 -163 48 -140 20
4073 20 -3 -207 102 -72 -398 197 3 110 323 -120 192 -211 -71 241 -57 -68 -94 38 146 -151 402
4094 402 316 -150 -223 91 -330 -8 -73 -48 225 25 120 -29 189 84 5 33 -33 -163 92 -61 88 227 -67
4117 -67 133 49 107 45 148 -185 154 -82 12 227 -23 -217 137 126 -31 188 -22 -63 83 -8 -30 -90 -90 132
4141 132 59 47 41 -103 28 -59 4 -89 26 83 -148 51 -259 9 -74 149 -23 -53 -56 -13 20 82 -89 -149 -240 -30
4167 -30 -70 91 224 213 -30 123 67 -104 -18 -14 -120 -100 14 -102 -113 -136 108 3 85 -54 135 -128 69 152
4191 152 146 -88 -176 -110 32 -182 13 -29 80 124 -170 82 -199 -159 -34 106 87 -56 -28 -29 -109 -90 -131 165 61
$$ packed form
4026b3J88j52K2k56K30K14l45M4J57J16m7q4l9Q7j07o9J10r9M76l18k7j71J59
4049F6l36K48k8j49J61pL8K23l95n1M31l33J65j29M8k0Q7k00J32o0n4K11j88J60
4073B0k3k04L09j74l26N95j94J07K13m43L12m03J40L12k98j1k6J32J08k97N53
4094D02q6m66p3L14m21L22o5K5K73k00R5j49K18j05p9K8o6j30K55j53J49J39k94
4117f7K00q4N8o2J03l33L39k36R4K15k50j94L54j1j57K19k10m1J46r1k2o0%K22
4141A32p3j2oj44J31q7O3r3J15N7k31J99l10K68q3K23j72l0lM3L3O2j71o0r1K10
4167c0m0J61J33j1k43J53n6j71Q6Mj06K0J14j16j1k3K44j05Q2j39J89k63J97Q3
4191A52ok34q8O6J42k14J95m2J09M4k94K52k81M0J25J40j9j43K8jq0J9m1K96j04
$$ plain form
4216 61 67 11 -68 -156 217 60 62 -43 -93 -26 158 -38 105 75 -90 197 -259 -187 52 39 -289 -8 53 -183 -237
4241 -237 -59 52 206 115 269 16 -79 -193 -237 191 -244 213 -15 185 73 173 122 -4 -154 321 -47
4262 -47 -8 -80 -32 67 -105 -191 -133 -216 -181 282 139 -43 -64 -41 157 274 -221 -155 10 -108 269 -17 394 -54
4286 -54 147 -222 68 -238 -83 -11 -41 110 158 397 -111 223 -349 90 -142 164 49 127 108 131 311 -201
4308 -201 -68 222 199 -176 -126 -110 175 -121 150 290 -61 78 -108 -81 268 -71 41 -119 -120 168 -282 319
4330 319 75 -89 209 17 88 147 92 30 10 30 34 -87 8 -37 149 -216 10 -121 100 -122 28 -104 90
4353 90 -45 61 -70 -398 40 -243 -76 74 59 103 -61 15 90 -146 125 49 -45 -1 -139 196 37 135 180
4376 180 7 68 21 -86 88 -302 -174 -31 47 320 -104 133 -89 -74 -165 186 27 39 -94 114 160 290
$$ packed form
4216F1On6p9q8L73j57Kj05n0O7J84j96J43l0j65K87m56P2K39j3l28K81O1k36n4
4241b37J78J11J54r1J54k53r5j14m4M28m35M57k28K00j12J00n1j26j50M75l68
4262d7L9p2M8R9j72q6N8q3L5M63j43j82k1K3J98J17m95O6J65j18L77k86M11m48
4286e4K01l69K90l06J55P2l0J51M8K39n08L34n72M39k32L06j15P8j9K3J80n12
4308b01J33K90k3l75N0J6K85k96K71J40l51J39j86K7L49l39J12j60jK88m50O01
4330C19k44j64K98j92P1N9n5o2k0K0Mj21R5m5J86l65K26j31K21k22J50j32J94
4353I0j35J06j31l28M38k83J67J50j5M4j64P6P5k36K71p6r4M4j38L35j59R8M5
4376A80j73O1m7j07J74l90J28J43P8K73m24K37k22J5r1L51j59J2j33K08M6J30
$$ plain form
4398 290 -8 -275 173 -146 141 -56 -321 163 -119 227 -257 -178 81 -15 89 183 108 11 77 -79 -95 48
4420 48 65 -42 -146 -216 -100 -88 -90 -38 -153 166 -59 81 -143 -221 -157 46 38 14 -144 -197 17 -242 42 -35 -209
4445 -209 192 223 97 -177 83 -37 -28 63 218 135 2 -98 -13 87 -101 172 131 -210 -121 -149 169 -84 -102
4468 -102 144 -52 181 155 41 144 22 166 -9 63 -117 -131 -127 43 -138 -33 -185 -311 33 87 -155 -28
4490 -28 13 -29 18 72 79 -86 -233 -181 -69 -10 -122 -127 -82 -191 239 204 216 -197 -27 117 64 54 108 109 -240 -350
4516 -350 -93 -95 32 -3 -40 72 -261 -55 207 -36 -39 117 -10 -51 192 -149 -137 72 266 35 170 -172 -122
4539 -122 23 28 -239 151 167 -80 128 -250 238 -59 16 77 -234 -210 235 21 -85 59 -35 -91 84 -7 -142
4562 -142 -36 179 103 154 -59 -27 -103 -40 348 34 4 -124 -56 78 -197 16 76 -50 -26 42 103 80 -28 -89
$$ packed form
4398B90k98k67M48l19K87j97k65M84k82L46m84P9K59r6J04R4p5r7O6j56j6J43
4420D8J7j07j04p0J16J2kN2j15L19k25J40k24p8O4K03qk4j58n3K14k59K84p7j74
4445b09M01L1j26k74K60j20RR1J55q3j33j00Q5J00j88K73m1l41Q9k8L18k53j8
4468a02K46j96K33k6j14J03j22J44j75P2j80j4MJ70j81J05j52j26L44N4k42J27
4490b8M1m2M7N4Pj65j47N2J12N9j12nM5j09M30l5J2m13J70J44n3j0N4Jl49j10
4516c50K57kJ27l5l7J12l33K06K62k43lJ56j27m1K43l41J2K09J94k31J35l42N0
4539a22J45Nk67L90J6k47K08l78M88k97P5O1l11K4M45k14j06J44r4n6J75r1j35
4562a42J06K15p6N1k13L2p6O3L88l14l0j28O8J34k75K13O0j26K4O8O1k3j08o1
$$ plain form
4586 -89 -16 36 -166 -115 -20 165 40 1 152 105 191 32 -81 -203 292 -5 109 54 21 218 83 -48 -25 -15
4610 -15 -110 177 17 128 1 -65 202 95 -227 259 -75 321 126 -183 -6 -98 46 -24 11 -3 -187 45
4632 45 -196 -137 146 64 -62 -296 126 -300 -8 -122 -100 34 -24 226 -31 -342 -18 140 234 90 121 176 -237
4655 -237 -136 8 -179 -142 -115 -135 155 -85 -14 85 34 -26 11 -105 6 -93 -250 -51 -250 -8 95 -51 112
4678 112 129 53 48 -24 157 137 -36 16 -22 -74 40 6 -5 -114 7 -75 58 132 -170 284 155 65 12 -48 291
4703 291 -239 -68 103 111 129 -163 211 64 -79 17 -146 36 106 23 -23 113 229 -20 -3 -92 -174 49 -229
4726 -229 -139 159 -149 -107 48 -45 44 -104 49 79 -43 111 19 -100 -27 -162 98 -85 -140 -264 28 -104 -233
4749 -233 -192 -53 203 -121 -91 -48 -186 -231 72 -35 -18 124 -72 -166 -99 -22 -17 -228 109 50 26 168 -95 -29
$$ packed form
4586h9P3N2k02N1R5J85j25l9J51m7Q6j59j13j22M95k97J14n5l3J97j35j31K3J0
4610a5r5K87j60J11j27o6K67j07l22M86l34L96j95l09J77r2J44p0L5j4j84K32
4632D5k41N9K83q2j26k34M22m26K92j14K2J34n8K50k57l11L24J58R4j44L1N5m13
4655b37J01J44j87L7K7k0K90k40P1R9n1o0L7j16J11r9j57J99j99K42J03j46J63
4678A12J7p6np2J81k0j73N2l8n2J14l4j1j09J21q2J33P4l02M54j29r0n3o0L39
4703B91n30J71J71QJ8k92L74j47j43R6j63J82P0q3m6J36J16k49J7q9q2K23k78
4726b29R0K98l08M2J55r3Q9j48J53L0j22J54r2j19P3j35K60j83n5j24K92j32j29
4749b33M1J39K56l24L0M3j38m5L03j07J7J42j96r4O7P7Nk11L37n9k4J42k63O6
$$ plain form
4773 -29 -30 -86 -54 -87 22 151 31 33 -244 44 263 99 -282 44 -43 171 138 -82 63 -149 -24 -173 -211 -87
4797 -87 320 -230 -30 142 -3 -52 215 167 -348 50 249 43 -172 151 141 -43 67 221 -266 -294 121 100
4819 100 -144 34 -47 -33 88 132 -35 134 19 -2 101 221 -9 98 -97 -228 -45 58 -23 -63 201 93
4841 93 -80 -136 45 87 -2 119 88 74 -74 -175 216 70 74 37 -51 -410 -203 -121 216 92 -32 47 -67 -251
4865 -251 131 104 -93 -138 -183 -201 54 40 58 -313 91 -125 85 42 176 9 46 -125 -87 26 -163 136 68
4888 68 -220 53 -119 26 -21 37 -123 237 -66 -135 20 -44 62 52 -67 184 -176 239 -16 43 -47 -21 21
4911 21 251 78 78 -129 -198 18 55 -106 56 -194 -6 83 -128 76 194 -86 -47 -88 -71 11 70 -306 125 399
4935 399 -142 145 -34 54 120 -153 235 -80 -145 159 -122 71 -8 -224 250 112 -310 193 90 102 1 67
$$ packed form
4773b9jn6L2l3J09J29j20Kk77K88K19j64l81L26q7K14l3k20J45k12J25j49l8J24
4797h7M07n50K00J72j45m9K67m8n15L98J99k06k15L23j0j84J10J54m87k8M15k1
4819A00k44J78q1J4J21M4j67J69j15k1J03J20k30J07j95j31J83J03q1m0K64j08
4841I3j73n6J81M2q9J21l1j4j48j01L91j46Ml7q8l59K07Q2L37j24j24P9j14j84
4865b51L82k7j97m5m5j8K55j4J8l71M04k16K10m3J34j67L7j71L8J13j89K99o8
4888F8k88K73j72J45m7N8j60L60l03o9J55o4J06j0j19K51l60M15k55N9r0K6M2
4911B1K30j73%k07o9K16L7j61J62k50J88Q9k11K04J18k80L9m1J7Q2N9l76M31K74
4935C99n41K87j79Q8O6k73L88l15o5L04k81J93p9k16M74j38m22N03j03J2j01O6
$$ plain form
4957 67 -155 -139 100 5 38 -76 164 -66 25 125 -182 -112 -8 116 105 -17 -73 -22 -54 189 -183 -19 1 -78
4981 -78 -166 -68 332 77 -64 62 28 -49 -14 -174 193 31 -220 103 -117 -91 -14 -266 47 -153 28 -49 152
5004 152 162 -129 -26 94 94 -68 81 -52 50 230 90 -81 -9 -109 195 -139 14 145 -91 164 -16
5025 -16 102 -17 245 -153 -113 76 -203 73 -24 -146 61 197 198 -108 -25 228 -30 43 -162 30 62 -1 49
5048 49 162 -27 -143 -294 -264 181 -132 -4 -15 -45 31 42 238 -225 -17 53 -19 -226 -27 108 254 -41 -159
5071 -159 112 158 9 -208 -119 211 -40 85 -25 -131 118 38 59 -121 20 -25 98 52 91 90 -139 -334 -77
5094 -77 -14 163 -29 10 -194 69 210 -57 -32 91 77 38 179 -49 -106 47 98 -342 67 78 -34 -27 26 105
5118 105 -150 -170 34 103 14 188 37 -141 -56 21 268 -133 181 -92 -80 -48 186 140 136 28 -150 -128 271 360
$$ packed form
4957F7k22J6K39r5L3j14K40k30R1J00l07P0J04J24j1j22n6N1l2K43l72J64K0p9
4981g8q8R8M00k55j41J26l4p7L5j60L67j62k51L23k20K6P7k52L13k00J81p7K01
5004A52J0k91J03J20%j62J49j33J02J80j40j71P2j00L04l34J53J31k36K55j80
5025a6J18j19K62l98M0J89k79K76r7j22K07J36Jl06Q3K53k58P3k05J92L2o3N0
5048D9J13j89j16j51L0M45l13J28j1l0P6J1J96m63K08P0p2k07J99J35J46k95j18
5071a59K71M6j49k17Q9L30k51J25j10j06K49q0K1j80J41m5J23m6L9jk29j95K57
5094g7O3J77j92L9k04K63J41k67K5J23j4l9J41k28n7J53N1m40M09J1j12PN3P9
5118A05k55k0K04O9q9J74j51j78Q5P7K47m01L14k73J2L2K34m6mj08j78K2L99Q9
$$ plain form
5142 360 201 203 294 -80 -65 65 69 112 124 269 -303 -8 69 250 -28 185 -271 -60 -63 -106 -151 72 -310 -47
5166 -47 -46 108 -318 38 -316 -132 70 122 -166 56 18 163 75 -331 -149 -143 -167 -270 -29 -191 -28 -299 84
5189 84 84 278 23 -193 164 62 -157 2 53 281 -221 -93 -134 -89 -31 79 60 -184 -78 162 -54 19 -68
5212 -68 74 -88 -127 -55 -13 69 126 -54 69 -153 -37 9 220 139 -241 0 77 63 -146 321 -192 126 -25
5235 -25 -286 124 -75 117 115 -209 3 -185 78 -138 97 58 119 152 110 72 -62 -19 101 104 -160 -59 18 51
5259 51 11 -14 152 -165 -7 107 -108 -229 -120 33 -95 59 277 172 -357 181 -122 -202 141 117 142 109
5281 109 -400 57 -1 161 75 246 98 -267 -68 114 215 -98 47 94 -127 267 27 274 150 70 -17 -24
5303 -24 25 47 219 87 254 -45 -92 188 23 22 26 -110 -116 93 159 43 303 46 -178 107 10 119 -195 -95
$$ packed form
5142C60j59KR1l74J5J30MM3J2J45n72K95P7J81k78K13m56K11lm3m5K23l82K63
5166d7JJ54m26L56l54J84K02N2k88K22l8J45q8m06J82Ok4j03K41j62J63k71L83
5189H4%J94k55k16L57j02k19J59N1K28n02J28m1M5N8J10j9k44J06K40k16P3q7
5212f8J42j62l9P2M2Q2N7j80J23k22J16M6K11q1l80K41P7j4k09M67n13L18j51
5235b5k61M10j99J92kl24K12j88K63k16K35l9O1L3m2l8j34M3J20Lk64J01P7L3
5259E1m0k5J66l17J58J14k15j21J09J53j28J54K18j05n29N38l03q0L43k4K5l3
5281A09n09M57n8J62q6J71j48l65J99J82J01l13J45M7k21L94k40K47j24q0q7p
5303b4M9K2J72j32J67k99m7K80j65jMj36oK09O6j16K60k57k24K85r7J09l14J00
$$ plain form
5327 -95 73 -81 -168 -84 28 -267 -177 -118 -11 -53 42 -98 187 -246 18 -274 -133 -96 6 -122 -60 -187 235
5350 235 24 48 34 263 -352 142 113 -34 176 -355 -211 205 -182 151 -157 -29 7 -15 245 40 87 -141
5372 -141 -101 -43 7 -31 -120 127 -39 -215 217 0 112 -6 98 147 119 -28 53 -38 -79 -55 -82 -45 78 104 -92
5397 -92 257 245 -149 86 -260 -13 -81 43 202 -220 -49 72 -14 272 -75 -6 -121 322 -184 -74 25 -14
5419 -14 3 -170 188 81 -117 -262 -62 -65 -199 192 17 46 -191 -47 -64 324 -9 200 8 12 -11 -2 204 -32
5443 -32 -28 222 -99 -93 -210 -144 -57 -203 36 127 -65 -180 -183 68 147 -36 154 -287 -150 62 -77 84 237 -3
5467 -3 -47 -188 36 115 44 3 193 -87 55 -119 -145 135 -4 153 -258 243 -20 291 153 -12 89 285
5489 285 23 -87 93 -56 -151 -31 -231 -291 137 36 171 56 -111 -12 -97 135 202 69 264 291 116 102
$$ packed form
5327i5J68j54q7Q4J12k95R0N9J07m2R5j40K85m33K64k92J41L7J02j28O2j27M22
5350B35k11K4j4K29o15M94k9j47K10n31J44M16l87L33l08J28L6k2K60k05M7k28
5372a41M0N8N0l8q9K47j66j76M32k17J12j18J04M9k8j47Q1r1m1K4k7L7J23K6j96
5397i2L49j2l94K35l46K47o8J24J59m22J71J21q6K86l47O9j15M43n06J10R9l9
5419a4J7j73L58j07j98j45K00lj34L91j75K9k37J44j7L88l33K09j92Mk3RK06k36
5443c2MK50l21Oj17O6Q7j46K39R1j92j15lK51P9j83J90m41J37K12j39J61J53k40
5467cm4j41K24P9p1m1J90k80J42j74k6K80j39J57m11N01k63L11j38j65J01J96
5489B85k62j10J80j49r5J20k00o0M28j01J35j15j67R9q5K32O7j33J95K7j75j4
$$ plain form
5511 102 131 -274 90 -15 166 -137 -95 -4 259 -118 -192 -165 -54 0 54 132 -67 -44 -101 81 -159 -220 262 -273
5535 -273 -134 -270 62 -198 102 -117 3 111 62 -47 183 -162 -280 187 -96 4 60 241 88 -161 -234
5556 -234 259 204 -206 77 -64 140 -128 -106 -83 -153 11 70 -137 52 -4 70 -74 334 -161 -24 -91 -328 222
5579 222 160 -98 113 103 106 62 38 -195 76 163 -13 -22 -55 -47 63 -189 -134 270 172 19 -40 -177 -95 133 247
5604 247 -110 -63 -100 -46 -16 189 144 -216 100 -18 16 -47 136 -32 -303 15 39 -6 29 101 -69 29 -70 131
5628 131 -46 29 375 172 -197 229 40 72 -205 -80 -5 56 -37 -12 50 130 -57 115 218 276 -86 -308 -16
5651 -16 82 -7 0 40 -56 100 -212 -280 -130 -86 95 94 186 14 61 -46 63 0 -90 68 94 -241 87 548 44
5676 44 102 69 -92 -270 -107 4 -24 169 -62 192 30 -166 135 149 158 -198 10 -13 -10 -354 61 147 4 -7
$$ packed form
5511A02K9m05L64j05J81l03M2R1K63l77p4K7J11N4N4P8j99K3n7J82k40o1M82n35
5535b73J39j36L32k60L00k19J20J08m9j09K30l45j18M67k83J00N6J81j53k49p3
5556b34M93n5m10K83j41K04k68K2K3p0J64N9k07J89n6P4j44M08m95J37o7k37N50
5579B22o2k58K11j0Lm4k4k33K71Q7j76rl3QJ10k52N5M04r8j53n9j37Q2K28J14
5604B47l57M7l7N4L0K05m5l60L16j18L4o3J83j68k71L18K4m5L5P2j70R8r9K01
5628A31j77P5L46k03l69M26j89L2k77J25P5O1r3K5O2Q0j87J72J03N8l62k22K92
5651a6R8q9PM0r6J56l12o8J50M4J81jR2j72M7j07J09o3r0J58K6l35L28M61n04
5676D4N8l3j61j78J63J11k8J93k31K54j62j96L01J4Rl56K08k3Ll44M15Q6j43j1
$$ plain form
5700 -7 -145 -91 -94 56 -90 54 -219 146 17 -189 -83 -326 152 9 111 -66 -44 84 -15 113 23 66 -69
5723 -69 323 -7 108 249 142 10 -242 -215 19 -41 266 -85 -53 25 233 -54 60 136 -160 -304 238 -229
5745 -229 -273 -118 221 -191 -68 208 128 188 -242 88 -28 -5 -302 43 -200 -14 -89 280 -213 43 79 13
5767 13 -80 -129 104 -28 157 -39 90 262 -32 93 -83 -34 -64 -244 -150 68 111 -177 -25 130 -78 193
5789 193 101 -13 106 -74 305 -30 94 -86 -45 -67 36 -90 268 170 -24 311 14 -83 212 126 -139 151
5811 151 53 -75 -81 58 -190 -200 132 -49 211 67 -106 119 -20 -42 100 -15 -4 -13 -112 133 -37 142 59
5834 59 -288 161 6 61 94 31 -41 -180 184 -164 -208 155 12 -398 169 97 -4 32 -50 97 287 48 195
5857 195 52 275 47 101 111 -94 285 157 79 -343 123 39 224 100 -67 -60 -128 -125 85 55 126 194 -20 -28 120
$$ packed form
5700gj38N4lJ50j46J44k73L65j29k06J06k43M78j43J02j77K2J28r9J28r0M3j35
5723f9L92l30J15J41j07j32k52K7K34o0L07l51L2P8K08k87J14P6k96j44N42m67
5745b29m4J55L39m12J23K76q0O0m30L30j16K3k97L45k43J86p5L69m93K56L6o6
5767A3r3m9K33j32J85j96J29J72k94J25j76M9l0j80R4K18M3k88J52J55k08K71
5789A93r2j14J19j80L79l35J24j80M1k2J03j26L58r8j94L35k97r7K95q6k65K90
5811A51r8j28oJ39k48j0L32j81K60j44j73K25j39k2J42j15J1rr9K45j70J79q3
5834E9l47M49j55N5L3o3p2j39L64l48m4L63j43m10N67p2j01L6q2J47J90k39J47
5857A95j43K23k28N4J0k05L79j28p8m22M66q4J85j24j67Po8LK10l0P1O8k14qJ48
$$ plain form
5882 120 21 94 117 66 91 -194 173 -262 79 10 38 102 80 -257 37 112 153 144 155 23 -134 54 -284 -111 -142
5907 -142 269 -194 17 72 293 -14 -51 86 -42 -74 149 -14 -186 65 63 210 -151 -12 11 31 -254 169
5929 169 98 -116 -358 -124 141 -156 90 -158 -59 24 112 -177 -36 -206 -121 -146 14 84 88 -176 -26 131 -41
5952 -41 -44 151 219 -12 74 -88 -105 -58 118 -74 -296 -8 -136 281 -264 -128 -61 23 -55 128 -37 -82 209 -44
5976 -44 219 -99 -64 7 -59 153 183 288 252 62 -128 -154 33 -144 95 -83 -54 0 -68 -180 165 379 -13
5999 -13 -40 65 -10 -330 -72 -111 -371 -65 79 -98 -28 -126 -203 54 -223 -39 28 -77 67 -3 93 135 -52 142
6023 142 -150 225 61 40 -115 -72 197 -117 69 78 221 32 -139 314 3 -209 -166 -11 -24 -75 39 -227
6045 -227 -167 -74 -38 93 125 40 24 161 145 -106 257 -201 -20 250 64 111 -134 -112 68 -117 -55 137 66 -139
$$ packed form
5882A20r9P3K3n1K5k85L67m35L41o9K8O4k2l37K94P5M1rJ1j32j57J88l38J73l1
5907a42M11m63K11N5K21l07l7J37j28l2K23j63j72K51kJ47l61J39K3K0k85M23
5929A69p1k14k42K34K65k97K46k48R9Q3Q8k89J41j70Q5k5J60P0Mk64J50J57j72
5952d1lJ95O8k31Q6j62j7M7J76j92k22K88j28M17n45J36O7Q4p8J83j65m5K91k53
5976d4K63l18L5P1o6K12L0J05l6j90j90k6J87j77K39j78K9N4o8j12L45K14l92
5999a3k7J05p5l20K58l9k60L06J44j77P0r8p7K57k77J84O7j05J44p0R6M2j87J94
6023A42k92L75j64k1j55M3K69l14J86RJ43j89j71M53l11k12M3J55j3n1J14k66
6045b27O0R3L6J31L2q5j6J37j6k51L63m58J81K70j86M7k45K2J80j85O2J92p1k05
$$ plain form
6069 -139 -250 -84 -73 291 9 -37 -152 -91 -102 252 -186 -15 -150 59 146 350 -7 91 69 15 152 57 -53
6092 -53 205 -56 -65 -90 -127 26 29 -182 152 -9 125 3 104 138 59 -87 -28 264 200 170 -203 -34 -133 188
6116 188 -236 11 -124 323 33 186 -143 -274 -4 -269 59 -170 -59 -141 72 205 -144 150 229 365 136
6137 136 -28 -17 -47 -17 -16 -83 166 60 -170 -11 34 92 -180 -24 7 -91 -262 26 189 -27 -51 99 94 -102
6161 -102 182 -29 -81 -12 -336 0 -87 291 -164 271 -81 154 23 -333 -178 346 -66 116 -90 116 75
6182 75 44 -38 150 -43 -61 184 -99 54 -243 189 8 246 49 18 -119 210 21 36 259 -169 -120 -164 -72
6205 -72 90 213 153 239 31 42 -109 181 142 -121 -158 -237 38 84 76 52 -241 176 3 -6 90 150 -62 83 -208
6230 -208 -60 -117 38 -158 -23 -243 -58 158 -51 251 86 13 -182 111 35 -131 -89 -140 -80 -196 -169 -133 -3
$$ packed form
6069a39j11J66J1L64k82m6j15O1j1L54m38J71j35K09Q7K04l57R8k2n4J37r5j10
6092e3K58k61rk5l7J53Lk11L34j61J34j22J01L4p9j46N9K92o4l0l73J69r9L21
6116A88m24K47j35M47k90J53l29j31K70k65L28k29J11q2K13J33l49K94P9J36k29
6137A36j64J1l0L0Jo7K49j06k30J59M5N8k72J56L1r8j71K88J63k16k4J50nj96
6161a02K84k11n2O9l24L36q7L78m55M35l52K35j31l56J55N24m12J82k06K06m1
6182G5l1q2J88j93j8K45k83J53k97M32j81K38j97l1j37L29j89J5K23m28M9m4R2
6205g2J62J23o0Q6k08J1j51K90l9k63l7p9K75M6qk4k93M17j73rR6O0k12J45k91
6230b08J48n7J55j96J35k20J85K16k09L02j65p3j95K93p6j66M2n1O0j16K7L6J30
$$ plain form
6253 -3 18 53 -83 170 98 -226 -205 -63 -110 4 -112 -25 68 262 243 110 162 -314 -21 69 -109 -15 382 -47
6277 -47 25 -126 -18 231 -124 69 181 141 -91 -62 -59 56 102 36 166 -185 -94 168 -174 70 -176 255 -49
6300 -49 -41 400 41 -223 233 34 87 173 -37 -25 -198 344 -1 43 101 -130 31 45 -60 -133 -37 137 -58 67
6324 67 -115 -143 57 270 -143 -169 134 184 -307 -83 133 58 245 297 41 -130 74 -154 66 -96 -392 -1
6346 -1 49 61 -175 292 33 80 -108 -79 -216 -201 125 -173 -43 75 -186 -263 151 -136 -168 101 181 6 110
6369 110 -240 77 19 -72 -88 216 0 36 -29 28 -120 262 19 116 115 47 89 55 23 -114 -53 -32 357 30 -85
6394 -85 11 151 209 22 59 56 60 -177 -49 112 51 7 -18 -93 251 124 14 -14 178 89 13 83 -196 -112 -108 12
6420 12 -93 163 -66 -87 -46 -301 41 -63 237 167 -131 -16 204 100 -54 -151 -152 -51 50 -171 -83 32 -16
$$ packed form
6253cK1L5j36K53p2l24K1J42m7J14j16Q7R3J94j9j33N2m76K93R0j78R4L97m29
6277d7P2j51J08K49l55J93J12m0k32K9LJ15M6o6J30l51R1K62l42K44k46M31l04
6300d9QM41l59k64M56j99N3Q6k10J2j73N42l45M4N8k31J61J4j05p3R6J74j95J25
6324F7j82k8K00K13m13k6L03N0m91K24K16p5J87N2k56j71K04k28K20j62k96L91
6346aN0J2k36M67k59M7j88K9j37J5L26k98J30J18k61p7M14k87l2K69Q0j75J04
6369A10l50L17n8r1j6L04k16L6o5N7j48L82k43R7jo8M2l4l2j37O1K1L89l27j15
6394h5R6J40N8j87L7lMk37J28J61o1m4k5p5L44j27j10k8J92q9p6P0k79Q4MJ20
6420A2j05K56k29k1M1k55L42j04L00p0k98J15K20j04j54r7jJ01J01k21Q8J15m8
$$ plain form
6443 -16 183 -70 152 -228 115 150 114 9 239 350 -64 -15 -78 -20 311 20 175 181 -179 -29 -62 198 -14
6466 -14 -40 150 70 140 -62 -13 -279 -138 106 111 -38 129 66 34 -148 -121 195 115 -2 159 -26 213 140 -130
6490 -130 182 52 -27 165 -226 196 31 -194 60 112 20 -121 -136 -85 -238 74 13 85 -258 -18 111 -66
6512 -66 -4 65 130 160 85 -2 -37 66 8 3 196 22 6 -25 108 46 -16 27 -35 88 267 153 -165 -28 56 -80
6538 -80 -98 -20 127 110 -38 104 -141 70 321 -255 8 -23 157 231 -53 106 -102 37 -70 47 169 109
6560 109 -36 -99 84 -88 -99 -199 -58 154 94 -91 -185 -52 17 56 -58 178 -64 -158 86 242 12 163
6582 163 -88 34 -3 -117 176 -19 8 -66 -1 114 -119 -166 -10 -239 -49 130 2 271 193 -180 82 278
6604 278 -64 180 -41 -202 31 -55 -39 -6 16 115 -24 -99 -58 33 154 -127 75 -90 -188 27 -173 -153 -126 -101
$$ packed form
6443a6J99k53K22l80L43L5l6j05K30J11m14M9o3N8L31k91J55Ol60J50l3K60k12
6466a4k6J90q0P0k02M9k66J41K44Nj49J67o3l2j82K7L16q0j17J61j85K39p3k70
6490a30L12j30p9J92l91M22j65k25K54N2r2j41j5N1j53L12o1P2l43K40J29j77
6512f6O2O9O5L0p5q7l5J03n8nJ93j74j6l1J33o2o2M3o2J23J79j14l18J37Q4j36
6538h0j8P8J47j7j48J42k45K11K51n76K63l1J80P4k84J59k08J39j07J17J22o0
6560A09j45o3J83j72j1j00J41K12o0j85r4J33O9L9j14K36k42r4K44J56k30J51
6582A63k51J22l7j14K93j95K7p4O5J15k33m7J56k29J90J79j28K69p8l73K62J96
6604B78l42K44k21j61K33q6J6L3K2R9j39p5M1R1J21k81K02j65r8K15k00K0K7K5
$$ plain form
6628 -101 -8 -49 -31 155 3 160 -51 -159 -129 50 89 71 -116 99 116 -125 166 -180 -125 90 -198 -155 76
6651 76 127 -164 -242 53 291 -143 95 -106 -31 177 66 -189 -80 105 -95 -90 21 171 -83 -186 26 90
6673 90 5 -159 -126 88 40 41 -56 -178 -19 -75 31 18 -69 65 -12 112 79 -50 97 -218 112 71 212 -81
6697 -81 -63 208 -61 56 212 39 42 -133 165 -12 -53 65 274 28 19 -65 43 112 183 -26 -306 -106 247
6720 247 -138 -106 -85 -106 405 -33 -22 -60 -119 -173 76 158 -82 33 43 -153 355 -145 -77 35 25 -356 -245 -68
6744 -68 16 -19 -26 244 -113 91 -105 143 109 14 -78 133 6 113 -228 41 128 -250 131 32 182 36 170
6767 170 153 75 -378 86 214 319 -36 95 -7 36 174 -312 259 58 -131 -135 98 87 250 -8 9 58 -255
6790 -255 276 -98 75 -69 -42 242 250 -113 77 -16 -225 258 -164 -173 -101 -125 -335 -45 -133 -240 -120 140 -154
$$ packed form
6628a01R3m1J8J86j52J57k11j08L0J79L9j8j87K15J7k41K91l46N5K15k88M3K31
6651G6N1k91p8K95K38m34K38k01P5K08j11k55J09J85k00NJ11J50k54j03K12O4
6673I0q5j64L3K14m8Jr7j22J59n6J06j3q7J34p7J24l3j29J47l15L30m1J41k93
6697h1J8K71k69J17J56j73Lj75K98j77m1J18K09k46rq4J08O9P1k09k80K00L53
6720B47l85L2K1k1N11m38J1l8n9n4K49Q2k40J15J0j96N08n00O8J12j0l81J11J77
6744f8Q4l5pK70l57K04j96K48l4r5r2K11j27J07l41K69Q7l78L81r9J50j46J34
6767A70j7p8m53M64J28J05l55J31j02M3J38m86N71k01j89mK33j1J63k58J7M9l13
6790b55N31l74J73j44K7K84Ql63J90r3k09M83m22rP2k4k10K90q8j07J20K60k94
$$ plain form
6813 -154 -103 19 72 134 237 181 105 -114 53 -70 -279 56 236 32 115 -273 -276 -82 -194 172 -82 2 101
6836 101 -183 5 26 -105 122 -308 64 -330 -195 42 -90 -44 116 -155 -232 91 18 -37 195 220 26 242
6858 242 -25 -128 -105 77 16 -68 34 92 -202 61 -240 14 49 239 31 97 -285 185 139 -74 -14 100 -185
6881 -185 -48 156 194 221 -48 154 123 261 222 337 -252 287 45 298 246 110 40 94 136 -96 99 104 170 -121
6905 -121 -198 -97 97 -242 -90 -168 168 79 -81 27 74 -175 -117 -110 -91 -2 -38 -147 107 71 -43 -68 -53 -242
6929 -242 164 269 45 -23 -126 -6 -375 163 -211 -207 72 -22 130 90 -224 205 27 -114 138 71 -112 -32
6951 -32 72 -86 -27 -161 -286 -80 119 213 -203 -7 -185 122 52 34 -71 -102 41 -168 -55 -8 -2 94 25 8
6975 8 101 159 234 -29 148 107 159 -80 -21 -129 -27 137 -118 -159 264 98 146 -292 -199 124 62 24 -75 18 -165
$$ packed form
6813a54N1J22N3O2J03n6p6k19J67j23k09L35J80k04Q3l88lJ94j12L66k54Q4R9
6836A01k84J88K1j31K27m30L72l94J35K37j32M6J60k71p7L23p3n5K32K5j94K16
6858B42k67j03K3J82o1q4J02N8k94K63l01K54L5J90k08O6l82M70m6k13O0J14k85
6881a85J37K04L8K7k69K02l1J38l9J15n89N39k42K53n2j36p0N4M2k32J95NO6k91
6905a21p7J01J94l39J52p8L36q9j60J08M7k49N8PJ9Q9l6j09K54l6j14k5J5j89
6929b42M06J05k24o8j03J20l69N38l74MK79r4J52m0l14M29j78j41K52o7j83Q0
6951c2J04j58N9j34j25K06J99R4m16J96j78L07p0j8j05l1J43k09J13M7OR6o9j7
6975HR3N8P5k63J77m1N2k39N9j08J02J64k55m1M23j66M8m38R3L23o2l8r9R3j83
$$ plain form
7000 -165 -143 -355 -103 -117 237 250 90 -54 -47 100 34 -40 -120 33 -68 79 263 217 -59 12 -182 -43 -94 -76
7024 -76 -11 92 -52 101 -47 66 51 90 224 149 8 67 -42 -94 128 -30 -235 -14 -165 -47 -44 83 67
7047 67 8 131 -137 129 173 -34 28 240 117 71 114 -186 -56 -237 -8 -232 206 67 -107 -84 -59 -61 21 94
7071 94 82 -296 -167 -41 -92 84 -59 34 -314 -128 -77 44 -91 -132 -6 -217 51 108 141 -149 1 190 74
7094 74 175 177 -6 -129 -80 -63 -148 60 116 46 -106 63 -111 -328 -180 59 43 -4 260 119 166 -63 5 66
7118 66 -46 213 196 -107 24 295 -71 -168 104 -68 81 -72 60 -86 -216 73 169 283 -31 -56 -82 1
7140 1 -192 -94 127 18 33 -31 49 118 281 -114 -106 -186 -217 -32 -71 222 -169 -10 15 0 37 -12 132 -335 277
7165 277 18 -76 -27 61 50 121 27 -93 146 84 162 -30 -203 74 -152 -126 92 -95 174 10 2 163 -35 -57
$$ packed form
7000a65K2k12K52j4L54J3j60j44PJ47o6p4q0J53j01J47J84m6k76P1j94J39n1J8
7024g6O5J03j44J53j48J13j5L9J34p5j41N9j09n2K22j58k05K21j51J18LJ27j6
7047F7n9J23k68K66M4k07O2K12j23m6M3l00J30j81K29k24M38j39j74K3K5kQ2P3
7071I4j2l78J29J26n1J76j43R3l48J86N1J21j35m1J26k11K68N7L3k90J50J89j16
7094G4J01Kj83j23M9J7q5K08N6p0j52J69j74k17J48K39j6m7K64j41M7k29O8O1
7118F6j12K59j7l03J31K71l66r7K72j72J49j53J32j46j30K89R6J14l14k5k6Q3
7140Aj93R8K21j09J5o4Q0O9J63l95Qq0l1J85l9K93l91J59K5j5L7m9J44m67O12
7165B77k59r4M9Q8j1P1r4j20K39o2P8j92j73K77k26K6K18j87K69j64qJ61j98k2
$$ plain form
7189 -57 -202 -17 -130 -34 60 -69 86 87 272 201 -22 131 202 -31 -41 -279 130 63 -81 -131 38 -140 99
7212 99 143 262 -211 80 -52 48 0 -30 114 1 -76 210 212 2 6 -25 173 58 -7 -39 0 -95 48 366 43
7237 43 -123 270 -110 32 122 99 -3 -162 23 -60 -142 -197 242 -74 -30 -20 54 -108 170 -50 -278 98 -280
7260 -280 -173 -34 118 7 203 114 -118 102 230 23 182 10 124 75 4 37 -185 317 51 92 -8 -24
7282 -24 -220 -166 165 -74 235 -82 25 -87 348 -53 -138 -61 126 -15 -167 -35 -174 106 -1 -37 -135 1
7304 1 122 119 -23 114 157 100 -81 108 -7 -228 -63 -12 -19 267 -188 -105 15 -13 110 -80 21 -137 39 84
7328 84 71 -102 -117 170 -67 190 -45 -176 -20 -132 27 -152 -233 192 353 -178 -38 -85 -12 -143 30 199
7350 199 -147 10 -100 -74 62 227 -128 91 19 -57 -107 -195 -27 154 154 119 144 224 90 276 49 -93 29
$$ packed form
7189e7j45J85j13R6R4j29J55JJ85p1k23J53P1k33j0k38M09o7j44n0J69j78K39
7212I9M4J19m73K91j32J00m8l0J44j13p7K86Kk10Ml1J98j15o5l2L9r5J43L18l23
7237D3j66L93l80J42R0k3j02j59J85q3q2n5M39l16M4J0P4j62K78k20k28L76l78
7260b80J07J39J52j11J96q9k32K20J28k07J59j72J14m9p1L3k22N02k66M1j00j6
7282b4j96N4L31k39L09l17J07j12M35m01q5P7J87j41j52J32j39K80j07l6r8J36
7304AJ21lj42J37M3n7j81J89j15k21J65N1pK86m55Q3J20k8J23j90J01j58J76M5
7328H4j3j73j5K87k37K57k35j31J56j12J59j79q1M25J61n31J40m7P3j31J73J69
7350A99l46J57j10K6J36J65l55K19p2p6n0q8J68J81%l5K5Q0j34J86k27j42J22
$$ plain form
7373 29 81 56 202 8 114 -138 -63 115 -305 -44 -204 -240 39 -9 -42 154 -15 76 132 -86 -66 -108 -107 25
7397 25 -128 152 276 -226 -91 -45 11 -48 -48 92 -40 85 232 213 98 181 25 53 -155 -107 -122 315 -65 -136
7421 -136 115 -187 -78 -18 238 -103 117 162 93 207 -23 240 -54 -23 -3 31 -40 203 -1 421 81 118 -83
7444 -83 2 219 24 -56 163 218 -73 -94 185 -25 50 248 203 8 119 337 -70 0 115 -101 -186 248 -157
7467 -157 -124 -61 6 -131 -86 -132 12 0 146 3 -116 24 36 151 -17 113 -139 387 65 -93 -2 107 51
7490 51 -323 -86 121 132 9 -155 142 95 -62 24 118 164 -94 10 79 7 61 218 -113 -161 -129 67 -85 63
7514 63 100 101 -110 274 -25 3 -109 -321 -80 -4 175 241 107 13 -1 25 39 -191 349 282 -240 268 -135 -35
7538 -35 59 -86 36 -214 207 -91 -258 115 -314 360 73 110 -4 169 -123 127 -361 -276 62 -234 -128
$$ packed form
7373B9N2k5J46j94J06k52P5J78m20K61j60l6K79m8l3J96j69R1N6k18K0m2JJ32
7397B5j53K80J24n02J35M6N6n9%J40j32J25J47j9j15Q3j56K8k08M8j5M37l80p1
7421a36K51l02J09O0K56l41K20M5o9J14k30K63k94L1K0L4p1K43k04M22l40L7k01
7444h3Q5K17j95q0K19N5k91k1K79k10P5J98m5j95J11K18m07P0J15k16q5M34m05
7467a57L3O3O7j37M5m6J44j2J46j43j19J40J2J15j68J30k52N26l22j58R1J09n6
7490E1l74K37K07J1j23j64K97m7j57Q6R4M6k58J04O9p2N4J57l31m8L2J96j52J48
7514F3L7Jk11L84k99K8j12k12K41P6J79O6j34r4j4K6J4k30N40o7n22N08m03J00
7538c5R4j45J22k50M21k98j67L73m29O74k87L7j14J73k92K50m88Q5L38k96J06
$$ plain form
7559 -128 -182 7 -128 -113 11 174 -62 -221 -27 -71 224 -142 85 86 31 -2 -293 19 53 160 -2 32 -5
7582 -5 255 137 279 -3 18 -16 -78 -97 -192 -191 31 -113 -79 -87 86 -157 231 -67 -120 125 -286 276 55 -121
7606 -121 -76 55 -185 -113 54 75 -4 187 232 -65 72 -55 60 -162 -24 78 299 37 -3 -19 -129 173
7628 173 -31 235 177 244 146 -225 -50 -146 71 -109 -44 8 142 211 106 1 114 4 -23 -226 141 -83 -108
7651 -108 -242 -193 90 28 -215 18 -17 -84 -110 -64 -78 15 183 165 -37 74 249 -194 54 188 394 5 -136
7674 -136 285 187 6 -40 184 57 14 -127 36 -124 -115 348 88 142 -271 -1 -242 66 -8 130 44 -54 328
7697 328 71 -185 14 151 59 -13 -12 229 -332 50 34 187 64 121 271 -279 15 90 -18 140 52 -196 4
7720 4 23 -39 111 145 -77 40 -246 55 -146 -190 -31 1 123 -221 69 101 -91 -114 -76 47 95 -83 120 -212
$$ packed form
7559a28n4J89j35J5J24J63k36j59J94m4K95l66K27Jn5l3k91L12L4J07j62L4l7
7582eK60j18J42k82K1l4o2j9r5JK22j44L4qJ73k43L88k98n3K45m11N62k21j76
7606a21M5J31k40P2J67K1p9J91M5k97J37j27J15k22J38J02K21k62m0j6j10L02
7628A73k04K66n8O7r8l71J75r6K17j80O5N2J34O9j05j05J13j10k7k03L67k24k5
7651a08j34M9K83o2k43K33l5o7k6M6j4R3J68j8k02J11J75m43K48J34K06l89j41
7674a36M21r8j81m6K24j27m3j41J63j60RM63k60N4m13K70k41L08p4J38q6r8L82
7697C28k57k56J99J37r2p2JK41n61L82j6J53j23N7J50n50K94P5j08J58q8k48K00
7720DJ9o2J50L4k22J17k86L01k01m4J59L2J22l44K90L2j92k3L8J23M8j78K03l32
$$ plain form
7744 -212 127 -70 277 49 225 -49 -16 17 20 -104 105 367 -83 -148 129 -161 -156 -165 1 123 135 129 101 69 -256
7769 -256 144 35 -13 149 154 123 -111 -26 36 -43 -101 -176 -72 -120 -263 -70 315 14 195 76 -29 100 318
7792 318 38 125 85 -193 -39 -9 -168 -137 210 -111 81 -141 -73 127 -20 -131 234 88 40 -276 220 370
7814 370 35 20 -78 -294 -15 -126 -71 13 -155 114 -37 -136 -56 101 -75 299 49 129 118 -151 -125 63 46
7837 46 39 -214 39 20 337 -9 -11 244 62 -73 -37 177 55 124 167 58 -277 29 -318 252 -23 -127 -14
7860 -14 -184 75 -193 -168 207 -178 -164 44 -126 -92 123 -97 -241 -175 -145 -68 151 -89 -225 317 354 144 -37
7883 -37 7 84 -135 120 -73 -70 -373 101 -52 -48 -68 -101 -77 155 39 -130 44 -237 126 -148 -94 161 -338 -54
7907 -54 63 75 400 -63 -238 86 -93 96 219 -14 -45 -36 -162 -316 106 182 304 191 -14 -90 -240 18
$$ packed form
7744b12L39j97L47k28J76k74L3L3Lj24K09K62m50o5K77k90NrJ66J22J2ok8l2l25
7769b56M00j09m8J62Nl1k34Q5O2p9n8p5J04m8j43J93L85l01J81j19j05J29K18
7792C18k80Q7m0k78J54L0j59L1L47l21J92k22O8K00j47j11L65j46m8l16M96J50
7814C70l35j5r8k16K79j11N5Q4j68K69j51r9Q0J57j76L74k50Q0j1k69K6J88j7
7837D6pk53K53j9L17l46kK55j82j35L6K14j22O9M3j09l35L06l47N70k75j04J13
7860a4j70K59k68K5L75l85J4K08j70L4K15k20j44O6L0P7K19k40j36N42L7k10j81
7883c7M4P7k19K55j93Ll03M74j53Mk0l3K4K32j16j69J74k81L63k74N4K55m99K84
7907e4J17J2L25m63j75L24j79J89J23k33l1Rj26j54M22P6J22j13k05p6j50K58
$$ plain form
7929 18 -84 -104 33 185 -42 47 31 20 -22 14 205 67 -166 -138 48 -85 35 51 -53 108 193 -238 -120
7952 -120 -7 -13 -150 44 -295 383 -182 132 -2 -22 65 -33 95 16 -10 -197 7 40 -127 20 157 -174 25
7975 25 -223 182 -98 -142 -73 -45 158 -117 -291 46 66 -152 -191 -13 314 -143 164 -202 -203 108 -85 319 98
7998 98 -51 -28 -409 -66 -178 -70 61 345 133 -64 -9 -152 -391 -108 -32 -191 127 238 92 7 -371 -58
8020 -58 -206 60 76 98 158 -38 145 92 214 76 70 1 138 -308 -86 120 23 -3 55 64 -204 128 -36 -95 -125
8045 -125 -173 -280 -324 28 -58 -189 65 150 144 78 36 -176 -48 -295 -214 147 196 150 46 -169 131 64 -94 140
8069 140 182 -117 12 89 -66 209 45 -202 128 -56 104 66 -23 -180 149 147 -41 5 -60 -95 47 -96 -113
8092 -113 -282 130 -54 -10 174 -56 -170 -144 108 -353 177 93 98 -54 49 160 -31 4 -87 98 -182 25
$$ packed form
7929A8j02k0J37J52k27Q9j6j1m2L6J91j38k33K8J86j33J20J6j04J61Q5m31J18
7952a20J13oj37J94l39O78n65L14j34k0Q7r8J28p9k6j87K04L3j67J47J37l31J99
7975B5k48M05k80m4O9K8K03k75j74L37K0k18l9J78L27m57L07l66jL11j93M04k21
7998I8j49K3l81L43j12J08J31K84k12j97N5j43k39K83P6j59L18J11j46q5l78L13
8020e8j48K66J6K2O0j96J83n3J22j38oo9J37m46K22K06r7k6N8Rk68L32j64n9l0
8045a25m8j07m4L52q6j31K54Q5oo6m2k12J28k47Q1L61M9m6j04k15L00o7j58K34
8069A40M2k99J29P7j55K75j64k47L30j84J60l8q9j57L29kj88M6o5l5J42j43j7
8092a13j69M12j84M4J84k30j14K6K52m61N30q4Nj52J03J11j91L5r1J85k80K07
$$ plain form
8114 25 -199 -192 105 -11 -143 24 177 136 76 -210 -120 40 107 14 -224 -6 -41 28 235 181 15 -6 61 -137
8138 -137 -22 13 -283 -111 139 -45 -161 110 -58 -88 -118 56 -127 56 125 -56 -197 -26 -51 -48 84 257
8160 257 108 90 -21 155 29 -40 -123 -168 229 -258 43 -84 -118 142 -127 16 -148 16 133 52 88 -310
8182 -310 -79 34 -254 200 128 -123 -149 157 -313
$$ packed form
8114B5k24PK97j16j32J67J53m1o0k86R0J60O7r3k38K18l5O9K07n4j66k1O7j98
8138a37J15L5k96J72K50j84j16K71j68l0l0J74j83J83O9j81j41J71k5LJ32J73
8160B57j49j8j11J76j26o9q3m5L97m87L01j27l4K60k69J43j64J64J17q1L6l98
8182c10K31J13k88M54p2k51k6L06m70
8191c13
$$ Imaginary data points
##PAGE= N=2
##DATA TABLE= (X++(I..I)), XYDATA
$$ plain form
0 0 0 0 0 0 0 0 0 0 0 0 0 -8 8 -8 8 -8 16 -16 24 -24 32 -40 44 -52 62 -72 80 -96 112 -128 144 -165 188 -212
34 -212 238 -269 302 -340 380 -421 469 -522 578 -642 709 -783 864 -954 1050 -1156 1274 -1404
52 -1404 1549 -1709 1889 -2093 2323 -2587 2895 -3259 3698 -4235 4914 -5802 7023 -8807 11683
67 11683 -17091 30891 -149058 -219189 49959 92985 52704 9558 60825 56347 23045 8108
79 8108 64080 75966 10921 -91071 -117085 -72766 -6018 20973 27361 18958 3599 -28765 -36894
92 -36894 -2774 47661 48892 9003 -12130 18314 38287 353 -53632 -44465 4315 10151 -37262
105 -37262 -46652 16568 72192 46838 -5392 -1415 37542 25460 -38996 -73927 -44679 -6459
117 -6459 -2379 -1669 31723 63121 46856 7882 4139 29258 20342 -36707 -76830 -51751 -4265
$$ packed form
0@%%%%%%%%%%%qJ6j6J6j6K4l2M0m8N6p2Q4r6J14j34J52j76K08k40K72l09L53m00
34b12M50n07N71o42P20q01Q90r91J100j220J351j492J647j818K004k206K430k678
52a404K953l258L598l982M416m910N482o154O957p933R149j0716J2825j5830K0490
67A1683k8774M7982j79949p0131K69148M3026m0281m3146N1267m478l3302j4937
79H108N5972J1886o5045j01992k6014M4319O6748K6991O388q403j5359l2364q129
92c6894L4120N0435J231l9889k1133L0444J9973l7934n3985R167M8780N836m7413
105c7262r390O3220N5624k5354n2230L977L8957j2082o4456l4931K9248L8220
117f459M080P10L3392L1398j6265l8974l743K5119q916n7049m0123K5079M7486
$$ plain form
130 -4265 4992 -9077 5698 41663 39854 -5298 -25157 18561 65650 41998 -29560 -61347 -24891
143 -24891 19547 19676 -2577 -10362 -14067 -36269 -49723 -18087 38745 61810 37960 11121 8784
156 8784 8843 -5907 -11691 5283 9641 -29434 -74787 -59765 7252 48880 27860 -1037 14062
169 14062 40214 19872 -29616 -38129 3780 29378 2 -37453 -25626 16950 27250 -1865
181 -1865 -19800 -2104 14708 -461 -21491 -13646 7830 10022 -1246 3975 20807 15166 -13640
194 -13640 -24357 -3530 14488 221 -18746 -6370 20014 15330 -15452 -22545 7218 24926
206 24926 -1978 -35189 -23376 18762 33584 9752 -8605 4346 18540 6098 -13615 -8956
218 -8956 5494 -3987 -29460 -29578 2567 25694 14939 -718 6396 17966 4565 -15734 -6171
$$ packed form
130d265R257j4069J4775L5965j809m5152j9859M3718M7089k3652p1558l1787L6456
143b4891M4438J29k2253p785l705k2202j3454L1636N6832K3065k3850k6839k337
156H784N9j4750n784J6974M358l9075m5353J5022O7017M1628k1020k8897J5099
169A4062K6152k0342m9488q513M1909K5598k9376l7455J1827M2576J0300k9115
181a865j7935J7696J6812j5169k1030P845K1476K192j1268N221J6832n641k8806
194a3640j0717K0827J8018j4267j8967J2376K6384m684l0782p093K9763J7708
206B4926k6904l3211J1813M2138J4822k3832j8357J2951J4194j2442j9713M659
218h956J4450r481k5473j18L2145K3127j0755j5657P114J1570j3401k0299R563
$$ plain form
231 -6171 24314 25302 -11973 -38402 -17762 17214 17346 -10276 -17992 3866 14053 -5378 -20471
244 -20471 -760 28298 27193 528 -11277 466 8340 -1590 -9567 -2534 2077 -9342 -19208
257 -19208 -7259 10937 8370 -7350 -5185 15462 20490 -2371 -17732 -248 23504 13548 -17049
270 -17049 -22237 4498 18645 -3721 -28021 -16151 13535 15876 -9413 -19070 1828 21758 11994
283 11994 -5905 -2917 12301 10794 -5648 -10326 1220 4906 -8796 -17505 -6585 5869 -134
296 -134 -10878 -2885 14401 13146 -5582 -10152 9778 23021 7252 -15556 -12059 8805 10825
309 10825 -8735 -18642 -3516 9802 -1766 -18089 -11144 9816 14713 972 -4083 9129 16697
322 16697 5146 -6452 760 11529 1910 -18125 -18874 -544 7299 -7037 -16790 -1221 17861
$$ packed form
231f171L0485R88l7275k6429K0640L4976J32k7622p716K1858J0187j9431j5093
244b0471J9711K9058j105k6665j1805J1743P874r930p977P033M611j1419r866
257a9208J1949J8196k567j5720K165K0647N028k2861j5361J7484K3752r956l0597
270a7049n188K6735J4147k2366k4300J1870K9686K341k5289r657K0898J9930r764
283A1994j7899K988J5218j507j6442m678J1546L686j3702q709J0920J2454o003
296a34j0744P993J7286j255j8728m570J9930J3243j5769k2808L497K0864K020
309A0825j9560r907J5126J3318j1568j6323O945K0960M897j3741n055J3212P568
322A6697j1551j1598P212J0769r619k0035p49J8330P843j4336r753J5569J9082
$$ plain form
335 17861 11761 -8036 -8601 12745 21986 3775 -13512 -5787 11434 8341 -10312 -15339 -1495
348 -1495 5964 -3644 -12791 -5179 7087 5607 -2421 411 10225 8701 -2418 -4419 6268 9261
362 9261 -4259 -13882 -3622 11379 5744 -12261 -13050 5030 12861 -3475 -18485 -7284 13131
375 13131 12378 -5892 -9805 8298 20673 8652 -8053 -5204 7182 4948 -10815 -16875 -5525
388 -5525 2425 -4149 -10497 -2173 9698 8644 416 2260 13500 13536 -2 -7318 605 6822 -3703
403 -3703 -17275 -13880 536 2412 -9366 -12140 3614 16382 10083 -1065 2773 14393 11913
416 11913 -3596 -10793 -2655 2564 -6794 -15972 -8642 4376 4116 -5245 -3648 9822 14987 2779
430 2779 -7257 -82 10367 4076 -11209 -11817 2924 8512 -3290 -12413 -3174 11835 9299 -4272
$$ packed form
335A7861o100j9797n65K1346R241j8211j7287P725J7221l093j8653n027J3844
348a495P459r608r147P612J2266j480q028K832R814j524j1119k001J0687K993
362I261j3520r623J0260J5001n635j8005p89J8080P831j6336j5010J1201K0415
375A3131p53j8270l913J8103J2375j2021j6705K849J2386k234j5763o060J1350
388e525P950o574o348Q324J1871j054q228J844J1240L6j3538p316P923O217j0525
403c703j3572L395J4416J876j1778k774J5754J2768o299j1148L838J1620k480
416A1913j5509p197Q138N219r358r178P330J3018k60r361J597J3470N165j2208
430B779j0036P175J0449o291j5285o08J4741N588j1802r123R239J5009k536j3571
$$ plain form
444 -4272 -7250 3391 8265 -1710 -10785 -5003 5164 3323 -4716 -3817 5650 8883 2120 -1229 4500
459 4500 6957 -1897 -10855 -7097 1807 -735 -10685 -9665 4301 11297 2721 -4586 3972 16488 11840
474 11840 -4418 -8679 1744 6613 -5418 -17680 -12122 900 2784 -6179 -6321 6765 15171 8359
488 8359 -435 3639 11363 7088 -5757 -10775 -5100 -3165 -9849 -12816 -3483 6732 4455 -2360 825
503 825 11006 12177 2522 -3636 1548 4951 -3264 -11979 -8611 1786 2789 -4709 -6425 2167 7890
518 7890 2266 -4616 96 9164 7174 -3054 -6466 1309 4629 -3540 -9332 -1723 7853 4256 -6455
533 -6455 -6258 4576 9817 1211 -6995 -2802 4406 814 -9274 -8716 3574 10189 3496 -3023 1089
548 1089 8531 6156 -2741 -5291 -719 -553 -7439 -10116 -3202 4197 2525 -2683 429 8207 8868 2272
$$ packed form
444d272k978J0641M874r975r075N782J0167j841q039Q99R467L233o763l349N729
459D500K457q854q958L758Q904k542r950J020J3966O996q576p307Q558J2516m648
474A1840j6258m261J0423M869j2031j2262N558J3022J884q963j42J3086Q406o812
488H359q794M074P724m275j2845n018N675J935o684k967R333J0215k277o815L185
503H25J0181J171r655o158N184L403q215q715L368J0397J003p498j716Q592N723
518G890n624o882M712R068j990j0228l412P775L320q169n792P609R576l597j0711
533f455J97J0834N241q606q206M193P208l592j0088N58J2290O615o693o519M112
548A089P442k375q897k550M572J66o886k677O914P399j672n208L112P778O61o596
$$ plain form
564 2272 -238 4148 4505 -3921 -9608 -3648 4813 1633 -9223 -11470 -1948 5202 2215 -1801 3772
579 3772 10992 7525 -2769 -3978 5688 9193 -942 -11307 -9508 -1831 -1135 -6478 -4644 4418 8324
594 8324 2513 -3364 872 7062 4689 -2816 -3956 2171 3800 -2551 -6520 -1429 3830 937 -4525
609 -4525 -3170 2106 1707 -4330 -5682 1577 7599 4067 -1343 -201 4314 2442 -3629 -3725 3413 5425
625 5425 -2935 -9264 -4677 3941 3899 -2924 -4525 1037 3748 -797 -3616 2629 10073 6404 -3842
640 -3842 -5713 2551 7249 852 -6989 -6784 -2209 -2052 -4350 -1475 5821 6505 -304 -4875 250 7258
656 7258 7340 1149 -1753 -366 -1043 -4501 -3961 2623 5121 -887 -7417 -5432 1396 3577 125 -134
672 -134 4481 5633 186 -4241 32 6261 4005 -3934 -6072 -178 2403 -2857 -7425 -2736 4760
$$ packed form
564B272k510M386L57q426n687N960Q461l180j0856k247R522P150k987m016N573
579C772P220l467j0294j209R666L505j0135j0365J799P677O96n343J834R062L906
594H324n811n877M236O190k373p505j140O127J629o351l969N091N259k893n462
609d525J355N276l99o037j352P259O022l532n410J142M515j872o071r6P138K012
625E425q360o329M587Q618m2o823j601N562K711m545k819O245P444l669j0246
640c842j871Q264M698o397p841K05M575J57k298K875P296O84o809m571N125P008
656G258Q2o191k902J387o77l458N40O584K498o008o530J985O828K181l452k59
672a34M615J152n447m427M273O229k256p939k138N894K581n260m568M689P496
$$ plain form
687 4760 3945 -1825 -2701 2803 5132 188 -3329 1039 6471 4283 -3727 -6581 -1724 1762 -461 -2913
703 -2913 -393 1869 -1568 -5651 -2752 4873 7201 1956 -2902 -1214 2538 1469 -770 574 2320
718 2320 -1036 -6830 -6552 452 4879 1190 -4157 -2483 2467 3456 303 149 3923 3843 -2427 -6273
734 -6273 -1245 5498 4468 -2799 -5800 -1788 1345 -1481 -3413 248 4544 2274 -3021 -2400 3702
749 3702 7064 2770 -1856 -1761 718 -1356 -4800 -3768 795 2415 -614 -2224 1104 4101 1966 -1648
765 -1648 -582 2577 2375 -1347 -2579 596 2282 -355 -2743 107 3386 583 -4970 -5442 129 4317
781 4317 2579 -733 911 3439 1350 -2978 -2143 2534 4007 -1563 -5770 -3044 2907 3885 120 -1569
797 -1569 437 927 -2890 -4665 -906 3497 2234 -1676 -1100 3184 5356 2361 -1187 -1429 -788 -3094
$$ packed form
687D760q15n770q76N504K329m944l517M368N432k188q010k854M857L486k223k452
703b913K520K262l437m083K899P625K328n245m858J688L752j069k239J344J746
718B320l356n794K78P004M427l689n347J674M950R89l153j54L774q0o270l846
734f273N028O743j030p267l001M012L133k826j932L661M296k270n295O21O102
749C702L362m294m626R5K479k074l444J032M563J620l029j610L328K997k135l614
765a648J066L159k02l722j232L175J686k637k388K850L279k803n553m72N571M188
781D317j738l312J644K528k089m328Q35M677J473n570m207K726N951R78l765j689
797a569K006M90l817j775L759M403j263l910N76M284K172k995l548k42O41k306
$$ plain form
813 -3094 -5824 -3301 847 1753 -1034 -1230 2015 4588 2876 -93 530 2077 363 -3502 -3311 1137
829 1137 2622 -996 -4392 -2926 597 105 -2757 -2037 2922 5208 2215 -373 2068 4668 2381 -3376
845 -3376 -4946 -2133 -739 -2965 -5094 -1264 3642 4319 1586 1009 2967 2820 -1157 -3735 -1887 1027
861 1027 284 -2284 -1658 1623 2518 428 -656 792 1258 -1684 -3870 -1729 2041 2212 -301 -928 1392
878 1392 2766 -207 -2398 -313 2366 1326 -2050 -1856 1986 3269 69 -3391 -2335 -28 -537 -3364
894 -3364 -2417 1922 4107 2180 613 2402 4578 2409 -1905 -3929 -2576 -2008 -3886 -4320 -1269 2526
910 2526 2573 652 1225 3392 3475 513 -1463 -250 648 -960 -2629 -1579 709 602 -1773 -2499 -75
927 -75 1163 -492 -1381 753 3837 2953 72 -586 1271 1454 -1575 -3788 -2100 495 235 -1976 -1498
$$ packed form
813c094k730K523M148R06k787j96L245K573j712k969O23J547j714l865J91M448
829A137J485l618l396J466L523m92k862P20M959K286k993k588K441K600k287n757
845c376j570K813J394k226k129L830M906O77k733n77J958j47l977k578J848K914
861A027p43k568O26L281Q95k090j084J448M66k942k186K141L770J71k513o27K320
878A392J374k973k191K085K679j040l376J94L842J283l200l460J056K307n09k827
894c364R47M339K185j927j567J789K176k169m314k024J353N68j878m34L051L795
910B526M7j921N73K167Q3k962j976J213Q98j608j669J050K288j07k375p26K424
927g5J238j655q89K134L084q84k881o58J857J83l029k213J688K595k60k211M78
$$ plain form
944 -1498 2278 3747 1312 -1491 -469 1317 524 -2451 -2610 192 2137 900 -807 884 2461 1259
960 1259 -1384 -1923 -280 -431 -1773 -2235 -196 1715 1075 124 406 2234 1728 -614 -1037 772 1711
977 1711 -315 -1815 -806 781 195 -2213 -2635 -143 1182 -163 -1214 676 3192 2714 -50 -677
993 -677 1162 1410 -939 -3026 -1881 53 -31 -2101 -1014 1235 2330 583 -941 373 1822 1039
1009 1039 -805 -1224 503 1113 -880 -1495 -550 1079 375 -1427 -1001 513 418 -652 -795 906 1653
1026 1653 267 -720 -101 1461 758 -977 -1433 300 915 -675 -1987 -656 1130 964 -1251 -1130 1211
1043 1211 1932 256 -1188 52 1703 1040 -1190 -1464 429 1173 -676 -2164 -1006 962 425 -937
1059 -937 -924 863 1606 210 -527 256 1459 316 -974 -875 187 94 -971 -1052 61 819 -157 -852 17
$$ packed form
944a498L776J469k435k803J022J786p93k975j59K802J945j237j707J691J577j202
960A259k643n39J643j51j342m62K039J911o40r51K82J828n06k342m23J809R39
977A711k026j500J009J587n86k408m22K492J325j345j051J890K516m78k764o27
993f77J839K48k349k087J145J934q4k070J087K249J095j747j524J314J449p83
1009A039j844m19J727O10j993o15R45J629p04j802M26J514r5j070j43J701P47
1026A653j386r87O19J562p03j735m56J733O15j590j312J331J786j66k215J21K341
1043A211P21j676j444J240J651o63k230k74J893P44j849j488J158J968n37j362
1059i37J3J787P43j396p37P83J203j143j290R9J062r3j065q1J113P58r76o95Q69
$$ plain form
1078 17 1507 1253 -624 -498 860 1161 -241 -1154 -239 1455 636 -1210 -1190 362 839 -786 -1733 -433
1096 -433 1226 1127 -515 -558 1240 1597 219 -994 -412 825 485 -1512 -1235 56 503 -401 -923 164
1114 164 928 445 -610 -451 860 1145 187 -304 316 827 229 -1428 -631 152 235 -1030 -1261 184 660
1133 660 48 -473 579 1923 980 -725 -835 689 1127 -480 -1206 -394 647 -39 -1260 -1227 67 464
1151 464 -141 -1121 -129 1411 1387 -19 -54 850 1305 230 -833 -403 -22 -603 -1385 -1134 38 508 -165
1170 -165 -613 555 1285 804 203 49 1288 361 -730 -1124 205 170 -801 -1337 -674 636 607 -361 -334
1189 -334 1120 1144 186 -479 -48 1125 235 -1067 -1100 252 638 -200 -912 -126 904 566 -609 -553 605
1208 605 950 -307 -1242 -382 645 578 -398 -158 517 558 -105 -337 223 742 -32 -1143 -1090 -144 66 -390
$$ packed form
1078A7J490k54j877J26J358L01j402r13R15J694q19j846K0J552M77j625r47J300
1096d33J659r9j642m3J798L57j378j213N82J237l40j997K77J291M47r04n22J087
1114A64P64m83j055J59J311K85r58m91O20N11n98j657P97P83Q3j265k31J445M76
1133F60o12n21J052J344r43j705j10J524M38j607p26Q12J041o86j221L3J294L97
1151D64o05r80R92J540k4j406l5R04M55j075j063M30L81n81p82K51J172M70o73
1170a65m48J168P30m81o01j54J239r27j091l94J329l5r71n36O63J310k9r68K7
1189c34J454K4r58o65M31J173q90j302l3J352L86q38p12P86J030l38j175N6J158
1208F05L45j257r35Q60J027o7r76K40O75M1o63k32N60N19p74j111N3R46K10m56
$$ plain form
1228 -390 -829 375 1075 651 219 805 1572 813 -580 -694 -174 34 -1016 -1639 -1032 369 208 -459 222
1247 222 1229 1535 306 -555 -175 797 613 -801 -1160 213 -285 -639 -1297 -355 772 450 -93 -77 1063
1266 1063 1279 243 -234 -152 331 -587 -921 -906 -127 91 -462 -262 520 1457 598 -219 -350 78 122 -757
1286 -757 -591 45 145 -383 -611 381 1419 850 -241 -644 134 237 -360 -686 158 545 204 -927 -530
1305 -530 427 664 539 -322 -180 532 445 -140 -369 -179 -43 -718 -1093 -417 238 20 -48 179 806 1094 598
1326 598 114 199 426 -206 -967 -1068 -201 -322 -733 -593 188 644 263 23 329 964 280 -469 -729 220
1346 220 344 179 -977 -322 382 -51 -772 -306 166 693 341 -287 673 563 528 -599 -842 -3 542 -166
1366 -166 -537 -426 -202 44 -325 65 623 358 -234 -662 -250 -122 99 -186 -38 253 295 -110 -93 245 340
$$ packed form
1228c90m39J204P00m24m32N86P67p59j393j14N20K08j050o23O07J401j61o67O81
1247B22J007L06j229q61L80R72j84j414l59J373m98l54o58R42J127l22n43J6J140
1266A063K16j036m77Q2M83r18l34J5P79K18n53K00P82R37q59q17j31M28M4q79
1286g57J66O36J00n28k28R92J038n69j091m03P78J03n97l26Q44L87l41j131L97
1305e30R57K37j25q61J42P12q7n85k29J90J36o75l75O76O55k18o8K27O27K88m96
1326E98m84Q5K27o32p61j01Q67j21m11J40P81M56l81k40L06O35o84p49k60R49
1346B20J24j65j156O55P04m33p21M66M72N27l52o28R60j10l5j127k43Q39N45p08
1366a66l71J11K24K46l69L90N58k65n92m28M12J28K21k85J48K91M2m05J7L38R5
$$ plain form
1387 340 3 -682 -525 211 18 -472 -213 467 726 -85 -2 188 599 342 -342 -345 200 172 -313 -771 -189
1408 -189 269 -86 -365 -347 345 470 220 -336 16 558 471 -146 -111 48 233 -101 -359 -71 173 287 -441
1429 -441 -331 160 132 -30 -236 368 310 -48 -457 95 562 224 -479 -368 323 416 -54 -273 41 52 233
1450 233 -133 -54 399 549 74 -661 -76 376 396 -272 -363 98 98 -268 -521 -315 302 296 -9 -195 64 401
1472 401 242 -148 -194 213 -16 -169 -111 61 324 -53 -181 -104 57 -315 -400 50 357 315 -8 10 341 433
1494 433 55 -435 -230 57 -58 -619 -395 -99 384 127 -183 -81 626 96 -184 -246 155 312 -181 -29
1514 -29 123 265 92 -278 -101 -153 62 -110 -389 -380 435 304 -11 -120 342 557 -246 -306 -121 180 -121 -112
1536 -112 -25 343 303 -84 -117 87 38 -122 -360 -362 297 207 22 299 458 356 -61 -279 -305 94 -267 -456 -188
$$ packed form
1387C40l37o85J57P36j93m90K59O80K59q11Q3J90M11k57o84lN45k8m85m58N82
1408a89M58l55k79J8O92J25k50n56L52N42q7o17L5J59J85l34k58K88K44J14p28
1429d41J10M91k8j62k06O04n8l58m09N52M67l38p03J11O91R3m70k19L14J1J81
1450B33l66P9M53J50m75p35N85M52K0o68r1M61%l66k53K06O17ol05j86K59L37
1472D01j59l90m6M07k29j53N8J72K63l77j28P7J61l72q5M50L07m2l23J8L31R2
1494D33l78m90K05K87j15n61K24K96M83k57l10J02P07n30k80o2M01J57m93J52
1514b9J52J42j73l70J77n2K15j72k79RQ15j31l15j09M62K15q03o0J85L01l01R
1536a12Q7L68m0l87l3K04m9j60k38kO59r0j85K77J59j02m17k18k6L99l61j89K68
$$ plain form
1559 -188 271 363 -115 -176 -72 231 14 -291 -162 81 539 -149 -63 174 -164 239 -219 -161 -171 -73 -77 -170 99
1582 99 441 -19 11 433 391 201 -528 -507 -206 11 -291 -166 -16 185 259 138 119 81 264 -393 -365 -62 -146
1605 -146 118 6 37 246 282 74 -186 116 207 -125 15 -84 381 427 177 131 174 -194 -158 -404 -248 -381 25
1628 25 284 289 96 345 295 -385 -335 -456 -145 -451 -368 -26 418 396 248 472 605 74 -114 -296 44 55 -409
1651 -409 -234 77 580 546 79 -21 312 286 -51 -274 -5 308 116 208 -296 -80 -194 -308 -160 -249 85
1672 85 175 227 -57 448 391 301 15 91 -23 -385 -489 -409 124 104 242 104 344 286 191 -238 80 -95 -73 -153
1696 -153 -269 -89 183 324 -66 -61 93 101 -31 46 -272 98 -3 -186 82 131 8 -22 -83 -173 355 -104 -229
1719 -229 -72 401 369 -19 -94 -247 96 -254 -629 -540 -350 159 308 88 321 297 233 151 -49 7 -172 -160 -374
$$ packed form
1559a88M59R2m78o1J04L03k17l05J29K43M58o88Q6K37l38M03m58N8j0R8mr3K69
1582I9L42m60L0M22m2j90p29K1L01K17l02J25J50K01P4j21j9l8J83o57K8L03q4
1605a46K64j12L1K09L6k08k60L02R1l32J40r9M65M6k50m6M3l68L6k46J56j33M06
1628B5K59Nj93K49n0o80N0j21L11l06Q3L42M44k2j48K24J33n31j88j82L40J1m64
1651d09J75L11N03l4m67j00L33k6l37k23K69L13j92R2n04K16j14j14J48q9L34
1672H5R0N2k84N05n7r0k86P6j14l62j04Q0N33k0J38j38K40n8r5m29L18j75K2q0
1696a53j16J80K72J41l90NJ54Qj32P7l18L70j01j83K68M9j23l0o1r0N28m59j25
1719b29J57M73l2l88p5j53L43l50l75Q9J90N09J49k20K33k4o4q2k00N6j79J2k14
$$ plain form
1742 -374 -210 -203 -2 -149 205 85 117 -5 -35 140 365 103 -28 -217 157 113 -600 -317 193 239 -129 -42
1764 -42 -117 125 543 512 -162 81 14 135 -319 46 -182 -384 99 25 56 143 63 190 144 178 -313 -144 -44
1787 -44 48 -24 -80 -92 248 296 51 118 192 306 168 -154 -262 96 15 -70 73 -147 40 201 194 60 123 -75
1811 -75 -280 -186 217 85 -147 -347 -235 -42 -255 -80 -172 -175 341 386 -90 181 207 272 -133 -234 169 193 -209
1834 -209 -11 -55 128 362 -174 116 121 106 -45 129 159 301 35 -170 -108 279 -94 85 -4 344 295 -140 -491
1857 -491 -110 32 57 106 -280 45 168 136 -164 90 219 119 -179 -102 -41 -95 -174 -21 58 -105 31 322 30
1880 30 40 159 -21 27 54 175 -64 -40 155 7 289 47 -110 -158 117 33 -39 -10 29 312 -35 -7 124 210
1904 210 53 -64 -31 166 0 138 56 -66 -71 32 -61 -144 197 88 -34 -132 168 54 110 -547 -206 -3 70
$$ packed form
1742c74J64PK01j47L54j20L2j22l0J75K25k62j31j89L74m4p13K83N10M6l68Q7
1764d2p5K42M18l1o74K43o7J21m54L65k28k02M83p4L1Q7q0J27m6L4m91J69J00
1787d4R2p2n6j2L40M8k45O7P4J14j38l22j08L58q1q5J43k20J87J61pj34O3j98
1811g5k05R4M03j32k32k00J12J93k13J75r2lN16M5m76K71K6O5m05j01M03K4m02
1834b09J98m4J83K34n36K90Nj5j51J74L0J42k66k05O2L87l73J79q9L48m9m35l51
1857d91L81J42K5M9l86L25J23l2l00K54J29j00k98P7O1n4p9J53P9j63J36K91k92
1880C0J0J19j80M8K7J21k39K4J95j48K82k42j57m8K75q4p2K9L9K83l47K8J31Q6
1904B10j57j17L3J97j66J38q2j22nJ03r3q3L41j09j22r8L00j14N6o57L41K03P3
$$ plain form
1927 70 56 3 181 -40 -258 -83 -118 53 27 236 93 -23 -9 38 -84 148 91 -12 -193 229 284 127 -217
1950 -217 -110 275 46 -47 -181 -4 278 394 -158 97 27 154 54 -56 -212 94 180 -32 -220 -67 -85
1971 -85 206 112 38 116 12 57 -18 -115 332 -174 -176 30 139 13 -181 76 24 -85 0 -103 10 -25 -17 200 83
1996 83 133 265 73 4 -196 6 -43 9 -85 69 -127 415 305 58 171 -240 12 -53 44 -303 -328 -83 147
2019 147 143 9 62 -191 198 71 -17 -205 -433 -90 210 -254 -141 362 -48 12 -39 -247 14 96 -90 172
2041 172 162 -120 -2 210 167 38 64 -83 132 31 23 15 0 273 52 96 7 212 -379 -158 -449 -200 221
2064 221 98 77 325 -113 15 78 -37 81 -107 -204 60 -47 -447 78 -38 80 11 42 -250 156 234 -167
2086 -167 108 64 -83 -104 11 56 -296 114 29 56 120 -80 83 -9 89 80 -23 57 -25 10 146 -126 -32 57 320
$$ packed form
1927G0j4n3J78k21k18J75l5J71k6K09j43j16J4M7j22K32n7j03j81M22N5j57l44
1950b17J07L85k29r3j34J77K82J16n52K55p0J27j00j10j56L06Q6k12j88J53j8
1971h5K91r4p4P8j04M5p5r7M47n06kK06J09j26j94K57n2j09Q5j03J13l5QK17j17
1996H3N0J32j92o9k00K02m9N2r4J54j96N42j10k47J13m11K52o5R7l47k5K45K30
2019A47mj34N3k53L89j27q8j88k28L43L00m64J13N03m10O0n1k08K61Q2j86K62
2041A72j0k82J18K12m3j29K6j47K15j01qqj5K73k21M4q9K05n91K21k91K49M21
2064B21j23k1K48m38J28O3j15J18j88r7K64j07m00N25j16J18o9L1k92M06P8m01
2086a67K75m4j47k1J15M5l52M10q5K7O4k00J63r2R8rj03Q0q2L5J36k72R4Q9K63
$$ plain form
2111 320 198 48 -20 -61 38 92 -11 -78 -131 2 -166 99 100 -134 -75 317 259 -160 -76 76 275 -333 75 -210
2135 -210 -69 134 -6 -272 -142 -189 89 25 -151 14 130 -152 45 188 51 -450 -183 -97 -165 -164 -6 220
2157 220 115 -260 68 -47 120 -52 -24 -366 65 60 -116 -136 -152 -6 -123 136 132 -239 -124 -133 -42 56 32 -108
2181 -108 -170 -87 -132 -161 -276 336 -329 50 162 175 76 41 -143 82 -25 4 -172 -215 207 102 -89 98 -88
2204 -88 -104 115 -196 -93 -124 -17 -196 39 -328 19 -46 143 -137 -283 -299 -102 -6 0 197 57 90 92 -41 64
2228 64 67 275 -115 -7 -120 160 67 -78 -97 -37 101 -243 112 -314 -4 144 -30 250 189 166 -201 -48 -134
2251 -134 -33 -203 -275 191 5 129 -81 -131 -100 -346 117 -251 62 -118 394 -60 -3 -128 -29 61 175 176 34
2274 34 70 66 -22 -106 30 -136 85 74 -136 20 110 -26 -20 244 -85 -58 148 91 145 -172 -32 -342 -98 -44 224
$$ packed form
2111C20j22j50o8m1R9N4j03o7n3J33j68K65Jk34N9L92n8m19Q4J52J99o08M08k85
2135b10J41K03j40k66J30m7K78o4j76J65J16k82J97J43j37n01K67Q6o8JJ58K26
2157B20j05l75L28j15J67j72K8l42M31nj76k0j6J46j17K59ml71J15rR1R8k4j40
2181a08o2Q3m5k9j15O12o65L79J12J3r9l5j84K25j07K9j76m3M22j05j91J87j86
2204h8j6K19l11J03l1J07j79K35l67L47o5J89k80j46j6J97R6OJ97j40L3Kj33J05
2228F4LK08l90J08j13K80r3j45j9O0J38l44L55m26L10J48j74K80o1k3l67J53q6
2251a34J01j70p2M66j86J24k10n0L1k46M63l68L13j80N12m54N7j25R9R0J14Jj42
2274C4L6mq8q4J36j66K21j1k10J56R0j36OK64l29K7K06n7N4l17J40l10K44N4K68
$$ plain form
2299 224 -59 126 -141 -22 137 -100 -97 137 105 -32 -69 -180 -62 -17 -80 127 -190 72 181 -64 177 -215
2321 -215 187 212 192 -40 -18 -9 126 -281 -30 -484 -97 207 77 -84 40 18 105 -219 -40 -67 -103 136 -153
2344 -153 -79 -331 134 -50 -151 -257 98 146 84 -11 -44 -153 18 221 -116 153 19 36 258 29 158 1
2366 1 -72 -108 -4 354 -280 101 -130 358 -136 -157 -103 -141 82 51 -102 293 -29 257 216 -9 278 42 -42
2389 -42 -327 266 -61 -59 3 -38 68 8 11 8 -25 72 -219 -42 69 125 188 101 -58 150 -183 37 -189 -272 25
2414 25 188 -78 -55 120 -192 -132 -59 114 -10 -143 -128 -119 84 42 52 -132 -24 10 -91 -35 154 -97 209 -115
2438 -115 124 34 -115 125 -103 159 231 93 119 4 56 -16 212 67 -20 26 199 49 -131 76 -147 182
2460 182 278 263 90 -279 -67 122 89 60 17 -301 -156 1 -115 181 -6 -400 72 -179 48 -91 -55 -75
$$ packed form
2299B24k83J85k67J19J59k37LK34l2j37l7j11J18M5o3K07l17K62J09k45K41l92
2321b15M02K5k0k32K2RJ35m07K51m54L87L04j30j61J24k2Q7l24J79k7l6K39k89
2344a53P4k52M65j84j01j06L55M8o2r5l3j09J71K03l37K69j34J7K22k29J29j57
2366Ap3l6J04L58o34L81k31M88m94k1N4l8K23l1j53L95l22K86m1k25K87k36q4
2389d2k85N93l27KO2m1J06o0Lll3R7k91J77J11N6O3q7j59K08l33K20k26q3K97
2414B5J63k66K3J75l12O0P3J73j24j33J5RK03m2J0j84J08L4j01N6J89k51L06l24
2438a15K39r0j49K40k28K62P2j38K6j15N2p2K28j45q7M6J73j50j80K07k23L29
2460A82R6j5j73l69K12J89l3k9m3l18J45J57j16K96j87l94M72k51K27j39L6k0
$$ plain form
2482 -75 -163 -206 -56 -70 -84 189 103 371 99 106 202 35 -172 73 -224 66 -168 124 22 -220 343 -47 111
2505 111 -219 -76 294 200 -28 -111 180 -155 46 -120 147 -14 184 93 140 -273 111 -6 -221 202 -35
2526 -35 27 -247 -325 62 33 -260 27 -250 -3 -23 56 116 164 209 142 -26 -175 -82 102 -102 -165 -85 -91 11 -173
2551 -173 -87 333 75 53 -32 -103 104 60 228 -42 77 -2 -33 -83 -26 -148 10 225 101 -222 39 124 17
2574 17 -99 -83 -55 -18 119 453 52 297 203 -10 -297 -164 130 115 2 -66 -143 -104 -54 197 195 -139 -154 -1
2598 -1 133 78 -52 99 -154 -28 66 -77 -5 -183 -141 -172 -19 -25 291 -134 43 43 -137 -99 -42 3 -252 171 -120
2623 -120 5 84 2 92 142 103 228 84 127 110 -135 301 -122 13 -63 -128 10 -49 150 36 -106 -260 -152
2646 -152 -146 -125 -100 237 -215 -114 143 40 -51 155 -115 211 -91 -164 -243 50 79 98 166 98 140 -173 304 144
$$ packed form
2482g5q8m3J50j4j4K73q6K68k72PR6j67k07K45k97K90k34K92j02k42N63l90J58
2505A11l30J43L70r4k28q3K91l35K01j66K67j61J98r1M7m13L84j17k15M23k37
2526c5O2k74p8L87k9k93K87k77K47k0P9O0M8M5o7j68j49R3J84k04o3Q0oJ02j84
2551a73Q6M20k58k2q5p1K07m4J68k70J19p9l1n0N7j22J58K15j24l23K61Q5j07
2574A7j16J6K8L7J37L34m01K45r4k13k87J33K94j5j13o8p7L9N0K51kl34j5J53
2598aJ34n5j30J51k53J26R4j43P2j78M2l1J53oL16m25J77%j80L8N7M5k55M23k91
2623a20J25P9q2R0N0l9J25j44M3j7k45M36m23J35p6o5J38n9J99j14j42j54J08
2646a52OK1K5L37m52J01K57j03r1K06k70L26l02p3p9K93K9J9O8o8M2l13M77j60
$$ plain form
2670 144 3 241 255 -216 -97 61 173 109 201 -27 68 -208 -1 217 -52 25 -67 102 14 198 -70 -232
2692 -232 249 184 67 -208 100 136 12 5 -103 24 -191 188 280 -183 -56 -51 -145 -175 107 181 -7 -76 344 162
2716 162 -281 336 -229 -135 -18 -83 -160 -81 -84 -58 -15 20 -131 38 50 -63 -105 86 75 -271 73 -352 45 81
2740 81 -119 -48 167 -96 213 -55 71 248 -263 75 -70 -58 -70 -63 219 50 -301 95 155 95 71 -131 92
2763 92 -8 -82 -175 -150 82 -215 75 25 -153 16 170 -55 -18 71 -36 -50 -205 -74 244 37 -221 136 -38
2786 -38 -3 -9 -125 -11 144 23 113 -32 224 148 -282 134 -58 156 -96 -45 -160 -21 10 115 -36 -140 -238
2809 -238 -89 171 283 59 -82 -45 -87 74 -153 -57 20 -29 -37 -85 13 99 -358 136 157 65 232 72 60 173
2833 173 -105 -76 69 216 102 -164 -94 127 -343 63 23 204 -163 -95 28 -99 -72 18 34 174 0 37 -330
$$ packed form
2670A44j41K38J4m71J19J58J12o4R2k28R5k76K07K18k69P7r2J69q8J84k68j62
2692b32M81o5j17k75L08L6j24pj08J27k15L79R2m63J27Nr4l0K82P4j88o9M20j82
2716A62m43O17n65R4J17o5p7P9lK6M3L5j51J69J2j13m2J91j1l46L44m25L97L6
2740H1k00P1K15k63L09k68J26J77n11L38j45J2j2PK82j69l51L96O0o0k4k02K23
2763I2j00p4r3K5K32k97K90n0j78J69J54k25L7Q9j07j4j55J31L18k07k58L57j74
2786c8L5oj16J14J55j21R0j45K56p6m30M16j92K14k52N1j15J39L1J05j51j04r8
2809b38J49K60J12k24j41L7m2J61k27R6P7m9qm8R8Q6m57M94K1r2J67j60j2J13
2833A73k78K9J45J47j14k66P0K21m70M06m0J81l67O8J23j27K7R0J6J40j74L7l67
$$ plain form
2856 -330 -110 123 2 -60 111 -22 -11 -25 58 153 -63 -252 230 -23 -201 -9 -108 21 196 226 -168 -20
2878 -20 -43 279 -143 -70 266 134 -90 32 -72 95 -55 -81 81 19 -273 -91 -96 230 -117 20 -31 55 161
2901 161 229 -38 -141 217 -84 -56 -168 -186 30 114 73 72 -171 290 27 -286 -55 124 59 161 138 56 70 123
2925 123 28 7 166 -66 26 -139 -7 -27 2 -199 -38 -7 224 -124 -284 233 -30 -113 -169 -137 168 -46 -159
2948 -159 95 -71 -186 -35 -186 -392 -28 -36 -213 -74 -72 15 70 185 112 80 -21 -48 196 148 -3 -14 59 -120
2972 -120 139 10 -70 57 169 38 32 20 35 -41 149 118 71 191 -134 142 10 5 23 -26 -79 -119 57 28 71
2997 71 -25 34 43 9 -16 142 -124 -226 46 79 -95 88 -92 -150 137 -177 112 177 -117 88 179 75 3 314
3021 314 -76 178 -61 -126 -141 109 -146 69 -55 91 -6 155 -4 53 -51 -164 49 127 -164 -158 35 45 278
$$ packed form
2856c30K20K33j21o2J71j33J1j4Q3R5k16j89M82k53j78J92r9J29J75L0l94J48
2878b0k3L22m22P3L36j32k24J22j04J67j50k6J62o2k92J82nL26l47J37n1Q6J06
2901A61O8k67j03L58l01K8j12j8K16Q4m1jk43M61k63l13K31J79o5J02k3q2J4N3
2925A23r5k1J59k32R2j65J32k0K9k01J61L1K31l48j60N17k63q3n6L2L05k14j13
2948a59K54j66j15J51j51k06L64qj77J39KQ7N5J15p3l2j01k7K44m8j51j1P3j79
2972a20K59j29q0J27J12j31oj2J5p6J90l1m7J20l25K76j32nJ8m9n3m0J76k9M3
2997G1r6N9Rl4k5J58k66j02K72L3j74J83j80n8K87l14K89O5k94K05R1j04p2L11
3021C14l90K54k39o5j5K50k55K15j24J46r7J61j59N7j04j13K13P8k91OJ93J0K33
$$ plain form
3044 278 -31 166 -75 -92 -108 136 -71 -39 -122 1 14 56 -9 -268 174 -50 97 216 151 -49 -100 -49 50 3
3068 3 -80 -100 292 -205 -141 -50 -176 -61 -44 130 -36 118 -62 39 -81 237 20 -22 40 211 200 81 41 -296
3092 -296 130 126 84 -206 -58 -3 -113 -105 -205 -40 -77 180 -141 57 -54 183 172 -164 14 -22 107 15 -401
3115 -401 223 -61 -99 7 -42 119 81 -234 -91 73 -73 -70 110 -44 8 222 -154 -128 -96 138 -218 153 18
3138 18 122 75 35 64 12 -4 -74 -79 57 144 -93 240 -240 152 -333 -17 -88 44 -140 -123 43 62 202 -39
3162 -39 66 -74 1 200 -18 43 -3 -232 72 -175 149 117 53 -132 -96 -81 12 -182 -342 -41 14 63 133 -10
3186 -10 148 170 112 -242 181 -49 59 -231 -68 35 139 -72 81 -21 -59 -17 73 4 86 23 212 13 177
3209 177 221 -163 -193 -5 -91 -51 -11 -81 -62 60 -96 176 -215 -82 -135 -125 -34 -32 -26 -141 -48 35 -9 -167 10 -115
$$ packed form
3044B78l09J97k41j7j6K44k07L2q3J23J3M2o5k59M42k24J47J19o5k00n1N1R9m7
3068Cq3k0L92m97O4R1j26J15J7J74j66J54j80J01j20L18k17m2O2J71j1j19m0l37
3092b96M26mm2k90J48N5j10Qj00J65l7K57l21J98j11K37j1l36J78l6J29r2m16
3115d01O24k84l8J06m9J61l8l15J43J64j46LJ80j54N2K14l76K6L2K34l56L71j35
3138A8J04m7m0K9n2j6p0nJ36Q7k37L33m80L92m85L16p1J32j84J7J66J9J40k41
3162c9J05j40P5J99k18O1m6k29L04k47L24l2o4j85L6J5R3j94j60L01N5M9P0j43
3186a0J58K2n8l54M23k30J08k90J63J03J04k11J53j02l8M2R0o9Q2o3J89j99J64
3209A77M4l84l0J88q6M0M0p0J9J22j56K72l91J33n3J0R1KOj15R3Q3m4j58J77j25
$$ plain form
3235 -115 -243 -66 -158 167 123 133 -39 -8 86 13 197 103 -118 -7 251 212 -97 91 183 56 184 75 179
3258 179 -41 74 -37 8 21 103 85 46 53 59 -40 52 32 -162 366 -37 -84 -22 30 -10 249 88 -40 -132 2 -206
3284 -206 15 59 99 1 -166 -193 -19 -52 -75 53 40 35 -55 3 21 -86 -240 -212 -5 98 59 -41 -82 -123 14
3309 14 -48 183 56 -53 225 48 -43 -118 -29 -104 120 -63 -10 -215 76 250 -89 157 34 111 175 249 200 -23
3333 -23 22 140 271 92 66 -13 102 61 35 -228 -165 -35 -120 -42 135 139 -120 21 113 247 -47 -228 201 -157
3357 -157 -181 100 -35 96 -30 -6 123 -87 23 -346 -15 -182 42 90 -65 79 28 190 101 -227 36 -20
3379 -20 -36 67 -42 108 22 158 68 -55 -130 -119 18 56 -172 16 239 -96 -200 308 -132 355 -318 -202
3401 -202 -147 -86 68 68 -15 -173 155 -169 -38 97 67 -118 68 -136 -14 47 -75 -44 115 145 -84 74 150
$$ packed form
3235a15j28J77r2L25m4J0j72L1R4p3J84r4k21J11K58l9l09J88R2j27J28j09J04
3258A79k20J15j11M5J3Q2j8l9POr9R2k0j94N28m03m7O2N2m0K59j61j28r2J34k08
3284b06K21M4M0r8j67k7J74l3k3J28j3nr0N8J8j07j54K8K07J03l9j00m1m1J37
3309A4o2K31j27j09K78j77r1p5Q9p5K24j83N3k05K91J74l39K46j23P7O4P4m9k23
3333b3M5J18J31j79k6p9J15m1k6k63O3J30q5P8J77Mk59J41R2J34k94j81M29l58
3357a57k4K81j35J31j26K4J29k10J10l69L31j67K24M8j55J44n1J62q9l28K63n6
3379b0j6J03j09J50q6J36r0j23p5J1J37L8k28J88K23l35j04N08m40M87o73J16
3401b02N5O1J54%q3j58L28l24J31J35l0j85J86k04J22O1j22L1J59L0k29J58P6
$$ plain form
3424 150 106 -152 -119 104 384 -109 -47 -30 104 89 18 -73 -2 406 145 126 -103 -14 5 170 -96 -55 -117 9
3448 9 -105 7 7 91 -30 80 -164 -18 73 -28 -78 154 32 -105 -149 -274 286 91 39 -49 55 -353 -217
3471 -217 24 129 196 -197 -2 -260 -64 190 205 150 0 -118 -17 11 97 -272 286 214 -95 -27 -5 295 -244
3494 -244 22 -2 32 249 3 7 -192 -127 10 -240 -111 -171 -93 -40 -16 86 171 137 -189 43 7 216 330 -74
3518 -74 228 35 -155 -129 33 -136 -164 -2 40 -45 122 -7 65 -42 141 -66 -91 22 -303 35 56 -223 20
3541 20 223 -105 -111 -103 12 195 77 11 208 110 52 -20 -86 -4 95 322 -225 -86 -34 -60 -13 -283 22 -118 -53
3566 -53 -186 123 -21 -144 -40 -144 22 -33 -142 -158 80 175 22 -86 -18 -186 -197 252 -228 -228 -48 -265 101
3589 101 -10 -58 47 186 -75 27 166 358 -82 -90 -123 -2 340 125 130 -57 32 -326 -60 38 -112 -43 113
$$ packed form
3424A50m4k58L3K23K80m93O2J7J34j5p1r1P1M08k61j9k29Q9J9J65k66M1o2J26
3448Ij14J12%Q4j21J10k44J46R1j01n0K32j22j37m4j25N60j95n2q8J04m08J36
3471b17K41J05O7l93J95k58J96K54J5n5j50j18J01K8Q6l69N58p2l09O8K2L00n39
3494b44K66k4L4K17k46Mj99O5J37k50J29o0P8N3K4J02Q5l4l26K32l6K09J14m04
3518g4L02j93j90K6J62j69k8J62M2q5J67j29P2j07J83k07k5J13l25L38K1k79K43
3541B0K03l28oQJ15J83j18o6J97r8n8p2o6Q2R9K27n47J39N2k6M7k70L05j40O5
3566e3j33L09j44j23J04j04J66n5j09j6K38R5j53j08O8j68j1M49m80%J80k17L66
3589A01j11m8J05J39k61J02J39J92m40ql3J21L42k15Nj87Q9l58K66R8j50O9J56
$$ plain form
3612 113 82 -28 147 154 175 102 9 2 108 -88 21 166 110 -62 325 151 174 70 106 -143 -96 -49 107 -16
3636 -16 -29 50 -230 65 193 -118 141 127 49 -177 362 -237 15 -15 301 63 -23 -46 9 -90 -212 -74 -14 60
$$ packed form
3612A13l1j10J75PK1p3r3pJ06j96J09J45n6j72L87j74K3j04L6k49M7M7J56j23
3636a6j3P9k80K95J28l11K59j4p8k26N39n99K52l0L16k38q6k3N5r9j22J38O0P4
$$ [...]
8191H0
##END NTUPLES=NMR FID
##END=
