##TITLE=1H_Ser 18-4
 200.13MHz,DMSO.
 8 sc
 
 6.1.2026
##JCAMPDX= 6.0         $$ Bruker NMR JCAMP-DX V2.0
##DATA TYPE= NMR FID
##DATA CLASS= NTUPLES
##ORIGIN= UXNMR, Bruker Analytische Messtechnik GmbH
##OWNER= pz
$$ XWIN-NMR		Version 3.5
$$ Fri Feb  6 15:45:08 2026 Russian Standard Time (UT+4h)  she@DPX200
##.OBSERVE FREQUENCY= 200.1317
##.OBSERVE NUCLEUS= ^1H
##.DELAY= (6, 6)
##.ACQUISITION MODE= SIMULTANEOUS
##.ACQUISITION SCHEME= undefined
##.AVERAGES= 8
##.DIGITISER RES= 18
##SPECTROMETER/DATA SYSTEM= spect
##.PULSE SEQUENCE= zg30
##.SOLVENT NAME= DMSO
##.SHIFT REFERENCE= (INTERNAL, DMSO, 0, 14.3821)
##AUDIT TRAIL= $$ (NUMBER, WHEN, WHO, WHERE, WHAT)
$$ ##TITLE= Audit trail, XWIN-NMR		Version 3.5
$$ ##JCAMPDX= 5.01
$$ ##ORIGIN= Bruker BioSpin GmbH
$$ ##OWNER= she
$$ F:/spectra/data/she/nmr/H-C/1/audita.txt
$$ ##AUDIT TRAIL=  $$ (NUMBER, WHEN, WHO, WHERE, WHAT)
(   1,<2026-02-06 15:43:46.32 +0400>,<she>,<DPX200>,
      <created by zg, POWCHK disabled, PULCHK disabled
       configuration hash MD5:
       00 E9 B6 7A A2 85 ED C7 34 08 36 98 17 FE 4E 26
       data hash MD5: 16K
       1B 2A AF FB 68 E2 7D 39 97 FE 8F DA 29 EE 58 54>)
$$ ##END=
$$ 
$$ hash MD5
$$ 4E 5C AE 6E 36 0F 37 65 D9 B6 7D 8E 9B D9 C9 CA
##$RELAX= 
##$RELAX= 
##$RELAX= 
##$RELAX= 
##$RELAX= 
##$RELAX= 
$$ Bruker specific parameters
$$ --------------------------
##$DU= <F:/spectra>
##$EXPNO= 1
##$NAME= <H-C>
##$PROCNO= 1
##$TYPE= <nmr>
##$USER= <she>
##$AMP= (0..31)
100 100 100 100 100 100 100 100 100 100 100 100 100 100 100 100 100 100 
100 100 100 100 100 100 100 100 100 100 100 100 100 100 
##$AQSEQ= 0
##$AQ_mod= 1
##$AUNM= <au_zg>
##$AUTOPOS= <>
##$BF1= 200.13
##$BF2= 200.13
##$BF3= 200.13
##$BF4= 200.13
##$BF5= 200.13
##$BF6= 200.13
##$BF7= 200.13
##$BF8= 200.13
##$BYTORDA= 1
##$CFDGTYP= 0
##$CFRGTYP= 5
##$CHEMSTR= <none>
##$CNST= (0..31)
1 1 145 1 1 1 1 1 1 1 1 1 1 1 1 1 1 1 1 1 1 1 1 1 1 1 1 1 1 1 1 1 
##$CPDPRG= <>
##$CPDPRG1= <>
##$CPDPRG2= <>
##$CPDPRG3= <>
##$CPDPRG4= <mlev>
##$CPDPRG5= <mlev>
##$CPDPRG6= <mlev>
##$CPDPRG7= <mlev>
##$CPDPRG8= <mlev>
##$CPDPRGB= <>
##$CPDPRGT= <>
##$D= (0..31)
0 0.7 0 0 0 0 0 0 0 0 0 0.03 0 0 0 0 0 0 0 0 0 0 0 0 0 0 0 0 0 0 0 0 
##$DATE= 1770378225
##$DBL= (0..7)
120 120 120 120 120 120 120 120 
##$DBP= (0..7)
150 150 150 150 150 150 150 150 
##$DBP07= 0
##$DBPNAM0= <>
##$DBPNAM1= <>
##$DBPNAM2= <>
##$DBPNAM3= <>
##$DBPNAM4= <>
##$DBPNAM5= <>
##$DBPNAM6= <>
##$DBPNAM7= <>
##$DBPOAL= (0..7)
0.5 0.5 0.5 0.5 0.5 0.5 0.5 0.5 
##$DBPOFFS= (0..7)
0 0 0 0 0 0 0 0 
##$DE= 6
##$DECBNUC= <off>
##$DECIM= 32
##$DECNUC= <off>
##$DECSTAT= 4
##$DIGMOD= 1
##$DIGTYP= 9
##$DL= (0..7)
0 120 120 120 120 120 120 120 
##$DP= (0..7)
150 150 150 150 150 150 150 150 
##$DP07= 0
##$DPNAME0= <>
##$DPNAME1= <>
##$DPNAME2= <>
##$DPNAME3= <>
##$DPNAME4= <>
##$DPNAME5= <>
##$DPNAME6= <>
##$DPNAME7= <>
##$DPOAL= (0..7)
0.5 0.5 0.5 0.5 0.5 0.5 0.5 0.5 
##$DPOFFS= (0..7)
0 0 0 0 0 0 0 0 
##$DQDMODE= 0
##$DR= 18
##$DS= 0
##$DSLIST= <SSSSSSSSSSSSSSS>
##$DSPFIRM= 0
$$ [...]
##$SUBNAM0= <"">
##$SUBNAM1= <"">
##$SUBNAM2= <"">
##$SUBNAM3= <"">
##$SUBNAM4= <"">
##$SUBNAM5= <"">
##$SUBNAM6= <"">
##$SUBNAM7= <"">
##$SUBNAM8= <"">
##$SUBNAM9= <"">
##$SW= 18.0516967727041
##$SWIBOX= (0..15)
0 0 2 0 0 0 0 0 0 0 0 0 0 0 0 0 
##$SW_h= 3612.71676300578
##$TD= 16384
##$TD0= 1
##$TE= 0
##$TE2= 300
##$TE3= 300
##$TEG= 300
##$TL= (0..7)
0 120 120 120 120 120 120 120 
##$TP= (0..7)
150 150 150 150 150 150 150 150 
##$TP07= 0
##$TPNAME0= <>
##$TPNAME1= <>
##$TPNAME2= <>
##$TPNAME3= <>
##$TPNAME4= <>
##$TPNAME5= <>
##$TPNAME6= <>
##$TPNAME7= <>
##$TPOAL= (0..7)
0.5 0.5 0.5 0.5 0.5 0.5 0.5 0.5 
##$TPOFFS= (0..7)
0 0 0 0 0 0 0 0 
##$TUNHIN= 0
##$TUNHOUT= 0
##$TUNXOUT= 0
##$USERA1= <user>
##$USERA2= <user>
##$USERA3= <user>
##$USERA4= <user>
##$USERA5= <user>
##$V9= 5
##$VALIST= <valist>
##$VCLIST= <CCCCCCCCCCCCCCC>
##$VD= 0
##$VDLIST= <DDDDDDDDDDDDDDD>
##$VPLIST= <PPPPPPPPPPPPPPP>
##$VTLIST= <TTTTTTTTTTTTTTT>
##$WBST= 1024
##$WBSW= 4
##$XGAIN= (0..3)
0 0 0 0 
##$XL= 0
##$YL= 0
##$YMAX_a= 195129
##$YMIN_a= -269967
##$ZGOPTNS= <>
##$ZL1= 120
##$ZL2= 120
##$ZL3= 120
##$ZL4= 120
##$ABSF1= 10
##$ABSF2= 0
##$ABSG= 5
##$ABSL= 3
##$ALPHA= 0
##$AQORDER= 0
##$ASSFAC= 0
##$ASSFACI= 0
##$ASSFACX= 0
##$ASSWID= 0
##$AUNMP= <proc_1d>
##$AZFE= 0.1
##$AZFW= 0.1
##$BCFW= 1
##$BC_mod= 2
##$BYTORDP= 1
##$COROFFS= 0
##$CY= -3
##$DATMOD= 1
##$DC= 2
##$DFILT= <>
##$DTYPP= 0
##$F1P= 0
##$F2P= 0
##$FCOR= 0.5
##$FTSIZE= 0
##$FT_mod= 4
##$GAMMA= 1
##$GB= 0.15
##$INTBC= 1
##$INTSCL= 1
##$ISEN= 128
##$LB= 0.25
##$LEV0= 0
##$LPBIN= 0
##$MAXI= 10000
##$MC2= 0
##$MEAN= 0
##$ME_mod= 0
##$MI= 1.114404
##$NCOEF= 0
##$NC_proc= 0
##$NLEV= 6
##$NOISF1= 3.799351
##$NOISF2= 2.8
##$NSP= 1
##$NTH_PI= 0
##$NZP= 0
##$OFFSET= 14.38212
##$PC= 1
##$PHC0= -3702.997
##$PHC1= 12.79231
##$PH_mod= 1
##$PKNL= yes
##$PPARMOD= 0
##$PSCAL= 0
##$PSIGN= 0
##$REVERSE= no
##$SF= 200.129724274929
##$SI= 16384
##$SIGF1= 3
##$SIGF2= 2
##$SINO= 400
##$SIOLD= 16384
##$SREGLST= <1H.CDCl3>
##$SSB= 0
##$STSI= 0
##$STSR= 0
##$SW_p= 3205.1282051282
##$SYMM= 0
##$S_DEV= 0
##$TDeff= 0
##$TDoff= 0
##$TI= <>
##$TILT= no
##$TM1= 0
##$TM2= 0
##$TOPLEV= 0
##$USERP1= <user>
##$USERP2= <user>
##$USERP3= <user>
##$USERP4= <user>
##$USERP5= <user>
##$WDW= 1
##$XDIM= 8192
##$YMAX_p= 0
##$YMIN_p= 0
$$ End of Bruker specific parameters
$$ ---------------------------------
##NTUPLES= NMR FID
##VAR_NAME=  TIME,          FID/REAL,        FID/IMAG
##SYMBOL=    X,             R,               I
##VAR_TYPE=  INDEPENDENT,   DEPENDENT,       DEPENDENT
##VAR_FORM=  AFFN,          ASDF,            ASDF
##VAR_DIM=   8192,          8192,            8192
##UNITS=     SECONDS,       ARBITRARY UNITS, ARBITRARY UNITS
##FACTOR=    0.0002768,     1,               1
##FIRST=     0,             0,               0
##LAST=      2.2672688,     0,               0
##MIN=       0,             -269967,         0
##MAX=       2.2672688,     195129,          0
$$ Real data points
##PAGE= N=1
##DATA TABLE= (X++(R..R)), XYDATA
$$ [...]
2096d7J266k530q59K772m96k206J278K080j530m16K779p93k560J973J842m196
$$ -47 1219 -1311 -2170 602 106 -2100 -822 1258 -272 -688 2091 1298 -1262 711 2553 -1643
2112a643m40L892k153k376L099N89l656K852K549l450o46L650j230j675J355J56
$$ -1643 -2083 1809 -344 -2720 379 968 -2688 164 2713 -737 -1383 2267 1037 -638 717 873
2128H73k181R53J271j787j092K358J37j911J441J523j907j35L166k157k933L079
$$ 873 -1308 -355 916 -871 -1963 395 532 -1379 62 1585 -322 -457 2709 552 -2381 698
2144F98J496m520J045K636k854o45L938j099k773K883J202k453K03J871j411j103
$$ 698 2194 -2326 -1281 1355 -1499 -2144 1794 695 -2078 805 2007 -446 -243 1628 217 -886
2160h86J502l13k465R60K308j611r00K429m26j277K415L61l349N06L301l083j289
$$ -886 616 303 -2162 -1202 1106 -505 -1405 1024 598 -679 1736 2097 -1252 -746 2555 -528 -1817
2177a817K384p88k372K856J120l041J144K645j219k066K386P04k284l21J895k450
$$ -1817 567 -221 -2593 263 1383 -1658 -514 2131 912 -1154 1232 1936 -348 -669 1226 -1224
2193a224j145K750M83k985J592K150j902Q1K215j684j506K760n83l051J456J556
$$ -1224 -2369 381 864 -2121 -529 1621 -281 -200 2015 331 -1175 1585 1002 -2049 -593 963
2209I63k575O16K012j429j009K868L22k781N69K250j131j613J680m47k234J282
$$ 963 -1612 -996 1016 -413 -1422 1446 1768 -1013 -444 1806 675 -938 742 295 -1939 -657
2225f57K350k706p06L196q45k105K572L38k508J407J519k640r24K775p25j613
$$ -657 1693 -1013 -1719 1477 632 -1473 1099 1437 -1071 336 1855 -785 -1709 1066 341 -1272
2241a272J124P02j834P61K079j129j617K113R67k557M83J486j892p55K803j367
$$ -1272 -148 554 -1280 -519 1560 431 -1186 927 1894 -663 -180 1306 -586 -1341 1462 95
2257I5k524K552J511l156N32K500j657n40K411m09k846J570J771k213q49J609
$$ 95 -2429 123 1634 -1522 -990 1510 -147 -687 1724 1315 -1531 39 1810 -403 -1252 357
2273C57o92j226J531J176k522O67K906j545j784K044M72k244J115P85k701K76
$$ 357 -335 -1561 -30 1146 -1376 -709 2197 652 -1132 912 1384 -860 255 1040 -1661 -1385
2289a385K740j679j600K192K46j204J319R76k206O1K007r14j931J171P01j649
$$ -1385 1355 -324 -1924 268 514 -690 629 1605 -601 -540 1467 553 -1378 -207 494 -1155
2305a155j73K114j213r07K700J86k621J395J822k536l03J896j706j774K965lk501
$$ -1155 -1328 786 -427 -1334 1366 1552 -1069 326 2148 -388 -691 1205 -501 -2275 690 687 -1814
2322a814Q88K182j564n05K316p14j657J522R39k571j1J700o92k141K021R82k231
$$ -1814 -926 1256 -308 -813 1503 789 -868 654 1593 -978 -989 711 19 -2122 -101 881 -1350
2339a350R15K948k615j011K753k56k543J430Q79k537M95J825j379j270J898O13
$$ -1350 -435 2513 -102 -1113 1640 1384 -1159 271 1150 -1387 -892 933 -446 -1716 182 795
2355G95j866P92J627j130o23J828o25k062R60J514k010m87J523q46o16K315k91
$$ 795 -1071 -279 1348 218 -405 1423 798 -1264 -304 1210 -800 -1287 236 -610 -1226 1089 798
2372G98j896J649J230k148m6J725j210q96R73L5j782J210Q50j198k27J799j69
$$ 798 -1098 551 1781 -367 -413 1312 102 -794 179 214 -1568 -358 492 -706 -933 866 697
2389F97j124J365M09j960J42K164j621j534J713K49k223J722R76j888k18L145
$$ 697 -427 938 1347 -613 -471 1693 72 -1462 251 500 -1723 -1 975 -913 -1131 2014
2405B014j043j975K122J72k008J78J668k174p14J963K05k496J456J901j079n94
$$ 2014 971 -1004 1118 1290 -718 -540 1128 -1046 -1760 203 408 -2088 -632 1269 190 -404
2421d04J830m60j466J482L88k494J85J751j618r24J968l4j517K031Q49j772j0
$$ -404 1426 966 -500 982 1370 -1124 -939 812 -806 -1730 238 204 -1313 718 1567 -205 -215
2438b15J841q15j698J164J49j932N98J758j765o76J894N62j373J125R74j734K35
$$ -215 1626 811 -887 277 426 -1506 -908 850 -915 -1591 303 865 -508 617 1591 -143 92
2455I2J317j428j122J053r2j126P19O60j110P60J344p31q11J508J49j606M77J018
$$ 92 1409 -19 -1141 -88 -180 -1306 -587 73 -1037 -277 1067 336 -475 1033 1182 -424 53 1071
2473A071j660p82K054j062j203J269J340j939O53J781j286q20J785r3k619R99
$$ 1071 -589 -1371 683 -379 -1582 -313 1027 -912 -259 1522 236 -584 1201 1108 -1511 -512
2489e12J546j786j047K394o65j040J398P80j582L77J769j156j172J264M7j980
$$ -512 1034 -752 -1799 595 -70 -1110 288 1068 -514 -137 1632 476 -696 568 615 -1365
2505a365R58N27j134k94K028q75n97J458N54j576K91J462j359p07J210j42j969
$$ -1365 -407 120 -1014 -1308 720 -155 -752 706 1260 -316 -25 1437 78 -629 581 439 -1530
2522a530J186O96j260QJ814p10r39J285M39j619N80J088j449o12J405m50j248
$$ -1530 -344 352 -908 -900 914 204 -735 550 989 -630 -50 1038 -411 -1023 382 -68 -1316
2539a316J213L55j246J86K074r70j024J746j01j333M51J143j932o04K021o59j654
$$ -1316 -103 252 -994 -808 1266 296 -728 1018 917 -416 35 1178 -754 -1358 663 4 -1650
2556a650J808R77k038O36J390r26o43J353k62j554Q72Q36j403l38J417p22r81
$$ -1650 158 1135 -903 -267 1123 197 -446 907 645 -909 -37 799 -604 -942 475 -247 -1228
2573a228J511N95j385O05J202j353l28J352l86j505J124L17j610M05J199j014
$$ -1228 283 878 -507 98 1300 -53 -381 971 585 -920 204 521 -1089 -684 515 -499
2589d99o38J926j71j322Q17R55j363l14J503l83j593Q38O50j263J1J605q93q44
$$ -499 -1137 789 618 -704 113 1068 -295 -609 894 511 -1082 -244 406 -857 -846 759 -134 -978
2607i78J840N8j596J090O77j413k32J260p10r64R50J2j207J114Q09q49j73J613
$$ -978 862 920 -676 414 1091 -322 -554 706 -4 -968 -18 -6 -1213 -99 710 -139 -312 1301
2625A301o55j007J029J46j592J17J392j196r45J384N36j665J085J457j308o26
$$ 1301 646 -361 668 814 -778 -661 731 -465 -1410 -26 510 -1155 -70 1387 79 -547
2641e47J746k64j508P25P11j826k48J551o31r45J079O95j337R73Q58q40J38N90
$$ -547 1199 935 -573 152 863 -963 -1211 340 -291 -1236 -157 538 -799 174 1032 192 330 920
2659I20q29q63R11l5j161N29P30p54N5J428m70r51J538L39j921L69J184j148j365
$$ 920 91 -772 139 104 -1057 -528 202 -552 -497 931 461 -490 1048 1387 -534 -165 1019 -129 -1494
2678a494J413K82j208M49J384j139o81J931N1j216L70O22j198p1R17q59p13R25
$$ -1494 -81 201 -1007 -558 826 -313 -994 937 988 -228 142 764 -434 -505 412 -447 -1160 -235
2696b35L80o32P12N89j037L59J032q27q09J098q4j216K29P23q25n12J834l69j300
$$ -235 145 -487 225 814 -223 136 1168 341 -468 630 546 -670 -441 282 -543 -1055 779 410 -890
2715h90O85J315j389k27J291n76j254J323N58j642L5J506q46o63J182J3o07M14
$$ -890 -205 1110 -279 -506 785 209 -1045 278 836 -806 -771 735 -111 -774 408 421 -186 228
2733B28M06q83K43L12k80m54O74n39k20M66J35o46n3J320o67n86J043J96j569
$$ 228 634 -249 -6 306 26 -428 246 -293 -513 -47 88 -558 -611 709 42 -544 499 695 -874
2752h74J185K61j105m02J653l25j299N55J003j122k01J788q22j022J194K70r24
$$ -874 311 572 -533 -935 718 393 -906 -351 652 -470 -671 1117 295 -727 467 737 -187
2769a87j01Q97q80o56R70J0o66M15N94l83o87J147n15K8N52j90q16N28R19j377
$$ -187 -288 609 -271 -927 43 53 -613 -198 396 13 -674 473 -42 -14 538 348 -468 60 979 -398
2789c98j74J009n01p77J468Qj017K30J157r10m97P96Q4j071L20R86j127j13J087
$$ -398 -572 437 -64 -841 627 635 -382 -152 1005 95 -402 394 478 -593 -273 713 -414 -527 560
2808E60k78j025J074O4k42m36Q72n45m19P47j33j000N77N46r80M89N50m55l99
$$ 560 282 -743 331 395 153 -283 589 44 -375 372 239 -761 -184 362 -618 -129 421 -34 -433
2827d33J089k47r56Q90M45j054k63Q28m41o51J007K96j747O63J188m95n44R84
$$ -433 656 409 -547 343 788 -266 -529 299 -142 -793 214 510 -1237 -574 614 119 -425 559
2845E59j02q64L82J102j280l84J233o24j160P11Q51q74M50O64q11j76J057k38
$$ 559 457 -407 -25 1077 -203 -587 646 22 -1138 -427 424 -450 0 664 -147 -323 734 496
2863D96o84J31L09o38K37N28o73r05J282L11j054N67R98p84j91J036n61j053R32
$$ 496 -188 -57 252 -386 -149 379 -294 -1199 83 394 -660 -93 905 121 -70 966 405 -648 284
2882B84L11j364j65Q47m7o06P82K18p45O93O93j11r61O46k03p72K19L70j158N62
$$ 284 595 -769 -934 -87 -134 -740 42 260 -485 208 901 790 -171 475 272 -500 -281 89 -1069 -507
2902e07P73n46m30J170N37j050O85L24r88k79R40o62q98M90N67r36K63J010m63
$$ -507 266 -280 -710 460 997 -53 632 956 -32 -311 629 -33 -931 -441 126 -810 -547 463 0
2921@KP49J13q23K60J11l92m74L75n01j15O63K46r23Q83R21q67L18K65l58j064
$$ 0 2 751 864 41 301 412 20 -454 -79 -580 -695 -32 214 -709 174 1095 228 546 811 453 -611
2942f11P86Q8j348O16M79n52O5R33N7o16M30R63j313mO76k19j054K17O0m42O5
$$ -611 175 263 -1085 -469 10 -542 -477 456 513 -103 327 1290 -23 -27 649 430 -624 -407 -347 -789 -724
2963g24J007n56k35J199j66q53N40N19r19J51M11m09r29R38J9r21M29P98j98J77
$$ -724 283 -273 -508 691 525 -328 212 731 -188 -37 374 -35 -964 -26 -7 -928 -499 299 101 278
2983B78M88j31r77J008K90j115m24P40o72p40J190Jk79K31R39m48o15J135m43
$$ 278 766 635 -342 666 956 -159 -583 157 -515 -1255 -65 -64 -343 -112 827 379 -236 899 456
3002D56n53j52N19l64J03L6n38m7N78Q3q1M16n5n19P27K92j123j09N51q2o79K66
$$ 456 -97 -249 270 -94 9 45 -493 -540 38 121 40 456 401 -118 609 901 -222 -331 220 138 -541 -275
3024b75L16n20J27O39k2q24Q51N77r88J98M77n46m49O55j95r11M88Q95o76j32
$$ -275 41 -479 -352 287 265 -559 292 869 -119 79 556 10 -439 216 21 -890 -402 493 -183 -315
3044c15P14l90k1O13J82p30K1N64n89o85M01J17n32Q24j15q59P70P75m66n46O96
$$ -315 399 9 -12 601 783 53 74 638 49 -636 -235 -118 -650 174 59 -800 -30 745 279 -267 429
3065D29J13p63J94N46q23l15O83r5o95O88L82o54N8Q11k24o83O61K20p87q8M71
$$ 429 542 -221 -27 519 -304 -619 64 -31 -726 -38 344 -310 -252 559 335 -348 313 533 -254 -342 129
3086A29n60k4L99K60o17N56O79r11J18O45m93m54N18j96o41N88L9n33L10M31m40
$$ 129 -431 -455 -56 204 -413 143 822 -89 29 674 181 -273 245 49 -592 -4 35 -498 -188 243 -197
3107a97o0N60J82o59K59L81l99m70L70k6o99N51J51m97J55P62k27k41M88J67o53
$$ -197 -257 303 485 -174 85 466 67 -403 -33 -59 -758 -207 -56 -553 -398 364 137 -104 384 551 -102
3128a02L13j75q1l39N19m74m58N82O21o79K53M92l79K7M00j7j032L58L66n39k71
$$ -102 211 36 -45 -384 135 -339 -797 -215 406 -273 -20 472 93 120 520 503 -529 -171 195 -344 -615
3149f15P94k97k16L55M50o16K33Q56q63j72N98k94q19L49L75o72j12P08K77m89
$$ -615 179 -118 -334 21 471 -145 88 944 81 -91 507 213 -606 -257 118 -554 -666 42 319 -170
3169a70L59K14m86M22L56q30k57N34k3p12O62q4o22L96N09j98P0L21J9n39J74
$$ -170 189 403 -83 339 695 -135 -392 142 119 -593 69 -15 -637 -241 268 70 140 461 480 -59 115
3190A15K68n89k38M07j84k51L86R3m64N21M45k21l78P57l21m71L55J69r13j39
$$ 115 383 -206 -444 -37 -221 -472 -86 7 -457 64 509 288 -90 667 346 -125 230 399 -514 -653
3210f53P44m9m03M66M32m22r0O80m51j29J56J38r81L97L1k86J90K81k88l40R70
$$ -653 91 42 -361 105 537 115 25 705 254 125 281 419 -562 -165 -134 -420 -230 51 -237 -577 393
3231C93k54J11l36K97m72K76M02n39o0K81M0p05L21K93k8k82R98m74k96L38m0
$$ 393 139 250 -86 211 -261 15 417 -122 -182 99 139 -566 -245 48 20 -262 736 262 -34 304 264
3252B64k38l80N56k25k32K27O1p42O22M58k59k55L44lk04K9J42l99J63J81k44
$$ 264 26 -354 202 -23 -255 -28 33 -709 -87 371 112 -143 201 198 -6 23 165 -234 -71 110 -134
3273a34q2L70l15q2L55J56p6l43N14n9n58K60K99p02J13M44q6j41J66J96n70M63
$$ -134 -216 154 -161 -243 112 268 192 -151 363 304 -254 6 305 -397 -284 160 74 -67 99 295 -275 188
3295A88j38j65j33L17J67n12M13J3k37MJ96m36L11pJ36m20L47N7k33O4J93k48
$$ 188 50 -115 -248 69 236 -276 137 150 -87 -83 113 -323 -12 -19 117 -303 44 101 -132 -68 125 -123
3317a23m21Q45k53m21M64L04n10j85N68rl48K77R3l57k08M62j78k65J85J41k50
$$ -123 -544 301 48 -373 91 395 -115 -300 268 259 -89 188 281 -76 -284 178 0 -265 -80 61 -189
3338a89q9L89q1j80J94N4m50M40R2m09M46J99n39k68O27l16j34K71N9k93OM67
$$ -189 -278 111 30 -150 44 98 -352 88 180 -229 217 416 -123 -391 236 -80 -214 57 116 -177 -171 296
3360B96p2m24N53j7m86N8M92n56l14N38Q9n96K29O38o59J47K17k03m69P10J91
$$ 296 224 -200 353 336 -150 -92 400 -156 -470 68 157 -439 -210 428 -231 -84 133 -70 -539 171 362
3381C62j95j38p4r0j1J55k03J02K32K08m41O8O3R0k34L41r4o71N12J69l29m73
$$ 362 167 29 -45 -135 -146 9 -194 -92 140 348 -93 -25 38 128 -106 235 141 -530 -18 151 -178 -651
3403f51P84j14k19L16J37l02M0K41k01l15K85J66m22L1M24j41k83M86p7r4P9K78
$$ -651 133 19 -200 116 253 -49 -9 232 31 -284 1 167 -255 -224 200 59 -224 262 185 91 170 448
3425D48m49M6J50j91k57J16J90m72L76K46m22K59K81m84L63k06L40p05L90L85
$$ 448 -1 45 195 4 -253 -137 53 -419 -43 203 -219 40 321 -163 200 -6 334 -371 19 404
3445D04l98k30K41N3n19N60nq5N6N28n93jL47k32k34J52r8j77J7lJ23j25J74L46
$$ 404 6 -224 17 70 -449 111 106 21 77 605 12 11 358 126 -108 44 -54 -231 -214 -217 -94 -219 -45 301
3469C01k18Q4j28n7j83K48P5k44L82K25p33K70K55l72o9M01R0m11M6O49p66j47
$$ 301 83 167 39 -18 -201 47 122 -122 260 485 -248 22 277 -95 -164 237 327 -84 -38 611 -155 -302
3491c02O09l74m3mL25m25N8O1K82k79K19K26n55K03J49l88L6L50j54j87K31rl61
$$ -302 307 -67 -110 -114 211 -214 -156 -95 187 -92 127 353 -202 1 150 -238 -202 148 -6 -193 38 29 -332
3514c32L38M52l10k97L54k89k50L51J50m55N5M34l86k09J15K11RK31J89m44QK25
$$ -332 6 458 148 -149 205 -84 -334 17 167 -288 -233 201 -185 -394 -279 -68 -59 172 361 -83 -75 150
3536A50j0k49j92K3J71k32L08j10L3K27k6j89M88mk31k46M29n77j01j3L53l49
$$ 150 140 -109 -301 -278 -107 -339 -31 -141 -108 119 93 -96 392 388 157 -89 340 -237 -338 -351 2 -347
3558c47K02N16n66LK65K06n87K97M00n03k66L70m3k71J76N7k97K75P3O2R0K77
$$ -347 -145 371 -195 -192 73 279 -308 -11 389 -114 -380 -10 -53 -324 -148 -91 -388 -113 -40 22 112 389
3580C89p6o29M81o4m1n5K33k95m60N98K74o88M54J42l89n0M94k18K4K99l83n02
$$ 389 313 -316 165 101 60 5 238 -57 -517 81 355 -333 121 263 -126 -176 318 100 124 423 40 -462
3602d62K18N75m85K04J65r2j45j6K50k51M0J19J19n37L3L88k83l3J34L0j31J92
$$ -462 -244 331 -154 50 215 123 -22 -38 212 -39 1 120 239 -298 -265 123 -160 -193 -59 -29 -160 32
3624C2M90n01L47k10k58J43K38o0l65J95N7k94K3L31k74p6L49L8j97k3N95m05
$$ 32 522 21 368 158 -100 43 281 221 -144 51 108 -186 -163 168 -106 -182 167 205 8 -15 580 175
3646A75j75J01J72j98k73J18l89N01J72k47j29L67k47K12n2P4k65p1j5j56J9L11
$$ 175 0 101 273 75 -198 -80 -469 32 204 -43 -172 195 -52 160 108 182 -83 -154 -169 -325 -306 5
3668Ej30P1Q8M0Q9r3K78l06m01O00K1o09J16N1P6j4K31k34J29j53L89j54n23Q20
$$ 5 -125 -54 34 74 163 70 348 42 -359 241 262 -347 -231 -180 -104 -118 113 -121 8 -145 244 90 -433 387
3692C87l53Oq6J34m16N06L9n0q4L4j02r0K28o6k16J4K56k98l37O36n0l99K09L55
$$ 387 34 40 -46 88 -328 178 217 167 83 117 15 -75 153 87 -129 -115 141 -157 -494 142 92 -307 -98 257
3716B57k85j73M05J31k30P2J2m34R1L21J04n54N9L90k21j03K74o8j25K99P4n00
$$ 257 -28 -201 204 335 105 177 189 -245 -154 167 271 -283 -224 166 -55 -158 116 48 -77 222 296 -204
3738b04R2L5M7o6J74r7J03R9j23l07J91J32K8n7k85n1j08M13p2m7j08M94l14k8
$$ -204 -112 -77 -30 -96 78 -19 84 183 60 -247 -56 76 104 47 -238 -289 -397 16 -56 -103 -211 283 -31 -59
3762e9J04m9r5K25r3k3j07M19m58q0J29l0k0K55K6k30J61k6j03j06Q2L47n28R9
$$ -59 45 -4 -99 126 33 10 -97 322 -136 -216 -87 -117 -137 118 144 -86 75 49 -54 -160 -78 269 -259 -160
3786a60M23j17l69J62K31m13M41J8l28K36K40m53R0p7R3k44J44J61m2m74O50l94
$$ -160 263 146 -223 -61 170 -243 198 216 -112 124 364 -89 1 -76 17 -227 -83 78 36 -438 212 -182
3808a82l9J59K42k21jJ45l51J84N32n34k6m0K40p7l26N63n78J99N9K74m68L34
$$ -182 -221 -62 180 -41 -42 103 -248 -64 468 -66 -92 -132 108 31 -295 268 -310 -111 -52 222 -246 88
3830H8p4r2J25J26j40J01n0j86K31m92M20l21j2R3O64o89jK80j83K17R5j26l79
$$ 88 14 -78 47 173 33 134 84 -102 129 -363 57 -264 -276 -183 481 -208 -209 71 -112 105 200 74 -305
3853c05L85l7k36R8j66L03j17J06o6k43M23O2o08L77N7k9l36L81l2k30J47K19
$$ -305 80 43 -193 -95 -261 42 -75 31 -35 -278 145 207 -401 -24 33 4 -332 49 17 -213 -66 153
3875A53l13j91L26L69n48l9L33j29R5J30l31M4J05M9m21K63J36N3nMl0k16j60
$$ 153 -160 -351 -25 344 -204 -243 90 -39 56 186 -145 -101 4 53 -368 -105 31 84 79 83 53 -163 -323
3898c23L99j29l82L91J45k26N8r1m3R9M80j15j14l2j8l67O48l8k66l03N18j28
$$ -323 76 -53 -435 -44 101 -125 -67 -158 -201 -102 378 263 149 117 99 -268 380 342 76 -227 291 163
3920A63m64J09N3j4m7L78j76o2R1j55k2L91l30j9R9K63l14j10K77p9k88k6M50
$$ 163 -301 -192 -139 -153 -200 178 2 -60 31 -124 -146 245 -85 -104 -5 258 -56 -166 111 32 -256 -282 168
3943A68j39k90M00j92k29L40J27k10j37K25k91L16q9K49l66J65r2p2R2L67m05
$$ 168 29 -261 139 -53 -282 58 185 -25 -162 63 -228 88 -1 248 -118 47 -45 -117 -25 342 -63
3964f3J42p3nJ58j21j7j17r3L23k88j34M47k37K7k9K23l45j67J51K65j50N8K17
$$ -63 79 6 1 159 38 21 -96 -189 134 -154 -288 159 -78 -51 -80 143 -202 -369 -218 47 -103 -45 172
3987A72RJ74j41m36N6J87J43l23MK08n2m2n9J15k73L76p1j08K64k20k54L75l26
$$ 172 181 355 214 -222 -166 21 164 -159 -155 53 1 -41 -100 15 -258 118 47 -61 203 -17 -271 104 -222
4010b22k20K06K09Q9j00rK6L07k73j11K85r6j08K95j11m07L88j03j93L03K77p08
$$ -222 -442 -236 -27 62 -38 -47 -21 286 13 -98 187 91 -17 278 167 -240 148 45 -148 155 432 -276
4032b76K08K75M6l33k87M91l08Q2J86j76j85M70k06j34R7L38k65j04K32j52k09
$$ -276 -68 207 253 -80 -367 124 -184 -102 84 -92 -277 193 -13 -147 -50 288 23 -81 151 -1 -210
4053b10M82k57k26M5J39j44j53L08K22n62M28J86n21PL09k08J03M1M36m34qj02
$$ -210 272 15 -211 -166 -27 -171 -324 -16 206 -356 72 258 -263 -256 53 -155 -52 -11 425 -9 -17 -119
4075a19r4p9M72Qk33L8Q4l37L58k6k78l7N38k61j02L10l72K32r7K6J47k08r5L98
$$ -119 -213 -292 180 188 -45 -7 77 -260 98 72 -206 -243 295 34 -68 242 -130 102 5 31 178 -30 -125 273
4099B73k50R0J24j95l21L61j91r1K19K32j80k9n3j68J26K60pm35J73J75j08j4
$$ 273 23 113 237 42 -279 82 -109 -200 19 251 71 42 -11 -179 -53 207 200 -235 -62 113 5 -9
4121iK38l77J56p4K52j97j18L47k67J67M0K0m23L34K18m40o7L17m8K1J48m57K37
$$ -9 229 -148 8 -66 186 -11 -129 218 -49 118 158 178 -245 89 307 -133 -200 117 69 90 238 -219 18
4144A8k24L87k76K18k34m0J09j82J85k5m7Qq0L10j38Q0o6m2J13J04j37r0J06k18
$$ 18 -206 181 -95 123 -111 -151 -42 -224 -39 -64 -111 -103 -183 127 -11 69 3 -39 74 178 41 -49 57 -161
4168a61L84k50J76j69j6j85K08k3L69j08r5k72L29k56J02l31J41K47L5l54K93
$$ -161 223 -27 149 -20 -36 -221 -13 -36 333 225 130 -142 187 -69 33 -298 -157 90 125 -229 64
4189F4J39j81j06Q8K56m07K32R9r0l40K03j09J03R7K09m14j59M37n7n8J35j0j09
$$ 64 203 22 -84 4 260 -147 85 184 94 -246 -43 -152 -49 48 257 -157 -316 121 64 6 141 131 22
4212B2j38K03k37K66k7k6j75J46J32j35Q0R2l17Q9k38L5J37J40o1l50K65J17l6
$$ 22 -116 87 -150 116 89 63 -112 34 166 31 111 203 -114 -25 -263 -228 -91 49 -12 -362 -97 20 -16
4235a6L8K00l66M8K3j23O4J74L47m73n5K3k7K12O6j80j8J90k11K69l00M21k73
$$ -16 22 222 -144 -96 -73 -196 -132 42 389 -84 -139 -116 -143 69 135 -45 -63 127 -84 185 -115 306 33
4258C3rk8J08j15j66K25j73J81j05M5Q1j46J72J21k12J99l63o9K48K13r6J80k58
$$ 33 24 -4 104 -11 -177 48 -125 56 -49 -4 77 -69 103 224 12 211 -152 -221 27 240 144 324 66
4281F6k62Q8N3J35n3mJ27J39l31J71J36k28j96j6K23o7J30K3j31j85O03m77J80
$$ 66 -196 -108 -55 80 27 23 150 289 -42 129 265 37 -159 -175 48 -19 111 134 3 -182 421 -56 124
4304A24m1p7k36K43kJ5r9L76l73J33J44j69j36J50L7j98j38L55k45j04J65K0j28
$$ 124 83 6 -230 13 11 26 -73 303 -70 63 207 38 -98 52 89 -109 -247 108 -137 -241 -76 -56 -184
4327a84K79l9k14J39K64j6l30o7K51m23L14J25K15k76L4j67p1J91J45r8m5J16
$$ -184 95 56 -158 -19 245 229 -101 -168 83 -340 -26 99 314 38 72 -95 -166 25 170 72 27 143
4349A43N6k80n8Q6l01J01M38j79k2m5K34l04K71p8k69P8J7K37J89m47J39j24p2
$$ 143 199 -81 -139 -53 -354 -253 185 6 -16 -61 173 -131 140 62 -207 -129 -112 125 314 -133 6 -118 -190
4372a90M32J8m03J62L09m07Q9K33l75M3j61J54J11m6J36PP1k98K1l31M91J9p5
$$ -190 242 260 -143 19 328 -79 10 243 -132 -89 -250 -96 15 -31 105 112 183 -115 -94 -425 66 85 10
4395A0K64k18k53K90L8k77QL90M7l85J71j31J8J6J97N2k43j20L06j2m24M0K81
$$ 10 274 56 -197 93 131 -146 -138 252 299 -86 85 -46 -28 -12 185 237 -6 -126 180 168 -256 -216 65
4418F5k92J39K10n19K24M13l26J11K6l4k8q6j05J46l3r9LL16j73jk1k3P7l92N48
$$ 65 -227 -88 122 -397 -173 240 -86 25 51 17 -11 -97 -202 -56 -89 -188 -185 131 -42 -43 -64 -87 -10 -402 146
4443A46J4k72P7j41K83j19j16J35r3J19K36o3l95O9J4j01J76R8j59K79r1L1j94
$$ 146 160 -112 -35 -176 107 -12 -128 7 -86 33 269 206 -189 -120 -106 -207 -31 67 -92 187 96 127 -67
4466f7L81L3m20M3J77k02J19j25J20j90K27J17j33j05K57l41L08j45K6N9m11K68
$$ -67 314 347 -73 -30 147 -55 64 -61 59 -131 96 213 80 -25 232 -109 199 54 80 139 -272 -4
4488dk00p8L66J1j74o2Q9J07j58L45n09L10j1M4k73J39j07Q7J2P7J48m8j00L22
$$ -4 -204 -282 84 95 -79 -141 -52 55 -103 242 -267 43 32 76 -197 -58 -165 -78 -66 11 159 111 11 333
4512C33k70j37Q5k9N0P5k3j39J6R8l33L37q7n1K9J75O7l18j44O57l53j38qJ51
$$ 333 63 -74 11 -18 32 107 84 -55 -39 59 -274 63 -24 -75 -46 129 196 -122 -266 391 38 -100 -108 43
4536D3O5o12N84p3j37k02L38l7J7j20j03L39J91k28k37J97R8j02r3K64j87j20
$$ 43 108 -504 80 7 -130 -332 6 -31 -14 -134 -237 102 293 65 -172 25 123 21 -72 192 5 -115
4558a15K80n9k08p7l0J43L03l02J23l19N39j15j01J1k93K42J13P1k38j42N8oJ75
$$ -115 165 106 -102 -179 -209 -66 237 -65 58 -261 278 163 62 73 -220 22 135 206 -32 -174 -116 -122 53
4581E3j8k6L52n86L28j20k38J49k9K41K05P6l65o8J14j26K90l43M7Q9m1n4K49
$$ 53 35 9 361 -225 103 -17 -255 -106 -135 106 311 387 22 -46 68 -58 232 -111 -64 25 -16 -70 179
4604A79k68J89Q1m5k89J57O6r1K25m29K24j14J36K76k21m2k7j96J01K33k49PL44
$$ 179 -89 100 181 136 -153 4 70 -21 204 -225 -1 -115 21 297 76 34 7 -189 -88 145 -104 -97 247
4627B47j62k0j93Q3l94L98J24j45o7K37p2k87N41m53M8K33j5m40K81p1Q6J46l01
$$ 247 85 65 -128 -45 -439 -41 83 -62 -129 108 36 -251 290 -163 -115 118 103 -337 -56 -127 -41 105 -196
4650a96K54l0j65L25l78K27n6r8K14j76k35J99K91q7r7J29Q8r0l32K18Nj82j50
$$ -196 58 28 -137 188 -190 37 -19 -117 97 -79 -314 -115 176 89 -8 121 209 119 -213 5 10 -172 -322
4673c22L20l68k7L18M44j69j19J16O5j68k47L88q2m19Q5M1K83k06L7N7K9Jm8N0
$$ -322 -2 -370 -397 -79 365 196 77 193 258 90 -157 231 149 -270 -185 -144 139 -67 -30 27 56 57 9 59
4697E9O7k20rJ77o4q4J51o6J33L8l25K94k87J99k14J16J24Lj16L4J90l47J94j17
$$ 59 126 -94 -103 74 10 -74 77 11 144 182 -143 151 -136 63 -151 -35 89 92 -24 10 200 -147 47 -70
4721g0J10L0N4P5l90l9K33J20j47k0j5J03j06K7j9n2N40n10j64K23R1p1oJ08p0
$$ -70 40 70 124 199 -191 -230 3 123 -24 -44 -59 44 -62 -35 -54 -106 434 -76 -240 -17 74 3 -3 105 35
4746C5l40J99J20k75J13J48J2N4j36r4Qn4M02m01K04Q8j80J88j06K19r1k4m95
$$ 35 -305 -106 14 -261 -148 0 12 66 -70 -164 -156 -210 192 -209 -5 83 -97 91 -15 204 113 89 -406
4769d06L33P6m7J00j5l1J68k87P1R5J11j16M3m2J64j90r0K86k08J40q6K4o5JK62
$$ -406 -73 3 -44 56 41 10 178 -109 -38 57 168 52 95 53 217 27 -63 223 15 155 69 93 28 29 291
4794B91n03L63m5Q2p5j1k12J81J64l26J20j6k99L87Q3p6j20q7K9O9l06K01L76
$$ 291 -212 151 106 188 113 102 -110 71 235 -91 29 13 -286 101 184 108 -12 -99 -70 -1 -307 -106 270
4817B70l88L35np6j2J26m49N3L45l6k64O0R9J28k85J66Q1qO5n71O11k63J38q1
$$ 270 -118 217 212 136 124 250 -199 -146 199 163 -101 -41 58 186 -99 67 148 140 205 -366 245 -18 120 39
4841C9n4J84k05N3j0R5l60J34N3O0j22n3M67k52k45K87P8j42l12R2L68K8j57q8
$$ 39 -15 169 -36 17 7 102 -258 -124 -71 -11 -133 -186 281 29 -216 71 149 7 -305 -213 155 183 26 -62
4865f2K62l00J38J72k40J90l34J43P1q5p1K73K1n62K75J98J88l14K44m0j54m9
$$ -62 200 -100 38 210 -30 160 -174 -31 40 -45 -116 157 178 -384 -109 89 277 -37 207 167 13 -36
4887c6J15k15L5L28j70k8j21J90n8j95J38k08N3J95l03N04Kj25k1l4k59J96j0
$$ -36 79 -136 -101 227 57 29 -92 98 40 -155 -17 -225 -172 23 -280 224 226 101 80 46 -213 -17 -27
4910b7%j14j38J76j08L71k89j93L44j40L44Jk54K59k42k0k99K83K6j48K04r3m7
$$ -27 -27 -141 -279 -103 -211 160 -129 -322 22 -118 226 227 -27 232 -10 -30 -329 -46 -20 -168 36 -57 -104
4933a04J15Nj36M40l02r5K06j88M85l82r3p0J77kj4J08l08q5J65K56k86L01k00
$$ -104 11 16 -120 320 18 -77 129 -59 426 44 -49 -119 58 56 42 150 -158 -243 -78 178 -108 193 -7
4956gj46L83l22Np3J03l4L6l2N51l24j38N5q3L3K50l67k15K60J47m4l04K94p7
$$ -7 -153 230 -92 -87 -160 -57 -91 -55 -87 464 140 2 57 -26 7 257 -110 -325 -65 82 38 -266 28 -49
4980d9P1j24q5KK56j9j93J86q6k2jp7J63j42k20K68Oo9K30J66l00J73j85J03K34
$$ -49 22 -102 -187 -185 71 52 -141 45 -41 -63 -64 -141 22 -120 -340 -72 -66 -135 95 261 -39 134 -51 52 286
5005B86o71K30P2j30K47K14j99j47L21n28K83k2J47l1j62J44p6K26l05R3j33J87
$$ 286 -385 -155 -83 -213 34 248 49 -98 223 -305 -22 -44 103 72 -90 54 -22 204 -101 -8 -141 46
5027D6l6K0j7m2J09j51Q2j09r5m2L37j09m4J18KP3l6k7M6kN5m42M68k63j38K48
$$ 46 10 30 13 -29 80 -71 11 -98 -193 -235 102 -7 -51 67 69 142 106 79 125 123 178 -264 204 -59 -197 51
5053E1j21L7K75N4k31j60J17R6j96K79j64k88L36J82l62K0J34q9OK46L9M6k58
$$ 51 -70 -33 242 296 65 -95 22 118 -78 201 37 -251 85 267 -95 -75 59 -30 -24 222 261 307 49
5076D9J34l17O3K5L52n47J82j31J63K9qr2N5P6J94k77pJ5j41Q9j7K20j56J54j57
$$ 49 183 -134 -71 -46 306 -241 -59 -190 -27 2 -6 -98 -43 33 227 -50 -57 -42 -183 -94 -111 109 -47 107 -50
5101e0j06J46l14L43k13K04j68O3P6J11j26K73mk9m64K56r7P6M7k26o0K80j14
$$ -50 -156 -10 -324 19 -194 10 -158 -95 -19 92 -34 239 235 206 -258 -2 -99 -23 24 -202 -262 18 -96
5124i6J47kl10O27m15K77l12L9l2J31J22q2k30J46M8k2j43O4Q9k17K78nj77J28
$$ -96 51 49 -261 366 -49 228 -84 -45 -77 54 176 94 -136 10 58 36 -107 -43 46 -171 107 102 -75 53
5148E3j58J11K8p1J66j84M39m54Q4m6j36K56j95J53J48m41M02K01m67Kk7L04l03
$$ 53 -105 6 34 -37 129 -55 384 -70 14 -32 -168 88 -107 46 194 -247 155 356 -111 -109 -136 168 -135
5171a35K56l0j99K08j89Q4J13l37J75j51L05j0j53J78m3k7J76j35j63L5r0K34
$$ -135 121 91 -108 100 -89 -5 108 -229 -54 -205 100 90 -63 115 72 45 221 86 -77 -42 -132 102
5193A02j37r9K0J63k57J13J55lJ9j52K68k67K94l46Q3K85j21j30J32o1j67K45
$$ 102 -35 -134 -114 49 -208 -95 60 57 76 -76 192 -75 219 -127 -44 241 120 -10 122 61 -106 139
5215A39k29R6L82l31M8k09L36k61k3K33j12r9K9J11J06j21p3o8o3J78j76K37j23
$$ 139 -90 6 388 57 105 -104 232 -29 -52 181 69 -30 -1 110 216 95 22 -46 -109 69 -107 130 7
5238Gq0J51J04m14O8M45l86K78k23K17j10N3m2J25Ll5j68J0j8m0J60j76j58J98
$$ 7 -73 78 182 -232 -164 281 -105 173 -50 167 57 110 68 193 196 161 -7 3 -15 -55 105 -71 -229 -31
5262c1M5j11P3r6K71O4k83K02Q0m97J63J10m8k13L01J62j40O8j35L5P3K88j69
$$ -31 14 -97 -24 -120 151 215 -68 134 214 -283 -120 -10 -58 -271 30 192 52 120 -15 20 93 381 212
5285B12j88j56K00O3j28k84K63K10m04L11k12n3J44J66k38L20l73P1K76k88K95
$$ 212 24 -132 68 131 3 -281 -18 192 -212 99 -113 -166 -22 144 -94 226 -147 -76 200 -88 207
5306B07l00Q5o5J16k45K02J2k63J60k1j0L05j83r5L5K09j96L84J5j90q4j25j96
$$ 207 -93 -8 -73 43 -202 0 12 -251 -91 -112 -122 183 0 -95 -60 149 -47 337 352 162 78 -47 -243
5329b43K03L94n77L21J65k52j30k6L41j47j24J58l1j27J59L3L6J76l58J97l34
$$ -243 -40 354 -223 98 263 11 -119 -145 196 49 -75 83 52 -75 84 117 153 329 -29 168 -166
5350a66J26J25O0l19J67j18J09j22J22j64J08M6j42K57j39J3L5O9j60K39R7l69
$$ -166 -40 85 145 -174 -7 -125 -16 -138 -16 -180 -72 -26 -168 89 -50 -37 -2 67 -93 146 243 -126
5372a26J45J46M6j72O9Rk8O2k79R2l8J76k16J09J13j32j65K74l13M52k56N1m74
$$ -126 19 165 211 39 108 117 89 151 -128 -36 -74 102 -114 -5 108 -24 -189 85 -228 224 -32 19 -455
5395d55O04r4r1q2o9K94J58l74K00k4l79K64J65m9Nk34K40l13L42j87J80kp7L5
$$ -455 149 55 -36 -118 -187 107 265 -109 91 67 -312 -48 117 68 73 -161 79 -234 108 -79 101 99 22 57
5419E7j12K00k28P6l5K05j63K32k69j32L5J35L8j26k30L90K1k29K8O7K3J19M5
$$ 57 -55 145 -83 -7 -42 163 0 232 -37 -169 -134 1 39 -87 -317 73 94 -135 -107 -40 -17 102 147
5442A47j7k66M02M5j69k61r5M88l82J0K82j6k47N0J4Q5Q7n8j35j53J97O9k9N2
$$ 147 130 -136 266 311 142 -119 -214 274 -108 -98 184 168 -79 -29 -15 70 157 99 -36 -189 8 77 48 100
5466A00N8k25L29j09J37k85J27Ok69J90j25J20m23N86j32o2n2P9k52K07J01oK7
$$ 100 158 -67 262 153 290 5 132 138 -131 59 -66 54 -369 217 85 23 -29 50 -202 5 106 100 127
5489A27j89K58r1K19j92j84J68q3J78j18q7j83L6P4m2K40L1j92j3J96r0O1k18
$$ 127 -62 196 105 324 132 -52 116 33 211 93 6 -177 -141 -67 -109 131 162 -30 -43 153 63 124 -94
5512i4k89L62R3o5P8l2J68m81N09n8J08k05o1q8j02Q5PL4J57R1R2k56O4j91L49
$$ -94 -383 -21 72 7 85 53 221 -260 249 191 299 94 33 -55 -157 -72 -65 -31 126 217 309 53 117 -74 275
5537B75l59j32L49q1n7l2m6j36M58k26L22n15R8J01J03l22K72n2n1k3mo7J41l6
$$ 275 -84 -216 133 52 -5 -37 -83 -219 239 13 335 -180 -82 19 122 -200 72 20 -31 -54 -58 -125 16 -20
5561b0J27J08j47p5J70p9q2J53k89K77Kl11M36k18K2l6r3j7J01K04m69J31o2L09
$$ -20 107 215 68 -7 163 84 2 155 -134 143 145 -166 270 52 74 38 -55 -72 29 233 -236 -105 -167 142
5585A42j30m35M07J6J88q2l58R2J80M06m83J74k8R6k63l6lL18k22p8J02P7j29
$$ 142 12 -423 -16 0 188 106 -252 -160 20 426 -57 117 89 185 -78 -114 -117 201 -21 -99 3 80 -49
5608d9J00L7L2K22o16L11n1j84l1k7K60J61k9k03K3K25j79J1k19K80lp0L2j25
$$ -49 51 88 120 342 -274 37 -14 -198 -229 -256 4 165 136 -67 -44 181 2 13 -206 74 71 1 33 -92
5632i2J28L7j81K2R5J48j37j00N4J72j41j43l5M42k47K3J5n0k11K03l43J61M45
$$ -92 36 73 -108 -86 9 157 20 -80 -26 146 5 -138 -173 269 22 45 60 10 -201 2 -341 -180 265
5655B65k53Qj27K57j17P5j47KJ21m03M29l20J36n5L15o4j41j84J65j93O7N7J69
$$ 265 12 20 -107 150 33 108 -39 -37 84 -319 110 -210 -74 -129 186 122 -19 -203 -38 -231 -164 -107 62
5678F2M4j46j55j14L17MM4k27M02k5k22n9J31k28K08N7K50k70j45j60n0M9M09
$$ 62 106 -40 -195 -309 8 12 56 -171 231 206 -16 -75 56 -172 36 93 343 73 -72 -232 -282 -233 176
5701A76o0j03J4j94K68O2k03Q0l6K01l51K90l3J78j27n0q6p2J31J49m7j5K3k26
$$ 176 116 13 27 -167 101 163 -40 40 4 205 -146 144 111 289 162 112 26 -46 85 234 187 172 195 -31
5725c1M9j28N9l1K18j50o6o0J57N4J38k74N8l09K25J95J98o95L77QP1J40l20J88
$$ -31 18 -110 -51 -82 136 -14 -80 -140 17 71 209 -65 -7 -316 -91 104 302 -393 -16 -8 63 203 -117 71
5749G1j7j22p0J20J49l24J86p5L53m28M21k12o5n7j5J10k08J76P9Q3k18m0M5o1
$$ 71 54 -68 -138 -18 131 -193 -7 -82 271 -157 264 52 -13 -70 -85 25 -183 -7 72 155 -63 -103 -58 -119
5773a19j38O68l31j27j67N50k56j8j50K22L5o34N93%nqm13K54L59k70o2L9J72
$$ -119 -257 411 80 -47 -214 336 80 62 -88 134 169 -465 128 128 123 115 -298 -44 315 45 -17 22 194
5796A94r0k1J58n31N25Rq8J96l15m5L1k63L32j99Mj42L6J65J18n8j80j6J54L8
$$ 194 104 83 241 -290 235 244 156 352 37 -8 23 -240 92 -107 -103 -245 -209 -44 74 16 -164 -180 -26 12
5820A2L95j37k74K25j68j56K6j10L26o9kLJ04j70n8k2L2J14k91L32r3o4k7J33
$$ 12 407 270 -4 221 53 -103 -77 -187 139 70 68 71 175 5 -53 -75 -43 71 -220 112 19 -45 -72 61
5844F1m1j95L6L05j14rl2j52K36k6k65L12j95L81n5j91k5N6J64j66l15L38Ml88
$$ 61 20 -175 -139 166 52 43 11 -141 95 69 -196 116 -79 302 247 56 31 87 251 85 -230 108 112 -276
5868b76K94J27j66j67K78l29K67k86L03o6J46k98L64m16N10l05Kl1K51k54K20
$$ -276 18 145 -21 -188 90 -239 28 -258 45 -21 125 -173 191 -225 285 -20 -18 -49 202 -52 168
5889A68K9R1n72M11k8l55J81J9o6N3M4J9N5j55M7N3j09r6M83l27R5J6J61k79L08
$$ 168 197 288 -284 127 99 -256 -75 -56 -122 -69 -25 -6 49 -106 -59 -6 -115 -211 272 -55 40 56 217 -62 246
5914B46l93J86K92k70M8L5j19qk40L17q3J74r6k06J50k04J82o7J4J53q5j78L18
$$ 246 -147 39 331 61 109 144 25 17 -223 94 11 185 89 -117 33 -171 11 -56 -42 111 26 -152 166
5937A66n8l74J11j92K54J8q4L32j6o0l9j64p6j3K23k84K57p1R4P0J18j97J5q8
$$ 166 108 -266 -155 -347 -93 -75 -159 173 157 97 58 -106 -182 -195 28 -256 1 -70 24 94 212 15 30 -58
5961e8j3k81N77j94r2L19k70r3j7J97k00o0J60L1j16m6L03k05j72P1J37r3Q3R8
$$ -58 -71 -352 225 31 -61 258 -12 -105 -122 75 -125 -185 -25 6 -110 -156 147 -58 -230 -159 -22 -115 -32 66
5985F6P0k53J72r9J23J26l30k2L90l95J20L6j13M09m75L64k03J87k45Q4n0J77
$$ 66 136 -117 55 -44 79 205 -125 -147 243 -152 -32 4 -109 300 -175 189 -14 173 -72 12 -38 139
6007A39l89L32l23M35l6j50j84J44L06k69J85k79J36j76K69n7J75j88m9Q0J97
$$ 139 -250 82 -241 194 158 8 -176 -32 274 5 190 -89 47 -129 140 83 258 70 21 101 298
6028B98m34J51Q3k44j2LQ0k4J71k38K33k29K54J35j67m4N7n1p2o6N9J13J33m8
$$ 298 -136 15 98 -146 -158 -155 -75 -99 72 -166 67 -162 92 227 60 16 73 22 -50 -116 -57 56 189 141
6052A41k87J88L2l62L44r7j30J41o4K06R1n10P73o16K74j87p6J32j38K38k17J62
$$ 141 -146 42 74 -288 56 -41 -171 -30 -94 112 203 -307 466 -150 124 -63 -139 -7 -145 93 -124 38
6074C8J62j56P6j02k63K67K56l06k16L87Pj91J32n6q6j16J38J35l49J46M7lJ01
$$ 38 200 44 120 18 -245 22 278 -28 -244 143 150 -41 91 35 -51 -167 -29 106 -243 -97 -50 -53 48
6097D8k49L37k67R2o8R3J42l43N75l19R0j46K53k29j96K29J4j59K0mN9l9o8m0
$$ 48 -201 136 -131 -39 -107 -14 128 -215 360 41 131 -15 238 9 -187 42 56 -103 -83 -87 -28 -67 -135 -175
6121a75J18J61q3N7J56k79O2r1K65j59K46k34r2j60M46j18m4k44K41l12J12J55
$$ -175 -57 104 21 78 234 -45 17 -74 191 32 278 44 -48 -208 238 120 76 -168 73 -239 -127 28
6143B8j9L5l07L57jj92M9J73Jk89J33R3p6p3L16l19k64N00k40O6K45m27K40L97
$$ 28 9 44 -263 94 93 -99 -50 123 124 -165 -32 61 -15 -88 228 -91 -355 145 -95 -29 216 -211 29 426
6167D26m36J21j12L9J22l69M88m8p6N1k09mk52R0M4K22k40L24k45P7k68K84L7
$$ 426 -10 111 -1 38 160 -209 279 231 155 206 -3 -7 -259 -169 -125 97 -143 181 -64 13 -255 29 66
6190F6j19m1P6P7J55N8m28K98j92LM0j51J92q8L34l96K55j11j05lJ74Q3pk35j39
$$ 66 -53 -94 -18 59 214 272 -156 142 -50 -47 -7 -158 34 -54 280 -116 139 28 -77 -80 94 177 170 -65 -204
6215b04M29n9k5j61J6j0j45L48l06K38n5k97L28k77J75O6j23l50K62K96k38k2
$$ -204 225 166 141 -20 -4 -14 -159 189 -117 121 66 -231 97 -180 -5 61 -62 -412 -150 146 -92 -114
6237a14J17J79k95R2n2j1K22p8r3l2K96l98J69l9J57p7L3k76K32j65K53k40K5
$$ -114 3 182 -113 -21 -73 -84 138 60 -33 -65 231 -167 2 -37 120 43 76 -200 32 -133 120 -120 -95
6260i5L15J05k90Jk63j35L24pQJ07r9J86l12N8K07k29K18k04JJ53k86N16j44j43
$$ -95 220 325 35 36 -227 -362 -38 -45 -37 70 -29 157 -155 -97 110 -119 99 -105 -104 49 -237 279 135 -8
6284hn3J35P2k4k42M9L10k93K59m11L01N3k88K4J16qj54L91K7n9k52K45k01J9
$$ -8 -61 74 146 122 -120 -71 239 -54 205 -206 95 148 -140 -116 0 -8 -162 229 256 197 -55 190 -11 8
6308Hk05n2N9M55l94qJ21k1L01m17K78j16j11J85n8j86J00R8k1M3m1q0J42k47
$$ 8 -197 -249 -190 265 -129 -137 -16 -37 264 -153 125 9 -102 83 25 -161 -61 37 16 59 18 -62 80 -167
6332a67K27q0J60j85k02M45K2l29L66l18K20j29o2R3q0L7n5k27Q5K68m9m04K73
$$ -167 60 -20 140 -45 -247 198 220 -109 257 -61 159 30 -32 61 -19 18 -37 -264 -179 89 40 -364 -91
6355i1M57l92L0J20k08J43o6J01j27K5r1p3L6L19l45K91M1j02j94NP5j3J69J41
$$ -91 366 -26 4 124 -84 59 -7 94 -33 -8 -99 -172 -136 183 -162 129 170 68 -126 -121 -46 -59 110 251
6379B51k89m7j65M48k75k68J57Q2Q8M42n31K13j61J12K08l74J07j2J63j02j1Q
$$ 251 -38 -85 -250 198 -77 -345 -188 -106 -18 424 -107 106 -55 57 265 -109 -2 -14 149 47 36 44
6401D4L0k22O3k37K12K32N5j2o13N00l47O57l71P7J25j15l28K42lR2k06K31j1
$$ 44 74 -148 -85 -322 -110 122 177 165 -448 52 -295 362 -9 68 193 78 -250 -8 -11 81 -125 106 95
6424I5J01k62K17j68R1Q0k88J28q0J66N3k10J81j11P9j10j31M09q1J49k31kq9
$$ 95 196 -66 151 -17 74 154 -134 -6 -86 80 133 -77 104 -7 72 -38 -169 240 159 308 77 75 -14
6447a4L9J0l28L48j05k6n6O7K24k26j48rJ30Q1j87K25j19pL7k13L00k06L66j34
$$ -14 25 35 -293 55 -50 -76 -132 -65 159 -67 -215 -224 -94 -13 -200 25 -94 -101 -64 -277 23 -183 183 49
6471D9j17R6K42l47o0J35j68L46k82K88k10o4O8J82k53K95k68K55k05K54q7k40
$$ 49 -68 28 270 -77 -137 -2 -170 176 -106 182 -28 -92 -24 158 -95 200 -68 187 -18 236 149 -91
6493i1o8%j81L57j38K31k14o2J70j35L29k13j98K57J09j23p9R2k65L88j14J17
$$ -91 -159 -159 -340 17 -121 110 -104 -166 4 -131 198 -15 -213 44 153 30 -49 43 -222 166 52 169
6515A69k00j00L47k00j24J37N1j20K79l34n4J27J28k64J37n4n1J99k50J6K20J3
$$ 169 -31 -131 216 16 -108 29 80 -40 239 -95 -149 -22 106 -158 -21 -75 -126 73 -177 -161 59 72
6537G2J64l24J82jk4k8j70N1R5R0M9q5q3o5J27mM4mK25l13Kj48L37j39Q7r8l09
$$ 72 236 -88 94 93 69 41 -129 -78 17 107 156 71 -12 -77 50 46 90 86 311 -2 0 -148 189 50 137 39 -270
6564b70N12m50K40Q7j19j85P9J2K75m61L29j23R0j12j25J98J10J3J38j88j44N3
$$ -270 242 -208 32 119 0 -185 -106 -94 181 -280 49 -74 16 -96 -221 -23 87 100 238 50 -94 -41
6586d1l3m5K78j86j60K63J26k03p9R9rO3o4j46J32j25N23m38O4n1OJ72p7J37j64
$$ -41 -74 -119 159 -27 -187 76 202 -1 -80 19 10 73 9 -137 -5 -130 393 -45 19 -32 -26 146 69 206 42
6611D2m7m9K98k43J86k73pJ14j12J93R1j69l0J21M8p6K07k85J61j80K6Kj50J28
$$ 42 -5 -54 244 1 187 -86 -93 21 -91 102 193 24 -6 115 163 87 294 9 170 -10 16 18 -132 -4
6635dl42J99j51J71q1L31l82N17o09N10j74J99l64K02J26j68p0K31J27l56O6K0
$$ -4 -346 -147 -298 -127 -208 123 -259 258 -351 159 -15 184 -180 22 148 -20 -90 141 268 -88 -22 -2
6657bk31N4RJ86P6j30q7K55j43K00j42o5n4p6Q9K00p5k50K7L44l7j41k97O23k93
$$ -2 -233 -179 -170 16 92 -38 -125 130 -13 187 45 -20 -74 -150 -61 139 64 -186 -159 185 148 7 -290 333 40
6682D0n2J27j45j41J96K39j77M6k85J85P7k0m72M92J3m02J71M5P7k83J88M2R1
$$ 40 -12 115 -30 -171 25 264 87 133 -152 33 110 90 -382 110 123 -279 -108 -63 14 -269 -81 -39 52
6705E2j11J98p5J2j11K92k52j32J6oL44k97Q2P5J43l05J80l59K06j12L98k29K0
$$ 52 -59 139 64 76 -35 257 5 -127 -111 -117 227 -70 12 87 230 -75 105 -254 -48 -160 238 9 29
6728B9o1k03K17K45k89j44L49j68K0J12Q3j91K62k26j6L9j19R9m8O8Q3M8l12J92
$$ 29 -32 -235 -18 227 -62 -206 143 -25 -5 107 190 -1 261 35 19 58 -61 38 -10 58 141 189 -123 69
6752F9q0J89k8n5j85j64L59k71K30j61L79j37j71l46M12m06R3L57k19K19o0K08
$$ 69 -11 178 150 95 -90 -254 105 -166 64 -97 282 145 -26 -372 40 -366 -273 84 -135 84 24 232
6774B32n05L16q5p1P4L2rK22k88j37K35k40K64o0Pj03m2M48j83l05K09Kr2O4K2
$$ 232 -273 43 -42 -113 -39 -7 -16 206 -82 -219 16 -224 40 -20 -13 -116 -158 290 107 -198 11 13 -79 -15 7
6799GQ8j0Op2j09j85L32l90M80l85L23n5p8MR5P7K7j89q6J36k87O4K00r5R3p2
$$ 7 95 85 91 19 -90 -275 57 -333 147 -238 85 30 -48 -44 51 128 155 -34 -120 16 -271 -207 -7 -102 -9 -81
6825h1R7m0J24j97K63m2l89O19m59J92j85P0l6K05j73j64J58j75P0J91J28m60
$$ -81 16 -24 100 -97 166 124 -265 354 -105 87 -98 -28 -64 141 -32 -196 -38 -213 -143 48 176 -284
6847b84K46J8j82K31J91m49P7M9K35r8k21K58k36K70j59J84M4l50K18P7j45M3
$$ -284 -38 -20 -202 29 220 -229 -152 -103 132 34 -187 71 -165 105 -54 130 174 -176 42 119 -26 17
6869A7k06L75j59n0Km9k41R6J41K04j66k6J55q9Q5k44kJ14J11j72J38j49M67k30
$$ 17 -189 186 27 -23 -21 -70 -311 -215 -74 130 -36 -62 93 4 89 -155 -157 -43 68 -104 34 -115 352 122
6893A22k32j6K91l0p3m8K1j37J78j12q9JQ1J17k76N7K39k9M9p8j28J94k55K6J02
$$ 122 -110 -126 165 135 62 14 35 -102 76 -36 -125 -124 -43 74 -202 -145 94 65 114 36 -92 102 -153 -127 -25
6918b5j18J37J83j42l2L63n23J33K81l49K31j73n4K02l8m93M46r8J23k56L24l49
$$ -25 -143 -6 177 35 3 366 -157 -24 257 -92 139 -34 -88 114 76 -417 29 -69 54 -202 122 -227
6940b27R3L13k93L77j53L2R8m97R4J40M4K13N0k53j21K50k92J01ll8j01N4L24
$$ -227 -134 179 -114 263 110 142 240 -257 -163 -23 21 234 284 31 -90 160 -132 -31 -34 -72 -173 -119 205
6963B05n4k07K45l40N7N0J9J46k00n2J37J60m14P2kM03j23j72R3j2K14l86K30
$$ 205 151 -56 189 -151 -94 -44 -25 121 -79 -131 6 166 -248 -176 -178 225 102 -70 23 11 225 -161 69
6986F9J17k09r7j33K85nk28J28J24l4o6J28p9Q2j58O7L0J85q1r1K97l73J10j35
$$ 69 186 -23 -120 -253 32 27 -201 -73 51 17 -49 79 0 82 -76 -9 21 206 125 34 331 -42 68 -67
7010f7q2K30K0k34J49o5O3j12RJ39n3K63L0l86rqNK09j30M0P3j76k23N08j48O5
$$ -67 -149 81 101 -133 16 -49 14 -98 -89 50 -3 260 290 -96 -105 -113 -108 101 -29 11 84 -92 -315 193 45 110
7036A10K01k24L9K94l51j46l2J82J65m57M07o1m19J26J15Q3k48K00j03J77k14
$$ 110 311 87 126 420 69 -77 -109 73 238 -219 188 127 -292 -166 -51 32 -216 -16 -119 58 -156
7057a56M3j4J74k46J18o6K19j31M0jj36N46m09m2K4M3m3o0k8K20j30j72L17o0
$$ -156 -113 -127 47 -199 -81 -147 72 -59 -19 -20 -156 390 -19 -61 -37 6 -37 -97 -125 95 -35 -207 110 50
7081E0J25k2k06J70j70J0K38l83K95J66l02J11l62K64k0Q8N5J39m21M55l92o7
$$ 50 175 153 -53 117 -53 -43 195 -188 107 273 -29 82 -280 -16 -36 52 107 246 -175 280 -112 -179
7103a79K52l28k4Q9M44j62nK71k91o8J48k46L46o7lL0k91O9j54L16j09J02N3k77
$$ -179 73 -255 -279 -190 254 92 87 358 67 -1 147 -99 247 180 177 207 -84 -15 -169 147 38 140 193 -84
7127h4r9L7l0L45N4j98l5L0l05K29j50L07j9m1n6OJ9j04k26L15K3l6J42j37P8
$$ -84 -183 -146 -176 169 223 25 -10 20 -285 -56 -206 101 82 41 -15 -9 10 -94 -320 -5 18 -18 124 -13 65
7152F5J67l68L14j23j01J12l13L05k36K8J99J15j52R1J25n5k7j08J36k52pJ71
$$ 65 232 -136 178 55 -46 66 -247 58 -178 -150 49 164 12 103 228 173 146 38 174 -78 -85 86
7174H6Q8Q1J30m03k92L96p3k75J81O2Q3k67J60q7P5K70l89L54j59J6N7j17J13
$$ 86 174 255 385 -18 -310 86 13 -262 -81 -19 64 -203 -43 -130 -55 215 -174 180 21 37 94 -23 90
7197I0j19J18n7o3olK4j15J59L7r0L11l37o3P2J36j91M51n37J17J2j62K56j65
$$ 90 -29 89 32 -31 -37 -40 -16 -131 28 65 -25 286 -51 -114 -42 94 -97 354 -183 -66 -54 -216 40 -125
7221a25J66l9J83j32Q5Q7j1l28Q9j33qm4L03l83J69J50N0Kk48J99l9n3J14M7l
$$ -125 41 2 185 53 138 225 214 -114 -25 -158 -166 -210 93 -290 -121 29 79 81 -167 32 -7 -60 54 101 98
7246I8L3lk18j13K95L13k62n99M68J7J69k44l22K03N9L7J90O7k94O5J95l13M2
$$ 98 131 128 -90 -203 92 405 143 -456 12 29 198 -46 -368 -165 -106 -69 121 188 -106 -41 154 -159 -117
7269a17m4K39l2j00j94J86J34j58J88j69J53j48K1J16R1j46M3K03l22R7K99n57
$$ -117 -161 78 46 -54 -248 -62 72 -86 102 -67 86 -62 -41 75 166 20 63 266 -56 41 340 -217
7291b17k3K24r3N3Q3j3L5j04K02l11L91m3r7j17k0r6K57j65k3k9P3M43l51l30
$$ -217 -240 -16 -109 -56 27 14 49 -55 147 -164 227 184 87 -30 -50 -146 111 -54 -77 -106 -33 410 59 -271
7315b71K83J14o7J9j59J15oJ53j50j71J04J8k31K80j5q7P5j86K22j75J55O7k67
$$ -271 12 126 59 78 -81 34 28 181 31 -140 -36 -18 -249 31 16 -71 4 -182 40 -135 20 87 -180
7338a80J53qN4J61k48o8N2m4J82J46j80k36L79j21n9j23J06K70j07j13k6o7r2
$$ -180 -27 -35 19 180 -68 -136 -84 -128 54 200 20 -216 163 42 -17 -140 -34 236 129 16 -10 -77 -169
7361a69Q0J79m8q4K61l56K09k51L7J96J08m0k65J43L1j50L01k36J10k83nK41j80
$$ -169 -89 90 42 -42 219 -137 72 -179 -142 54 162 122 -143 0 31 -119 182 -54 56 -227 -232 9 -171
7384a71r7J85o0L2k9R5K3mJ9j44J51L50l86N0j51j45L43j49m3J08j88J4J97J28
$$ -171 -268 -83 -143 -111 -140 -45 -22 -26 -7 -151 0 350 -36 14 -137 -282 61 -88 -131 -23 -211 -197 0 128
7408A28l93L46Q9j60N8Lj91l3J96j81J92j38J38K7q0J1J97m35O5j5L59k54j88
$$ 128 -265 81 170 10 68 71 -120 -153 43 -138 54 -84 54 81 1 12 209 -226 -161 -176 183 -71 -259
7431b59J34K12J6k6m6k38M1J81j44l8K74j54J89j8k0k4j76O0k8R3l35K67j25K58
$$ -259 -125 87 103 77 31 -207 -166 15 -129 -167 107 -47 142 124 104 80 -96 -36 -64 29 -306 -39 -164 94
7455I4j52J3K01j23k0L14l98K16l6j1j45J90j53k6j24K00Ko6m7l9J96j48M28m93
$$ 94 -58 -45 156 33 13 327 -71 145 109 98 -47 143 -10 -36 -160 40 42 -24 -71 -110 86 -62 366 -127
7479a27M53m35PQ5m8o0J39l92N07j23Q6k0k53J92q6j06M2p2R3J19j52J48Q3O2
$$ -127 326 -109 -102 -17 -65 -125 14 -378 129 6 92 72 -181 11 -75 -181 -139 -211 -118 1 -151 -3 80 142
7503A42P0j45k03J68j15J75k61K30j14q8L04J58l05j36K6J82K7r8n3J66k06MJ94
$$ 142 212 67 -136 32 -83 92 -169 61 -53 -141 163 321 16 -120 -94 88 115 17 -36 130 -76 -72 122
7526A22k55K65k1k3k22K78j9j88K4K1k96K76L37l34k34K51m0O7r3P5j97M84j86
$$ 122 -133 132 111 88 -134 144 125 -63 -39 -18 -314 -38 299 -35 -269 -18 -58 9 -84 -9 -206 278 92
7549I2j31r9K09k64K25O2L1k53M5O9k24M36P6j97k52l0L40L6j79J86k82p7O1J18
$$ 92 -39 -138 71 -193 32 94 125 -128 -83 -14 -238 198 274 77 -175 -205 135 171 -8 178 -104 -181 -120 -2
7573bm1L4o2j20J95j06q9P9J05J14r0L0j86N4p4K96j94k1J99j26K34j07k53J04
$$ -2 -43 -9 -71 -191 4 -102 -191 -112 -7 107 17 47 -139 -85 -159 137 -57 -78 121 -5 229 122 -131 -27
7597b7J62j09r5K83j78R1J63k64r3q5L1J43l03N28j75J42l9k40m6p0K56l8J89
$$ -27 135 26 -69 214 36 127 290 26 -67 -152 -121 22 -281 247 72 214 175 -65 -111 -181 75 37 226
7620B26k91J03P0j27K32l01K65j97%j94J14J38k32L23k9j03k2J85j43N7o7k6n7
$$ 226 -65 38 108 -19 213 -88 177 -20 -20 -214 -100 38 -194 129 100 -3 -25 160 17 74 7 -19 -76
7643g6k1j8K47r5k0q4n4MK14k1j06j09K83j94J53R5j96Rm7M6J15k56l21M59n0
$$ -76 -97 -115 132 37 17 -67 -121 -117 97 76 -30 -139 144 -50 103 198 2 11 -36 10 125 -131 -452 7 -43
7668d3M4n2j72N1LL64J18l58J64j7l0k0k39J24J57j86p7M85l79J64q1O2j45P0
$$ -43 1 -51 -223 -172 -169 195 313 -45 119 102 72 52 -187 -63 94 -92 -169 316 -63 101 20 82 -63 7
7692GQ6K35k03n5j44K00k47m1L10k26m9M91n95L14R3l02K8J20J90k14j76J66J38
$$ 7 93 328 125 70 -74 126 -121 -162 148 -78 -127 364 -231 83 176 -126 -98 22 212 -2 -178 -12 126
7715A26j52J5Q5j96P4J45j8N4l3j16j09P2K48l2k04j55K63r2k99K08L65l23J70
$$ 126 -26 -11 74 -122 -48 97 79 133 100 -16 -125 -53 195 163 -41 -196 67 -25 -324 -116 249 -74 96
7738I6j54K8j51K32J23j20q6J07O3j1k50L01k53j76M11M3l32R9K29j32M5m5j83
$$ 96 -58 -30 -181 51 174 54 -32 75 138 127 -123 178 -75 -251 160 203 -129 -30 199 67 112 67 -116
7761a16J43l9L18m75K59l3k12L42k37J86m2j14L07o9j23M8j19J8j5o3N1p2K98
$$ -116 27 -12 306 -169 90 57 -155 187 -50 136 94 -20 287 218 95 143 24 42 27 -36 15 -57 241
7784B41j13J31l09Q6J35m11K13K58l09K17j6k08K08k26j35K21K42l27J22k05K59
$$ 241 128 259 -50 36 171 -240 -27 231 -78 139 123 -85 123 -103 -238 -17 225 -102 20 -185 74
7805G4j23j26L67p8j38J49j46j45K71k18Q7J49p0n6K0Q4j53R5m6J1J18nj46j18
$$ 74 -49 -175 192 114 -24 125 -21 -166 105 -113 -26 123 53 -3 17 101 -52 43 -3 8 126 121 -25 -143
7829a43j48L02j00K41l84K16J9k07MK66n6j32K52l17K08J48j80K64k66j73J47
$$ -143 -291 11 -89 152 -232 -16 3 -204 -200 66 10 -122 130 -187 21 169 -11 253 -13 -186 -39
7850c9J44m9j39J25q4J52J37m09J54j0J22j79J2J44j36l54K12J12J56mP5k77L28
$$ -39 105 56 -83 42 -42 110 247 -162 -8 -18 104 -75 -63 81 -55 -409 -197 -85 71 67 142 -135 193
7873A93m43K54K00j99m6P1j2J40m9n31N24j67p4J03J80l39P9Q7j8Qr2o2L45k69
$$ 193 -250 4 204 5 -41 30 18 158 109 -422 102 -65 -139 -36 144 -195 -116 -29 -47 -39 -131 -193 152 -117
7897a17q8J24M7J10k73J03K29nl26L04k8J0r9K17j9q1j03JL47m93J9L5K54Rl39
$$ -117 -205 -81 -34 76 -197 -94 135 130 -196 108 80 90 -9 208 189 108 5 6 353 -140 -121 -86 168 177 -162
7922a62K32j26M89o41L1K40m9O5j6J14k50O5K09l14J32j5L1j28R8O6k73J19K59
$$ -162 70 -56 433 -208 -177 63 14 79 63 177 -73 -8 201 -113 19 4 35 -93 5 71 -202 -83 176
7945A76l83K59k48l1M0L04oj20o9M16j37j33J55o6r6J22j55K03J11l75k23J16
$$ 176 -207 52 -196 -227 -187 117 111 -9 -78 338 201 68 223 157 61 183 28 231 342 -33 -256 -140
7967a40L50k02o8j5j0M5O6q9Q4m8R0M3l7j67L52k28l0K0r6J44k16K1L30k26O5
$$ -140 210 8 -60 -75 -85 -40 26 -63 21 -27 63 106 69 -98 254 26 -4 16 -80 64 -152 -131 199 -27 38
7992C8Lj03J88o1j31l4r3J03r9L18j60N8r0j54M70j88l5M7j7K3j4P6n7m55P04
$$ 38 41 -62 126 65 -66 -100 -193 -90 -189 129 -31 27 -63 -217 253 65 30 77 60 83 69 145 88 -367 337
8017C37l97N4K10k00j83M14k99J02l42K59K26l92J62Q5m3O2o5l88J49J11RK44
$$ 337 -60 -6 204 4 -179 235 -64 38 -304 -45 181 -211 -49 36 -7 55 -10 -398 -249 -138 -129 115
8039A15j88M5k7J1k3j85N23j93j44Q2Qm3j16J98J18j06K83k93n5Q0Kk70L19N4
$$ 115 -73 -28 -55 -44 -67 -252 271 78 -66 16 24 -19 -135 63 181 75 358 65 10 90 92 -178 141 195
8063A95j15L82m47p7J12r1O2l29Q6L57k73J28RQ6j86mJ8R0j18J78N1R4o3jj9p0
$$ 195 80 462 15 -62 50 -41 21 -308 -222 135 -138 -10 -1 85 -101 -105 -87 3 -115 63 114 208 145 144 125 55
8089E5J62j62Q9l16J59j61M3J60lm3J59j5j65J05J47J5l43O9j46K32q2p8K54k30
$$ 55 217 55 144 -172 -13 -174 -131 29 26 -17 142 127 -38 67 214 229 -114 -45 -191 41 -41 -119 135 -95
8113i5j90L87J25k06m05M06nN0k94J36m8p5L89l51J85O5k1n1J63o24N34J6mj84
$$ -95 -285 102 227 21 -384 22 17 67 -227 -91 -139 -214 175 -176 9 74 53 2 165 -459 75 91 87 -97
8137i7r6l8K73j96J50LK52j35j53J75qp0j30L73j33k11J33l13M6K28K0j39K67
$$ -97 -193 -231 42 -154 -4 -1 251 116 -37 138 130 60 -70 303 170 -41 92 -221 -175 53 73 -66 201
8160B01j76k7j70L7L32l33n3K90J86l56p2p5J42j47J51m2K9q9M33k8J4n66Q3J40
$$ 201 25 -2 -172 -135 197 -136 -189 101 287 -69 -141 -216 -74 -221 -70 -112 -83 -172 261 233 247 -319 -236 -96
8184i6J57Kl3k07K12n2K98
$$ -96 61 63 30 -177 35 -17 281
8191B81
$$ Imaginary data points
##PAGE= N=2
##DATA TABLE= (X++(I..I)), XYDATA
0@%%%%%%%%%%JrJ6j6J7k5L2m0N6o4P2q8J06j30J53j77K08k41K78l21L68m20M80
$$ 0 0 0 0 0 0 0 0 0 0 0 1 -8 8 -8 9 -16 16 -24 32 -32 40 -48 58 -72 81 -96 112 -129 149 -172 196 -224 256
33B56n44O14o92P78q72R76j090J213j350J499j660J838k032K244k476K727l002
$$ 256 -288 326 -366 412 -460 516 -574 639 -711 788 -872 966 -1066 1178 -1298 1429 -1573
50a573L307l644M016m430M891n411N999o670P445q352R434j0748J2382j4477J7280
$$ -1573 1734 -1910 2106 -2324 2567 -2844 3155 -3515 3930 -4422 5012 -5736 6646 -7831 9449
65I449k1242K7310l7880O1497k10647K9905K39272k59898R5412K50247k2774j06322
$$ 9449 -11793 15517 -22363 39134 -171513 -141608 97664 -162234 -66822 183425 160651 54329
77E4329J11344K0879j18560j21758K5352R543j39232p2102J56767K3068n6976
$$ 54329 165673 186552 67992 -53766 -28414 -18871 -158103 -230205 -73438 -50370 -107346
88a07346J09916J00900k0572M7234J4800m3076j1933q0696q2744N6379o1563j40675
$$ -107346 2570 103470 82898 130132 144932 101856 89923 9227 -73517 -17138 -78701 -219376
100b19376J10890J07610r6495N0082J62676k9216l4632R5493o530j14283l1233
$$ -219376 -108486 -876 -97371 -47289 115387 86171 51539 147032 140502 26219 -5014
111e014K7200m9270j05764k089Q7873k7494k5573J22812M0922o0991Q7680O9343
$$ -5014 22186 -27084 -132848 -134937 -47064 -74558 -100131 22681 63603 2612 90292 159635
123A59635j07072k9411M6842p3353n2894J2359n0812j564N7330j3387R570Q0457
$$ 159635 52563 23152 69994 -3359 -56253 -43894 -94706 -96270 -38940 -52327 -42757 37700
135C7700L901q990O1751r45p4693m097L2544m4326q4357N411O0927m3248l8351
$$ 37700 41601 32611 94362 93417 18724 14627 47171 2845 -81512 -76101 -15174 -58422 -96773
148i6773J02884L3023q7053P3722J10365j02933n7258J14246l0475j17441L6936
$$ -96773 6111 39134 -47919 25803 136168 33235 -24023 90223 59748 -57693 -20757
159b0757K5298p5133J951N7342j8359j5547M5993M0399m975o702J2562K211j9961
$$ -20757 4541 -70592 -68641 -11299 -29658 -45205 788 41187 36212 29510 42072 44283 24322
172B4322M42j9477m8958J3198K0639m6742M580N6643k9244n94Q3073j6868n7433
$$ 24322 24764 5287 -43671 -30473 -9834 -56576 -51996 4647 -24597 -25191 57882 41014 -16419
185a6419O9613K2096q1962J752L0938n6169k0395M2636k0728l5463L7996M5509
$$ -16419 53194 75290 -6672 -4920 26018 -30151 -50546 -7910 -28638 -64101 -26105 19404
197A9404j4000p884L9215J5814l4794J2199J9908o2057k3003N0610l6004n7221
$$ 19404 5404 -2480 36735 52549 17755 29954 49862 -12195 -35198 15412 -20592 -77813
209g7813N4002J8232m1849M7724M0627m8453K5651N7029m2862l2758L1843k1701
$$ -77813 -23811 -5579 -47428 296 40923 -7530 18121 75150 32288 -470 31373 9672
221I672m2939J5802K765l9417K571M9718N617k8485L1046N2030l2801j5422M8514
$$ 9672 -33267 -17465 -14700 -54117 -51546 -1828 3789 -24696 6350 58380 25579 10157 58671
234E8671k9532o1495M4843O842q4044J3413N6577m1002n504O2901j3501j7113
$$ 58671 29139 -32356 12487 19329 -64715 -51302 5275 -35727 -41231 21670 8169 -8944
246h944N4710J0000m7035O544J8384l2798k5693J1877q200k9683J8835L6215k1716
$$ -8944 45766 55766 8731 15275 33659 861 -24832 -12955 -21155 -50838 -32003 4212 -17504
259a7504j0653O1267J0798m0018K5888K0996n3731qL1606n2225l0935M5946q690
$$ -17504 -28157 33110 43908 3890 29778 50774 -2957 -2965 28641 -23584 -54519 -8573 -17263
272a7263k8661M0873J2509k2379L5723L2061l9617o826L6557k0255m7467J5588
$$ -17263 -45924 -5051 7458 -14921 20802 52863 13246 6420 42977 22722 -24745 -9157
284i157J3767m7454o719N8139j4137m8867O1811N1942o0858n922P2303l3323n8160
$$ -9157 4610 -42844 -49563 8576 -5561 -54428 7383 59325 -1533 -7455 64848 31525 -26635
297b6635M6213Q922p4436M754M8417k7267k5360L7153K2140j2999J1387J6854
$$ -26635 19578 28500 -45936 -41182 7235 -20032 -45392 -8239 13901 902 12289 29143
309B9143n451o133M407j2174j3597m128j4098q480K2502l905l0202L6726M3850
$$ 29143 23692 17559 21966 9792 -3805 -7933 -22031 -30511 -8009 -11914 -42116 -5390 38460
322C8460l9837j0331O6216j7490o2588M2465K9965q2112j2896P1133k6014o3082
$$ 38460 -1377 -11708 54508 37018 -25570 16895 46860 -35252 -48148 22985 -3029 -66111
334f6111N0068N0745m8702q399O4014m443n0711K6851L2325m8201k8803L6404
$$ -66111 -16043 34702 -14000 -22399 41615 37172 -13539 13312 45637 -2564 -31367 5037
346E037n195l3732J2789J5259q444J2681J1065p054J8044N957k5152J0124J9346
$$ 5037 -158 -33890 -21101 -5842 -14286 -1605 9460 2406 20450 26407 1255 11379 30725
359C0725m4237j6506M4120j2437n3188L2608M5779m1727j6096O3409L330n8234
$$ 30725 -13512 -30018 14102 1665 -51523 -18915 26864 -14863 -30959 32450 35780 -22454
371b2454K7506N0906n3883m1611O0036J376o8250K0599M9599m1604j6474N3849
$$ -22454 5052 55958 2075 -39536 20500 21876 -46374 -25775 23824 -17780 -34254 19595
383A9595o02l3847K4140K0620k4337m287P268r727n210M098j2166k183J5970k699
$$ 19595 18993 -14854 9286 29906 5569 1282 8550 -1177 -6387 -2289 -14455 -16638 -668 -3367
397c367j2342K0370J5752k5801J598L6574j9661l9996L8843J6179n8310M363N3455
$$ -3367 -15709 4661 20413 -5388 -3790 32784 13123 -26873 11970 28149 -30161 -25798 27657
410B7657l5545l3837N5913J0211n1551K2202M2161l5248k0538L8210p85l9264
$$ 27657 -7888 -41725 14188 24399 -27152 -4950 37211 1963 -18575 19635 18850 -20414
422b0414J3049K3169k5332j3671L0957j425k5617J9978J7597k6670M936K5647
$$ -20414 -7365 15804 -9528 -23199 7758 6333 -19284 694 18291 -8379 -3443 22204
434B2204k4522r245K9525j3883k6373L0518L215l4626J7949K5057l1736l367L4417
$$ 22204 -2318 -11563 17962 4079 -22294 8224 11439 -23187 -5238 19819 -11917 -15284 19133
447A9133j1850k5569K4160J5849l0723k952L0114j0740k9397K4006J5231l3863
$$ 19133 7283 -18286 5874 21723 -9000 -11952 18162 7422 -21975 2031 17262 -16601
459a6601J867L4540k3293j9805L7308j128l1337K1802J7100l0830O490K3382k3402
$$ -16601 -14734 19806 -3487 -23292 14016 12888 -18449 3353 20453 -10377 -3887 19495 -3907
472c907j0553K7154j0737k0914J9577R083k3873N156K6138j5332j7471K8693J0398
$$ -3907 -14460 12694 1957 -18957 620 9703 -14170 -9014 17124 1792 -15679 13014 23412
485B3412l7134O623L3473k9366k4818M1824m091m4856K8683L2179m1353l875M5928
$$ 23412 -13722 -7099 26374 -2992 -27810 14014 9923 -34933 -6250 25929 -15424 -19299 26629
498B6629j5517k5976K9545O664l3186O232J9507j9481j7045K0926N022j9832R410
$$ 26629 11112 -14864 14681 21345 -11841 -5609 13898 -5583 -22628 -1702 3320 -16512 -7102
511g102J9675j4361l500K9332j0947k4769K3944N619l6673J2103J9147l4093j776
$$ -7102 12573 -1788 -5288 24044 13097 -11672 12272 17891 -18782 -6679 12468 -21625 -23401
524b3401L7626j7130k1061L6087P818k6452J2386J8481k2338r429J8481n770k7370
$$ -23401 14225 -2905 -23966 12121 19939 -6513 5873 24354 2016 -7413 11068 5298 -22072
537b2072Q290J9544j6677r754K8302k60k0652K8376J3530l7454Q633L0748l5326
$$ -22072 -13782 5762 -10915 -20669 7633 7373 -13279 15097 28627 -8827 -194 30554 -4772
550d772j6547L3214j5353k9987L2476J0231l2109J3276L2175j3938j4144J9866
$$ -4772 -21319 11895 -3458 -33445 -969 9262 -22847 -9571 22604 8666 -5478 14388
562A4388N526j9841k085J5129j7211k0044K0225P903k6497J0008K3719j7703L897
$$ 14388 19914 73 -2012 13117 -4094 -24138 -3913 3990 -22507 -12499 11220 -6483 -2586
575b586K7569k0290j1379L3726j4847l0969K3926M342l6671J4852K3626k9614
$$ -2586 24983 4693 -6686 27040 12193 -18776 5150 9492 -27179 -12327 11299 -18315
587a8315o828L9706J483k7221J2137K6670j6763k0886K4964K385m0097N696L5243
$$ -18315 -25143 14563 16046 -11175 962 27632 10869 -10017 14947 17332 -22765 -17069 18174
600A8174l0584k3008M0522N538k8618K2103J5331k0415J0083J2800k0024l663
$$ 18174 -12410 -35418 5104 10642 -17976 4127 19458 -957 9126 21926 1902 -1761
612a761P628j5657J109R711j8141p022K7478O029k1196P781K9233j0342k3972
$$ -1761 5867 -9790 -8681 1030 -17111 -24133 3345 9374 -11822 -4041 25192 14850 -9122
625i122K5505J2155m5828k611M6689l0977m5869M7767K5994n2245R059N0555k2509
$$ -9122 16383 28538 -17290 -19901 26788 -4189 -50058 -2291 23703 -28542 -19483 31072 8563
638H563k4215M0384Q007m1966P21K5776j4355k5997R703J0299j1162J057J5829
$$ 8563 -15652 24732 32739 -9227 -8506 17270 2915 -23082 -13379 -3080 -14242 -13185 2644
651B644k335k15J4354K99n533M137q722r397J4150j0403k9081J6060K2414k5567
$$ 2644 309 94 14448 14747 9214 13351 4629 -4768 9382 -1021 -30102 -14042 8372 -17195
665a7195k316L3850n978j8995K9489J2867l5775j179K9021j7218l2573J7296J2435
$$ -17195 -19511 14339 8361 -10634 18855 31722 -4053 -5232 23789 6571 -26002 -8706 3729
678C729k4637R18K8147j0713j2268K9503J0830k4811L813J5491j5743p737P822
$$ 3729 -20908 -19990 8157 -2556 -14824 14679 25509 698 4511 20002 4259 -3478 4344
691D344j4961j0910J7446r19j2749J3873J1861j1412J1016J7535j9439j1416K6747
$$ 4344 -10617 -21527 -4081 -5000 -17749 -3876 7985 -3427 7589 25124 5685 -5731 21016
704B1016m747l8362R408K4049k7030j2527L6528n141k9934L0315L1752l5849j2675
$$ 21016 16269 -22093 -12685 11364 -15666 -28193 8335 3194 -26740 3575 35327 -522 -13197
717a3197M0189n328l7417J4530J6811l2628o366L0180p826k5186K2529K0329j6010
$$ -13197 26992 21664 -15753 -1223 15588 -17040 -23406 6774 -1052 -26238 -3709 16620 610
730F10k251J6709n808n810R121q538j4371P104J813j1609O511M296j1742Q480
$$ 610 -1641 15068 9260 3450 12571 4033 -10338 -3234 -1421 -13030 -6519 -2223 -13965 -5485
744e485K3263j3561j4074K4033P485k6537K058J7652k0073j3806K3866j454k9276
$$ -5485 17778 4217 -9857 14176 21661 -4876 -2818 14834 -5239 -19045 4821 3367 -25909
757b5909J4565K6916j5940j1697K3661J157j5754J2674O614k2971j783J6602j0756
$$ -25909 -11344 15572 -368 -12065 11596 12753 -3001 9673 16287 -6684 -8467 8135 -2621
770b621j2217R819J480p068J2876L897j2795Q743J7231j3714r270J4451n457j7318
$$ -2621 -14838 -5019 -3539 -10607 2269 6166 -6629 2114 19345 5631 -3639 10812 5355 -11963
784a1963J4040N954k9270K780L1748j1611k3359K7328J3963k7213O481K8949k4316
$$ -11963 2077 8031 -21239 -18459 13289 1678 -21681 5647 19610 -7603 -1122 27827 3511
797C511k1609K9553M161l6116L413K6982j4821j2928K1524L750j7295J4335J5972
$$ 3511 -18098 11455 15616 -20500 -17087 9895 -4926 -17854 3670 7420 -9875 4460 20432
810B0432j6750r569J5878k782j3729N872k416j2748J0491J1294j6093J276J9532
$$ 20432 3682 -5887 9991 7209 -6520 -648 -3064 -15812 -5321 5973 -10120 -8844 10688
823A0688m914q474J5366k351j6974J0681R987k2661q033J9718l499j4044J2131
$$ 10688 5774 -2700 12666 10315 -6659 4022 14009 -8652 -16685 3033 -466 -14510 -2379
836b379Q681j4903P704K0348j3002j5503J9673K675k2544N131J1978k0001l019
$$ -2379 6302 -8601 -897 19451 6449 -9054 10619 13294 -9250 -4119 7859 -12142 -15161
849a5161K4059r320j8148K1133J4342k0013J015J6461j0424j0177J5187k802k0860
$$ -15161 8898 -422 -18570 2563 16905 -3108 -2093 14368 3944 -6233 8954 6152 -14708
862a4708O180J5325j1002q045J4865O1p973J1951M759j6547N345J2844j3265q319
$$ -14708 -8528 6797 -4205 -12250 2615 2676 -5297 6654 11413 -5134 211 13055 -210 -8529
876h529J3126o685j0284J6270O22j9366J1094J9659j6508q205J9319k116j8710
$$ -8529 4597 -2088 -12372 3898 4520 -14846 -3752 15907 -601 -8806 10513 8397 -10313
889a0313J3037J1577k3668n904K6734m639k4485J4810J6897j9961k681K2311j0285
$$ -10313 2724 14301 -9367 -15271 11463 6824 -17661 -2851 14046 -5915 -8596 13715 3430
902C430j5806J8352P487k2016J058J4795o929n913Q545l686o000J0291K194j0696
$$ 3430 -12376 5976 13463 -8553 -7495 7300 371 -5542 3003 -683 -6683 3608 5802 -4894
916d894K706Q094q441L42R959q783r546J7366L400k1808N539J9238j4564j0949
$$ -4894 -2188 5906 -2535 -2193 7766 -1017 -10563 6803 10203 -11605 -6066 13172 -1392 -12341
930a2341K1139k695k1109J4218J8409k3455q015K4437j419k0171J1223J0715j8188
$$ -12341 8798 6103 -15006 -788 17621 -5834 -13849 10588 9169 -11002 221 10936 -7252
943g252o45J8512p931j6026J4623P673j3854L56J1590q284k414J1639n809j0315
$$ -7252 -7897 10615 2684 -13342 1281 8954 -4900 -4544 7046 -1238 -3652 7987 2178 -8137
957h137J0442M313j2306L231P116r946o99J5281q033j2244J3644Q234j7054J979
$$ -8137 2305 6618 -5688 -2457 4659 -5287 -5986 9295 1262 -10982 2662 10896 -6158 -4179
971d179J5124j1580r790J8486j095k1049J0418J6556j6523q440J9554k555j4497
$$ -4179 10945 -635 -10425 8061 6966 -14083 -3665 12891 -3632 -12072 7482 4927 -9570
984i570J2246R026j8066KJ7429o979j3818J0450N627j3371L544R879r972m578
$$ -9570 2676 11702 -6364 -6362 11067 4088 -9730 720 6347 -7024 -3480 6399 -3573 -8151
998h151J5070k949j1111R414N351j1351L929P888j2534k988J5005n563j3809J1162
$$ -8151 6919 3970 -7141 2273 7624 -3727 202 8090 -4444 -7432 7573 2010 -11799 -637
1012f37O249j2334K948J3836j0209p553J5839K883j8330L900J3816j2655q336
$$ -637 5612 -6722 -3774 10062 -147 -7700 8139 11022 -7308 -3408 10408 -2247 -10583
1025a0583J4313k179j4792J2872R558j4510l98J6536o348q065J0320j358j2150
$$ -10583 3730 1551 -13241 -369 9189 -5321 -5719 10817 4469 -3596 6724 5366 -6784
1038f784O747N601j3502p12J1762m753o941J2534K044j0993P080J2372j4469p319
$$ -6784 -37 5564 -7938 -8650 3112 -1641 -8582 3952 5996 -4997 2083 14455 -14 -7333
1052g333J6373l595j8488J0086R839j8388Q81K0257p893j3438J8482O995j6267
$$ -7333 9040 5445 -13043 -2957 6882 -11506 -10625 9632 1739 -11699 6783 13778 -2489
1065b489J872J2857j1340q856J1044j359j3875N334J0683q708k068J2514j37p830
$$ -2489 -617 12240 900 -7956 3088 1729 -12146 -6812 3871 -4837 -6905 5609 5472 -2358
1079b358J0074K303j2822L120P941j2788n090J1377n646q226J2794L630j1488
$$ -2358 7716 10019 -2803 317 8258 -4530 -9620 1757 -3889 -12115 679 4309 -7179
1092g179Q154J1179r226m424J0952m162j0869N614K860j1891p51J2118m439p662
$$ -7179 975 12154 2928 -1496 9456 5294 -5575 39 2899 -8992 -9743 2375 -2064 -9726
1106i726J2091N735j1417O160J0625j2086o133J4341o487j5810J0614O025j5528
$$ -9726 2365 8100 -3317 2843 13468 1382 -4751 9590 3103 -12707 -2093 3932 -11596
1119a1596L106J4809q421m587J3991K301j1739N281P301j0211n504Q609m166j0208
$$ -11596 -8490 6319 -2102 -6689 7302 9603 -2136 3145 10446 235 -5269 3340 -826 -11034
1133a1034P248N822j0279K859J3279o974m110J3479j758j3541R952M866j7171
$$ -11034 -3786 2036 -8243 -5384 7895 921 -3189 10290 8532 -5009 4943 9809 -7362
1146g362k64J3540j0648r769J5340L396j3547O882J4626r418o647J3166P77j6052
$$ -7362 -7626 5914 -4734 -14503 837 4233 -9314 -2432 12194 2776 -3871 9295 10072 -5980
1160e980L906R718j1742p737J2315m29j0710Q684P747p485J937R080n608k698
$$ -5980 -2074 7644 -4098 -11835 480 51 -10659 -1975 5772 -1713 224 9304 3696 998
1174I98N743l764p426M935j321q878M916O491q373L94J3490l424p742J1578M886
$$ 998 6741 2977 -4449 486 -835 -9713 -4797 1694 -6679 -6285 7205 3781 -3961 7617 12503
1189A2503j5003P96J1581r990j2036J1620K733j4268L881J4673p624o159J6003
$$ 12503 -2500 -1704 9877 -113 -12149 -529 2204 -12064 -8183 6490 -1134 -7293 8710
1202H710J961j3111N398R363j2076n975Q801n272r847Q685L437q846N265J0058
$$ 8710 10671 -2440 2958 12321 245 -5730 3071 -2201 -12048 -3363 74 -8772 -3507 6551
1216F551n503n15J0070l818o774N927l63j2703J505O578p849n083J1261J604p651
$$ 6551 1048 533 10603 6785 11 5938 5575 -7128 -5623 955 -6894 -11977 -716 888 -6763
1231f763R325R912j0612k114J3120o112j2796P151K367j4963K315J0259p708l669
$$ -6763 2562 12474 1862 -252 12868 6756 -6040 1111 3478 -11485 -9170 1089 -6619 -10288
1245a0288J4072J656p348P334O313p550k042N600p681p985N506R72r962L613Q681
$$ -10288 3784 5440 -1908 5426 11739 4189 2147 7747 66 -7919 -2413 -1441 -11403 -7790 891
1260H91m841K32J3019k243q197J0383L274j4946m10R359j1867p686J0988k38j0635
$$ 891 -3950 -3718 9301 7058 -1139 9244 12518 -2428 -2838 6521 -5346 -13032 -2044 -2282 -12917
1275a2917R922J1229q526j368J2862j320r918N165K014j1949l020R117o287p877
$$ -12917 -2995 8234 -292 -1660 11202 9882 -36 5129 7143 -4806 -7826 1291 -4996 -12873
1289a2873R566M956o918N794Q613o074m97Q648n605r044N484q59r187J867M071
$$ -12873 -3307 1649 -5269 525 9138 3064 2567 11215 5610 -3434 2050 1191 -7996 -6129 -2058
1304b058p025K578J0632j848n509R193M656q292K54N740p971p793Q242j208j1389
$$ -2058 -9083 -6505 4127 2279 -3230 5963 10619 2327 2581 8321 350 -7443 799 -409 -11798
1319a1798M212J0484o791j845J1384J24o110Q104J979j0900K78N687p144n524
$$ -11798 -7586 2898 -3893 -5738 5646 5770 -340 7764 9743 -1157 -879 4808 -2336 -7860
1333g860N894k839m170Q202M007p017L901R616n207n162Q216j318j1388M003N264
$$ -7860 -1966 -4805 -8975 -773 3234 -3783 118 9734 4527 -635 7581 6263 -5125 -1122 4142
1348D142j1964m163J4907k378j0855J0168R014j0488J910J2242p987r830J0122
$$ 4142 -7822 -11985 2922 544 -10311 -143 8871 -1617 293 12535 4548 -5282 4840
1361D840K015j3981M23P830n568m722R225J664n833N628P762o792k592P014k621
$$ 4840 6855 -7126 -6703 1127 -4441 -9163 62 1726 -4107 1521 9283 2491 -101 6913 4292
1376D292o827L644j411q559M827N288o974m05R709j835k729P466L82q019L868
$$ 4292 -2535 1109 -302 -8861 -4034 1254 -5720 -6125 3584 1749 -980 6486 6868 -1151 2717
1391B717M189q382m008N271j203n717M050L143m596K660R206l978n380P690J854
$$ 2717 6906 -1476 -5484 -213 -1416 -7133 -3083 60 -4536 -1876 7330 3352 -2028 5662 7516
1406G516q902K233L635j0008j674R748m946p750R828M644p027K978P595n653k409
$$ 7516 -1386 847 4482 -5526 -7200 2548 -2398 -10148 -320 4324 -2703 275 7870 2217 -192
1421a92P099k272r665K657N728p203l377O513p43n342R032M183q514K165R190
$$ -192 6907 4635 -5030 -2373 3355 -3848 -7225 -712 -1455 -6797 2235 6418 -2096 69 9259
1436I259o433m896O695l515p547N354K299r470K396R252l456m232Q369J769o289
$$ 9259 2826 -2070 4625 1110 -6437 -1083 1216 -8254 -5858 3394 -62 -4294 4075 5844 -445
1451d45L781N011q844m952R059j500j0615L650O841p437P00R561k544n597Q551
$$ -445 3336 8347 -497 -5449 3610 2110 -8505 -4855 1986 -5451 -4751 4810 2266 -3331 5220
1466E220K323p774N27L778m671k668L320l921l092O042K541m795K148N494k442
$$ 5220 7543 -231 296 4074 -597 -3265 55 -3866 -6958 -916 1625 -3170 -1022 4472 2030
1481B030j100O379l866p539N631K833r993o25P768m088m009Q377J672p464O179
$$ 2030 930 7309 3443 -4096 1535 4368 -5625 -6250 1518 -2570 -6579 1798 3470 -3994 2185
1496B185O861p490m355P503j614p658K805K798p482O72Q744l268m953P151M025
$$ 2185 9046 1556 -2799 4704 3090 -4568 -1763 1035 -6447 -5775 2969 -299 -5252 1899 5924
1511E924o040K032M036o145j661N537m210o862O000K648o213K732N220m189k0
$$ 5924 -116 1916 5952 -193 -1854 3683 -527 -7389 -1389 1259 -4954 -2222 2998 -1191 -1211
1526a211P917j940q170M655M119p071k177N598l649m976P401K473p335K368Q547
$$ -1211 6706 4766 -3404 1251 5370 -1701 -3878 1720 -1929 -6905 496 2969 -4366 -1998 6549
1541F549m907l925O271l57p036M373K379q314q0P720l027m130N246Q10l407L453
$$ 6549 1642 -2283 3988 3631 -3405 968 3347 -4967 -5047 2673 -354 -4484 762 1572 -1835 1618
1557A618L439n873j374O100k027n606L527J955n308J810M923n229k542Q660j51
$$ 1618 5057 -816 -2190 3910 1883 -3723 -196 1759 -3549 -1739 3184 -2045 -4587 4073 3922
1572C922p991M036N404o882o7O331m890n874P439K524p547N71O342l749k524N402
$$ 3922 -4069 -33 5371 -1511 -1578 4753 -137 -6011 1428 3952 -3595 -3024 3318 -431 -2955 2447
1588B447n94n221L664M119n771j439N352j438m086M041l1n374L914M258n800j592
$$ 2447 1853 -3368 296 4415 -1356 -2795 2557 1119 -2967 1074 1043 -4331 -417 3841 -1959 -3551
1604c551O537k187l374N280O21o727L172N478o329l975P001l20o374L801L935
$$ -3551 2986 799 -2575 2705 3326 -3401 -229 5249 -1080 -5055 1946 1626 -4748 -947 2988
1619B988n480r19Q745l160o331N523M276o998o42M899m080l351N588K17o066L466
$$ 2988 -2492 -3411 5334 2174 -4157 1366 5642 -1356 -1998 2901 -1179 -4530 1058 1275 -4791 -1325
1635a325M464l568o26M685k290k270L876l08o149K068L689m199j994M349l12l495
$$ -1325 3139 -429 -1055 3630 1340 -930 2946 2638 -3511 -1443 2246 -1953 -3947 402 90 -3405
1651c405N270K064n634Q09O472m144l796M559j225n746L716L123o138K08P103
$$ -3405 1865 3929 -1705 -896 5576 1432 -2364 2195 970 -4776 -1060 2063 -4075 -3867 3236
1666C236k078m136N777P34m645K555L108o065k316N425m85o569L277M121m510
$$ 3236 1158 -2978 2799 3533 -1112 1443 4551 -1514 -3830 1595 1110 -5459 -2182 1939 -2571
1681b571K44O626k319m806O314J845p378O56N107n645j893M812k065l955N170
$$ -2571 -2327 4299 1980 -2826 3488 5333 -2045 -1389 3718 -1927 -3820 992 -1073 -5028 142
1696A42K694m912J553M563k309k304M146j655n143K313L860n857k403N991k30
$$ 142 2836 -2076 -523 4040 1731 -573 3573 1918 -3225 -912 2948 -2909 -5312 679 449
1711D49m895N154M209o976J454P252m865n643O573n6o661J435L919m576n26N059
$$ 449 -4446 708 4917 -2059 -605 6647 1782 -3861 2712 2656 -4005 -2570 1349 -3227 -3753 1306
1727A306n58k533L012K482k497k90J246j225k278J499m08l358J118K926k666Q00
$$ 1306 748 -1785 1227 3709 1212 922 2168 943 -1335 164 -244 -3602 -2484 442 -2224 -1424
1743a424M054k485j217O008j942n879M707J743o553j25N604n118k535O548N21
$$ -1424 2630 145 -1072 4936 2994 -2885 1822 3565 -2988 -3113 2491 -2627 -5162 1386 1907
1758A907n511L218N000l306k862M121J186n890R02M203m709l479O899p01n965
$$ 1907 -3604 -386 4614 1308 -1554 2567 3753 -2137 -1235 2968 -1741 -5220 1679 978 -4987
1773d987M634L906n443J818M896m677j909N251k280m731L858L31m062J546L279
$$ -4987 -353 3553 -1890 -72 4824 147 -1762 3489 1209 -3522 336 667 -3395 -1849 1430
1788A430k637j429M400J265m107Q98M126l016l292M310j14o491L239M440o117
$$ 1430 -1207 -2636 1764 3029 -1078 -180 3946 930 -2362 1948 1834 -4657 -1418 3022 -3095
1803c095n81O763k775k895N090L26m425K767K114m076n65K296j141k288J800M54
$$ -3095 -3676 3087 312 -2583 2507 2833 -1592 1175 3289 -787 -1352 944 -197 -2485 -685 -231
1819b31k008J155K839j296j627L503K20l537J443K930n294m77M922l794l916O454
$$ -231 -2239 -1084 1755 459 -1168 2335 2555 -982 461 3391 -1903 -2380 2542 -1252 -5168 1286
1835A286j26n078M026L712n036M33N246k678l618K901P92m234j87L136j389k995
$$ 1286 1160 -3918 108 3820 -1216 -783 4463 1785 -1833 1068 1860 -2374 -2561 575 -814 -3809
1851c809L350K927m024J081M877l192k290M914k184m647L419J051o198K258L830
$$ -3809 -459 2468 -1556 -475 4402 1210 -1080 3834 1650 -2997 422 1473 -4725 -2467 1363
1866A363l754m23N624j421k621L934J088l557o51K814k131l460J863K212m449
$$ 1363 -2391 -2814 2810 1389 -1232 2702 3790 233 -418 2396 265 -3195 -1332 880 -3569
1881c569Q9N563j859k925N825Q72m695K378K805n432q44L773l713k308L638l73
$$ -3569 -3480 2083 224 -2701 3124 3996 -699 1679 4484 -948 -1792 1981 -1732 -4040 -402 -775
1897g75k805M194J481k274P72K802j433k270J933K47m102o86L608k458k969N010
$$ -775 -3580 614 2095 -179 593 3395 1962 -308 1625 1872 -2230 -2916 692 -1766 -4735 275
1913B75J552n073L120N262n079o84N479l212m686M039L91m899J165K646k415m5
$$ 275 1827 -3246 -126 5136 57 -627 4852 1640 -3046 993 1384 -3515 -2350 296 -2119 -2164
1929b164K860O85j685J530J920j979j147K022j226l573K367O92l880J210M412
$$ -2164 696 1381 -304 1226 3146 1167 20 2042 816 -2757 -390 302 -3578 -2368 2044
1944B044l564r08N700j308l317M464O59n266J088K505l282j669K365p14j474J559
$$ 2044 -1520 -2428 3272 1964 -1353 3111 3770 -1496 -408 2097 -1185 -2854 -489 -1203 -2677 -1118
1960a118K131j029L29K191j56k595J519J485l994m44K686l065j747N011r55l755
$$ -1118 1013 -16 313 2504 2348 -247 1272 2757 -1237 -1681 1005 -2060 -3807 1204 249 -3506
1976c506M457K180m359K089L736m209k001L935j250m653K157K313k832j274L657
$$ -3506 951 3131 -1228 861 4597 388 -1613 2322 1072 -3581 -1424 889 -1943 -3217 440
1991D40P59l133K643L484m026j417M502j458m617K873J130m636J375L292k982
$$ 440 1199 -1934 709 4193 167 -1250 3252 1794 -2823 50 1180 -3456 -2081 1211 -1771
2006a771n65M477j063j755L049Q9k748J563L06k633j306K572n73k382J554K294
$$ -1771 -2336 2141 1078 -677 2372 2461 -287 1276 1582 -1051 -2357 215 -358 -2740 -1186 1108
2022A108j942J0M274j609l052K897J676m801Q1L245l626j637L757n88l300L849
$$ 1108 -834 -824 3450 1841 -1211 1686 3362 -1439 -1358 1887 -1739 -3376 381 -207 -3507 342
2038C42J823k648L73K744j339j009J257o27k642L94J635j617j211K241K93j528
$$ 342 2165 -483 -110 2634 1295 286 1543 916 -1726 -1332 303 -1314 -2525 -284 9 -1519
2054a519L005Q31k921J298K771l431j840L479j884l092L247R72m296J846M270
$$ -1519 1486 2317 -604 694 3465 34 -1806 1673 -211 -3303 -56 916 -3380 -1534 2736
2069B736k347k223L575O25k532N8K806l372k121L470K82l682J026L205k408o83
$$ 2736 389 -1834 1741 2366 -166 -108 2698 -674 -2795 675 957 -2725 -1699 1506 -902 -1585
2085a585L351n97k368L269J5l662J149K116k978m40K380j942j068K998N03k415
$$ -1585 1766 1169 -1199 2070 2085 -1577 -428 1688 -1290 -1730 650 -1292 -2360 638 1141 -1274
2101a274J077J994j198j248K103n90k438J253K137l499j100M376j256l049L057
$$ -1274 -197 1797 599 -649 1454 864 -1574 -321 1816 -1683 -2783 1593 337 -2712 345
2116C45J533l139J479K764l104j268K862m42k823J557L78j807O43J769j268q59
$$ 345 1878 -1261 218 2982 -122 -1390 1472 1030 -1793 -236 142 -1665 -1022 747 -521 -1380
2132a380K220R12k499Q61J754j613j359K797j272l693L235J655l520j2M019k407
$$ -1380 840 1752 -747 114 1868 255 -1104 1693 421 -3272 -37 1618 -1902 -1914 2105 -302
2148c02j191L798n14l392K019K064l013q01K240j130j376J369K96j356O08K384
$$ -302 -1493 2305 1791 -1601 418 2482 -531 -1332 908 -222 -1598 -229 67 -1289 -681 1703
2164A703j220j692K419O48k353J205P27k812k06L235j824k727L288L75k370K017
$$ 1703 483 -1209 1210 1858 -495 710 1437 -1375 -1581 1654 -170 -2897 391 766 -1604 413
2180D13K087k905L0K657j112l094K210J071k404o47J913o17j735L029P35k766
$$ 413 2500 -405 -375 2282 1170 -1924 286 1357 -1047 -1694 219 -398 -2133 896 1631 -1135
2196a135P18K627j653j138J909q98k272K548P0l049J004K299j627n61K490r93
$$ -1135 -417 2210 557 -581 1328 430 -1842 706 776 -2273 -1269 1030 -597 -1158 1332 339
2212C39j150K135O59k956k45K567q71k307J649P15k276J212K620k320j789L525
$$ 339 -811 1324 1983 -973 -1218 1349 478 -1829 -180 535 -1741 -529 2091 -229 -2018 1507
2228A507P3k586J485J103k748M67K519k462j372K536N17k580P95J656j045l7K004
$$ 1507 1580 -1006 479 1582 -1166 -699 1820 -642 -2014 522 1039 -1541 -746 910 -135 -172 1832
2245A832j575j461J698J068k413p6J784j225j170K419k15k764K014K348k974n24
$$ 1832 257 -1204 494 1562 -851 -927 857 -368 -1538 881 666 -2098 -84 2264 -710 -1234
2261a234L137j522j675K346j80k765J371K061k105r50J888K51j905J467J176j717
$$ -1234 1903 381 -1294 1052 872 -1893 -522 1539 -566 -1516 372 623 -1282 185 1361 -356
2277c56m98K883j206k139J573Q93k351J82J921k059l37K712p89k074K301O88j697
$$ -356 -854 2029 823 -1316 257 1150 -1201 -1019 902 -1157 -1494 1218 429 -1645 656 1344 -353
2294c53L39J360j918l35J935n01k333J291J297j695J03J774m93j277K046L55k694
$$ -353 -14 1346 -572 -907 1028 527 -1806 -515 782 -913 -810 964 471 -806 1240 1595 -1099
2311a099M28K430k401j059K400m57k240K219J259l006Q29K573j525r16J858o25
$$ -1099 -671 1759 -642 -1701 699 242 -1998 221 1480 -1526 -697 1876 351 -565 1293 668
2327F68j746Q04J617k487o32K492j98j983J017J814j905L66K390j395k564L172
$$ 668 -1078 -274 1343 -1144 -1776 716 518 -1465 -448 1366 -539 -173 2217 822 -1742 1430
2343A430L7k859N03J720k109o7K396p50k039K029J608k093J30J108n46j538J532
$$ 1430 1467 -1392 -889 831 -1278 -1345 1051 301 -1738 291 1899 -194 -64 1044 498 -1040 492
2360D92j80j474L23J793j672r32K179J14j326J327N82j898P92J483j680r42J791
$$ 492 312 -1162 -839 954 -718 -1650 529 643 -683 644 1226 -672 120 1603 -77 -1019 772
2377G72r71j102J251L05j502R58J646j447n10J591j0j374J166K38j851l60K128
$$ 772 -199 -1301 -50 255 -1247 -289 1357 -90 -600 991 981 -393 773 1011 -840 -1200 928
2394I28j148j732J874P21j572P83J839j973l06K301n70k631J705R55k162l91J779
$$ 928 -220 -1952 -78 643 -929 -146 1693 -280 -586 1715 1145 -1486 219 1174 -988 -1379 400
2411D00q95j034J974P86k152Q88K036j387j289J808l77k076J196O08j760n19K548
$$ 400 -495 -1529 445 1231 -921 -33 2003 616 -673 1135 758 -1318 -122 486 -1274 -1793 755
2428G55j169r72J946N10j456J014J086j941j58J221l08k227J155R20j672M35J793
$$ 755 -414 -1386 560 1070 -386 628 1714 -227 -385 836 528 -1699 -544 376 -1296 -861 932
2445I32r96q91J949O40j676L20J238k005l44J407n47k027J779N25j509Q82J296
$$ 932 -64 -955 994 1634 -42 278 1516 -489 -833 574 27 -2000 -221 304 -1205 -323 973
2462I73j039m3J522q02r14O84L91j374l84J467j174j006J818K50j422J290J429
$$ 973 -66 -109 1413 611 -303 381 772 -602 -986 481 -693 -1699 119 369 -1053 237 1666
2479A666j566n71K060j024j498J072O42k300L98J626q14j115J884M21j688J244
$$ 1666 100 -471 1589 565 -933 139 781 -1519 -1121 505 -309 -1424 460 881 -807 437
2495D37J059j683J9J572j048j569J167L88j579M22J184r49l21K021l1j794J267
$$ 437 1496 -187 -168 1404 356 -1213 -46 342 -1237 -815 369 -580 -901 1120 1089 -705 562
2512E62Q65j759q5J369j276r44J349Q8j567P40J111o39l04J694k43j581J234L99
$$ 562 1427 -332 -417 952 -324 -1268 81 169 -1398 -658 453 -186 -490 1204 961 -620 614 1013
2530A013j638j30J580j379o68J247j89p48R13Q59r42m47J747n00j308J185K02
$$ 1013 -625 -755 825 -554 -1222 25 -164 -912 1 860 -82 -529 1218 718 -590 595 797
2547G97j679K31J346j561p18K112r6j493J211J070j504j1J629j076j412J699j05
$$ 797 -882 -651 695 -866 -1584 528 432 -1061 150 1220 -284 -295 1334 258 -1154 545 440
2564D40j457j37J848j316o35J699j72r99J035P84j061k4Q37m89j267J406m60q67
$$ 440 -1017 -1154 694 -622 -1257 442 270 -729 306 1090 29 5 842 353 -914 492 32 -835
2582h35L89R49j181p8J429o26o24J508K06j470M28R87j270j259J959k18j587Q94
$$ -835 -446 503 -678 -756 673 47 -577 931 1137 -333 95 1082 -188 -1447 512 294 -1293 -399
2600c99R48r53j34J407k91j114J057O64j808L48J079j094p12J443n71r21J159
$$ -399 549 -404 -538 869 578 -536 521 1185 -623 -275 804 -290 -1002 441 -130 -1051 108
2617A08P99j471L80J237p40l44J019k52j647Q03N05j198n08J977o93j415J647
$$ 108 907 -564 -184 1053 313 -31 988 736 -911 -108 397 -801 -1309 668 -25 -1440 207
2634B07J032j685J60J763r76j153J113O68k347P49Q10j058n74J648o9q09R23M02
$$ 207 1239 -446 -286 1477 501 -652 461 1129 -1218 -469 341 -717 -1291 357 288 -521 402 804
2652H04o25j2P09n33q88N16j65j090J020N54j057M94R98n01m53J426k65j443O45
$$ 804 179 167 876 343 -545 -29 -194 -1284 -264 290 -767 -273 725 224 -229 1197 932 -511 134
2671A34J012j799n10J668n91j380J559O80j239J62J641q10q83J256J15j641L20
$$ 134 1146 -653 -1163 505 -86 -1466 93 773 -466 -304 1337 527 -356 900 1015 -626 -306
2688c06O50p47l04Q23j3r52P16N89q35O40O86q82j91J036p55j060J093J58j220
$$ -306 344 -403 -707 116 103 -849 -133 456 -379 261 947 65 -126 910 155 -905 188 346 -874
2707h74j00J525q01l95J378O7j610P59J324j285m89J203l65j304O66J205j528
$$ -874 -974 551 -250 -645 733 800 -810 -51 1273 -12 -501 702 337 -967 -301 904 -624
2724f24q6J491k06j394J314J50o42JM63o50m61R60k74p29N11O07q89N46M13m96
$$ -624 -710 781 575 -819 495 645 3 4 467 -183 -644 316 42 -687 -176 431 -458 88 501 5
2744Em06J054l78j040J000O93j676L89J254p84j412J430N89j500N73J014q03m21
$$ 5 -401 653 275 -765 235 928 -748 -359 895 111 -1301 129 718 -782 -209 805 2 -419
2762d19J091J46j674Q64R02j057l84J017p42l50M81N28q82M21O97o93l31J223
$$ -419 672 818 -856 8 910 -147 -531 486 -256 -606 -125 403 -479 -58 639 -54 -385 838
2780H38k88p71M88j0q15K57Q50p05o48J113j27o27M89O44j185K32J256p28q70
$$ 838 550 -221 267 257 -558 -301 549 -156 -804 309 182 -445 44 688 -497 -265 991 263 -607
2799f07J111K08j459L90J356j096o67J302pj089N07P82n46l26J08J04o20O48p7
$$ -607 504 712 -747 -357 999 -97 -764 538 531 -558 -51 731 185 -141 -33 71 -549 99 22
2818B2o93M63O74m65l74R98l03j032J135J90j215L02R33p47o30J069k60q02P47
$$ 22 -671 -208 466 1 -373 625 322 -710 425 615 -600 -298 635 -112 -742 327 67 -735 12
2837A2P79j335L22J100n37n74M97M79j142M01O79q97p32J055J31r13M92Q72r89
$$ 12 791 -544 -222 878 341 -233 264 743 -399 2 681 -216 -948 107 238 -675 -183 689 -300
2856c00K34O06l52m78Q84k72j108K43J037j047l16J368n87o68R44P49j119J10
$$ -300 -66 540 188 -290 594 322 -786 -543 494 -553 -869 499 -88 -756 188 937 -182 -72
2874g2J144p04r64R02l4r91N98N04r84k92J557m22n24O91N70j029K48M79r14j93
$$ -72 1072 368 -596 306 272 -719 -121 383 -601 -893 664 242 -282 409 979 -50 198 677 -237 -430
2894d30M78k94o39M27M95m76K79Q12p41L0R70N2j304K66M47p66j51O60r3j395
$$ -430 48 -246 -885 -458 37 -439 -160 652 -89 -59 911 963 -341 -75 372 -394 -545 115 22 -1373
2914a373J088N53k87K6P72l05m95P09mj211J73L54m77l76L82L24j62O59K13n01
$$ -1373 -285 268 -19 7 779 474 -21 688 684 -527 -354 0 -477 -853 -471 -147 -309 350 563 62
2934F2L19P08p06m84M06n06n67O51L57j084n8J192l3q06J331J67q94J80L04o48
$$ 62 381 1089 383 -101 305 -201 -768 -117 240 -844 -902 290 257 -549 782 949 55 235 539 -109
2954a09o28Q97j58j348P49O61o76M63Q93m05m39Q05K29j082j07O04q04k31O26
$$ -109 -737 160 2 -1346 -597 64 -612 -149 744 339 -100 705 934 -148 -255 349 -455 -686 -60
2973f0m38j03O62M57j026O22P54m63l95L74k10p60O65L75r31m45R04k02m06R27
$$ -60 -498 -601 61 518 -508 114 868 405 10 384 174 -586 79 454 -477 -922 -18 -220 -626 301
2993C01M92r53J79Q48n95p70Q18J91j127J32P38n30k52P00k08j05K83O58q50M34
$$ 301 793 -160 19 867 272 -498 320 511 -616 -484 254 -276 -528 172 -36 -141 142 800 -50 384
3013C84j89m31P8J86N4p11N54Q8q36O57O07m30j55O92j6p67N64O47j171l70R71
$$ 384 195 -236 -158 28 82 -629 -75 13 -823 -166 441 11 -144 548 532 -235 329 976 -195 -565 406
3034D06n37m22Q95J1j041M16J214q26j78R03l72n71J01P31r27k29Q98o27p25P54
$$ 406 -131 -553 342 353 -688 -272 942 116 -62 841 469 -102 -1 730 -197 -426 472 -155 -880 -126
3054a26N14o38J78Q81p77j87P74k34p38J57N69j061K13O41m15m67P52L03n43J90
$$ -126 388 -250 -72 809 32 -155 619 385 -353 -196 373 -688 -475 166 -249 -716 36 339 -204 -14
3074a4P95n88k90O43k90p45K54L88o36J5N72j54k14N67J05m32L48L41o97q3L49
$$ -14 781 193 -97 546 256 -489 -235 153 -483 -468 104 -50 -264 303 408 -24 324 665 -32 -115 234
3095B34j54q81M56J70l15J19Q24m77l64R58n5n99N27r6m98N4N40p96m52R54p0
$$ 234 80 -801 -345 -175 -490 -371 453 -24 -388 570 515 -84 443 347 -151 -97 443 -353 -805 149 79
3116G9o77N34M43j52k61Q62l04q98R35j12p92K00K60o10k01O01M4l07M57P33m65
$$ 79 -598 -64 379 227 -34 828 524 -374 561 449 -343 -143 117 -493 -694 -93 -49 -356 101 834 369
3137C69m06N33k28l34J87j70o69L11L58l41M6N24J36l30N20J97j087K64O02k52
$$ 369 -37 496 268 -66 121 -49 -718 -407 -49 -390 -344 180 316 -14 506 703 -384 -120 482 230
3157B30n77J99j41k44J43M81k78j31P32p3l22O30j13n04k39M61p90Q2K75K98o67
$$ 230 -347 -148 -289 -533 -390 91 -187 -318 414 341 19 649 536 32 -207 254 -536 -454 -179 119 -548
3178e48K06P29l59n6O57j85n29L61J52p89N9L58m88j93N24M7l70N35N91r32L85
$$ -548 -342 387 28 -28 629 444 -85 276 428 -361 -302 56 -432 -625 -101 -54 -424 111 702 -230 155
3199A55M20l40n19M42k15o92K73M49k57k64P75j77m14Q70Q7j95l51K42m09n27
$$ 155 575 235 -284 158 -57 -749 -476 -27 -284 -548 227 50 -364 506 593 398 47 289 -120 -647
3219f47O72j31k75l6L13m93J72P77k23j81O28n3o42N1N16o65k28O68l24m42M61
$$ -647 25 -106 -381 -417 -104 -597 -425 352 129 -52 576 523 -119 -68 448 -217 -445 223 -101 -543 -82
3240h2M39o21J75O30l48k47L05L25q94K70L40n85k79P04k20k80L95K67m16J93
$$ -82 357 -264 -89 541 193 -54 251 576 -318 -48 292 -293 -572 132 -88 -368 27 294 -122 71
3260G1L51j10m07L9N28r71K81J92k21j79O94l78k88L20N04n77Q9M77o23j6L89
$$ 71 422 312 -95 -56 472 -499 -218 -26 -247 -426 268 -110 -398 -78 426 -151 -62 415 -208 -224 165
3281A65j99l33L61k6Lk37M08J54l95L85K37p40J03M05m37q2O1L89o96M35K13k48
$$ 165 -34 -367 -6 -32 -29 -266 142 296 -99 286 523 -217 -114 291 -146 -228 -167 222 -474 -39 174 -74
3303g4k93N62j07j21Q1J59o29M69K41o65O8M98m7n09K57K22j68K63K67o94J25
$$ -74 -367 195 88 -33 48 207 -422 47 288 -377 -309 189 142 -367 -110 112 -56 207 474 -220 -95
3324i5M37k22o23L49L67m75O8L69k62j77J34K83j69o9N15n50K12o6J34m51M54
$$ -95 342 120 -503 -154 213 -262 -194 175 -87 -264 -130 153 -16 -85 430 -120 92 26 160 -291 163
3345A63l4l06K38J37l77n1M85J10n25K68J54l85Q6M74o45k53M37K53l28K91j00
$$ 163 129 -177 61 198 -179 -230 255 365 -160 108 262 -123 -37 437 -208 -461 -24 229 -99 192 92
3366I2l46l10M87K72n13L12N97o72j21N53k65l81K74L43m22k24L37j15K0L85p9
$$ 92 -254 -564 -77 195 -318 -6 591 -81 -202 351 86 -295 -21 322 -100 -324 13 -102 -82 303 224
3387B24m11L52J77m92J13j4J94l40K81k12k29M84j31j22J21J95J90n38L35N9l93
$$ 224 -187 165 342 -150 -37 -51 143 -197 84 -128 -357 127 -4 -126 -5 190 380 -158 177 236 -157
3408a57o2O19m28m82M26k7j8R6M27j39n34L11K34k62m1M11m61j76L12j92k14L83
$$ -157 -219 400 -28 -510 -84 -111 -129 -33 394 255 -279 32 266 4 -37 374 -87 -263 49 -143 -357 26
3430B6L1r1M7J96j70j72J47J86k63J52j11l13PL45k8l11K86L98n53J69M60q11
$$ 26 57 -34 13 209 39 -133 14 200 -63 89 -22 -335 -328 17 -11 -322 -36 362 -191 -22 438 -373
3452c73L51K89j7n04K14k8j71K4N36o75J38K15J42R2Q6N8M3k94N4n4j42L96k48
$$ -373 -22 267 250 -254 -40 -68 -239 -215 321 -354 -216 -1 141 233 319 377 420 126 180 126 -16 380 132
3475A32l84J14K33k36J09K63r5l93M86k41j31j01M57k9p42O99j03k53J57M35o58
$$ 132 -252 -138 95 -141 -32 231 136 -257 229 -12 -143 -244 213 184 -558 141 38 -215 -58 377 -281
3496b81J66K03n7K5j02K36k28O1J65l82p8N29m53kJ27K57j06p6J20o9k30L29l6
$$ -281 -115 88 31 56 -46 190 -38 23 188 -194 -272 257 -196 -198 -71 186 80 4 124 55 -175 154 118
3519A18k84L31l43j14R2L58J5m25K77L85k01k3n9L8n17O9L29k66J48Oo9j58K46
$$ 118 -166 165 -178 -292 -200 158 173 -252 25 410 209 186 127 165 -352 -283 46 -220 -72 -66 -135 -293 -47
3542d7J62p3m2K29l30K22N2l05j42J11J92j43J29N0j42k08O79k45j41J75q5l02
$$ -47 115 42 0 229 -101 121 173 -132 -274 -163 29 -114 15 65 -77 -285 394 149 8 183 98 -204
3564b04L02L6k93j03K17j76l75P36K7l38J18L96j11k36K75Qm73M1J61j37j43M24
$$ -204 98 134 -159 -262 -45 -221 -596 140 167 -171 -53 343 232 -4 271 279 -194 -153 8 -129 -272 152
3586A52n3l95N74l07k93K13L36l07n2K72k8n87M56j38o2R1K46j12m0j8K50j53
$$ 152 99 -296 278 -29 -322 -109 227 -80 -132 140 112 -475 -19 -157 -219 -128 118 6 -34 -52 198 45
3608D5L6M9k0l86L21n4P7k39L99k20n0K90k18J6N1L11n65o0M25l91K44K51m81
$$ 45 81 130 110 -276 45 -9 68 -171 228 8 -42 248 30 46 97 408 -157 -217 208 -183 61 312 -169
3631a69k71N49Rk97J21J51Q7l11K73j5m8j04J96k72k66M25J68l96K34p1O9o7J8
$$ -169 -440 109 118 -179 -58 93 180 -131 142 127 79 -25 171 -101 -367 58 226 -170 64 -7 62 -5 13
3654A3K62l89J66j80l49L87j49N2J87m3q4K1J05K48K9j04j16j95m5L56j20m29
$$ 13 275 -114 52 -128 -477 -90 -239 -187 0 -43 -127 -106 -1 247 276 172 56 -139 -184 172 52 -377
3676c77K49m8k28J20N63k90j19L72O7l37r8J89M7k16K69k86j40K66J95m28Q0L68
$$ -377 -128 -176 -404 -284 279 -11 -130 242 309 -28 -126 63 110 -106 163 -123 -263 3 198 -230 -150 218
3698B18Rk46J05L03l98l27N96l03l43K72rm3P8O9k14K38L37j73r3J62k82N9j08
$$ 218 227 -19 86 389 -9 -336 260 -43 -386 -114 -123 -166 -88 -19 -233 5 342 169 76 238 -44 15 -93
3721i3R2k32k32M08K2k86M47LK6j45m2p0J01J45k95j02P9L04l67L07k50L23m01
$$ -93 -1 -233 -465 -57 -35 -321 126 129 155 10 -32 -102 -1 144 -151 -253 -174 130 -237 70 -180 143 -258
3744b58O25m2m79K85J93m80K66J26k96r2J31P2l31L32j27Jm5L02K09p26M84m9
$$ -258 367 325 -154 131 324 -156 110 236 -60 -152 -21 51 -280 52 -75 -74 -119 183 392 -334 150 101
3766A01m78L30K85j17k55K70Ok02j88L69k64K22J85l27M09l43J18j37J40j0J2
$$ 101 -377 -47 238 121 -134 136 142 -60 -248 121 -143 79 264 -63 346 3 121 -16 124 114 126
3787A26j84L93j15n85K87Q9J30j62K77k76j92J83J28j10K5L18l52o1J23J91l13
$$ 126 -58 335 220 -365 -78 11 141 -21 256 -20 -212 -29 99 -11 14 332 -20 -81 42 233 -80
3808h0L9J29j12o6K94k99K22k08J24j09kJ79Nj51J64jm37M80r3m84L86K78k44
$$ -80 -41 88 -24 -90 204 -95 127 -81 43 -66 -68 111 116 -35 129 128 -309 171 78 -406 -20 258 14
3831A4k05M54k95k03L66l8N2k84J50k7j44L86k48r4K49j63j83N35l02l4k88J9
$$ 14 -191 263 -32 -235 131 93 145 -139 11 -16 -160 226 -22 -116 133 -30 -213 322 20 -14 -302 -283
3853b83O44l69Q5j77K54n3J5k06N9J47k03J33k79K54j07J38j50J59J52k18q3K22
$$ -283 361 -8 77 -100 154 101 116 -90 -31 116 -87 46 -233 21 -86 52 -98 61 213 -5 -88 134
3875A34k80K28J67r3l0j94j67K03L8K07m25M64J1m66R9K49l65J97Q9L5j44Q8J9
$$ 134 -146 82 249 156 126 -68 -235 -32 6 213 -212 252 263 -203 -104 145 -220 -23 66 101 -43 45 64
3898F4P7k29L20k16j67j5L19k12KK41q3j43L47l28j27J37K08o03M07Q4Q1k03j15
$$ 64 141 -88 232 16 -151 -166 153 -59 -57 184 101 -42 305 -23 -150 -13 195 -408 -1 83 164 -39 -154
3921a54P9J96R0j87j61l32N41j1OJ08r2M9l53K23j72M0K16K27n04K46o8k90K25
$$ -154 -75 121 211 24 -137 -469 72 61 67 175 83 132 -221 2 -170 -130 86 313 -191 55 -13 -303 -78
3944g8L8K72m90K01o1j16P2K09L9M2k3N0l11n6N39m49k97L95k38R0K13J28R7k02
$$ -78 -40 232 -258 -57 -118 -234 -162 47 86 128 105 155 -156 -212 327 -122 -419 -24 -262 -172 41 169 266 64
3968F4j73J90k42L94j68l01L86j42Q4j51o2K23k34L86j68O5k34J98r7k47M27p9
$$ 64 -109 81 -161 233 65 -236 150 8 92 -59 -121 102 -132 254 86 151 -83 115 18 -229 198 119
3990A19k25n8K59m14J29L92l74r0N43j3m47J16K32m33M56l4p3j62K69k52j95J06
$$ 119 -106 -164 95 -319 -190 202 -172 -262 281 268 -179 -63 169 -264 192 158 85 -77 192 -60 -255 -149
4012a49OJ66M2oK30l65L56n0n24L06q1L0k23M58j08L6k7K2OL2Ok9l27O9R5j11
$$ -149 -143 23 65 59 289 -76 280 230 -294 12 -69 -39 -262 196 88 124 97 119 125 157 163 134 -193 -124 -29 -140
4038a40O0K12k61N8J62J75k05k73K32nJ52k07K45l51J36K54k92n5J08l3L7PJ59
$$ -140 -80 132 -129 -71 91 266 61 -212 20 15 167 -40 205 -146 -10 244 -48 -103 5 -28 9 16 175
4061A75l18K22Q9k81p7N23jk94j95L22k11k5L83l68N6rk56O7J31L51n86K81l5
$$ 175 -143 79 168 -113 -190 333 332 38 -157 165 -46 -71 312 -56 0 -9 -265 -198 -67 284 -302 -21 -56
4084e6q3RJ17j89M3L45L1j10j74K81J23k47k6K47m33P9q2K8j9J40Q6j49O9J66
$$ -56 -139 -130 -13 -202 -159 186 217 107 -67 214 337 90 64 311 -122 -43 -125 -97 -116 24 110 -39 30 196
4108A96l35j36J01J34j73K31j21k1K4P9P6j91K45M1l09J73L76l77M6K09l33l1
$$ 196 -139 -275 -174 -40 -213 18 -103 -124 -100 -21 55 -136 109 150 -159 14 390 13 59 268 -65 -96
4130i6oJ24j2J47Q9k15j82q6R9o1J38N6k02K98k09J36P7N2k15k04J51L50j50L3
$$ -96 -102 22 10 157 246 31 -151 -237 -138 -199 -61 -5 -207 91 -118 18 95 147 -68 -272 -121 229 79 112
4154A12m7j3l09M81k01J06k59N4k71R2N80k49l18L09J7j36j6J15j98k1pM04l37
$$ 112 65 52 -257 224 23 129 -130 -76 -347 -255 325 76 -242 67 84 -52 -68 47 -151 -172 -179 225 -112
4177a12N9J66j11O3k41J36K8lK27k24K7j55K83l48L02p5o3p6J50Ml16K63J39K17
$$ -112 -53 113 2 65 -176 -40 -12 -15 212 -12 15 -140 143 -205 97 22 -41 -117 33 37 -279 -16 123 340
4201C40l09R2j54q8j19L39l33K36J55j63j24P3k32K53M1P8l6j84M19m75J18L14
$$ 340 31 123 -31 -119 -238 101 -232 4 159 -4 -128 -55 -287 -34 7 85 49 -135 284 -191 -73 241
4223B41p03J94L01m6j0k57M52k77OJ67pk15J87k14k9K79J37k02O5n5K26k24q8
$$ 241 -462 -268 33 -13 -23 -280 172 -105 -99 68 61 -154 33 -181 -210 69 206 4 69 14 240 16 -72
4246g2K94n02K52L26k57j87K49kk26N5J09j02j73L46k3J82l03K18k39K09K40l04
$$ -72 222 -280 -28 298 41 -146 103 101 -125 -70 39 -63 -236 110 87 269 -34 184 -55 154 394 90
4268I0j30k9m6J8K63Ok23k4N6R3j57K0J77k32L28j11j04J8P3j83N0L48l11j20
$$ 90 -40 -69 -115 -97 166 172 -51 -75 -19 74 -83 -63 114 -118 210 99 -5 13 86 -97 -47 301 -10 -130
4292a30Q0J60m6n3K4q7r4kJ70k57K26q9J50J02r4J99l59M03j6k25k8r6p7J49j95
$$ -130 -50 110 64 11 35 -52 -146 -148 22 -235 -9 -98 52 154 60 259 -100 303 287 62 34 -62 -139 10 -185
4317a85L12k76L65k33kj14n7O3J30l7nJ21j39K84l9k38K53n8l75K35J51j38j05
$$ -185 127 -149 216 -17 -19 -133 -190 -127 3 -34 -39 82 -57 227 188 -50 203 145 -230 5 156 18 -87
4340h7L98j36j69j4K47k30j81L09k75K1J07N2Q3j07K24j29o4k02K02j47j87O75
$$ -87 311 175 6 -8 239 9 -172 137 -138 -117 -10 42 125 18 242 113 49 -153 49 -98 -285 390
4362C90j56k78K37j4m65J91M61k79k90J13k4Q7L5J65j96L6q6n9K35k44OJ1K32
$$ 390 234 -44 193 179 -286 -95 366 87 -203 -90 -114 -27 8 173 -23 13 -73 -132 103 -141 -135 -124 108
4385A08O6j88R3k58Q5L80m4n6l63K90l57J57J31J4mj59K82j93M39l67o4j98K5
$$ 108 174 -14 79 -179 -94 286 242 186 -177 113 -244 -87 44 58 54 -105 177 -16 423 56 -8 -206 -181
4408a81J42Q2l15K10M35j36n8J05k58p6jp3J04%N0j09K44j19j2r4L34J0n21L04
$$ -181 -39 43 -272 -62 373 237 179 284 26 -50 -51 -124 -20 -20 30 -79 165 46 34 -60 274 284 -237 67
4432F7q0l52K78J65L5r8j49j32K87l38N36k68J37L8M2n3P5k00K92n17J85J25k53
$$ 67 -13 -365 -87 78 113 15 -134 -266 21 -317 219 -49 88 126 168 115 190 -10 282 -235 -50 75 -178
4455a78L7J39l2j8J14k58J60J12L28m82L12l67J31k2j09J83k6J43j16k03P7J62
$$ -178 -141 -2 -34 -52 62 -196 -36 76 404 -78 234 -133 -2 -24 -133 50 24 167 51 -152 -75 87
4477H7J4j83J44K35n48J84K01n0r6J24j04k30K46K16j21k57L55j41K19j66j63
$$ 87 101 -82 62 297 -251 -67 134 84 -12 112 8 -222 24 240 119 -138 217 76 295 129 -34
4498c4p1m4M5j03O3K15j70K0J95o3n7j03K65k01k25J98qm36L98J80J76k48r3K33
$$ -34 -105 -149 -104 -207 -144 71 -99 -79 116 53 -4 -107 158 -43 -268 -70 -78 -514 -116 64 240 -8 -101 132
4522A32j69J56J20l01k5L40l41N8J85J2j74K29j72m5n9J93k30K45M7j60l5K75
$$ 132 -37 119 239 -62 -87 253 -88 -30 155 167 -7 222 50 5 -54 139 -91 154 201 41 6 281
4544B81j74k58M40k77j04J80j39J16r4k74J47J76n2J57p5k47L56j09j64J61m2
$$ 281 107 -151 289 12 -92 88 -51 65 -29 -303 -156 20 -32 125 50 -197 159 50 -114 47 5
4565EJ46l18O7J98K9j6j06k11J35L25j26mnl6k77J60K16r9j21r8K58Rn3K9r0M
$$ 5 151 -167 -100 98 127 111 5 -206 -71 254 128 124 119 83 -194 -34 182 83 -38 -136 122 131 78 107 17 21
4591B1k12J73k04L89k05j04J41l3K99k62P8j1l3M4o6K37l91L2K58j45N6p4k38
$$ 21 -191 -18 -222 167 -38 -142 -1 -34 265 3 81 70 37 81 15 252 -139 -107 151 6 62 -12 -250
4614b50JL81l5k53K57J3m9j4J23k85K15P1k20O5l0J91q1r5L9n8o3q2K23K13j32
$$ -250 -249 132 97 -156 101 114 65 51 174 -111 104 175 -45 20 -10 181 100 5 44 -14 -77 -159 64 277 145
4639A45k35p0J65J49j33N7N5%j98K19m16P7J98J69m02j83K44J83M9j01k7J74l43
$$ 145 -90 -160 5 154 21 78 133 133 -65 154 -262 -185 13 182 -220 -403 -159 24 73 -28 -55 119 -224
4662b24J2Q9q7J90J43k17l8J55o5P0R5j27Q7j67JR0j59J83Q0j10m9K78m31K51
$$ -224 -212 -123 -210 -20 123 -94 -132 23 -42 28 123 -4 83 -84 -83 7 -152 31 111 1 -48 230 -201 50
4686E0k9P7o9j76L85k56J50J08l76O1Mn8K16pj26n8K05O7M1qJ02m09K14k71K74
$$ 50 21 98 29 -147 238 -18 132 240 -136 -75 -71 -129 87 80 -46 -104 101 168 209 201 303 -106 108 -163 111
4711A11p9j05K92l29KL29k47k1L52l05l4N9J86j08p4l6j54R2J00M1j29rJ73j24
$$ 111 32 -73 219 -110 -108 221 -26 -47 305 0 -34 25 211 103 29 -7 -161 -69 31 72 -57 -66 107 -17
4735a7L18k86R1j29j97K98r8l09L07J58j73m9K05m53L97j27J40J89m70L3O5K22
$$ -17 301 15 106 -23 -220 78 -20 -329 -22 136 -37 -86 119 -334 63 -64 76 265 -205 -172 -107 115
4757A15j07J7j15M1k3PO1l0M8j00Q8J7j5j40K16k43N9L85l44R0J48J81n5l79K11
$$ 115 8 25 -90 -49 -72 -65 -4 -34 14 -86 2 19 4 -136 80 -163 -104 281 -63 27 175 356 301 -78 133
4782A33N5k2r6m55K06K73r5K86l18o4o3o5K47J21j27J79j88j10M93l08J1k01J67
$$ 133 188 166 70 -385 -179 94 -1 285 -33 -97 -160 -225 22 143 16 195 7 -103 390 82 93 -108 59
4805E9k93J84k3L7R2K4M2k4j04p4Oq1L34j61p0J25j45N3P4P1o5R5l82L53k00p2
$$ 59 -234 -50 -73 -36 56 80 122 98 -6 -80 -74 -155 179 18 -52 73 -72 -19 55 126 61 156 -226 127 -73 -145
4831a45K35m4K5k01N0K22m6j14j21K58j40n5J60k7J48k45k07L59k68K7K57km22
$$ -145 90 46 71 -130 -80 142 96 -18 -139 119 -21 -76 84 57 205 -40 -247 112 -156 -129 128 126 -296
4854b96J25k14M44o9l4k91K99J10k11J60j41O5K37j09p2k56L59m1n4k73L07r2
$$ -296 -171 -385 59 -10 -44 -335 -36 74 -137 23 -118 -53 184 75 3 -253 106 65 11 -262 45 -47
4876d7k33N15k57j14K81r8k1j62K22q4J49j93k6K3O4J51k45K15l27K58jP7m52
$$ -47 -280 235 -22 -136 145 47 26 -136 86 2 151 -42 -68 -45 19 170 -75 140 -187 71 70 147 -305
4899c05J77q8N0K27P9m8O0k03j52L80m51K29R6p4K3j67M09j42J61l09N6J63k65
$$ -305 -128 -216 -166 61 140 92 152 -51 -203 177 -274 -45 51 -23 0 -167 242 100 261 -48 8 171 -94
4922i4K00l0j64J41j67j06J26M7K0J34j60K1J25k46K09q9Q5J36k29J95l13L75
$$ -94 106 76 -88 53 -114 -220 -94 -47 -27 107 -53 -32 93 -153 56 -33 52 188 -41 154 -159 216
4944B16k92J97k70K37j76M4K5j32p5Ok4K78j70L55l18L60q6k99K79k4l40J29J1
$$ 216 -76 121 -149 88 -88 -44 -19 -151 -226 -220 -244 34 -136 219 -99 261 175 -124 155 131 -209 -80 -69
4967f9nJ97o1N5o8k14J86l2K24j3j60Q5M9k89J15k8j19R2k57N28l27K6j35P3J08
$$ -69 -74 123 62 117 49 -165 21 -11 213 200 40 125 174 -115 0 -28 -147 -55 -312 216 -111 -85 -220 -147 -39
4992c9K9j24K46r7o9o3r2J93K11j67K62k95K01j47r6K42j85j50P3L54m16o7L73
$$ -39 -10 -134 112 15 -54 -117 -209 -16 195 28 290 -5 196 49 -47 195 10 -140 -67 287 -129 -196 177
5015A77k04L4j92KK32m26J78K49m5R2j01n3K51J54k30j39m2J87k18L0J60k20J63
$$ 177 -27 7 -185 -183 49 -377 -199 50 5 97 -4 -57 194 348 118 -21 -63 124 -94 -64 96 -124 39
5038C9k34J76K7O3pj41L9q7N52o47Q1R3k9K51j57L2k5j51M77k43j6R4k04l7p7
$$ 39 -195 -19 8 71 64 -77 -38 -125 427 -220 -139 -46 -75 176 19 51 26 -125 352 109 93 187 -17 -54 -131
5063a31q3J49N6J42p3M6k55J02K60m11L50j19rJ20j30P1q9k0k01K35LJ35l7Mj04
$$ -131 -214 -65 -9 133 60 106 -149 -47 213 -198 152 33 24 144 14 85 -4 -24 -225 10 13 148 111 115 11
5088A1j8Pp9j25K65o6j17k31J69J65JJ65K0k79k6j5L4K03j37p5J15O7K10k10J75
$$ 11 -7 0 -79 -204 61 -5 -122 -353 -184 -19 -18 147 167 -112 -138 -153 -119 84 -53 -128 -13 54 264 54 229
5113B29r0k29J49l1l1J29j47j86K41J23p9q5J11j36qr0K02n7J33j09L47l75j23
$$ 229 139 -90 59 28 -3 126 -21 -207 34 157 78 -7 104 -32 -40 -130 72 15 148 39 386 11 -112
$$ [...]
8191f3
##END NTUPLES=NMR FID
##END=
