##TITLE=1H_Ser 1377-2
 CDcl3, 8 sc, 
 20.12.2019
##JCAMPDX= 6.0         $$ Bruker NMR JCAMP-DX V2.0
##DATA TYPE= NMR FID
##DATA CLASS= NTUPLES
##ORIGIN= UXNMR, Bruker Analytische Messtechnik GmbH
##OWNER= root
$$ XWIN-NMR		Version 3.5
$$ Fri Dec 20 15:36:33 2019 Russian Standard Time (UT+4h)  she@DPX200
##.OBSERVE FREQUENCY= 200.1315
##.OBSERVE NUCLEUS= ^1H
##.DELAY= (6, 6)
##.ACQUISITION MODE= SIMULTANEOUS
##.ACQUISITION SCHEME= undefined
##.AVERAGES= 8
##.DIGITISER RES= 18
##SPECTROMETER/DATA SYSTEM= spect
##.PULSE SEQUENCE= zg30
##.SOLVENT NAME= CDCl3
##.SHIFT REFERENCE= (INTERNAL, CDCl3, 0, 15.7039)
##AUDIT TRAIL= $$ (NUMBER, WHEN, WHO, WHERE, WHAT)
$$ ##TITLE= Audit trail, XWIN-NMR		Version 3.5
$$ ##JCAMPDX= 5.01
$$ ##ORIGIN= Bruker BioSpin GmbH
$$ ##OWNER= she
$$ F:/spectra/data/she/nmr/H-F/1/audita.txt
$$ ##AUDIT TRAIL=  $$ (NUMBER, WHEN, WHO, WHERE, WHAT)
(   1,<2019-12-20 15:33:41.23 +0400>,<she>,<DPX200>,
      <created by zg, POWCHK disabled, PULCHK disabled
       configuration hash MD5:
       00 E9 B6 7A A2 85 ED C7 34 08 36 98 17 FE 4E 26
       data hash MD5: 16K
       8C AC 00 FE F2 DA 89 76 7B A3 53 CB 8F EA FF 6E>)
$$ ##END=
$$ 
$$ hash MD5
$$ 15 8E 64 38 E5 9B 5B 59 EB E0 A3 DE 15 90 79 7E
##$RELAX= 
##$RELAX= 
##$RELAX= 
##$RELAX= 
##$RELAX= 
##$RELAX= 
$$ Bruker specific parameters
$$ --------------------------
##$DU= <F:/spectra>
##$EXPNO= 1
##$NAME= <H-F>
##$PROCNO= 1
##$TYPE= <nmr>
##$USER= <she>
##$AMP= (0..31)
100 100 100 100 100 100 100 100 100 100 100 100 100 100 100 100 100 100 
100 100 100 100 100 100 100 100 100 100 100 100 100 100 
##$AQSEQ= 0
##$AQ_mod= 1
##$AUNM= <au_zg>
##$AUTOPOS= <>
##$BF1= 200.13
##$BF2= 200.13
##$BF3= 200.13
##$BF4= 200.13
##$BF5= 200.13
##$BF6= 200.13
##$BF7= 200.13
##$BF8= 200.13
##$BYTORDA= 1
##$CFDGTYP= 0
##$CFRGTYP= 5
##$CHEMSTR= <none>
##$CNST= (0..31)
1 1 145 1 1 1 1 1 1 1 1 1 1 1 1 1 1 1 1 1 1 1 1 1 1 1 1 1 1 1 1 1 
##$CPDPRG= <>
##$CPDPRG1= <>
##$CPDPRG2= <>
##$CPDPRG3= <>
##$CPDPRG4= <mlev>
##$CPDPRG5= <mlev>
##$CPDPRG6= <mlev>
##$CPDPRG7= <mlev>
##$CPDPRG8= <mlev>
##$CPDPRGB= <>
##$CPDPRGT= <>
##$D= (0..31)
0 1.2 0 0 0 0 0 0 0 0.06 0 0.03 0 0 0 0 0.0002 0 0 0 0 0 0 0 0 0 0 0 0 
0 0 0 
##$DATE= 1576841620
##$DBL= (0..7)
120 120 120 120 120 120 120 120 
##$DBP= (0..7)
150 150 150 150 150 150 150 150 
##$DBP07= 0
##$DBPNAM0= <>
##$DBPNAM1= <>
##$DBPNAM2= <>
##$DBPNAM3= <>
##$DBPNAM4= <>
##$DBPNAM5= <>
##$DBPNAM6= <>
##$DBPNAM7= <>
##$DBPOAL= (0..7)
0.5 0.5 0.5 0.5 0.5 0.5 0.5 0.5 
##$DBPOFFS= (0..7)
0 0 0 0 0 0 0 0 
##$DE= 6
##$DECBNUC= <off>
##$DECIM= 24
##$DECNUC= <off>
##$DECSTAT= 4
##$DIGMOD= 1
##$DIGTYP= 9
##$DL= (0..7)
0 120 120 120 120 120 120 120 
##$DP= (0..7)
150 150 150 150 150 150 150 150 
##$DP07= 0
##$DPNAME0= <>
##$DPNAME1= <>
##$DPNAME2= <>
##$DPNAME3= <>
##$DPNAME4= <>
##$DPNAME5= <>
##$DPNAME6= <>
##$DPNAME7= <>
##$DPOAL= (0..7)
0.5 0.5 0.5 0.5 0.5 0.5 0.5 0.5 
##$DPOFFS= (0..7)
0 0 0 0 0 0 0 0 
##$DQDMODE= 0
##$DR= 18
##$DS= 0
##$DSLIST= <SSSSSSSSSSSSSSS>
$$ [...]
##$SUBNAM2= <"">
##$SUBNAM3= <"">
##$SUBNAM4= <"">
##$SUBNAM5= <"">
##$SUBNAM6= <"">
##$SUBNAM7= <"">
##$SUBNAM8= <"">
##$SUBNAM9= <"">
##$SW= 24.9337058887773
##$SWIBOX= (0..15)
0 0 2 0 0 0 0 0 0 0 0 0 0 0 0 0 
##$SW_h= 4990.01996007984
##$TD= 16384
##$TD0= 1
##$TE= 0
##$TE2= 300
##$TE3= 300
##$TEG= 300
##$TL= (0..7)
0 120 120 120 120 120 120 120 
##$TP= (0..7)
150 150 150 150 150 150 150 150 
##$TP07= 0
##$TPNAME0= <>
##$TPNAME1= <>
##$TPNAME2= <>
##$TPNAME3= <>
##$TPNAME4= <>
##$TPNAME5= <>
##$TPNAME6= <>
##$TPNAME7= <>
##$TPOAL= (0..7)
0.5 0.5 0.5 0.5 0.5 0.5 0.5 0.5 
##$TPOFFS= (0..7)
0 0 0 0 0 0 0 0 
##$TUNHIN= 0
##$TUNHOUT= 0
##$TUNXOUT= 0
##$USERA1= <user>
##$USERA2= <user>
##$USERA3= <user>
##$USERA4= <user>
##$USERA5= <user>
##$V9= 5
##$VALIST= <valist>
##$VCLIST= <CCCCCCCCCCCCCCC>
##$VD= 0
##$VDLIST= <DDDDDDDDDDDDDDD>
##$VPLIST= <PPPPPPPPPPPPPPP>
##$VTLIST= <TTTTTTTTTTTTTTT>
##$WBST= 1024
##$WBSW= 4
##$XGAIN= (0..3)
0 0 0 0 
##$XL= 0
##$YL= 0
##$YMAX_a= 155680
##$YMIN_a= -113256
##$ZGOPTNS= <>
##$ZL1= 120
##$ZL2= 120
##$ZL3= 120
##$ZL4= 120
##$ABSF1= 10
##$ABSF2= 0
##$ABSG= 5
##$ABSL= 3
##$ALPHA= 0
##$AQORDER= 0
##$ASSFAC= 0
##$ASSFACI= 0
##$ASSFACX= 0
##$ASSWID= 0
##$AUNMP= <proc_1d>
##$AZFE= 0.1
##$AZFW= 0.1
##$BCFW= 1
##$BC_mod= 2
##$BYTORDP= 1
##$COROFFS= 0
##$CY= 11.3945322036743
##$DATMOD= 1
##$DC= 2
##$DFILT= <>
##$DTYPP= 0
##$F1P= 16.9975609425685
##$F2P= -3.02152046262296
##$FCOR= 0.5
##$FTSIZE= 0
##$FT_mod= 4
##$GAMMA= 1
##$GB= 0.15
##$INTBC= 1
##$INTSCL= 1
##$ISEN= 128
##$LB= 0.24
##$LEV0= 0
##$LPBIN= 0
##$MAXI= 10000
##$MC2= 0
##$MEAN= 0
##$ME_mod= 0
##$MI= 1.114404
##$NCOEF= 0
##$NC_proc= 0
##$NLEV= 6
##$NOISF1= 3.799351
##$NOISF2= 2.8
##$NSP= 1
##$NTH_PI= 0
##$NZP= 0
##$OFFSET= 15.70392
##$PC= 1
##$PHC0= -10152.93
##$PHC1= 23.0008
##$PH_mod= 1
##$PKNL= yes
##$PPARMOD= 0
##$PSCAL= 0
##$PSIGN= 0
##$REVERSE= no
##$SF= 200.130013532006
##$SI= 16384
##$SIGF1= 3
##$SIGF2= 2
##$SINO= 400
##$SIOLD= 16384
##$SREGLST= <1H.CDCl3>
##$SSB= 0
##$STSI= 0
##$STSR= 0
##$SW_p= 3612.71676300578
##$SYMM= 0
##$S_DEV= 0
##$TDeff= 0
##$TDoff= 0
##$TI= <>
##$TILT= no
##$TM1= 0
##$TM2= 0
##$TOPLEV= 0
##$USERP1= <user>
##$USERP2= <user>
##$USERP3= <user>
##$USERP4= <user>
##$USERP5= <user>
##$WDW= 1
##$XDIM= 8192
##$YMAX_p= 0
##$YMIN_p= 0
$$ End of Bruker specific parameters
$$ ---------------------------------
##NTUPLES= NMR FID
##VAR_NAME=  TIME,          FID/REAL,        FID/IMAG
##SYMBOL=    X,             R,               I
##VAR_TYPE=  INDEPENDENT,   DEPENDENT,       DEPENDENT
##VAR_FORM=  AFFN,          ASDF,            ASDF
##VAR_DIM=   8192,          8192,            8192
##UNITS=     SECONDS,       ARBITRARY UNITS, ARBITRARY UNITS
##FACTOR=    0.0002004,     1,               1
##FIRST=     0,             0,               0
##LAST=      1.6414764,     0,               0
##MIN=       0,             -113256,         0
##MAX=       1.6414764,     155680,          0
$$ Real data points
##PAGE= N=1
##DATA TABLE= (X++(R..R)), XYDATA
$$ [...]
$$ plain form
2284 139 4241 1162 -3511 -371 4655 1701 -3220 -1209 4046 2645 -2884 -1850 3438 3239 -2326
2299 -2326 -2728 3031 4137 -1570 -3250 1918 4351 -766 -3536 1395 4329 -436 -4157 227 4190
2314 4190 485 -3993 -650 3726 745 -4080 -1557 3783 1755 -3555 -2561 3044 2592 -2763 -3365 2334
2330 2334 3025 -2502 -3395 1843 3386 -1875 -4059 818 3695 -488 -4078 182 3793 -4 -3884
2345 -3884 -519 3796 741 -3335 -1190 3450 1847 -3253 -1975 3095 2286 -3120 -2503 3034 3434 -2406
2361 -2406 -3061 2212 3190 -1550 -3505 986 3638 -1408 -4124 156 3518 -576 -4097 -688 3310
2376 3310 291 -4013 -1289 2917 1083 -3752 -2045 2867 1706 -3370 -3023 2308 1932 -2878 -3302 1880
2392 1880 2777 -2011 -3493 978 3382 -988 -3932 413 3682 -230 -3194 109 3736 605 -3452
$$ packed form
2284A39M102l079m673L140N026k954m921K011N255j401n529J034N288j99n565
2299b326m02N759J106n707j680N168K433n117k770M931K934m765l721M384L963
2314D190l705m478L343M376k981m825K523N340k028n310R94N605m52n355o02N699
2330B334O91n527q93N238J543n261k184M877K877m183l590M260L611l797l880
2345c884L365M315l055m076K145M640j603n100J278N070q09n406O17N537M00n840
2361b406o55N273R78m740j955M491K652n046k716M280L362m094l521L409L998
2376C310l019m304K724M206j834m835J707M912j161n076L47N331l76m810m24N182
2392A880Q97m788j482M471K404m370k944M345L269l912k964L303L627l131m057
$$ plain form
2407 -3452 -634 3912 1545 -2729 -1307 3419 2448 -2226 -1659 3288 3146 -1935 -2527 2392 3574 -1525
2423 -1525 -2538 1675 3446 -758 -3320 956 3564 82 -3520 -162 3839 487 -3112 -536 3592
2438 3592 814 -3412 -1343 3083 2163 -2999 -2467 2601 2462 -2431 -2496 2089 2378 -2068 -3139 1584
2454 1584 3377 -1023 -3457 770 3122 -695 -3551 575 3718 189 -3305 -296 3731 1292 -3051
2469 -3051 -1136 3361 1662 -2787 -1576 3003 2259 -2683 -2273 2443 2868 -2057 -2895 1276 3021 -1203
2485 -1203 -3449 982 3103 -573 -3675 157 3096 -179 -3422 -615 2802 123 -3766 -1344 2555
2500 2555 964 -3602 -2582 2086 1481 -2865 -2989 1656 2232 -2528 -3063 1303 2555 -2039 -3302 901
2516 901 3007 -899 -3493 299 3097 -359 -3314 -136 2911 866 -3072 -830 3043 1217 -2788
$$ packed form
2407c452K818M546k367m274J422M726r71m674N67M947j42n081n92M919J182n099
2423a525j013M213J771m204k562M276K608l482l602L358M001l352l599K576M128
2438C592k778m226K069M426r20n162N32N068j39m893o5M585K89m446j071M723
2454A584J793m400k434M227K352l817k856M126L143l529l494L009M027k439m343
2469c051J915M497j699m449J211M579p44m942M10M716M25m925q38M171J745m224
2485a203k246M431K121l676l102L832K939l275l243K807L417k679l889K422L899
2500B555j591m566J020M668o05m346j24M645N76m760n35M366J252m594j263M203
2516I01K106l906k594L792K798l456k955L178L047k045l938K242L873j826m005
$$ plain form
2531 -2788 -1580 2788 2142 -2429 -1970 2750 2643 -1450 -2013 2240 3300 -1203 -2697 1382 3043 -690
2547 -690 -2812 582 3326 -50 -3075 -245 2923 688 -2848 -649 3126 801 -2948 -1160 2795
2562 2795 1843 -2114 -1777 2407 2009 -1812 -2362 1937 2711 -1309 -2457 1060 2901 -675 -2876 646
2578 646 3265 -147 -2854 352 3213 539 -3024 -460 3148 1305 -2144 -853 2640 1408 -2426
2593 -2426 -1396 2504 2150 -1715 -2174 1831 2667 -1353 -2363 1080 2521 -1205 -3004 794 2744 -650
2609 -650 -3003 -347 2508 -252 -2820 -629 2258 451 -3194 -1513 2136 1125 -2645 -1940 1920
2624 1920 1374 -2704 -2445 1435 1758 -2043 -2931 1182 2333 -900 -2794 424 2420 -831 -2959 276
2640 276 2775 124 -3118 -630 2710 1013 -2489 -1010 2431 1410 -2082 -1346 2223 2036 -1908 -1934
$$ packed form
2531b788J208M368o46m571M59M720j07m093n63M253J060m503j494M079J661l733
2547f90k122L394K744l376l025K830L168k235l536K199L775k325l749J788L955
2562B795r52l957L37M184l98l821n50M299P74m020j148L517J841l576k201L522
2578F46K619l412k707L206K861k674l563K564L608j843l449J291L493j232l834
2593b426J030L900l54l865m59M005Q36m020j010L443J441l726j799L798J950l394
2609f50k353K656K855k760k568K191K887j807l645J681L649j011l770P05L860
2624A920n46m078K59L880L23l801q88M113J151l233j894L218J996l251k128L235
2640B76K499k651l242K488L340j697l502J479L441j021l492P36L569j87l944k6
$$ plain form
2656 -1934 1656 2295 -1582 -2029 1550 2638 -1017 -2362 794 2734 -314 -2529 382 2438 -38
2671 -38 -2443 -370 2563 764 -2603 -1195 2406 1089 -2197 -1337 2186 1365 -1897 -1692 1631 1845
2687 1845 -1729 -2129 1584 2111 -975 -2239 1052 2623 -410 -2555 395 2797 246 -2208 78
2702 78 2604 348 -2197 -370 2715 1484 -1933 -652 2584 1981 -1657 -1275 2041 2019 -1539 -1813 1865
2719 1865 2590 -910 -2069 996 2548 -707 -2298 508 2490 -51 -2875 -210 1972 222 -2348
2734 -2348 -898 2297 590 -2514 -1544 1834 1065 -2346 -1731 1137 1191 -2231 -2342 1130 1853 -1847 -2497
2751 -2497 915 1765 -1033 -2488 162 1993 -527 -2526 -308 2325 84 -2584 -810 1957 725
2766 725 -1821 -1272 1978 947 -1848 -1358 1989 1895 -1380 -1632 1055 1712 -1324 -1889 907 2016 -787
$$ packed form
2656a934L590O39l877m47L579J088l655j345L156J940l048k215K911K056k476
2671c8k405K073K933j799l367J408L601j317l286Q60L523q21l262K05L323K14
2687A845l574m00L713N27l086j264L291J571l033k145K950K402k551k454K286
2702G8K526k256k545J827L085j231l417J281L236o03l638L82L316k2l558k74L678
2719A865P25l500j159L065J552l255j591K806J982k541k824K665K182j750k570
2734b348J450L195j707l104R70L378p69l411O15K868N4l422j11L472P23l700o50
2751b497L412Q50k798j455K650J831k520j999K218K633k241k668J774K767j232
2766G25k546N49L250j031k795M90L347r4l275k52K687O57l036n65K796J109k803
$$ plain form
2783 -787 -2263 303 2169 -246 -2209 -330 2132 240 -2149 -567 2348 313 -2229 -1086 1822
2798 1822 1008 -1949 -1342 1736 1164 -1245 -1403 1393 1854 -1293 -1876 687 2048 -454 -1649 528
2814 528 2421 -103 -2014 571 2784 92 -2110 -156 2261 1021 -1548 -354 2262 1307 -1606
2829 -1606 -990 1886 1819 -1189 -1185 1303 1856 -827 -1317 1124 2081 -632 -1741 781 2158 -220 -2128
2846 -2128 139 2217 -61 -2129 -357 2032 306 -1895 -626 1832 717 -1682 -797 1549 1214
2861 1214 -1991 -1666 1074 1382 -1393 -1583 712 1581 -1039 -2032 453 1424 -748 -2286 89 1872
2877 1872 -87 -2072 -267 1730 483 -2157 -403 1788 458 -2024 -973 1413 1105 -1650 -1305
2892 -1305 1277 1344 -904 -1704 1024 1534 -714 -1812 565 1936 -365 -1635 51 1758 53 -2244
$$ packed form
2783g87j476K566J866k415j963J879K462j892k389J582K915k035k542J143K908
2798A822q14k957O07L078n72k409j58K796M61l147n83K563J361k502j195K177
2814E28J893k524j911K585K213k692k202J954K417j240k569J194K616r55k913
2829a606O16K876o7l008MK488N53k683m90K441R57k713j109K522J377k378j908
2846b128K267K078k278k068J772K389j726k201J269K458j115k399Q85K346l35
2861A214l205L25K740L08k775j90K295Q69k620r93K485R71k172j538K375J783
2877A872j959j985J805J997j247k640J754K191j330k482J051K386l08k755L45
2892a305K582O7k248q00K728N10k248j098K377J371k301j270J686J707j705k297
$$ plain form
2908 -2244 -583 1667 205 -1753 -635 1626 549 -2108 -1308 1328 733 -1533 -1169 1278 1297 -1125
2924 -1125 -1466 1049 1483 -857 -1506 535 1799 -319 -1890 551 1430 148 -1481 13 1933 377
2940 377 -1491 -474 1833 1015 -1270 -583 1984 1472 -1585 -915 1436 1451 -1137 -1285 1342 1842 -718
2957 -718 -1278 977 1791 -507 -1489 529 1880 206 -1718 -109 1745 631 -1836 83 1711 803
2973 803 -1657 -906 1475 925 -1493 -1005 1236 1098 -877 -1403 809 1257 -919 -1465 634 1414 -654
2990 -654 -1440 345 1446 -262 -1600 45 1356 105 -1709 -696 1606 364 -1634 -797 1426 871
3006 871 -1615 -984 1233 1123 -1369 -1098 1055 1487 -1071 -1664 743 1249 -744 -1563 484 1592 -465
3023 -465 -1680 164 1455 124 -1849 -397 1344 527 -1498 -1008 1089 598 -1463 -1085 1045 846
$$ packed form
2908b244J661K250j462j958J118K261j077k657Q00K636n95k266L64K447J9k422
2924a125l41K515M34k340o49K041J264k118j571K441Q79j282j629J494J920j556
2940C77j868J017K307q18k285O87K567n12l057O70K351J5k588j48K627N00k560
2957g18n60K255Q14k298r82K018J351j674j924J609J854j114k467J919J628r08
2973H03k460P51K381n50k418M88K241j38j975n26K212M48k176n46K099P80k068
2990f54p86J785J101j708j338J645J311j251j814J013K302j242j998Q37K223n55
3006H71k486O31K217j10k492K71K153M32k558n93K407N06j993q19K047J108k057
3023d65j215J844J291j331j973J452J741q17k025M90K097m91k061L78K130j99
$$ plain form
3039 846 -1244 -1164 769 1455 -836 -1457 354 1360 -702 -1602 556 1383 -327 -1647 142 1612 350
3056 350 -1414 -388 1511 716 -1376 9 1359 454 -1444 -593 1597 1350 -932 -786 1167 1319 -601
3073 -601 -992 1014 1490 -378 -1262 584 1615 19 -1467 432 1775 -99 -1564 -64 1374 423
3089 423 -1107 -371 1883 569 -1251 -523 1284 1081 -1222 -945 1302 1018 -1023 -1259 738 1158 -899
3106 -899 -1490 406 1229 -196 -1288 342 1303 -223 -1287 -188 1684 183 -1235 -300 1379 456
3122 456 -1456 -706 1152 439 -1191 -1277 948 1243 -1114 -1002 708 1118 -662 -1359 613 1554 -397
3139 -397 -1286 127 1351 -568 -1394 -105 1338 220 -1439 -601 987 108 -1628 -849 932 272 -1242
3156 -1242 -821 835 622 -1032 -1103 768 989 -784 -1196 607 1027 -332 -1484 238 1022 -399 -1219
$$ packed form
3039H46k090Q0J933O86k291o21J811J006k062r00K158Q27j710j320J789J470j262
3056C50j764J026J899p95k092J385J350r05j898Q51K190k47k282J46J953J52j920
3073f01l91K006M76j868q84J846J031j596j486J899J343j874j465J500J438r51
3089D23j530P36K254j314j820P28J807k03k303K77K247k84k041k36J997M20k057
3106h99n91J896Q23j425j092J630R61j526j064J099J872j501j418R35J679r23
3122D56j912P50J858p13j630q6K225K95k357J12J710M10j780o97J972R41j951
3139c97q89J413J224j919q26J289J443j118j659Q38J588q79j736P79J781o60j514
3156a242M21J656k13j654p1J871K21j773m12J803M20j359j152J722P84j421q20
$$ plain form
3173 -1219 -9 1298 36 -1304 -606 1367 327 -1097 -525 1363 976 -881 -895 889 870 -785 -781
3190 -781 909 919 -839 -707 573 1175 -602 -1293 456 1309 -222 -961 -22 1259 437 -1114 -234 1458
3208 1458 549 -987 -533 1213 622 -1318 -679 971 832 -645 -670 463 1001 -612 -1147 560 1359
3225 1359 -258 -980 466 1173 -485 -1331 -148 1147 -26 -911 -157 1295 484 -1186 -317 766 552
3242 552 -961 -674 689 796 -788 -881 502 907 -589 -805 875 1017 -389 -978 530 1143 -332
3259 -332 -1413 56 1052 242 -1358 10 1145 158 -1391 -497 1099 383 -873 -731 493 401 -809
3276 -809 -1112 945 726 -763 -1153 563 1013 -687 -1452 177 760 -341 -1179 -139 860 -22 -1111
3293 -1111 -41 980 -51 -1121 -229 793 355 -1254 -353 966 632 -623 -673 704 797 -922 -1045
$$ packed form
3173a219J210J307j262j340O98J973j040j424N72J888l87j857j4J784j9j655M
3190g81J690J0j758J32J280O02j777o91J749Q53j531p39R39J281q22j551Q80J692
3208A458r09j536M54J746n91j940O39J650j39j477k5J133N38j613n35J707P99
3225A359j617p22J446P07j658q46J183J295j173q85P54J452q11j670Q69J083k14
3242E52j513K87J363J07j584r3J383M05j496k16J680J42j406n89J508O13j475
3259c32j081J469R96q10j600J368J135r87j549Q94J596p16j256J42J224r2j210
3276h09l03K057k19j489l90J716M50j700p65J629N83j101q38J040R99q82j089
3293a111J070J021j031j070Q92J022m38j609R01J319l34j255n0J377R3j719j23
$$ plain form
3310 -1045 741 1131 -171 -998 327 1310 -249 -1076 251 913 -135 -1070 -73 1479 80 -899 -334
3327 -334 1135 514 -924 -115 883 552 -980 -500 906 941 -679 -703 814 732 -726 -850 688 834
3345 834 -210 -903 69 781 -147 -1138 51 1027 232 -1036 5 963 381 -1098 -581 865 646 -582
3363 -582 -435 907 685 -509 -527 318 625 -493 -648 398 959 -380 -857 -184 1092 -74 -1092 1
3381 1 844 -245 -1151 -363 930 -158 -1097 -343 450 381 -1009 -662 526 438 -846 -911 588 675 -993
3400 -993 -901 271 606 -582 -768 41 635 -225 -1103 197 838 -262 -1248 -160 829 143 -750 -439 1041
3419 1041 -74 -833 -392 590 504 -540 -369 668 562 -452 -504 535 856 -137 -779 520 725 -329
3437 -329 -536 -85 892 165 -632 -76 937 287 -508 -86 741 390 -759 -729 763 421 -764 -676 429
$$ packed form
3310a045J786L90j302q27J325R83j559q27J327O62j048r35R97J552j399r79N65
3327c34J469o21j438Q09R98l31j532M80J406L5j620k4J517q2j458j24J538J46
3345H34j044o93R72P12r28r91J189R76p95j268J041R58n82j479N17J446k19j228
3363e82J47J342k22j194j8Q45L07j118j55J046N61j339m77O73J276j166j018J093
3381AQ43j089r06P88J293j088r39P54P93o9j390L47J188q8j284o5J499Q7j668
3400i93R2J172L35j188j86Q09N94q60q78J300O41j100r86J088R89o86q93L11J480
3419A041j115p59M41R82q6j044J71J037j06j014n2J039L21r93o42J299K05j054
3437c29k07M51R77p27p97N56J013o50p95M22Q27l51j149L0J492l42j185Q8J105
$$ plain form
3456 429 653 -444 -677 702 556 -202 -530 668 899 -194 -568 168 771 67 -606 37 972 344 -660
3475 -660 -197 807 268 -502 -157 643 374 -691 -656 820 475 -478 -521 687 803 -103 -567 555 882
3494 882 -246 -923 381 912 -320 -763 43 1053 162 -789 -272 565 121 -641 -221 924 692 -975
3512 -975 -197 347 397 -908 -814 325 403 -648 -626 67 731 -379 -893 41 682 -173 -1008 -36 573 63
3532 63 -891 -401 667 28 -736 -391 588 132 -875 -516 348 579 -870 -558 319 434 -636 -396 578
3551 578 769 -163 -433 222 945 -258 -804 240 668 -364 -735 35 975 151 -575 -336 631 337 -572
3570 -572 -410 750 454 -596 -629 688 515 -443 -381 105 565 -363 -685 232 920 46 -720 71 743 -252
3590 -252 -743 -134 490 121 -413 -35 1022 271 -869 -323 633 286 -379 -203 843 704 -508 -623 34
$$ packed form
3456D29K24j097k33J379j46p58l28J198K31j093l74P36O03p04o73O43R35o28j004
3475f60M63J004n39p70L45Q00k69j065L5J476l45r53m3J208J16r06m64J122L27
3494H82j128o77J304N31j232m43Q06J010q91r51N17Q37m44p62M20J145k32j667
3512i75P78N44N0j305R4J139P8j051K2O93O64j110n14R34O41q55q35R72O09n10
3532F3r54M90J068o39p64L45R79m56j007L59Q64K31j449L12Q77J15j070K40R74
3551E78J91r32k70O55P23j203n46J044M28j032l71P70R40q24p26K39R67k94r09
3570e72J62J160k96j050l3J317j73r58O2M86M60r28l22R17O88q74p66P91O72r95
3590b52m91O09O24l69n34L78J057p51j140N46R56l47o65J76J046j39j212j15O57
$$ plain form
3609 34 732 -45 -358 232 953 114 -886 383 1000 -73 -226 50 661 311 -641 -174 577 238 -615
3628 -615 -11 590 476 -444 -433 697 768 -859 -341 586 512 -765 -625 248 367 -380 -808 -78 742 51
3648 51 -870 168 598 -8 -890 -24 407 95 -697 -176 604 45 -712 -227 553 279 -472 -526 173 413
3668 413 -397 -665 4 462 -269 -603 -4 630 -111 -763 -35 556 -20 -682 161 280 -65 -599 -72 408
3688 408 177 -596 -252 391 349 -529 -499 461 248 -530 -476 16 397 12 -235 422 954 -161 -362 -270 364
3709 364 -108 -680 -336 717 177 -567 -119 813 235 -553 -142 411 584 -459 -505 683 430 -128 -308
3728 -308 647 673 -172 -128 365 416 11 -274 418 708 199 -385 27 872 255 -509 -162 661 104 -458 -414
3749 -414 334 123 -287 -381 268 256 -422 44 155 455 -453 -465 153 339 -304 -531 141 618 -299 -611 136
$$ packed form
3609C4O98p77l13N90P21q39j000J269O17j073j53K76O11l50r52M67P51l39q53
3628f15O04O01j14r20J1J130P1j627N18R27p4j277J40Q73J19p47m28P30Q20o91
3648E1r21J038M30o06q82Q66M31l12p92N21P80n59p57M85P80k74p51n4O99K40
3668D13q10k68O69M58p31l34N99O34p41o52P28N91n76o62Q43J19l45n34N27M80
3688D08k31p73L44O43m2q78L0R60k13p78N4M92L81l85k47O57N32j115k01R2O34
3709C64m72n72L44J053n40p44M48R32n78p88M11N53J73j043m6J188k53n58j80
3728c08R55K6q45M4M93N1m05k85O92K90n09n84M12Q45o17p64L47Q23n57n62M4
3749d14P48k11m10r4O49j2o78M66J11L00r08j2O18J86o43k27O72M77r17l12P47
$$ plain form
3770 136 295 129 -522 184 419 7 -513 -264 622 279 -498 -334 363 344 -504 -376 429 468 -20 -506 221
3791 221 515 -399 -644 47 181 -271 -630 219 279 -69 -691 88 215 -78 -674 -225 345 -209 -363 -49
3811 -49 343 223 -597 -714 -26 177 -92 -570 394 88 -324 -705 298 81 -91 -325 -58 341 -81 -385
3831 -385 -337 811 220 -411 -231 688 137 -173 -94 119 196 -411 -421 360 289 -193 -180 297 585 264 -221 234
3853 234 692 -180 -335 180 771 -231 -358 41 717 -154 -101 -65 325 11 -550 -117 275 441 -678 -79
3873 -79 357 141 -215 -294 157 406 -338 -554 309 371 -180 -172 -50 478 253 -463 17 320 -34 -502 -144 335
3895 335 344 -286 -203 391 116 -421 -133 222 50 -317 -251 339 246 -335 -394 -42 289 -121 -377 278 174 25
3917 25 -581 -15 -167 -48 -489 106 247 -17 -405 -197 518 -45 -367 -196 430 116 -75 -264 250 430
$$ packed form
3770A36J59j66o51P06K35m12n20K49Q86l43p77J64O97j9q48J28Q05L9m88m86P27
3791B21K94r14k45O91J34m52l59Q49O0l48o22P79J27k93n96M49N70n54j54L14
3811d9L92j20q20j17O88K03k69m78R64l06m12l81J003k17j72k34K67L99m22l04
3831c85M8J148n91o31J80R19n51l10P9K13P7o07j0P81p1m82J3M77K88l21m85M55
3853B34M58q72j55N15N91j002j27L99O76q71N3L6L90l14n61M33L92J66j119N99
3873g9M36k16l56p9M51K49p44k16Q63O2n51QJ22N28k25p16M80L03l54m68L58M79
3895C35Ro30Q3N94k75n37K88L55j72l67O6N90r3n81n9L52L31m10k56O55j04j49
3917B5o06N66j52J19m41N95J41k64l88K08P15n63l22J71O26l14j91j89N14J80
$$ plain form
3937 430 -389 -229 -122 521 -433 -450 220 502 -276 -121 108 480 -192 -350 12 363 -30 -449 41 158
3957 158 209 -472 -11 448 119 -277 -33 379 587 -32 -21 72 347 -50 -57 526 372 -211 -163 19 542 40
3979 40 -151 108 357 100 -517 -46 559 33 -57 -207 219 175 -231 -11 -16 274 -116 -183 6 439 56 -305
4001 -305 269 169 -156 -336 130 341 8 -256 42 188 -103 -204 -161 297 -16 -52 13 135 367 157 106
4022 106 201 299 -231 -236 184 20 115 -209 -25 41 45 -319 -46 345 -120 -243 -6 144 -194 -434 -440 267 -43
4045 -43 -160 -243 189 180 -205 -288 153 102 -391 -393 55 142 -293 -433 165 215 -80 -199 69 561 -59 -335 32
4068 32 332 134 -404 3 78 -76 -348 113 278 55 -283 -174 256 340 -16 -382 337 193 181 -305 14
4089 14 300 -81 -198 -14 574 -531 -238 86 390 77 -161 -154 239 95 -307 -122 349 286 221 -63 220
$$ packed form
3937D30q19J60J07O43r54j7O70K82p78J55K29L72o72j58L62L51l93m19M90J17
3957A58N1o81M61M59l29l96K44M12K08o19J1R3K75l97pN83j54n83M8J82N23n02
3979D0j91K59K49k57o17M71O05n26r0j50M26m4m06K20nK90l90o7J89M33l83l61
4001c05N74j00l25j80M66K11l33k64K98J46k91j01M3M58l13l6O5J22K32k10n1
4022A06R5R8n30nM20j64R5l24J84O6Ml64K73L91m65j23K37J50l38k40oP07l10
4045d3j17q3M32rl85q3M41n1m93kM48Q7m35j40N98N0k95j19K68M92o20k76L67
4068C2L00j98n38M07P5j54k72M61J65k23l38J09M30Q4l56l66P19j44j2m86L19
4089A4K86l81j17J84N88j105K93L24L04l13k38PL93j44m02J85M71o3o5k84K83
$$ plain form
4110 220 301 56 -161 204 198 -328 -451 370 156 -133 -32 -36 305 -149 -408 21 121 -77 -190 191 525 55
4132 55 -232 169 109 236 16 -73 161 127 -370 -145 288 444 -220 -305 359 -6 -34 -253 252 352 80 -296
4154 -296 64 537 3 -485 37 244 -106 -377 -5 369 -37 -223 -320 187 149 -85 -285 131 248 -400 -220
4175 -220 327 552 -259 -283 -126 177 -252 -404 43 179 10 -483 -160 216 -57 -197 -255 231 -167 -514 -99
4196 -99 383 226 -83 -580 335 157 -408 -208 208 247 59 -143 134 181 186 -245 220 352 196 -23 -87 316
4218 316 -214 -245 -5 437 16 56 236 224 5 -370 -8 377 115 -153 -346 206 151 -136 -53 228 370 -503
4240 -503 -265 350 39 -107 -269 -79 158 147 -278 153 552 330 -262 -54 316 212 -231 179 373 294 -86
4261 -86 -189 282 194 -134 -445 373 458 -11 -178 59 288 -87 -412 -15 191 54 -489 -139 313 -283 -375
$$ packed form
4110B20Q1k45k17L65on26j23Q21k14k89J01mL41m54k59M29J00j98j13L81L34m70
4132E5k87M01o0J27k20q9K34l4m97K25M33J56o64q5O64l65k8k19N05J00k72l76
4154b96L60M73n34m88N22K07l50k71L72L74m06j86r7N07l8k34k00M16J17o48J80
4175b20N47K25q11k4J57L03m29j52M47J36j69m93L23L76k73j40n8M86l98l47M15
4196i9M82j57l09m97R15j78n65K00M16L9j88k02K77M7Nm31M65J32j56k19o4M03
4218C16n30l1K40M42m21M0J80j2k19l75L62L85k62k68j93N52n5k87Q3K81J42q73
4240e03K38O15l11j46j62J90K37j1m25M31L99k22n92K08L70j04m43M10J94p9l80
4261h6j03M71q8l28l11Q18Q5m69j67K37K29l75l25L97K06j37n43L50M52n96r2
$$ plain form
4282 -375 -107 377 115 -327 -233 445 241 -195 -133 136 76 -155 -3 -140 342 -218 -132 30 -62 -72 35 284
4304 284 -58 -96 -115 10 285 255 -74 -7 160 -1 139 -236 181 131 -204 -229 442 178 -477 -233 -69 78
4326 78 -220 -224 203 369 143 -53 67 377 90 -133 -45 355 195 -170 -53 138 12 -342 307 157 220 -323
4348 -323 -120 93 186 -270 -327 150 97 1 -279 110 241 -129 -32 9 8 21 -46 124 336 -116 -285 137 179 31
4372 31 -321 -178 265 167 -194 -87 279 275 -419 -50 -55 228 -25 -84 209 233 -76 -166 253 82 92 -198 67
4395 67 282 18 -450 -109 116 60 -291 -22 416 203 -174 -99 425 283 3 -30 -62 235 -178 -254 233 154
4417 154 -172 -424 114 172 32 -327 -225 1 -138 -179 -109 211 117 -506 -254 218 2 -91 160 141 215 -143
4439 -143 -410 53 398 -280 -96 226 -39 -362 -245 109 501 40 -94 391 104 369 -246 -123 240 -155
$$ packed form
4282c75K68M84k62m42R4O78k04m36O2K69o0k31J52j37M82n60Q6J62r2j0J07K49
4304B84l42l8j9J25K75l0l29O7J67j61J40l75M17n0l35k5O71k64o55K44J64J47
4326G8k98mM27J66k26j96J20L10k87k23Q8M00j60l65J17J91j26l54O49j50O3n43
4348c23K03K13R3m56n7M77n3r6k80L89J31l70R7M1jJ3o7J70K12m52j69M22M2j48
4372C1l52J43M43r8l61J07L66mo94L69nK83k53n9K93K4l09r0M19j71J0k90K65
4395F7K15k64m68L41K25n6l51K69M38k13l77P5N24j42k80l3l2K97m13p6M87p9
4417A54l26k52N38N8j40l59J02K26j39m1P0L20r4o23K52M72k16r3K51j9P4l58
4439a43k67M63L45o78J84L22k65l23J17L54L92m61j34M85k87K65o15J23L63l95
$$ plain form
4459 -155 -309 -75 56 -142 -101 13 166 92 -187 -62 194 -117 -393 50 -9 -3 -182 -45 174 -204 135 -274
4481 -274 287 269 -92 -50 -47 241 -156 -203 68 338 -127 28 85 281 72 -82 -261 340 215 -127 -192 459
4503 459 260 -489 -4 237 140 81 -116 234 228 79 49 299 122 43 -45 -271 582 -37 -386 -48 149 -138
4525 -138 -258 121 237 49 -197 27 262 252 -112 -216 156 510 -270 31 299 192 65 -214 -81 62
4545 62 -96 -10 146 290 -138 5 107 147 187 -190 -118 -187 -123 -112 -168 130 156 -197 -56 433 89 -130 80
4568 80 21 84 -261 -287 -54 313 -9 -67 33 58 -463 -257 -264 204 99 -101 -481 168 -21 -114 96 11 23 -332
4592 -332 -32 40 277 146 -119 250 125 -242 157 130 52 -30 -8 7 129 -206 -332 -55 -93 151 119 151 230
4615 230 154 -241 27 381 -25 157 -232 467 88 294 -126 89 110 42 -40 339 195 98 -1 -121 293 -101
$$ packed form
4459a55j54K34J31j98M1J14J53p4k79J25K56l11k76M43n9Oj79J37K19l78L39m09
4481b74N61j8l61M2LK88l97m7K71K70m65J55N7J96k09j54j79O01j25l42o5O51
4503D59j99p49M85K41r7n9j97L50oj49l0K50j77p9q8k26Q53o19l49L38J97k87
4525a38j20L79J16j88k46K24K35j0l64j04L72L54p80L01K68j07j27k79J33J43
4545F2j58Q6J56J44m28J43J02M0M0l77P2o9O4J1n6K98K6l53J41M89l44k19K10
4568H0n9O3l45k6K33L67l22n8J00K5n21K06pM68j05k00l80O49j89r3K10q5J2l55
4592c32L00P2K37j31k65L69j25l67L99k7p8q2K2J5J22l35j26K77l8K44l2L2P9
4615B30p6l95K68L54m06J82l89O99l79K06m20K15K1o8q2L79j44r7r9j20M14l94
$$ plain form
4637 -101 -398 10 159 -282 -42 274 127 230 -269 -64 -115 186 37 142 168 -83 -78 -274 -323 364 -38 -76
4659 -76 27 329 -125 73 313 34 -4 -125 17 142 287 -104 80 206 211 -64 -75 105 112 -178 -34 51 203
4682 203 -230 -59 270 48 -52 -193 114 132 132 -53 223 125 -233 -266 227 235 -307 -252 -284 129 -241 -153 -108 158
4706 158 85 -19 15 253 79 -179 -298 102 186 -40 -246 73 247 -328 -199 81 -115 -49 454 -4 -169
4727 -169 -221 -335 193 17 94 -207 -230 52 100 180 -17 -12 -124 -83 -370 259 57 -229 -24 145 321 154 -116
4750 -116 79 -138 33 -118 402 -66 204 -77 -76 138 73 -24 50 339 -171 -173 39 223 391 -268 77 41 168
4773 168 -236 -151 49 440 -156 44 148 -142 -261 -132 52 60 -64 -35 -109 -101 34 -57 -81 -94 -72 -86 300 180
4797 180 3 136 -174 139 -3 -165 -73 -18 -124 -162 -102 12 -15 -208 -135 171 85 -33 -182 33 100 81 34
$$ packed form
4637a01k97M08J49m41K40L16j47J03m99K05n1L01j49J05K6k51Nj96m9O87m02l8
4659g6J03L02m54J98K40k79l8j21J42J25J45l91J84J26Nk75j1J80Pk90J44Q5J52
4682B03m33J71L29k22j00j41L07J8%j85K76r8l58l3M93Qn42N5l2M13l70Q8M5K66
4706A58p3j04L4K38j74k58j19M00Q4k26k06L19J74n75J29K80j96O6N03m58j65
4727a69n2j14N28j76P7l01k3K82M8Q0j97Nj12M1k87O29k02k86K05J69J76j67k70
4750a16J95k17J71j51N20m68K70k81JK14o5r7P4K89n10kK12J84J68o59L45l6J27
4773A68m04Q5K00L91n96K00J04k90j19J29J84Qj24K9p4QJ35r1k4j3K2j4L86j20
4797A80j77J33l10L13j42j62R2N5j06l8O0J14k7j93P3L06q6j18j49K15O7j9m7
$$ plain form
4820 34 277 27 87 -110 -393 519 130 -270 -162 139 -229 -155 89 363 177 206 35 257 86 -39 -229
4841 -229 -167 -39 -148 -196 286 141 437 -95 74 171 39 -14 142 -39 -25 -131 -258 -65 -232 51 161 10
4863 10 298 -57 -190 93 -162 -193 12 -197 -74 154 -207 -71 -4 -194 -420 -45 428 26 -149 85 72
4884 72 30 -53 -102 -176 -16 -145 289 302 143 216 -204 -170 81 -292 -243 24 71 66 112 98 117 -39 -361 -6 -192
4909 -192 -41 -324 108 -35 0 292 -47 371 293 95 80 43 97 -165 -213 -18 111 -101 -46 189 186 31 38 84
4933 84 186 169 151 6 50 -38 -52 -305 -94 -68 -101 268 75 -122 -149 311 -193 83 228 -274 -60 94 47
4956 47 -29 -69 -78 -289 155 -217 42 119 164 -285 95 166 -153 24 -314 -124 -256 21 155 69 -393 18 -116
4979 -116 185 -315 -64 -130 -46 -178 -306 -118 28 -115 -124 116 -53 257 -51 323 76 -168 79 -98 29
$$ packed form
4820C4K43k50O0j97k83R12l89m00J08L01l68P4K44K74j86K9j71K22j71j25j90
4841b29O2J28j09m8M82j45K96n32J69R7j32n3J56j81J4j06j27J93j67K83J10j51
4863A0K88l55j33K83k55l1K05k09J23K28l61J36O7j90k26L75M73m02j75K34j3
4884G2m2q3m9p4J60j29M34J3j59P3m20L4K51l73M9K67M7nM6j4J9j56l22L55j86
4909a92J51k83M32j43L5K92l39M18p8j98j5l7N4k62m8J95J29k12N5K35lj55PM6
4933H4J02j7j8j45M4q8j4k53K11K6l3L69j93j97k7M60n04K76J45n02K14J54m7
4956D7p6m0rk11M44l72K59P7M5m49L80P1l19J77l38J90j32K77J34q6m62M11j34
4979a16L01n00K51o6Q4j32j28J88J46j43rK40j69L10l08L74k47k44K47j77J27
$$ plain form
5000 29 8 -321 1 155 -11 1 -123 85 135 -31 -57 110 -48 -165 -318 126 209 -18 53 187 -56 228
5022 228 -191 -138 137 112 76 10 77 72 143 -15 102 124 -171 59 -126 65 -53 -37 161 -9 6 38 208 31
5046 31 -73 55 -235 -19 -146 -142 179 -254 92 104 -66 64 -165 3 -243 -29 -55 -292 -128 263 43 -145
5068 -145 -214 141 -102 -222 -191 69 214 -244 1 9 -54 86 -125 -151 60 183 -60 365 -118 21 -380 88
5090 88 113 -55 -7 -57 -73 -118 -122 57 -15 -119 9 40 205 -20 100 199 236 270 -210 -86 287 199 298 131 33
5115 33 63 80 -127 166 144 57 -14 41 157 76 -209 -9 -87 196 -450 -212 -74 148 233 -64 37 27 138 -74
5139 -74 -77 -35 16 76 225 227 -148 -187 -77 -290 -2 -225 -141 52 155 0 -13 1 185 -450 -98 113 -105 88
5163 88 -30 105 182 122 59 71 22 190 -7 54 20 -50 5 -370 325 101 -141 140 77 230 -192 271 258 58
$$ packed form
5000B9k1l29L22J54j66J2j24K08N0j66k6J67j58j17j53M44Q3k27P1J34k43K84
5022B28m19N3K75k5l6o6O7nP1j58J17K2k95K30j85J91j18J6J98j70J5L2J70j77
5046C1j04J28k90K16j27ML21m33L46J2j70J30k29J68k46K14k6k37J64L91k20j88
5068a45o9L55k43j20L1K60J45m58K45Qo3J40k11k6K11J23k43M25m83J39m01M68
5090H8K5j68M8n0j6m5mJ79p2j04J28L1J65k25J20R9L7L4m80J24L73q8R9j67r8
5115C3L0J7k07K93k2q7p1N5J16q1k85K00p8K83o46K38J38K22Q5k97J01j0J11k12
5139g4lM2N1O0J49Kl75l9J10k13K88k23Q4J93J03j55j3J4J84o35L52K11k18J93
5163H8j18J35P7o0o3J2m9J68j97O1l4p0N5l75O95k24k42K81o3J53m22M63j3k00
$$ plain form
5187 58 -147 -191 -137 102 41 250 -20 316 26 -3 -152 -86 14 -191 223 183 99 -110 -90 -127 -25 102 36 222
5211 222 -86 56 219 -146 -43 -55 196 106 -120 137 350 280 -119 -251 197 271 -38 -110 -113 -33 -83 -153 -19
5234 -19 -194 40 -73 13 -156 -85 -52 -31 2 66 80 -26 296 43 26 14 143 -269 43 -149 -6 179 116 -54
5258 -54 -335 -85 259 66 -128 -164 -144 -192 230 276 133 -17 -234 -81 11 -223 93 39 -196 52 220 -32
5280 -32 -323 -39 164 165 205 36 -318 159 296 16 -110 -65 149 74 -57 -190 281 19 133 -213 -558 297
5302 297 -248 -249 15 -150 -234 3 -138 39 -259 -211 -37 26 24 -183 -160 114 -77 30 24 34 -119 -67 40 -216
5326 -216 207 183 220 -23 103 4 114 -52 -41 145 91 159 202 -261 18 176 54 -175 -128 -113 -6 -17 13 -69
5350 -69 -144 -92 -50 109 -55 -28 -1 -200 196 -115 137 -183 255 -17 38 181 135 266 -205 8 -63 -72 -122 103
$$ packed form
5187E8k05m4N4K39o1K09k70L36k90k9j49O6J00k05M14m0q4k09K0l7J02J27o6J86
5211B22l08J42J63l65J03j2K51r0k26K57K13p0l99j32M48P4l09p2lQ0n0p0J34
5234a9j75K34j13Q6j69P1L3K1L3O4J4j06L22k53j7j2J29m12L12j92J43J85o3j70
5258e4k81K50L44j93j94l6K0m8M22M6j43j50k17J53R2k34L16n4k35K48J68k52
5280c2k91K84K03JM0j69l54M77J37k80j26M5K14p5j31j33M71k62J14l46l45Q55
5302B97n45jK64j65q4K37j41J77k98M8J74O3kk07K3K74j91J07oJ0j53N2J07k56
5326b16M23k4L7k43J26r9J10j66J1J86n4O8M3m63K79J58j22k29M7J5J07j1L0q2
5350f9p5N2M2J59j64K7K7j99L96l11K52l20M38k72N5J43m6J31m71K13p1rn0K25
$$ plain form
5374 103 -110 122 54 -53 33 120 -64 -25 261 249 70 4 -75 -73 136 -33 40 -69 -14 221 281 192 -297 -167
5398 -167 -124 -7 63 164 -45 -100 253 241 -138 280 87 24 36 -208 172 -90 -40 80 -255 65 -78 65
5420 65 97 -102 -147 -80 -48 105 -201 -61 317 7 -109 -147 16 124 33 224 -175 -237 44 -65 367 -172 -87
5443 -87 -305 164 -22 -111 -156 -181 -5 -76 288 11 196 -50 -70 -89 42 72 119 -42 -28 124 -83 396 249
5466 249 -172 -149 -236 26 114 -79 189 57 38 -201 20 -47 -47 -41 8 -118 -156 -86 68 26 -193 -95 131 168 -111
5491 -111 -47 -237 -86 60 104 -43 34 -46 -167 22 -205 -67 -74 51 134 78 165 -177 182 -134 150 211 56
5514 56 93 197 65 107 120 172 190 -3 109 37 9 118 252 294 120 -1 -136 -55 -201 -89 -82 80 -105 129
5538 129 138 115 -56 -54 88 161 443 -70 81 -91 24 78 55 5 24 -98 62 -18 75 237 40 -40 68 -20 104
$$ packed form
5374A03k13K32o8j07Q6Q7j84L9K86j2j79o6p9KK09j69P3j09N5K35O0q9m89J30
5398a67M3J17P0J01k09n5L53j2l79M18j93o3J2k44L80k62N0J20l35L20j43J43
5420F5L2j99m5O7L2J53l06J40L78l10j16l8J63J08r1J91l99o2K81j09M32n39Q5
5443h7k18M69j86q9m5k5J76p1L64k77J85k46k0j9J31L0M7j61J4J52k07M79j47
5466B49m21K3q7K62Q8j93K68j32j9k39K21o7%OM9j26l8P0J54m2k19R8K26L7k79
5491a11O4j90J51J46M4j47P7q0j21J89k27J38pJ25Q3n6Q7l42L59l16K84O1j55
5514E6L7J04j32M2J3N2J8j93J12p2k8J09J34M2j74j21j35Q1j46J12PJ62j85K34
5538A29Rk3j71KJ42P3K82n13J51j72J15N4k3n0J9j22J60q0R3J62j97q0J08q8J24
$$ plain form
5563 104 15 129 -9 -236 -240 272 -257 -244 -86 -39 73 -187 -11 48 186 -175 -56 123 174 119 -258 -7 -103
5586 -103 -171 70 -3 19 -141 29 -183 -53 -134 -172 -77 360 16 244 237 -57 50 -30 -169 -87 289 -48 159
5609 159 78 -112 36 -162 -74 136 43 -73 35 -28 -116 185 -29 101 149 -23 -52 -172 155 47 -221 -19
5631 -19 -2 -250 292 9 -112 250 -129 -92 158 104 78 535 -9 46 -42 -44 167 -11 -82 -29 435 6 -289 -21
5655 -21 15 6 186 -155 -116 9 41 -138 -3 117 -157 -114 -42 12 102 163 57 -125 -117 -131 22 -4 -10 137 -36 203
5681 203 58 230 -220 -101 -99 87 45 -6 -58 275 -82 -70 -11 88 -237 -110 -351 -188 126 -35 369 -50 19
5704 19 -90 -47 115 -191 -240 28 59 -167 -46 -106 246 114 -229 61 -129 -89 8 82 26 -57 122 -28 -39 214
5728 214 -226 4 152 -329 -141 -255 17 -46 -205 -16 -100 78 228 110 149 207 97 -27 55 26 -214 -124
$$ packed form
5563A04q9J14j38k27mN12n29J3J58M7J12k60J76N9J38l61J19J79N1n5l77K51r6
5586a03o8K41p3K2j60J70k12J30q1l8R5M37l44K28pk94J07q0j39Q2L76l37K07
5609A59q1j90J48j98Q8K10r3j16J08o3q8L01k14J30M8j72k9j20L27j08k68K02
5631a9J7k48N42k83j21L62l79L7K50n4k6M57n44N5q8kK11j78p1N3M64m29k95K68
5655b1L6rJ80l41L9J25L2j79J35J20k74M3P2N4R0O1j06j82Qj4J53k6oJ47j73K39
5681B03j45J72m50J19KJ86m2n1n2L33l57J2N9R9l25J27k41J63L14j61M04m19O9
5704A9j09M3J62l06m9K68L1k26J21o0L52j32l43K90j90M0R7P4n6q3J79j50j1K53
5728B14m40K30J48m81J88j14K72o3j59J89q4J78J50j18L9N8j10j24Q2k9k40R0
$$ plain form
5750 -124 34 100 68 -198 128 -62 31 -46 218 -16 127 -49 257 2 92 166 6 -246 8 121 22 25 -13
5773 -13 -236 94 96 214 88 3 242 -144 -163 -178 -241 110 4 -340 35 140 -294 17 45 -423 -9 -117 -133
5796 -133 235 -63 -85 -8 -92 560 -164 215 35 86 92 -235 211 302 -197 -307 185 -81 311 -27 9 -304 162
5819 162 128 -83 163 -101 96 -42 362 43 212 -208 -119 368 -87 13 121 -75 8 11 140 133 -14 -204
5841 -204 57 17 -262 -520 221 454 -19 -234 258 -176 151 -25 -102 3 -231 -67 -51 -149 63 181 -225
5862 -225 -276 -16 -66 -72 -67 32 -207 165 9 -22 61 4 -15 8 132 -163 9 134 -1 -213 -48 12 -465 -117
5886 -117 -63 355 -160 -147 -57 38 44 -226 36 96 220 -302 -31 52 236 109 -258 -102 73 295 164 175 35
5909 35 99 -20 95 153 141 -33 -20 395 400 -106 121 60 349 -172 -185 -163 -124 51 -47 38 187 108 -20 321 -64
$$ packed form
5750a24J58O6l2k66L26j90R3p7K64k34J43j76L06k55R0P4j60k52K54J13r9Ll8
5773a3k23L30KJ18j26q5K39l86j9j5o3L51j06l44L75J05m34L11K8m68M14j08j6
5796a33L68k98k2P7q4O52p24L79j80N1Ol27M46R1m99j10M92k66L92l38L6l13M66
5819A62l4k11K46k64J97j38M04l19J69m20Q9M87m55J00J08j96Q3LJ29pj47j90
5841b04K61m0k79k58P41K33m73k15M92m34L27j76p7J05k34J64J6r8K12J18m06
5862b25n1K60n0oNR9k39L72j56l1Q3n7j9K3J24k95J72J25j35k12J65O0m77L48
5886a17N4M18n15J3R0R5Ok70K62O0J24n22K71Q3J84j27l67J56J75K22j31J1j40
5909C5O4j19J15N8j2j74J3M15Nn06K27o1K89n21j3K2L9J75r8Q5J49p9j28L41l85
$$ plain form
5934 -64 -177 -221 -209 -211 61 -37 216 86 93 -113 -150 20 208 -337 10 -176 4 -27 -8 -296 -242 -164 -65 -32 47
5959 47 -125 -48 31 26 145 -204 196 -14 262 201 150 -17 173 -140 91 -122 127 -34 -486 52 98 -224 -149
5982 -149 56 349 111 71 125 -40 -134 180 96 67 -66 -68 -91 105 -195 85 253 77 40 14 176 221 -73 -35
6006 -35 -208 65 152 0 -26 197 268 12 -56 269 146 224 -270 257 201 101 -443 -8 115 -255 -33 -44 223
6029 223 169 -95 -32 225 12 -196 -187 19 -200 -352 -16 -206 -77 -72 -305 -52 -274 -176 172 -82 238 105
6051 105 119 -96 49 -50 -3 49 39 -28 85 -64 183 -212 3 61 96 -11 20 1 118 -74 32 64 150 35
6075 35 94 -44 91 138 251 -30 -11 103 -55 -386 168 101 15 -355 17 -1 79 187 -176 -85 275 34 31 73
6099 73 245 35 -97 0 49 198 111 296 177 68 137 35 32 -402 39 61 -7 112 -289 88 54 73 -94 161
$$ packed form
5934f4j13m4J2kK72r8K53j30Pk06l7J70J88n45L47j86J80l1J9k88N4P8R9L3P9
5959D7j72P7P9nJ19l49M00k10K76o1n1j67J90l13K31k13K49j61m52N38M6l22P5
5982a49K05K93k38m0N4j65r4L14q4k9j33kk3J96l00K80J68j76l7k6J62M5k94L8
6006c5j73K73Q7j52k6K23P1k56o8L25j23P8m94N27n6j00n44M35J23l70K22j1K67
6029B23n4k64O3K57k13k08RK06k19j52L36j90J29Nk33K53k22R8L48k54L20j33
6051A05J4k15J45r9M7N2j0o7J13j49K47l95K15N8L5j07L1j9J17j92J06L2Q6j15
6075C5N9j38J35M7J13k81J9J14j58l31N54o7q6l70L72j8Q0J08l63R1L60k41lM2
6099G3J72k10j32R7M9J49q7J85j19j09O9j02lm34M41K2o8J19m01L77l4J9j67K55
$$ plain form
6123 161 -61 -52 97 216 143 35 -160 50 262 135 -31 197 104 263 -18 -135 41 -99 -57 -104 23 -7
6145 -7 -8 12 30 183 -91 -154 113 17 -181 -224 -93 7 -120 153 135 275 38 136 -134 -108 27 61 112 -132 -55
6170 -55 31 12 -95 93 125 -232 29 -18 107 23 -63 131 -163 46 -271 -72 234 186 -134 308 56 -50 -14
6193 -14 161 233 -188 -213 356 -33 292 -110 105 250 225 285 -249 -29 -98 -194 -11 90 30 58 195 -125 131
6216 131 -67 278 119 284 122 -183 169 -157 -119 -45 -44 -14 260 -76 -11 164 -175 -192 -69 83 -80 -50 118
6239 118 -37 67 15 20 368 -51 -15 -116 142 -5 -43 -264 329 -20 -15 221 10 -107 13 -115 70 -120
6261 -120 -37 -37 143 62 42 99 113 21 256 -83 4 -88 119 80 -33 -135 -313 -85 92 280 4 -61 -273 52
6285 52 -12 -11 -60 86 -222 -45 14 53 97 -127 -43 102 -117 -77 0 197 232 -150 132 139 469 149 -124 -157 75
$$ packed form
6123A61k22RJ49J19p3j08j95K10K12j27j66K28r3J59k81j17J76j40M2m7J27l0
6145gjK0J8J53k74o3K67r6j98m3J31J00j27K73j8J40k37R8k70K6J35L4N1k44P7
6170e5Q6j9j07J88L2l57K61m7J25q4q6J94k94K09l17J99L06m8l20M42k52j06L6
6193a4J75P2m21k5N69l89L25m02K15J45k5O0n34K20o9r6J83J01o0K8J37l20K56
6216A31j98L45j59J65j62l05L52l26L8P4JL0K74l36O5J75l39j7J23J52j63L0J68
6239A18j55J04n2NL48m19L6j01K58j47l8k21N93l49NK36k11j17J20j28J85j90
6261a20Q3%J80q1k0N7J4r2K35l39Q7r2K07l9j13j02j78K28J77J88k76o5k12L25
6285E2o4Jm9J46l08J77N9L9M4k24Q4J45k19M0P7J97L5l82K82PL30l20k73l3K32
$$ plain form
6310 75 34 -160 143 10 54 -107 6 76 -106 -179 85 -28 100 26 70 -74 40 -419 47 -9 -1 112 162 10
6334 10 -131 131 268 -159 -108 105 -14 -95 -57 -35 -12 -13 -42 70 -70 -138 -171 -226 -164 161 157 -38 22 -278 4
6359 4 -34 131 -130 169 174 -184 228 374 86 -197 159 32 194 17 183 61 192 9 79 186 -18 283
6381 283 -175 -16 85 -68 -25 -173 -57 75 124 17 -31 -132 166 206 0 -31 -165 -190 -147 -393 -20 -28 -6
6404 -6 180 38 64 166 6 -129 65 41 172 -41 -127 -11 -107 -23 -186 2 1 -114 16 -50 -130 -250 -34 -53
6428 -53 82 268 -164 159 184 -467 -13 146 128 -63 -127 -154 201 -38 -151 91 -229 -174 164 -9 -111 -177
6450 -177 29 -137 72 -84 -188 -42 -34 -317 19 -142 -303 209 83 -290 104 117 -116 -273 -235 -122 183
6471 183 -76 46 62 238 -290 1 68 118 51 234 31 319 108 42 -212 40 16 -161 32 92 319 -109
$$ packed form
6310G5m1j94L03j33M4j61J13P0j82p3K64j13J28p4M4j44J14m59M66n6QJ13N0j52
6334A0j41K62J37m27N1K13j19q1L8K2K3jk9J12j40o8l3n5O2L25mj95O0l00K82
6359Dl8J65k61K99Nl58M12J46k88k83L56j27J62j77J66j22J31j83P0J07k04L01
6381B83m58J59J01j53M3j48J16J32M9j07m8j01K98M0k06l1j34k5M3k46L73qK2
6404fJ86j42K6J02j60j35J94k4J31k13q6J16r6Q4j63J88jj15J30o6q0j20K16j9
6428e3J35J86m32L23K5o51M54J59j8j91o4k7L55k39j13K42l20N5L38j73j02o6
6450a77K06j66K09j56j04J46Qk83L36j61j61N12j26l73L94J3k33j57L8J13L05
6471A83k59J22J6J76n28K91O7N0o7J83k03K88k11o6k54K52k4j77J93O0K27m28
$$ plain form
6493 -109 147 -145 232 73 -301 170 171 -16 -38 109 133 123 -169 301 -37 103 -241 -9 43 -200 140 -64
6515 -64 139 49 12 120 233 187 -13 47 41 -43 -305 -1 172 92 -195 166 107 -105 -38 -293 -11 88 -27 117
6539 117 -104 -185 8 -7 -227 -184 53 125 -184 179 286 -425 113 22 217 -39 -154 186 -16 163 129 234
6561 234 -111 131 16 -113 174 119 31 -277 10 244 -1 234 233 143 85 -254 -45 307 -68 -225 -26 154
6583 154 -130 -48 36 -126 0 -48 29 -7 170 -123 -26 -359 -90 -173 41 64 240 -30 -274 -18 277 -196 58
6606 58 16 -59 283 122 -190 219 29 -1 130 70 134 -172 126 86 -97 243 515 -110 78 -14 -65 357 113
6629 113 31 108 13 279 35 -152 -114 331 -159 116 -9 18 44 -46 -261 -163 -5 267 -70 297 350 135 42
6652 42 -67 -202 51 89 270 122 -4 -15 -248 68 70 -192 -72 75 217 32 35 -144 -188 131 299 187 -43
$$ packed form
6493a09K56k92L77j59l74M71Jj87k2J47K4j0k92M70l38J40l44K32N2k43L40k04
6515f4K03r0l7J08J13m6k00O0oq4k62L04J73q0k87L61n9k12O7k55K82R9j15J44
6539A17k21q1J93j5k20M3K37P2l09L63J07p11N38r1J95k56j15L40k02J79l4J05
6561B34l45K42j15j29K87n5q8l08K87K34k45K35jr0n8l39K09L52l75j57J99J80
6583A54k84Q2Q4j62J26m8P7l6J77k93R7l33K69q3K14K3J76k70k44K56K95m73K54
6606E8m2p5L42j61l12M09j90l0J31o0O4l06K98m0j83L40K72o25J88r2n1M22k44
6629A13q2P7r5K66k44j87L8M45m90K75j25K7K6r0k15R8J58K72l37L67N3k15r3
6652D2j09j35K53L8J81j48j26j1k33L16Kk62J20J47J42j85Lj79m4L19J68j12k30
$$ plain form
6675 -43 31 53 -136 111 -177 -137 -170 31 -53 47 108 206 13 196 184 10 121 -260 364 103 119 55 -201 -21
6699 -21 94 -164 -369 -85 -173 -45 -165 -245 146 -74 -157 -61 103 109 101 66 -71 -53 -253 -445 113 -83 -63 -220
6723 -220 -10 -97 -61 -141 154 -237 -50 118 -78 173 -162 -75 196 -153 -355 -171 41 -36 193 226 17 240
6745 240 138 127 -41 -74 87 -290 182 245 -85 -117 13 216 92 -152 106 -281 69 -217 48 -96 -47 8
6767 8 -28 49 -27 -131 58 -134 -63 228 -25 -231 135 17 -31 -247 162 -49 -69 52 14 -9 -11 -62 6 68 17
6792 17 -128 -47 -159 55 90 -193 -15 63 166 -50 -93 -76 -142 -55 7 -330 -316 -199 100 -194 -41 -103 -43 -396
6816 -396 45 82 144 97 9 -89 -38 223 198 73 127 -56 86 -106 123 245 -103 68 -115 17 -19 -153 -244
6839 -244 -80 -122 -295 -162 279 -146 324 221 26 -158 124 -134 158 274 -5 -110 -222 108 64 -204 126
$$ packed form
6675d3P4K2j89K47k88M0l3K01q4J00O1R8j93J83j2j74J11l81O24k61J6o4k56J80
6699b1J15k58k05K84q8J28j20q0L91k20q3R6J64Oql5j37J8k00j92N58j96K0j57
6723b20K10q7L6q0K95l91J87J68j96K51l35Q7K71l49k02J84K12p7K29L3k09K23
6745B40j02j1j68l3J61l77M72O3l30l2J30K03j24k44K58l87L50k86K65j44M9N5
6767Hl6P7p6j04J89j92P1K91k53k06L66j18m8k16M09k11k0J21l8k3kn1O8O2n1
6792A7j45Q1j12K14L5k83J78P8J03k16m3J7o6Q7O2l37J4J17K99k94J53o2O0l53
6816c96M41L7O2m7q8r8N1K61k5j25N4j83J42j92K29J22l48J71j83J32l6j34r1
6839b44J64m2j73J33M41m25M70j03j95j84K82k58K92J16k79j05j12L30m4k68L30
$$ plain form
6860 126 90 49 -92 -32 131 -24 108 -119 177 -198 -40 -118 77 -296 -33 -189 57 11 -5 -49 -29 15 1
6883 1 365 217 -343 -24 157 29 103 -135 -158 -54 167 257 -122 8 179 -186 114 -152 276 206 -57 -422
6905 -422 -66 116 -86 144 -153 155 -7 272 35 133 130 -174 -28 74 141 112 -103 -64 11 -158 -22 -178
6927 -178 163 -230 -24 19 19 249 -155 19 389 94 -2 126 -104 -3 81 -124 131 42 152 -136 207 20
6949 20 -112 271 -106 -28 -24 157 50 -70 25 85 -235 52 24 159 -37 13 -13 -135 -108 -182 -17 -122 -58 111
6973 111 317 8 -24 50 265 -162 -12 -29 -7 -74 -136 -100 16 -62 54 -28 63 -67 37 121 81 -153 27 34 -312
6998 -312 122 172 108 -501 -86 77 1 -50 -72 115 -117 121 293 -157 88 -3 -285 -83 -69 -22 -112 -202 -52
7021 -52 220 -64 -143 -12 -138 29 -181 66 136 100 -161 -127 -220 182 18 -323 117 -30 31 191 42 44 -150
$$ packed form
6860A26l6m1j41O0J63j55J32k27K96l75J58p8J95l73K63j56K46m6j6m4K0M4j4
6883AL64j48n60L19J81j28P4k38k3J04K21R0l79J30J71l65L00k66M28p0k63l65
6905d22L56J82k02K30k97L08j62K79k37R8ll04J46J02O7k9k15L9P5j69J36j56
6927a78L41l93K06M3%K30m04J74L70k95r6J28k30J01Q4k05K55q9J10k88L43j87
6949B0j32L83l77P8MJ81j07j20R5O0l20K87k8J35j96N0k6j22K7p4J65j05O4J69
6973A11K06l09l2P4K15m27J50j7K2o7o2L6J16p8J16q2R1j30J04Q4m0k34J80Pl46
6998c12M34N0o4o09M15J63p6n1k2J87k32K38J72m50K45r1k82K02J4M7r0r0J50
7021e2K72k84p9J31j26J67k10K47P0l6k61L4r3M02j64l41M40j47O1J60j49Kj94
$$ plain form
7044 -150 301 188 246 -71 0 296 154 122 61 70 392 -40 66 35 -126 137 -434 -118 56 13 97 30 -99
7067 -99 27 0 -11 -156 126 -162 28 108 -260 -32 77 -281 -92 -122 -222 -208 -42 -326 -96 -104 -43 34 -59 -191
7091 -191 -261 -193 340 -288 -68 -188 -18 -61 132 203 40 -105 -201 364 47 -151 -252 0 -111 -212 37 94
7113 94 108 61 -39 80 -79 -69 191 -135 -46 239 190 -71 118 172 -81 307 -111 -292 167 59 -26 -46 -10
7136 -10 127 177 -65 55 -62 273 148 148 -96 3 69 44 141 -2 52 41 -5 -35 51 -30 -187 114 195 -48 50
7161 50 -62 -215 3 -67 -102 29 -83 -84 -74 309 -105 -370 -207 -199 84 228 102 179 39 -111 -34 -54 -27 -89
7185 -89 9 -51 -229 -98 95 265 -174 58 -213 -18 -162 -107 -47 -150 109 -46 141 -49 43 -153 11 193
7207 193 -271 -67 169 -240 -204 174 -514 -120 154 -81 47 95 -418 50 -121 -265 73 162 35 138 103
$$ packed form
7044a50M51j13N8l17P1K96j42l2o1RL22m32J06l1j61K63n71L16J74m3Q4o7j29
7067i9J26k7j1j45K82k88J90Q0l68K28J09l58J89l0j00J4J66k84K30qO1P7r3j32
7091a91p0O8N33o28K20j20J70m3J93P1j63j45r6N65l17j98j01K52j11j01K49N7
7113I4J4m7j00J19j59J0K60l26Q9K85m9k61J89N4k53L88m18j81M59j08q5k0L6
7136a0J37N0k42J20j17L35j25%k44R9O6k5R7j43N4j1m6l0Q6q1j57L01Q1k43R8
7161E0j12j53K18p0l5J31j12jJ0L83m14k65J63QK83J44j26P7j40j50P7k0K7o2
7185h9R8o0j78J31J93J70m39K32k71J95j44N5O0j03K59j55J87j90R2j96J64J82
7207A93m64K04K36m09L6L78o88L94K74k35J28M8n13M68j71j44L38Q9j27J03l5
$$ plain form
7228 103 212 183 -15 -87 2 -313 59 -338 -70 -112 -14 157 -19 211 -50 32 -252 118 -116 -71 6 -81 84
7251 84 147 -32 45 206 65 -29 -90 215 -27 41 -103 -37 115 27 123 -22 64 52 -55 123 108 129 72 69 -155
7276 -155 -136 -66 -104 -26 -15 23 -323 -110 -123 -337 7 137 346 204 322 85 -84 152 128 69 277 261 -55
7299 -55 18 -311 130 3 -86 -4 308 -111 4 -16 -201 355 -90 -285 141 56 264 -232 -305 -159 -98 -242 -10
7322 -10 -155 -52 -182 -52 -123 -335 -52 386 -1 16 -15 56 154 299 95 -160 -198 -44 -111 25 86 -93 156
7345 156 128 238 151 56 117 107 -8 -208 -150 -15 -139 -42 -230 52 -162 -85 -263 76 -41 -145 99 -14 120
7368 120 -6 165 15 -4 186 -37 216 -93 -69 -156 157 -38 -67 104 -118 -165 -144 43 -75 -133 -212 241 104
7391 104 -49 21 272 -262 -141 12 31 -151 6 -34 -73 120 -112 249 187 -56 -334 67 88 163 67 -176 -15
$$ packed form
7228A03J09k9j98p2Q9l15L72l97K68m2R8J71j76K30k61Q2k84L70k34M5P7q7J65
7251H4O3j79P7J61j41r4o1L05k42O8j44O6J52q8R6j45Q6j2j07J78j5K1n7lk24
7276a55J9P0l8P8J1L8l46K13j3k14L44J30K09j42J18k37j69K36k4n9K08j6l16
7299e5P3l29M41j27q9Q2L12m19J15k0j85N56m45j95M26q5K08m96p3J46O1j44K32
7322a0j45J03j30J30p1k12K83M38l87J7l1P1R8J45k04k55l8J54o7J36O1j79K49
7345A56k8J10q7r5O1j0j15k00N8J35j24R7j88K82k14P7j78L39j17j04K44j13J34
7368A20j26J71j50j9J90k23K53l09K4q7L13j95k9J71k22m7K1J87j18n8p9M53j37
7391A04j53P0K51n34J21J53J9j82J57m0l9J93k32L61o2k43k78M01K1P5r6k43J61
$$ plain form
7414 -15 162 191 37 -31 -23 -62 133 -49 16 -94 56 27 -54 251 154 128 -14 272 334 -123 -66 56 -178 46
7438 46 193 -111 -120 -54 49 -91 -34 -42 -18 -20 126 -186 -76 51 116 196 41 6 400 154 -50 -179 164 14
7462 14 33 -10 -140 323 75 -227 -208 -176 -237 209 14 -67 -90 141 -85 54 17 -390 71 150 37 -154 -197 -174
7486 -174 -87 -45 -27 -520 -152 -50 190 -31 129 9 -224 9 219 44 112 319 35 -82 109 -319 -36
7507 -36 -23 -189 -330 -179 -202 33 231 -197 22 114 127 77 -282 -29 58 -54 -90 180 -10 27 36 312 103 178
7531 178 -55 -141 -57 94 180 -201 142 -60 66 108 84 173 352 21 -30 39 128 -142 -190 46 -200 -118 369 27
7555 27 96 -173 320 -95 175 -20 -204 -328 268 8 -59 61 161 41 23 2 17 4 -29 -33 -20 182 -319 139
7579 139 -87 202 -37 216 181 237 -308 -326 111 75 -68 285 87 193 145 -114 -194 -188 109 -57 -181 267 215
$$ packed form
7414a5J77K9j54o8Ql9J95j82O5j10J50k9q1L05r7k6j42K86O2m57N7J22k34K24
7438D6J47l04rO6J03j40N7qK4kJ46l12J10J27O5Q0j55l5L94k46k04j29L43j50
7462A4J9m3j30M63k48l02J9L2o1M46j95q1k3K31k26J39l7m07M61P9j13j91m3K3
7486a74Q7M2J8m93L68J02K40k21J60j20k33K33K10j75O8K07k84j17J91m28K83
7507c6J3j66j41J51k3K35J98m28K19R2J3n0l59K53Q7j12l6K70j90L7RK76k09P5
7531A78k33q6Q4J51Q6l81L43k02J26M2k4Q9J79l31n1O9Q9k70m8K36k46Q2M87l42
7555B7O9k69M93m15K70j95j84j24N96k60o7J20J00j20j8k1J5j3l3mJ3K02n01M58
7579A39k26K89k39K53l5N6n45j8M37l6j43L53j98J06m8k59q0OK97j66j24M48n2
$$ plain form
7602 215 199 -37 236 -25 244 160 -192 -87 58 -153 111 244 -111 -58 -252 25 -333 -13 149 38 -157
7623 -157 -74 193 -276 -164 -258 111 139 119 21 144 266 -99 -239 -137 180 -157 174 -276 -15 -292 164 -379
7645 -379 -22 192 -33 311 174 247 -21 12 350 78 142 -24 -154 153 -98 -113 -75 101 -61 -39 -263 24
7667 24 -74 -77 63 56 -119 149 -36 -146 114 -246 94 72 193 -201 30 317 -8 107 6 42 37 96 77 -145
7691 -145 -142 -182 -176 205 -204 -94 125 155 -147 -183 144 -162 -253 31 130 105 34 89 -17 109 -87 -27 24 -1 261
7716 261 13 -87 152 -177 28 139 -16 -39 104 4 72 -111 92 -29 -155 -138 -55 130 -101 -231 5
7737 5 40 -50 -69 -315 -322 -263 -224 -237 -49 -12 181 -120 -122 34 38 1 -72 184 -198 77 -48 -154 87 85 -85 -224
7763 -224 265 17 207 60 24 9 84 -90 53 156 141 230 64 98 185 45 30 -9 -7 -6 193 -250 -51 292
$$ packed form
7602B15j6k36K73k61K69q4l52J05J45k11K64J33l55N3j94K77l58L20J62j11j95
7623a57Q3K67m69J12r4L69K8k0r8J23J22l65j40J02L17l37L31m50K61k77M56n43
7645c79L57K14k25L44j37P3k68L3L38k72O4j66j30L07k51j5L8J76j62K2k24K87
7667B4r8lJ40pj75K68j85j10K60l60L40k2J21l94K31K87l25J15j01L6nN9j9k22
7691a45Lm0OL81m09J10K19L0l02l6L27l06r1K84R9k5p1N5j06J26j96O0N1k5K62
7716B61k48j00K39l29K05J11j55k3J43j00O8j83K03j21j26J7Q3J85k31j30K36
7737EL5r0j9k46pN9L9j3J88L7J93l01kJ56Ml7p3K56l82K75j25j06K41kj70j39
7763b24M89k48J90j47l6j5P5j74J43J03j5Q9j66L4Q7j40j5l9KJJ99m43J99L43
$$ plain form
7787 292 35 97 -367 -276 -31 -27 51 -9 -108 47 158 67 179 301 -37 161 46 -159 -68 -84 119 78 279 93
7811 93 51 -1 82 50 184 186 -171 86 259 10 143 -277 -28 67 90 -93 43 149 -93 -174 292 79 18 -71
7835 -71 329 152 117 15 201 -1 -34 73 61 -180 -47 8 -172 204 -80 -25 7 8 252 182 -216 59 -70
7858 -70 -196 97 -164 188 267 -344 331 149 -147 -124 -138 39 -139 18 25 188 -130 -10 180 191 -40 116
7880 116 473 151 39 -40 161 142 194 164 -89 162 228 156 -158 -70 295 158 28 298 -91 -278 -125 172
7902 172 92 52 58 -58 188 150 -281 -302 -69 39 -58 -156 132 141 -170 17 90 30 -81 75 -281 226 -165 30
7926 30 203 96 -58 -126 80 -76 359 17 43 102 -83 -68 -194 273 -8 230 137 -24 85 -387 27 -88
7948 -88 -305 90 -193 375 154 90 -64 -137 -335 57 88 125 35 124 133 149 -180 -35 233 22 -15 -26 -357 59
$$ packed form
7787B92k57O2m64R1K45MP8o0r9J55J11r1J12J22l38J98j15k05R1j6K03m1K01j86
7811I3m2n2Q3l2J34Kl57K57J73k49J33m20K49R5K3j83J36J06k42q1M66k13o1q9
7835g1M00j77l5j02J86k02l3J07j2k41J33N5j80L76k84N5L2JK44p0l98K75j29
7858g0j26K93k61L52P9o11O75j82k96K3j4J77j78J57PJ63l18J20J90J1k31J56
7880A16L57l22j12p9K01j9N2l0k53K51O6p2l14Q8L65j37j30K70l89j87J53K97
7902A72q0m0Oj16K46l8m31k1K33J08r7r8K88Rl11J87P3o0j11J56l56N07l91J95
7926C0J73j07j54o8K06j56M35l42K6N9j85J5j26M67k81K38r3j61J09m72M14j15
7948h8k17L95k83N68k21o4j54p3j98L92L1L7r0Q9RJ6l29J45K68k11l7j1l31M16
$$ plain form
7972 59 64 236 -45 192 -29 -75 -293 17 -88 -338 28 -84 -215 51 292 -55 13 221 114 363 76 -47
7994 -47 336 -56 329 144 -76 -73 64 75 57 54 -61 -18 123 49 -60 -19 148 34 -43 -55 -75 252 101 23 -45
8019 -45 259 -235 169 -202 -94 -321 -54 -184 43 -98 207 127 211 327 -18 128 -75 -80 0 289 166 -118
8041 -118 -73 -58 155 176 67 172 89 216 -274 82 418 -75 3 -38 -56 102 -215 -64 -169 110 131 198 -200
8064 -200 -172 -4 98 364 -266 -52 26 -186 -225 64 157 -34 152 -207 -170 121 44 19 19 100 -15 313 61
8087 61 256 -73 20 -50 -468 116 95 51 313 101 -373 394 -90 -73 -110 89 -7 -61 342 327 55 -149 102
8110 102 -64 -262 63 97 320 214 89 -29 -193 -92 -30 24 185 48 -76 316 350 304 16 -143 156 -212
8132 -212 97 97 23 -11 85 -167 209 -105 -22 -244 -35 -119 193 -78 168 -32 -203 -92 -227 -135 216 -77 -92
$$ packed form
7972E9NJ72k81K37k21m6k18L10j05k50L66j12j31K66K41l47O8K08j07K49k87j23
7994d7L83l92L85j85k20LJ37J1j8lj15M3J41p4j09M1J67j14p7j2k0L27j51p8o8
8019d5L04m94M04l71J08k27K67j30K27j41L05q0Q4J16l45J46k03nQ0K89j23k84
8041a18M5J5K13K1j09J05q3J27m90L56L36m93P8m1j8J58l17J51j05K79K1O7l98
8064b00K8J68J02K66o30K14P8k12l9K89R3j91J86l59L7K91p7k5%Q1j15L28k52
8087F1J95l29R3p0m18N84k1m4K62k12m74P67m84J7l7J99r6n4M03j5k72k04K51
8110A02j66j98L25L4K23j06j25j18j64J01O2N4J61j37j24L92L4m6k88j59K99l68
8132b12L09%p4l4R6k52L76l14Q3k22K09q4L12k71K46k00j71J11j35R2L51k93j5
$$ plain form
8155 -92 -51 -16 58 95 -1 -51 -70 -240 -2 189 -18 -61 134 186 -71 49 281 -125 -59 -208 77 -232 -304 -21
8179 -21 244 68 -110 159 97 -203 -78 -82 82 -103 162 -113
$$ packed form
8155i2M1L5P4L7r6n0j9j70K38J91k07m3J95N2k57J20K32m06O6j49K85l09p2K83
8179b1K65j76j78K69o2l00J25mJ64j85K65k75
8191a13
$$ Imaginary data points
##PAGE= N=2
##DATA TABLE= (X++(I..I)), XYDATA
$$ plain form
0 0 0 0 0 0 0 0 0 -8 8 -8 8 -8 16 -16 16 -24 24 -32 40 -46 51 -59 70 -80 93 -104 120 -138 155 -174 197
31 197 -221 248 -276 310 -345 382 -423 472 -524 579 -639 711 -787 869 -966 1075 -1197 1338
49 1338 -1503 1698 -1934 2223 -2590 3073 -3741 4725 -6328 9389 -17337 81431 155680 -50230
63 -50230 -84189 40295 91017 -26106 -44401 67869 87773 -58677 -98206 48833 131815
74 131815 4786 -91246 -410 87041 -1875 -81173 15827 116340 20262 -107233 -41833
85 -41833 94684 58640 -68370 -57899 42142 17719 -83677 -48915 78058 61053 -80511
96 -80511 -95466 40109 79863 -37083 -85853 18217 68980 -28374 -82462 16300 83727 -8453
108 -8453 -88160 -9301 75427 4597 -84289 -18039 82211 29655 -74345 -30839 83484 57512
$$ packed form
0@%%%%%%%qJ6j6J6j6K4l2L2m0M8n6P2q6R7j10J29j50J73j97K24k58K93l29L71
31A97m18M69n24N86o55P27q05Q95r96J103j218J350j498J656j835K041k272K535
49A338k841L201l632M157m813N663o814Q466j1053J5717k6726R8768P4249k05910
63e0230l3959J24484N0722j17123j8295J12270J9904j46450l9529J47039Q2982
74A31815j27029r6032R0836Q7451q8916p9298R7000J00513r6078j27495O5400
85d1833J36517l6044j27010J0471J00041k4423j01396L4762J26973j7005j41564
96h0511j4955J35575L9754j16946m8770J04070N0763r7354n4088R8762O7427r2180
108h453p9707P8859Q4728p0830q8886O6250J00250n2556j04000M3506J14323k5972
$$ plain form
120 57512 -57191 -48175 61120 62222 -44866 -54382 51786 71939 -32115 -63252 34925 72115
132 72115 -27320 -75429 22755 86503 -4759 -84587 -7781 80068 18668 -71319 -22661 61796
144 61796 12457 -81288 -40323 61395 32006 -74627 -59092 47974 44932 -60552 -68190 35848
156 35848 54052 -48376 -77343 23534 67445 -23776 -76294 6370 63048 -14069 -75954 -613
168 -613 71708 3917 -76682 -16690 74097 28942 -61030 -22779 72654 44011 -55695 -39652
180 -39652 63105 62448 -33456 -40731 50083 58836 -35064 -50172 48596 77501 -22353 -69938 19836
193 19836 79717 5604 -55547 9915 67698 -1227 -67865 -616 79365 20631 -72915 -35962
205 -35962 54411 30900 -51319 -28570 51560 24480 -70407 -54682 52425 61909 -39350 -68042
$$ packed form
120E7512j14703R016J09295J102j07088r516J06168K0153j04054l1137R8177L7190
132G2115r9435m8109R8184O3748r1262p9828P6806Q7849o1400q9987M8658Q4457
144F1796m9339r3745M0965J01718k9389j06633J5535J07066l042j05484p638J04038
156C5848J8204j02428k8967J00877M3911r1221n2518Q2664N6678p7117o1885P5341
168f13P2321o7791q0599N9992R0787m5155q9972L8251R5433k8643r9706J6043
180c9652J02757o57r5904p275R0814Q753r3900j5108R8768K8905r9854m7585Q9774
193A9836N9881p4113o1151O5462N7783o8925o6638O7249P9981n8734r3546L6953
205c5962R0373k3511q2219K2749Q0130k7080r4887J5725J07107R484j01259k8692
$$ plain form
217 -68042 14983 46052 -25077 -49394 26580 52411 -33820 -77575 8071 74809 8492 -64608
229 -64608 -16562 51096 10959 -49626 -3908 65346 20992 -63001 -33047 59979 53323 -30732
241 -30732 -35366 35654 37154 -34885 -34046 48353 58683 -29584 -60415 18950 64616 549 -47425
254 -47425 5572 48294 -7337 -54227 2649 60182 6691 -64878 -26314 47280 21560 -50085
266 -50085 -31347 36198 18314 -54694 -41726 38007 38037 -42975 -56636 18565 39680 -28964 -53259
279 -53259 13902 42207 -24848 -60408 6677 54242 -5709 -60186 -8149 51874 9402 -51521
291 -51521 -12924 51455 19451 -47585 -20464 52841 34738 -39734 -31089 44119 43736 -29300 -35335
304 -35335 37332 50262 -21473 -42300 27944 56910 -9241 -46501 13980 56459 269 -46783
$$ packed form
217f8042Q3025L1069p1129k4317P5974K5831q6231m3755Q5646O6738o6317p3100
229f4608M8046O7658m0137o0585M5718O9254m4354q3993K9954R3026o656q4055
241c0732m634P1020J500p2039Q39Q2399J0330q8267l0831P9365M5666o4067m7974
254d7425N2997M2722n5631m6890N6876N7533n3491p1569L8564P3594k5720p1645
266e0085J8738O7545j7884p3008J2968P9733L0q1012j3661P5201K1115o8644k4295
279e3259O7161K8305o7055l5560O7085M7565n9951n4477N2037O0023m2472o0923
291e1521L8597O4379l2004o7036K7121P3305j8103p4472Q645P5208l83p3036o035
304c5335P2667J2930p1735k0827P0244K8966o6151l7260O0481M2479n6190m7052
$$ plain form
316 -46783 3677 54428 6544 -50351 -9618 52683 18491 -48867 -24727 41751 24876 -41956
328 -41956 -30556 37267 31079 -39664 -42335 28141 39856 -27403 -46450 16645 39986 -20207
340 -20207 -47672 12446 47594 -9566 -52714 -1025 49259 7002 -44159 -7646 45159 12280
352 12280 -42430 -11616 50063 26970 -39102 -26226 40017 36509 -25051 -25905 34364 37825 -25025
365 -25025 -34760 29941 49772 -12063 -42160 11276 45109 -3081 -37575 7786 44752 -2347
377 -2347 -48233 -6452 46509 13387 -44028 -22361 32457 15276 -38597 -23601 31916 19517
389 19517 -41889 -39118 24104 31919 -27314 -42398 10617 27903 -22306 -41743 10712 36774
401 36774 -15216 -49852 -3034 39914 2322 -41567 -9701 34337 5582 -39075 -10540 40775
$$ packed form
316d6783N0460N0751m7884n6895M0733O2301l4192o7358K4140O6478j6875o6832
328d1956J1400O7823o188p0743k671P0476J1715o7259j9047O3095K3341o0193
340b0207k7465O0118L5148n7160m3148N1689N0284m2257n1161L6513N2805l2879
352A2280n4710L0814O1679k3093o6072J2876O6243l508o1560q54O0269L461o2850
365b5025r735O4701J9831o1835l0097N3436L3833m8190l4494M5361L6966m7099
377b347m5886M1781N2961l3122n7415K1667N4818j7181n3873J4996N5517j2399
389A9517o1406K771O3222P815n9233j5084N3015J7286n0209j9437N2455K6062
401C6774n1990l4636M6818M2948l7592m3889L1866M4038k8755m4657K8535N1315
$$ plain form
413 40775 18458 -37887 -24022 33804 30132 -24116 -24336 27836 30588 -22312 -28336 27327 41201
426 41201 -13672 -36535 13403 41603 -2210 -32838 7989 39377 -1161 -38448 68 43715
438 43715 10463 -39146 -14536 34706 16544 -32211 -17753 31275 18030 -34788 -27111 28412
450 28412 28967 -26530 -35287 16376 30131 -18253 -34007 13904 33078 -14661 -40483 5896 39596
463 39596 -383 -37800 -3486 35524 6262 -32814 -4542 38428 13478 -34283 -14971 36681
475 36681 26044 -24511 -19846 27972 27515 -19818 -21101 27937 33980 -16597 -30598 17732 38229
488 38229 -5341 -29706 8796 34138 -3495 -32336 4376 37337 3328 -36416 -9878 31817
500 31817 11302 -30619 -15142 25787 11348 -32414 -21785 24736 20287 -28423 -31506 13925
$$ packed form
413D0775k2317n6345J3865N7826l672n4248k20N2172K752n2900o024N5663J3874
426D1201n4873k2863M9938K8200m3813l0628M0827L1388m0538l7287L8516M3647
438D3715l3252m9609K4610M9242j8162m8755J4458M9028j3245n2818P677N5523
450B8412N55n5497q757N1663J3755m8384j5754M7911J9174m7739k5822M6379L3700
463C9596l9979l7417L4314L9010k9262l9076K8272M2970k4950m7761J9312N1652
475C6681j0637n0555M665M7818m57m7333j283M9038O043n0577j4001M8330K0497
488C8229m3570k4365L8502K5342l7633k8841L6712L2961l4009l9744K6538M1695
500C1817k0515m1921J5477M0929j4439m3762J0629M6521m449m8710l083M5431
$$ plain form
512 13925 22633 -19835 -30914 9897 23290 -18254 -36020 5292 30248 -7533 -37285 -4912
524 -4912 27583 707 -31801 -6177 28802 5613 -33325 -13433 29853 17949 -25937 -19533
536 -19533 22798 21198 -19444 -19509 22800 26584 -17276 -26812 16243 33082 -6703 -27582 7275
549 7275 30701 -2732 -27227 4570 32560 2033 -31875 -5898 30773 11013 -27529 -12840
561 -12840 24674 12370 -26128 -16636 24406 18429 -24781 -25545 16476 23503 -16245 -26715 10846
574 10846 23320 -13879 -28627 8569 28915 -6152 -31727 -690 28902 3326 -26791 -3627
586 -3627 27391 6599 -26852 -7734 30633 16510 -23253 -15278 24556 21877 -16062 -15098 22461
599 22461 23918 -15372 -20435 20029 31350 -7278 -24473 9995 29615 -1819 -22633 7539
$$ packed form
512A3925Q708m2468j1079M0811J3393m1544j7766M1312K4956l7781k9752L2373
524d912L2495k6876l2508K5624L4979k3189l8938J9892M3286j1904m3886O404
536a9533M2331j600m0642o5M2309L784m3860r536M3055J6839l9785k0879L4857
549G275K3426l3433k4495L1797K7990l0527l3908K5977L6671j9760l8542J4689
561a2840L7514j2304l8498R492M1042n977m3210p64M2021P027l9748j0470L7561
574A0846J2474l7199j4748L7196K0346l5067k5575L1037K9592k5576l0117K3164
586c627L1018k0792l3451J9118L8367j4123l9763P975L9834k679l7939R64L7559
599B2461J457l9290n063M0464J1321l8628j7195L4468J9620l1434k0814L0172
$$ plain form
611 7539 29840 230 -28004 -736 30949 8508 -25970 -9626 23921 10209 -23764 -12490
623 -12490 23011 13123 -25578 -21484 17961 20015 -18155 -25111 9930 18123 -15385 -25534 8300
636 8300 22167 -11553 -30779 387 24369 -1693 -27554 -4797 21231 1219 -26076 -6269
648 -6269 24496 8539 -25250 -14422 20714 15497 -17378 -14944 17152 16578 -16229 -17615 16925
661 16925 23862 -10602 -23357 8411 24267 -2850 -20555 5083 23362 -2179 -24097 316
673 316 26636 5369 -24404 -9362 21114 9445 -20510 -10536 19071 10672 -21928 -17710 17381
686 17381 18104 -16429 -22774 9080 17650 -12156 -21632 8322 20315 -10510 -27312 2486 24590
699 24590 -514 -24921 -3789 20928 2893 -21997 -3730 24314 8445 -23187 -11274 22391
$$ packed form
611G539K2301k9610k8234K7268L1685k2441l4478J6344L3547j3712l3973J1274
623a2490L5501r888l8701M094L9445K054l8170o956L5041Q193l3508j0149L3834
636H300J3867l3720j9226L1166K3982k6062k5861K2757K6028k0012k7295J9807
648f269L0765j5957l3789J0828L5136n217l2875K434L2096n74l2807j386L4540
661A6925O937l4464j2755L1768J5856k7117j7705K5638J8279k5541k1918K4413
673C16K6320k1267k9773J5042L0476j1669k9955R974K9607q399l2600M218L5091
686A7381P23l4533o345L1854Q570k9806r476K9954J1993l0825j6802K9798K2104
699B4590k5104k4407K1132K4717j8035k4890J8267K8044j5869l1632J1913L3665
$$ plain form
711 22391 16697 -15533 -12872 17759 17250 -13180 -13797 18586 23532 -9603 -19755 11234 26148
724 26148 -1256 -17903 7095 23717 -1235 -19994 4290 27521 5282 -21859 -5250 22655
736 22655 9746 -17959 -7117 19877 9565 -20491 -13408 18348 15891 -16690 -19459 10786 16204
749 16204 -12857 -19565 8380 17083 -11789 -24005 3970 20911 -4151 -24179 -2678 18111
761 18111 -734 -22086 -3430 19784 3471 -22827 -9425 18988 10692 -18158 -12730 15468
773 15468 12571 -15024 -13112 15059 16300 -12142 -17885 10933 20542 -6085 -18315 5914 19318
786 19318 -3372 -18549 3603 21136 25 -21038 -3200 20061 5646 -18445 -7859 16264
798 16264 7163 -17986 -10705 15699 10690 -17222 -16897 11138 14640 -12164 -18529 5836 13670 -10298
$$ packed form
711B2391n694l2230K661L0631n09l0430o17L2383M946l3135j0152L0989J4914
724B6148k7404j6647K4998J6622k4952j8759K4284K3231k2239k7141J6609K7905
736B2655j2909k7705J0842K6994j0312l0056P083L1756k457l2581k769L0245N418
749A6204k9061o708K7945Q703k8872j2216K7975J6941k5062k0028K1501K0789
761A8111j8845k1352J8656K3214j6313k6298J3402K8413q296k8850N428K8198
773A5468k897k7595J912K8171J241k8442n743K8818R609k6627j2230K4229J3404
786A9318k2690j5177K2152J7533k1111k1063J7838K3261j4415k4091J0586K4123
798A6264r101k5149P281K6404n009k7912L25K8035L502k6804o365K4365P834k3968
$$ plain form
812 -10298 -19266 5083 17525 -6573 -23043 -1748 18224 1206 -19218 -4023 16088 2045
824 2045 -18985 -5670 19404 9317 -17887 -12005 15749 14453 -10639 -10665 14182 14962 -10682 -12955
838 -12955 14612 22046 -5197 -17416 6763 21014 648 -13608 6069 20711 43 -18140
850 -18140 1548 24044 8155 -16734 -6407 17164 8868 -13776 -5718 17794 9834 -16930 -13474
863 -13474 14556 15873 -10848 -16097 7220 12957 -9709 -15826 7917 16311 -8445 -21713 669
876 669 18299 -373 -17807 -2690 14459 -725 -18603 -3311 18245 5771 -18629 -10578 14188
889 14188 10156 -12584 -9765 12822 10801 -12560 -12154 12496 16686 -7827 -15860 6478 16607
902 16607 -3138 -13684 5652 17054 -2702 -17314 1643 18935 3610 -16312 -4568 14910
$$ packed form
812a0298q968K4349J2442k4098j6470K1295J9972j7018k0424J5195K0111j4043
824B045k1030J3315K5074j0087k7204N882K7754j296k5092k6K4847P80k5644k273
838a2955K7567P434k7243j2219K4179J4251k0366j4256J9677J4642k0668j8183
850a8140J9688K2496j5889k4889J0327K3571q296k2644Q058K3512p960k6764L456
863a3474K8030J317k6721n249K3317N737k2666o117K3743Q394k4756j3268K2382
876F69J7630j8672j7434J5117J7149j5184j7878J5292K1556j2474k4400Q051K4766
889A4188m032k2740K819K2587k021k3361M06K4650M190k4513q033K2338J0129
902A6607j9745j0546J9336J1402j9756j4612J8957J7292j5325j9922J1744J9478
$$ plain form
914 14910 4090 -15273 -5733 15302 7380 -16374 -11881 11582 10642 -12344 -13902 7687 10386
927 10386 -11557 -16233 5681 13250 -8621 -19243 1228 14222 -3698 -17640 -1978 13350
939 13350 -1683 -17589 -3540 15322 3410 -16514 -7585 13476 7942 -13207 -8100 12711 10475
952 10475 -10779 -10375 12134 14656 -6961 -12205 9188 16803 -2719 -12542 6092 17308 -301
965 -301 -12797 4476 19015 2795 -14294 -1009 17825 7127 -12361 -4151 14891 7632 -12278
978 -12278 -6542 14354 10749 -12123 -12123 10274 12996 -8038 -12869 6371 11380 -8408 -14891 5843
992 5843 15542 -4794 -18594 -1447 14360 614 -14195 -1662 12905 -294 -17237 -4172
1004 -4172 16609 7272 -14577 -10366 11193 9282 -9608 -7445 11827 9794 -11037 -11739 11100
$$ packed form
914A4910j0820j9363R540K1035p922k3754M493K3463r40k2986j558K1589K699
927A0386k1943m676K1914P569k1871j0622K0471J2994j7920j3942J5662J5328
939A3350j5033j5906J4049J8862j1912j9924Q929K1061n534k1149N107K0811k236
952A0475k1254M04K2509K522k1617n244K1393P615j9522r823J8634J1216j7609
965c01j2496J7273J4539j6220j7089J3285J8834j0698j9488Q210J9042p259j9910
978a2278N736K0896l605k2872%K2397K722k1034m831J9240N009j9788o483K0734
992E843R699k0336j3800J7147J5807j3746j4809J2533J4567j3199j6943J3065
1004d172K0781r337k1849M211K1559j911j8890K163J9272k033k0831p02K2839
$$ plain form
1017 11100 16451 -4683 -13746 3821 13520 -2025 -10701 6173 15566 -2494 -16283 -199 17505
1030 17505 5454 -12633 -4431 11336 3134 -12916 -4337 13977 6793 -14855 -11966 9279 10082
1043 10082 -9050 -11874 4922 7193 -10294 -14171 5471 11992 -7068 -18243 -1509 11437 -2258
1056 -2258 -14462 -1985 10559 -2452 -16420 -3660 13700 4292 -14265 -8173 9691 5766 -11038
1069 -11038 -6848 11522 8912 -10373 -10210 10068 13499 -5316 -10603 6810 13214 -3256 -10408
1082 -10408 6487 15760 -778 -12679 2009 15877 3770 -10893 -299 14050 4360 -11591
1094 -11591 -3204 14240 8213 -10953 -7769 10457 8940 -9067 -8653 9081 10088 -8711 -12012
1107 -12012 5854 11508 -5808 -13332 2454 11725 -3061 -13628 568 11923 -684 -13918
$$ packed form
1017A1100N351k1134r063J7567R699j5545q676J6874R393j8060j3789J6084J7704
1030A7505j2051j8087Q202J5767q202j6050Q579J8314p184k1648K889K1245Q03
1043A0082j9132k824J6796K271j7487l877J9642O521j9060j1175J6734J2946j3695
1056b258j2204J2477J2544j3011j3968J2760J7360r408j8557O092J7864l925j6804
1069a1038M190J8370k610j9285J63K0278L431j8815n287J7413O404j6470p152
1082a0408J6895R273j6538j1901J4688J3868j2107j4663J0594J4349r690j5951
1094a1591Q387J7444o027j9166L184J8226j517j8007M14J7734J007j8799l301
1107a2012J7866N654j7316p524J5786R271j4786j0567J4196J1355j2607j3234
$$ plain form
1119 -13918 -2175 12504 2729 -13064 -4746 11935 5578 -11299 -5755 11181 8160 -9350 -7618
1132 -7618 10513 11052 -7188 -9306 8280 13236 -3470 -10340 5774 13021 -2484 -10752 4616
1145 4616 14704 150 -12596 -290 13687 3844 -10379 -2246 11413 3587 -12383 -5141 12243
1158 12243 6834 -11689 -10052 7089 7470 -8509 -9641 5643 7049 -10175 -12906 4449 10824
1171 10824 -5719 -15285 -1141 8899 -2954 -12649 -578 9883 -2421 -15281 -4451 11588
1183 11588 4197 -11970 -7043 8020 4142 -10040 -5491 10467 7696 -9727 -10098 8085 11620
1196 11620 -4152 -8752 5155 10181 -3470 -8898 6516 14030 -776 -11792 718 12948 3418
1209 3418 -8617 -367 11061 2385 -10534 -2516 12814 6820 -9966 -7132 8309 7532 -7116
$$ packed form
1119a3918J1743J4679r775j5793Q318J6681o357j6877N544J6936l021j7510J732
1132g618J8131N39j8240k118J7586M956j6706o870J6114P247j5505q268J5368
1145D616J0088j4554j2746J2306J3977r843j4223Q133J3659p826j5970P242J7384
1158A2243n409j8523J637J7141L81j5979j132J5284J406j7224k731J7355O375
1171A0824j6543r566J4144J0040j1853r695J2071J0461j2304j2860J0830J6039
1183A1588p391j6167M927J5063l878j4182M549J5958k771j7423l71J8183L535
1196A1620j5772m600J3907N026j3651n428J5414P514j4806j1016J2510J2230r530
1209C418j2035Q250J1428q676j2919Q018J5330n994j6786K834J5441p77j4648
$$ plain form
1222 -7116 -6891 7512 7312 -8443 -10598 5924 10850 -4804 -12131 1594 9634 -2842 -10952 1272
1236 1272 10665 -1513 -12521 -1889 11786 3398 -10530 -3853 9842 4236 -9482 -4018 10962
1249 10962 7421 -8552 -6978 9112 10019 -5032 -7205 7290 10587 -4189 -8274 5979 12398
1262 12398 -1529 -9525 3100 12394 1165 -9260 1016 11759 1960 -9894 -1629 11061 3757
1275 3757 -10224 -5140 8983 5378 -9365 -6964 7205 5941 -8732 -9124 4975 6995 -7364
1288 -7364 -11282 2832 7780 -5060 -11662 599 7595 -3526 -11995 -814 8575 -1231 -12202
1301 -12202 -3557 8411 1827 -10139 -4639 7995 3484 -9416 -5553 8530 6418 -7545 -7815
1314 -7815 6449 8602 -4660 -7424 5527 9051 -3537 -8671 4411 11273 -706 -9383 701
$$ packed form
1222g116K25J4403k00j5755k155J6522M926j5654p327J3725Q040j2476q110J2224
1236A272R393j2178j1008J0632J3675q388j3928O677J3695n606j3718N464J4980
1249A0962l541j5973J574J6090R07j5051k173J4495L297j4776m085J4253O419
1262A2398j3927p996J2625R294j1229j0425J0276J0743r799j1854Q265J2690p304
1275C757j3981N084J4123l605j4743K401J4169j264j4673l92J4099K020j4359
1288g364l918J4114M948j2840o602J2261O996j1121q469J1181R389r806j0971
1301a2202Q645J1968o584j1966N500J2634m511j2900L863J4083k112j3963k70
1314g815J4264K153j3262k764J2951L524j2588n134J3082O862j1979q677J0084
$$ plain form
1327 701 10335 1561 -8373 134 10239 2081 -9566 -2960 9847 5386 -8131 -5645 7052 5319
1341 5319 -7190 -6223 6571 6692 -7334 -9446 4057 8560 -4004 -9559 1730 7725 -3098 -9540
1355 -9540 1471 9297 -806 -10860 -1475 9003 2640 -8215 -2470 8657 3694 -8181 -3546
1368 -3546 9668 6765 -6707 -5649 7398 8325 -3903 -5245 6702 9086 -3859 -6972 6049
1381 6049 11031 -784 -7815 2697 10334 817 -7100 1726 10232 1627 -8689 -1276 9938 4167
1395 4167 -8093 -4065 7784 4476 -7683 -5242 6839 5089 -7754 -8279 4670 6811 -5640
1408 -5640 -9154 2481 6529 -4636 -9495 1493 7569 -3310 -10821 -954 7552 -119 -9719 -2554
1422 -2554 7393 1131 -8950 -3177 7844 3096 -8287 -5386 6797 5535 -5820 -5587 5649 6179
$$ packed form
1327G01R634q774r934Q507J0105q158j1647O606J2807m461j3517K486J2697j733
1341E319j2509R67J2794J21j4026k112J3503M503j2564n555J1289N995j0823o442
1355i540J1011P826j0103j0054R385J0478o363j0855N745J1127m963j1875M635
1368c546J3214k903j3472J058J3047R27j2228j342J1947K384j2945l113J3021
1381F049M982j1815p031J0512P637r517p917Q826Q506q605j0316P413J1214n771
1395D167j2260M028J1849l308j2159K441J2081j750j2843n25J2949K141j2451
1408e640l514J1635M048j1165m859J0988O076j0879p511R867Q506p671r600P165
1422b554R947o262j0081N773J1021m748j1383K901J2183j262j1355K33J1236N30
$$ plain form
1436 6179 -4704 -6130 5262 7989 -3221 -7685 2554 8613 -478 -7242 1260 8018 -223 -7901
1450 -7901 -392 8812 2056 -7877 -3124 7074 3602 -7094 -3879 6092 3545 -7068 -6124 5228
1464 5228 5937 -5632 -7780 2736 6081 -4009 -7286 2578 6627 -3167 -8804 432 8337 -234
1478 -234 -8392 -1232 7523 1328 -7333 -1413 8437 3575 -7067 -3669 7759 5823 -5167 -3966
1492 -3966 6538 6384 -4221 -4511 6581 8338 -2913 -6170 4432 9033 -441 -5895 3112 8499
1506 8499 63 -6850 1347 9556 1714 -7349 -1285 8002 2813 -6527 -2441 7001 3311 -6901 -4770
1521 -4770 6109 4840 -5914 -6223 4154 5482 -4911 -6996 2921 5746 -3892 -8314 1540 6681
1535 6681 -2287 -8246 -753 6194 -273 -8054 -1363 6619 1024 -7763 -3186 6858 3266 -6602 -4197
$$ packed form
1436F179j0883j426J1392K727j1210m464J0239O059r091o764Q502O758q241p678
1450g901P509R204o756r933M753J0198l472j0696L215R971k547j0613R44J1352
1464E228P09j1569k148J0516L345j0090l277R864M049r794n637R236P905q571
1478b34q158P160Q755o195q661N920R850m862j0642L398J1428j936j0990J201
1492c966J0504j54j0605k90J1092J757j1251l257J0602M601r474n454R007N387
1506H499q436o913Q197Q209p842r063O064R287n189r340M086R442l690j0212K131
1521d770J0879j269j0754l09J0377J328j0393k085R917K825r638m422R854N141
1535F681q968n959P493O947o467p781O691P982n595q787M577J0044l592r868K405
$$ plain form
1550 -4197 5802 4325 -5386 -4558 5017 5510 -4490 -5836 4224 7023 -2427 -6566 2346 6585 -1670
1565 -1670 -6375 1688 7318 -522 -7415 -918 6951 1367 -7092 -2711 5663 2103 -6701 -3595 5207
1580 5207 3093 -6646 -5903 4146 4801 -4788 -6746 2277 4586 -4059 -6889 1940 6130 -2639 -7872
1595 -7872 -60 6202 7 -6682 -860 6106 456 -6490 -1589 7474 3425 -5899 -3403 5888 4774
1610 4774 -3927 -3030 5596 5481 -3757 -4355 5395 7782 -1403 -5367 3043 7155 -490 -5099 2471 7998
1626 7998 147 -6068 470 8249 2283 -5699 -1379 6513 2477 -5673 -2109 6549 3532 -6465 -4870
1641 -4870 4860 4976 -4497 -5445 3377 4702 -4189 -5919 3201 6267 -2899 -7672 794 6056 -1125
1656 -1125 -6739 -62 5868 -522 -6860 -1000 6410 1870 -6144 -3355 5228 3371 -4921 -3353 5342
$$ packed form
1550d197R999j477r711Q28R575M93j0000j346J0060K799r450m139Q912M239q255
1565a670m705Q063N630p840o893O497P869n584q459M381Q374l560q804L106Q802
1580E207k114r739P43J0049O55r589j958R023K309q645k830Q829M190q769n233
1595g872P812O262o195o689N822O966n650o946M901R063m049r324K496R291j114
1610D774q701Q97Q626j15r238n98R750K387r185l964Q410M112p645m609P570N527
1626G998p851o215O538P779n966p982M320P892m036q150L564Q658l017r997J595
1641d870R730J16r473r48Q822J325q891j730R120L066r166m773Q466N262p181
1656a125n614O677N930o390o338N860P410m540q014K789Q583j857q292J568Q695
$$ plain form
1671 5342 3849 -4619 -4557 4623 5647 -3223 -5646 2747 5993 -1814 -5661 2249 6025 -1476 -6362
1686 -6362 494 6481 418 -6269 -1318 5485 798 -6262 -2166 5240 1990 -6305 -3966 4345 3309
1701 3309 -5272 -5380 3055 3735 -4252 -5602 2190 4769 -3561 -6737 1058 4954 -1809 -6866 -283
1716 -283 5493 -650 -6397 -764 5733 1064 -6121 -1985 5886 3047 -4784 -2803 4991 3616 -4127
1731 -4127 -3142 5161 5040 -3132 -4118 4086 6436 -1521 -4510 2686 6408 -410 -4512 2004 6969 545
1747 545 -5800 4 6560 2207 -4755 -1085 5994 2244 -5041 -2246 5271 3631 -4589 -4092 4121
1762 4121 4360 -3445 -4743 3183 4790 -3166 -5542 2269 5727 -1664 -5828 614 5328 -353 -5615
1777 -5615 -133 5778 377 -6273 -1028 5849 2514 -5259 -2725 4616 3158 -4179 -2996 4500 3959
$$ packed form
1671E342j493q468O2R180J024q870k423Q393L246p807l847P910L776p501m886
1686f362O856N987o063o687M951O803m687p060M096P406l250q295K339Q311j036
1701C309q581j08Q435O80p987j350P792K579q330l176P795L896o763n057O583
1716b83N776o143n747N633O497m669p185M136P871k839p831J981P794j375p743
1731d127R85Q303j21q172r86Q204K350p957k989P196L722o818m102O516M965o424
1747E45o345N804O556m353o962L670P079l750p285K795P517j640q220M97Q213
1762D121K39p805j298P926J607p956k376P811L458p391m164O442M714n681n262
1777e615N482N911n401o650N245O877l335p773K534P341j458p337J183P496n41
$$ plain form
1792 3959 -3951 -4488 3918 5315 -2359 -4796 2323 5339 -1890 -5296 1848 5562 -810 -6099 3
1807 3 5528 627 -5654 -1544 4769 885 -5714 -2191 4848 2218 -5753 -4131 3621 3154 -4231 -4564
1823 -4564 2520 3096 -4378 -5879 1993 4390 -3015 -6707 125 4554 -1420 -5957 -362 4539 -847
1838 -847 -6228 -981 5551 1135 -5609 -2374 4654 2491 -4414 -2740 4595 3299 -4692 -3685 4087
1853 4087 4794 -2512 -4451 3005 5122 -1364 -4446 2641 5823 -881 -5178 965 6293 831 -4595
1868 -4595 -5 5081 1518 -4613 -945 5362 2681 -4945 -2853 4719 3710 -3404 -3810 3642 3810
1883 3810 -3523 -4088 3195 4930 -2450 -5144 1579 5201 -929 -4743 769 4858 -90 -5218 -84
1898 -84 5684 982 -5037 -1724 4883 2457 -4194 -1966 4420 3242 -3888 -3005 4415 4562 -3069 -4199
$$ packed form
1792C959p910n37Q406J397p674k437P119L016p229l406P144L714o372n289O102
1807CN525m901o281M110O313l884o599L523P039k630p971J622P752m67p385l33
1823d564P084N76p474j501P872K397p405l692O832M429n974m537N595M901n386
1838h47n381N247O532m416o744L235P028k163o905J674P335j296p991J007P772
1853D087P07p306j939P456K117o486l082P087L182o704m297O143N328n462n426
1868d595M590N086l563o131L668O307k681p626K092P572j009p114m06P452J68
1883C810p333n65P283J735p380k694O723L622o130l814N512M089m948n128N134
1898h4N768m702o019L313O607k426o651K228O386j178p130Q83P420J47p631j130
$$ plain form
1914 -4199 3266 5128 -1923 -4250 2180 5149 -1258 -4572 1079 5597 -216 -5541 -263 5231 970
1929 970 -4909 -1374 4738 1309 -5112 -2556 4581 2287 -4693 -3801 3134 2928 -4229 -4742 2539 3741
1945 3741 -3494 -5396 1492 4269 -2291 -5783 177 4210 -1237 -5378 -500 4394 -364 -5704 -1358
1960 -1358 4939 944 -5217 -2872 4079 2040 -4150 -2754 4163 3153 -3772 -3581 3277 4558 -2115
1975 -2115 -4125 2342 4568 -1313 -4168 2174 5251 -609 -4819 225 5581 1098 -4126 -921 4735
1990 4735 1365 -4233 -1606 5115 2667 -4433 -3002 3725 3455 -3166 -3082 3304 3320 -3043 -4325 2263
2006 2263 4780 -1756 -4618 988 4749 -650 -4380 726 5077 -42 -5124 -561 5440 1606 -4250
2021 -4250 -1637 4284 2416 -3776 -1594 4840 3620 -3666 -3082 3766 4680 -1983 -3299 2771 4514
$$ packed form
1914d199P465J862p051k327O430K969o407l314N651M518n813n325N278N494m261
1929I70n879L535O112l429o421K556P137k294o980Q92O935k06p157n13P281J202
1945C741p235j902O888K777o560l492N960M033n447m141M878M894m758n340M346
1960a358O297l995o161K345O951k039o190J396O917j010o925J91O858J281o673
1975b115k010O467K226n881k855O342L077n860m210N044N356m483n224L205N656
1990D735l370n598K627O721k448p100J431O727k70o621Q4O386J6o363j282O588
2006B263K517o536k862N606L761n399l730N106M351n119n082M563O001l834n856
2021d250K613N921j868o192K182O434j220p286N84O848R14o663j316O070J743
$$ plain form
2036 4514 -1923 -3673 2208 5264 -527 -4469 678 5199 544 -4273 -159 4842 957 -4826 -1614
2051 -1614 4765 1957 -4540 -2649 3958 2525 -3747 -3487 3138 3113 -3895 -4415 2149 3967 -2656 -4863
2067 -4863 930 4009 -2179 -5300 305 4290 -1208 -5671 -979 4370 80 -5409 -2090 4109 1275
2082 1275 -4283 -2162 3371 1972 -4142 -2816 3565 3339 -2915 -3763 2607 3798 -2192 -3679 2020
2097 2020 4326 -1295 -4267 1031 5116 -112 -4462 119 4471 943 -4048 -619 4343 1523 -4314
2112 -4314 -1780 4440 2692 -3527 -2910 3226 2720 -3081 -3457 2887 3301 -2955 -4063 1765 4400 -1329
2128 -1329 -4609 552 4052 -683 -4534 -185 4696 303 -5090 -718 4730 1842 -4064 -1658 3986
2143 3986 2365 -3472 -2001 4047 3384 -2928 -3345 3275 4302 -1828 -3066 2684 4167 -1282 -3686
$$ packed form
2036D514o437j750N881L056n791l942N147M521m655m817M114N001l885n783L212
2051a614O379k808o497J891O607j433o272K60O625k5p008n20O564J818o623k207
2067d863N793L079o188l121N605L985n498m463M692N349m290n489L319O199k834
2082A275n558K121N533j399o114J326O381k26o254q48O370J191n990j487N699
2097B020K306n621k972N298M085n228m350M581M352l528m991L429M962k820n837
2112d314K534O220j748o219O17O136n06n801l76O344M14o256j108N828K635n729
2128a329l280N161L500m735l851M349M881m393n393M372N448k888n906K406N644
2143C986j621n837J471O048o63o312m17O620J027o130j238N750J483n449k404
$$ plain form
2158 -3686 1990 5234 -83 -4224 687 4984 782 -4030 -465 4575 1324 -4262 -1234 4355 2404
2173 2404 -3656 -2541 3408 2444 -3364 -3182 2934 3049 -3012 -4259 1886 3755 -1788 -4667 848 3543
2189 3543 -1847 -5111 430 4070 -717 -5140 -1049 4110 102 -4693 -1864 3614 1068 -4557 -2327
2204 -2327 3435 2026 -3638 -3129 2966 3071 -3110 -3258 2412 3810 -2536 -3817 1395 4111 -1075 -3745
2220 -3745 830 4174 -394 -3876 -103 4114 572 -4059 -687 4179 1290 -3725 -1882 3649 2303
2235 2303 -3377 -2755 2730 2656 -2783 -3355 2409 3477 -2374 -3902 1256 3651 -1210 -3942 583 3749
2251 3749 -646 -4362 -322 4119 640 -4270 -821 3805 1338 -3534 -1509 3785 2023 -3113 -2192
2266 -2192 3644 3523 -2296 -2635 2981 3732 -1441 -2797 2335 4415 -640 -3327 1296 4801 289 -3498
$$ packed form
2158c686N676L244n317m141M911M297m202m812L565N040l251n586L028N589j951
2173B404o060J115N949r64n808J82O116J15o061j247O145J869n543k879N515K695
2189C543n390l264N541L640m787m423M091N159m008m795K829N478k546n625K230
2204b327N762j409n664N09O095J05o181j48N670J398o346j281N212K716n186k670
2220c745M575L344m568l482L773M217l542m631L372M866k889n015J843N531j346
2235B303n680O22N485p4n439n72N764J068n851j528N158K395m861k732M525L166
2251C749m395l716M040M441l479m910L449M626k467m872K025N294j762n136R21
2266b192N836j21n819l39N616P51n173j356N132K080n055k687M623L505m512l787
$$ plain form
2282 -3498 589 4756 939 -3489 -374 4767 1636 -3483 -1331 3904 2152 -3143 -2172 3299 2461
2297 2461 -2820 -2963 2470 3379 -2386 -3954 1970 3527 -1665 -4346 953 3439 -1335 -4460 -144
2312 -144 3668 -315 -4618 -965 3413 310 -4242 -1674 3352 1288 -4185 -2741 3186 2348 -3346
2327 -3346 -2875 2626 2960 -2613 -3293 2026 3207 -1763 -3579 1566 3872 -702 -3947 557 4023 205
2343 205 -3892 -289 3895 482 -3430 -1260 3673 1622 -3654 -2198 3032 1947 -3221 -2622 2401
2358 2401 2398 -2622 -3252 1831 2791 -2014 -3888 1007 3002 -1504 -4312 664 3416 -862 -4232 -342
2374 -342 3654 597 -3555 -1132 3528 1234 -3386 -1756 3270 2349 -2810 -2248 3180 3106 -2187 -2696
2390 -2696 2433 3373 -1220 -2876 1994 4110 -519 -3284 875 4304 409 -2767 489 3880 958
$$ packed form
2282c498M087M167l817m428L115N141l131n119K152N235j752n295R71N471q38
2297B461n281j43N433R09n765j568N924J557n192k681N299K486m774l125M316
2312a44L812l983m303L653M378l103m552K568N026k064n473J444N927q38n694
2327c346M71N501L34n573o80N319J181m970j816N145K306m574l245M504L466l818
2343B05m097L603M184l413l912K170M933k051n276J456N230j085n168N99N023
2358B401ln020o30N083R60m805j874M895J995m506k808M976K752m278l370L890
2374c42L996l057m152K423M660k294m620J630N026r21n159N62N428p4n293n09
2390b696N129R40m593j656M870K116m629k765M159L429l895l176L256L391k922
$$ plain form
2405 958 -3360 -251 4054 1433 -3157 -1263 3475 2408 -2694 -1730 3027 2470 -2590 -3032 2393 3203
2421 3203 -1867 -3305 1267 2981 -1512 -3490 972 3270 -776 -3892 -454 3454 314 -4031 -871
2436 -871 3337 513 -3682 -1049 3235 1618 -3401 -2226 2547 2347 -2441 -2573 2252 2495 -2133 -2788
2452 -2788 1938 3307 -1457 -3271 1022 3259 -628 -3367 687 3554 53 -3656 -660 3712 775
2467 775 -3516 -1402 3215 1134 -3159 -1915 2747 1639 -3070 -2581 2108 2427 -2803 -2838 1437 2526
2483 2526 -1687 -3523 984 2910 -1213 -3709 187 3294 -282 -3627 -402 2885 117 -3617 -1115
2498 -1115 3024 1068 -3081 -1588 2913 1885 -2641 -2085 2346 2561 -2114 -2262 2397 3013 -1277 -2456
2514 -2456 1686 3607 -492 -2907 924 3858 502 -2816 524 3933 672 -2604 -155 3214 1411
$$ packed form
2405I58m318L109M305k621m590J894M738j067n102R64M757n57n060m42N425Q10
2421C203n070j438M572J714m493j978M462K298m046l116L438L908l140m345L160
2436h71M208k824m195K633M284j617n019J175M773k00m788j32M825K43m628o55
2452b788M726J369m764j814M293K237l887k739M054K867l501l709K996M372k937
2467G75m291K114M617k081m293J244M662j108m709M89M689L19n230l5M275J089
2483B526m213j836M507J926m123k496L896L107l576l345L225L287k768l734K502
2498a115M139j956m149J493M501j028m526N56M431K15m675j48M659O16m290j179
2514b456M142J921m099k415L831K934l356l318L340L409l261l276K449L369j803
$$ plain form
2529 1411 -2520 -893 2819 1993 -2335 -1430 2678 2045 -2090 -2476 1850 2746 -1480 -2920 1111 2894
2545 2894 -950 -2944 632 2899 -528 -3331 -42 2969 450 -2905 -614 2895 408 -2875 -962
2560 -962 2931 1721 -2571 -1934 2477 2004 -1713 -2082 1761 2395 -1600 -2481 1640 2672 -541 -2801
2576 -2801 604 2735 -527 -3013 282 3065 88 -3095 -365 2761 853 -2870 -1072 2249 987
2591 987 -2897 -1605 2124 1515 -2323 -2537 1690 2026 -1725 -2825 961 2118 -1717 -2947 359 2482
2607 2482 -1093 -3467 -100 2251 -517 -2851 -438 2353 158 -3192 -1074 2508 1221 -2581 -1526
2622 -1526 2074 1736 -2299 -1781 1968 1992 -1748 -2414 1656 2650 -1060 -2371 777 2845 -296 -2607
2638 -2607 821 3218 266 -2440 264 3063 749 -2535 -477 2587 1163 -2155 -1128 2603 1715
$$ packed form
2529A411l931J627L712q26m328R05M108o33m135l86M326Q96m226j440M031J783
2545B894l844j994L576K267l427k803L289L011k519l355K291L509k487l283J913
2560i62L893j210m292O37M411m73l717l69L843O34l995q81M121J032l213k260
2576b801L405K131l262k486L295K783k977l183K730L126j908l723J798L321j262
2591I87l884J292L729o09l838k14M227L36l751j100L786J157l835j230L306K123
2607B482l575k374L367K351k768k334K413K791k195l350K118L582j287l802J055
2622a526L600l38m035N18L749K4l740o66M070R94l710j311L148K068l141k311
2638b607L428K397k952k706K704K799k314l284K058L064j424l318J027L731q88
$$ plain form
2653 1715 -1994 -1685 2007 2118 -1583 -2125 1341 2591 -1271 -2271 1082 2706 -909 -2565 707 2624
2669 2624 -239 -2504 -461 2535 516 -2123 -729 2581 953 -2393 -1298 2310 1529 -1848 -1385
2684 -1385 2241 1755 -1546 -2046 1604 2389 -991 -2010 1087 2677 -688 -2443 548 2642 13 -2339
2700 -2339 -186 2721 228 -2332 -441 2490 1144 -2231 -1303 2104 962 -2223 -1905 1808 1560 -2221
2716 -2221 -2310 1374 1676 -1685 -2344 952 2044 -1243 -2996 228 2097 -712 -2534 -193 2050 37
2732 37 -2949 -690 2138 732 -2553 -1032 2041 1217 -2442 -1589 1783 1265 -1983 -1724 1747 1826 -1407
2749 -1407 -1871 1343 2441 -489 -2273 692 2215 -164 -1810 283 2653 384 -2222 -206 2516
2764 2516 1052 -1842 -548 2233 1094 -2069 -1074 1991 1609 -1826 -1691 1375 1675 -1121 -1865 1341
$$ packed form
2653A715l709L09L692J11l701n42L466J250l862j000L353J624l615j656L272J917
2669B624k863k265K043K996k019k639J394L310j628l346J095L608p81l377M63
2684a385L626m86l301n00L650P85l380j019L097J590l365j755K991K094k629k352
2700b339K153K907k493k560J891K931j346l375R28L407j142l185L18L713k48l781
2716b221q9L684L02l361o59L296J092l287j753L224J869k809j822K341K243k013
2732C7k986K259K828j406l285J521L073q24l659Q53L372n18l248K59L471P9l233
2749a407m64L214J098k930j784K965J523k379j646K093K370k269k606K016K722
2764B516j464k894J294K781j139l163R95L065l82l435J35L066L00k796p44L206
$$ plain form
2780 1341 2150 -655 -1992 892 2067 80 -2342 11 1952 202 -2065 -76 2336 198 -2187
2795 -2187 -743 2311 979 -2071 -1300 1943 1666 -1527 -1106 1695 2044 -1464 -1401 1180 2175 -345 -1600
2812 -1600 908 2069 -444 -1687 515 2345 245 -1920 143 2167 492 -2140 -776 2134 593
2827 593 -1959 -1058 1571 1259 -1708 -1644 1221 1332 -1577 -1936 882 1639 -1271 -2290 545 1763 -866
2844 -866 -2507 -82 1579 -455 -2332 -765 1734 215 -2251 -709 1765 306 -2025 -1081 1719
2859 1719 1019 -1743 -1429 1286 1479 -1336 -1328 1165 1778 -1066 -2054 828 1678 -581 -1814 683 2006
2876 2006 -97 -1811 197 1976 644 -1493 -496 1911 911 -1829 -1180 1645 1017 -1481 -1214 1449
2892 1449 1336 -1313 -1637 1138 1525 -553 -1908 929 1923 -770 -1846 610 2144 -181 -1772 -12
$$ packed form
2780A341Q09k805j337K884J175j987k422K353J941j750k267J989K412k138k385
2795b187J444L054j332l050P71L243k77l193M21K801L49l508O3K581R95k520j255
2812a600K508J161k513j243K202J830k100k165K063K024j675k632J364K910j541
2827E93k552R01K629l12k967O4K865J11k909l59K818P57k910j019K835J218k629
2844h66j641K425J661k034j877J567K499j519k466J542K474j459k331R44K800
2859A719p00k762L14K715J93k815QK493O13k844r88K882Q50k259j233K497J323
2876B006k103j714K008J779j332k137R97K407j000k740O49K825o28k498K67K663
2892A449j13k649l24K775L87k078j355K837R94k693j076K456J534k325j591J760
$$ plain form
2908 -12 1845 199 -1426 -70 1921 771 -1730 -912 1853 1325 -1576 -1229 1482 1354 -1025 -1046 1409
2925 1409 1927 -647 -1512 716 1880 -434 -1389 539 1812 -18 -1810 262 2157 496 -1578 -147
2941 -147 1612 731 -1610 -356 1663 868 -1451 -1127 1192 1231 -1259 -1481 932 1592 -971 -1166 450
2958 450 1709 -487 -1895 123 1347 -345 -1913 -391 1620 6 -2149 -303 1405 411 -1879
2973 -1879 -1066 1202 746 -1593 -1079 1144 951 -1695 -1310 1034 1380 -922 -1545 728 1715 -763 -1790
2990 -1790 508 1584 -384 -1653 33 1491 -239 -1719 -187 1708 553 -1801 -522 1508 828
3005 828 -1444 -1035 1497 1081 -1262 -1361 1216 1367 -1152 -1512 784 1397 -865 -1321 488 1226 -367
3022 -367 -1406 153 1135 -218 -1355 10 1681 566 -1458 -470 1471 810 -1216 -718 1244 1302 -1133
$$ packed form
2908a2J857j646j625J356J991j150k501Q18K765n28k901L47K711j28k379k1K455
2925A409N18k574q65K228J164k314r55J928J273j830j792K072J895j661k074J431
2941a47J759q81k341J254K019p95k319L24K319L9k490k22K413O60k563j95J616
2958D50J259k196j408K018J224j692j568J522K011j614k155J846J708r94k290
2973a879Q13K268m56k339N14K223j93k646L85K344L46k302o23K273R87k478j027
2990a790K298J076j968j269J686J458j730j480J532J895j155k354J279K030o80
3005H28k272M09K532m16k343r9K577J51k519l60K296O13k262m56J809P38j593
3022c67j039J559R82j353j137J365J671j115k024R88J941o61k026M98J962N8k435
$$ plain form
3039 -1133 -880 948 1224 -802 -1105 734 1668 -257 -1381 645 1978 -274 -1293 514 1834 254
3055 254 -1021 -130 1819 658 -1345 -144 1326 869 -1033 -538 1256 800 -964 -487 947 1229 -1012
3072 -1012 -1086 904 990 -713 -1406 427 1397 -618 -1418 101 1676 -331 -1705 -272 1189 44 -1135
3089 -1135 -685 1479 496 -1554 -941 1086 560 -1043 -1378 847 760 -856 -968 678 1243 -901 -1662
3106 -1662 632 1332 -571 -1276 205 1221 -252 -1238 -44 1328 274 -1584 -720 1347 398 -1276
3122 -1276 -607 1308 476 -1566 -830 676 1185 -976 -1522 683 1358 -901 -1501 650 1230 -708 -1200
3139 -1200 228 1091 -68 -1396 -228 1087 -18 -1577 -301 1250 465 -1325 -194 1321 482 -1225
3155 -1225 -564 798 814 -879 -1110 1016 1253 -809 -999 906 1351 -137 -1134 486 1101 -406 -1263
$$ packed form
3039a133K53J828K76k026l03J839R34j925j124K026J333k252j019J807J320j580
3055B54j275Q91J949j161k003J201J470m57j902M95J794m56j764M77J434K82k241
3072a012p4J990Q6j703o93J833R70k015q00J519J575k007j374J433J461j145j179
3089a135M50K164r83k050O13K027n26j603l35K225q7j616j12J646N65k144p61
3106a662K294P00j903p05J481J016j473r86J194J372j054j858Q64K067r49j674
3122a276O69J915q32k042P36J506N09k161n46K205O75k259o00K151N80j938m92
3139a200J428Q63j159j328J168J315j105j559J276J551p85j790J131J515q39j707
3155a225O61J362J6j693k31K126K37k062j90J905M45j488r97J620O15j507q57
$$ plain form
3172 -1263 257 1502 389 -911 -3 1499 335 -838 -283 1108 885 -800 -635 1116 917 -632
3188 -632 -912 883 1337 -737 -1014 781 844 -563 -1207 391 1071 -148 -1225 233 1262 3 -1120
3205 -1120 -246 1223 359 -1263 -692 934 301 -1262 -702 871 546 -1106 -558 813 848 -777 -1149
3222 -1149 323 921 -357 -1316 622 1407 -92 -1155 34 990 -267 -1288 -136 1304 202 -1107
3238 -1107 -581 755 486 -1076 -683 813 470 -1156 -861 956 759 -1034 -1004 407 728 -494 -1142
3255 -1142 291 1051 -355 -914 -96 1120 -235 -1324 -145 915 -112 -1092 -395 874 648 -835
3271 -835 -531 1002 571 -978 -619 899 757 -766 -601 467 1057 -596 -1152 533 1039 -317 -808
3288 -808 313 1110 -166 -1106 221 1296 117 -899 134 1256 629 -956 -465 848 561 -763
$$ packed form
3172a263J520J245j113j300R08J502j164j173N55J391k23j685J65J751j99j549
3188f32k80J795M54k074k77J795O3j407o44J598O80j219j077J458J029j259j123
3205a120Q74J469q64j622N71J626o33j563N60J573l25j652N48J371L5j625l72
3222a149J472N98j278r59J938P85j499j063J189R56j257j021J152J440j102j309
3238a107N26J336k69j562L93J496l43j626K95J817j97j793L0J411L21j222o48
3255a142J433P60j406n59Q18J216j355j089J179J060j027r80O97J269k26j483
3271h35L04J533m31j549L59J518j42j523J65J068N90j653n56J685N06j356m91
3288h08J121P97j276r40J327J075j179j016J033J122o27j585M91J313k87j324
$$ plain form
3304 -763 -489 747 1125 -249 -876 671 896 -565 -729 407 1023 -281 -556 504 1021 -124 -936
3321 -936 262 1262 201 -987 -173 1068 274 -1351 -379 1048 837 -1011 -510 876 764 -718 -635
3338 -635 771 898 -563 -888 445 857 -95 -1156 373 1124 -208 -923 29 893 177 -1063 57
3355 57 859 211 -878 -335 838 328 -750 -605 903 568 -1007 -689 694 802 -941 -606 791 491
3373 491 -433 -799 93 769 -251 -928 -77 788 -252 -1070 -124 818 125 -987 -428 680 120 -1098
3391 -1098 -316 785 613 -881 -1020 527 642 -536 -542 584 700 -510 -771 271 1074 -409 -801 138
3409 138 1142 149 -984 -2 1140 354 -1071 87 820 185 -721 -604 826 721 -759 -423 671
3426 671 787 -359 -445 366 677 -171 -656 56 755 -330 -830 518 860 -41 -1063 15 772 79 -935
$$ packed form
3304g63K74J236L78j374o27J547K25j461j64J136O16j304k75J060N17j145q12
3321i36J198J000j061j188Q14J241p94j625R72J427k11j848N01J386j12j482Q3
3338f35J406J27j461l25J333M12r52j061J529P51j332p15R52Q64p16j240J120
3355E7Q02o48j089N43J173n10j078J45J508l35j575L18J383J08j743L35J397l00
3373D91r24l66Q92O76j020o77Q51Q65j040q18R46R42o93j112N59J108n60j218
3391a098P82J101j72j494j39J547J15j178oJ126J16j210k61J042Q03j483l92R39
3409A38J004r93j133R82J142p86j425J158P33o35r06J17J430j05j480L36J094
3426F71J16j146q6Q11L11q48m85P12O99j085n00J348L42r01j022J078P57o93j014
$$ plain form
3445 -935 -265 1027 413 -738 -13 905 486 -617 -661 918 741 -639 -763 651 764 -414 -987 172
3463 172 708 -459 -726 391 1127 40 -670 60 819 -89 -1007 40 843 311 -1033 -417 756 315
3481 315 -647 -894 649 496 -583 -493 628 555 -498 -693 307 773 -73 -1020 120 621 -395 -820
3499 -820 -475 788 -143 -1164 -131 777 48 -1198 -434 571 424 -821 -430 731 354 -594 -578 517
3517 517 663 -605 -886 542 590 -422 -890 194 798 -276 -941 111 959 107 -718 -412 1141 243
3535 243 -1167 -330 507 159 -813 -535 841 438 -679 -190 450 690 -117 -261 642 691 -309 -769 574
3554 574 1043 -318 -518 476 740 -143 -602 33 685 110 -562 165 504 479 -409 15 740 62 -631 -276
3574 -276 749 580 -280 -657 407 750 16 -548 613 851 -253 -792 28 584 144 -475 442 833 56
$$ packed form
3445i35O70J292o14j151P25R18m19j103m4J579j77j380j24J414J13j178n73J159
3463A72N36j167k67J117P36j087p10P30P59r08r18J047Q03n32j344O16J173m41
3481C15r62k47J543j53j079R0J121p3j053j95J000M66q46r47J140N01j016m25
3499h20L45J263r31j021J033R08p29j246P64J005j47j245L91J161l77r48J6J095
3517E17J46j268k81J428M8j012m68J084O04j074o65J052Q48q52q25L06J553q98
3535B43j410Q37Q37l48r72K78J376m03j117M89O40K40q07j44R03M9j000m60J343
3554E74M69j361k00R94K64q83m59O35O52n75o72P27L39k5q88M24P25o78o93L55
3574b76J025j69q60l77J064L43p34n64J161K38j104n39Q20N56m40o19R17L91p77
$$ plain form
3593 56 -301 53 814 434 -909 -331 724 484 -638 -385 213 347 -820 -526 253 703 -197 -503 77
3612 77 214 95 -590 42 728 -247 -865 -143 399 25 -892 -405 465 162 -727 -309 428 64 -885 -536
3632 -536 314 329 -612 -330 358 171 -550 -640 205 595 -61 -697 347 712 -424 -556 126 645 75 -611
3652 -611 -114 439 314 -447 -232 478 197 -573 -176 708 282 -514 -387 304 489 -221 -468 374 577 -213
3672 -213 -434 96 656 151 -608 -121 672 -70 -522 -109 512 22 -522 -110 565 495 -484 118 524 423
3692 423 -561 -223 596 580 -350 -517 560 499 88 -645 426 273 -138 -343 -43 828 -280 -469 25 636
3712 636 27 -236 -224 721 371 -434 -49 469 312 -826 -209 280 497 -339 -360 428 632 -524 -805 285
3732 285 572 -300 -648 -67 358 -94 -405 -231 521 -156 -718 -69 366 -16 -739 -576 310 368 -697 -616
$$ packed form
3593E6l57L54P61l80j343N78J055k40j122K53N98J34j167K94P79M50r00l06N80
3612G7J37j19o85O32O86r75o18P22N42l74r17M87Q70l03q89M18P37l64r49L49
3632e36Q50J5r41K82O88j87p21r0Q45L90o56o36J044L65j136j32O82N19n70o86
3652f11M97N53j25p61K15P10k81p70L97Q84m26p96J27O91J85p10k47Q42K03p90
3672b13k21N30N60n05p59M87P93p42m52M13O21m90n44M12O75p0r79O02M06j01
3692D23r84L38Q19j6r30j67J077o1m11p33J071j53m11k05L00Q71j108j89M94O11
3712F36o09k63J2R45l50q05L85N18j57j138O17M89K17q36k1P88K04j156k81J090
3732B85K87q72l48N81M25m52l11J74P52o77n62O49M35l82p23J63Q86N8j065Q1
$$ plain form
3752 -616 259 435 -559 -335 565 -89 -652 -437 305 471 -299 -456 266 317 -143 -494 90 351 -157 -596
3772 -596 -39 354 65 -775 -15 618 -113 -411 -239 458 271 -515 -401 111 248 -348 -175 47 138 -245
3792 -245 -434 167 276 -206 -466 47 709 -73 -485 33 618 86 -400 -525 465 378 -286 -110 286 414
3812 414 -262 123 193 458 -213 -29 141 703 -198 -484 331 486 110 -345 43 738 -144 -609 30 513
3832 513 -250 -185 -18 387 155 -358 -316 445 127 -432 -271 505 187 -40 -526 650 601 -321 -458 299 377
3853 377 -301 -524 -253 550 144 -350 104 500 297 -324 183 64 -142 -404 -68 323 -24 -106 -212 522
3873 522 406 -393 -420 324 363 -305 -438 242 181 -245 -511 391 536 -139 -716 146 338 165 -397 -67 399
3894 399 478 -356 -395 217 -90 -485 -144 273 335 -160 -249 197 303 -479 -640 -95 194 29 -366 38 -18 -72
$$ packed form
3752f16Q75J76r94K24R00o54n63K15P42J66p70j57P22N1m60l51N84K61n08m39
3772e96N57L93k89q40P60O33p31k98J72O97j87p86J14N12J37n96J73K22R1l83
3792b45j89O01J09m82k60N13O62p82m12N18N85n32m86j25R90q7o64J76L96J28
3812D14o76L85P0K65o71J84J70N62r01k86Q15J55l76m55L88O95q82m65O39M83
3832E13p63O5J67M05k32n13M2P61l18n59J61P76l18k27m86J176m9r22j37P57P8
3853C77o78k23K71Q03m06m94M54L96k03o21N07j19k06k62L36L91l47q2j06P34
3873E22j16p99k7P44L9o68j33O80o1m26k66R02J45o75n77Q62J92j73n62L30M66
3894C99P9q34l9O12l07l95L41M17O2m95q9M46J06p82j61N45K89j65l95M04n6n4
$$ plain form
3916 -72 -336 192 81 -132 -346 -161 147 83 -536 135 462 458 -328 5 309 -197 -213 -92 392 279 -176 -363
3938 -363 292 413 -111 -290 181 300 119 -400 -66 236 -324 -559 -181 624 -90 -289 29 512 232 -401
3958 -401 -344 325 214 -515 -22 399 639 -394 -57 519 63 -302 -188 300 208 36 -415 20 629 -244
3978 -244 -477 240 545 367 -507 -128 256 172 -179 -337 392 270 -607 -177 303 192 -328 -274 279 210 -44
3999 -44 -246 130 224 -189 -544 66 363 151 -432 -107 275 -44 -403 195 669 340 -385 -203 443 4 -439
4020 -439 -210 55 109 -135 -238 -256 -140 -168 -371 199 187 -205 -404 -14 325 -208 -462 -168 627 -180 -423
4041 -423 -39 194 -191 -361 -64 257 367 -109 -17 457 26 -196 -19 4 383 232 -151 253 297 -126 -198
4062 -198 197 311 -178 -284 206 307 -59 -254 -74 298 -27 -357 -224 468 1 -306 0 84 273 -150
$$ packed form
3916g2k64N28j11k13k14J85L08o4o19O71L27mp86L33L04n06j6J21M84j13m55j87
3938c63O55J21n24j79M71J19j81n19L34L02n60k35L78Q05p14j99L18M83k80o33
3958d01N7O69j11p29M93M21K40j033L37N76m56l65J14M88r2j72m51M35O09q73
3978b44k33P17L05j78q74L79L84q4l51j58P29j22q77M30M80j11n20N4N53o9k54
3999d4k02L76R4m13l55O10K97k12n83L25L82l19l59N98M74l29p25J82O46m39m43
4020d39K29K65N4k44j03j8J16k8k03N70j2l92j99L90L39n33k54K94P95q07k43
4041d23L84K33l85j70K97L21J10m76R2M74m31k22J77K3L79j51l83M04M4m23p2
4062a98L95J14m89j06M90J01l66j95J80L72l25l30J33O92m67l07L06Q4J89m23
$$ plain form
4082 -150 -225 -58 97 54 65 98 381 -9 -395 -39 391 -29 47 -294 122 -188 -419 -64 81 191 -346 -36
4104 -36 383 -87 -466 -180 482 211 -267 -197 23 104 -331 -376 -102 146 -216 -198 110 60 -197 -397 -133 137
4126 137 38 -586 -30 264 -63 -424 -8 396 219 -258 -200 99 -83 -149 -39 180 383 -312 -268 310 343 21
4148 21 53 -122 467 -16 -175 -330 343 15 -338 63 416 99 -415 2 107 55 -373 -67 -47 70 -353
4169 -353 -251 311 -74 -88 -156 -7 250 -1 -352 -131 155 -369 -292 10 205 -158 -316 -58 358 156 -142
4190 -142 -44 95 163 -179 -251 324 310 -244 13 374 5 -345 -87 465 246 -29 91 -245 5 -113 -239
4211 -239 144 254 52 -236 -74 121 -204 -427 -212 326 87 -350 -164 487 184 -247 49 424 109 -19
4231 -19 -9 208 205 -311 -239 30 385 -253 -218 -37 104 -71 -289 38 372 44 -22 62 263 -155 -123 -150 521
$$ packed form
4082a50p5J67J55m3J1L3K83l90l86L56M30m20P6l41M16l10k31L55J45J10n37L10
4104c6M19m70l79K86O62k71m78P0K20Q1m35m5K74K48l62J8L08n0k57k00K64K70
4126A37r9o24N56K94l27l61M16M04j77m77N8K99j82o6J10K19K03o95M4N78L3l22
4148B1L2j75N89m83j59j55O73l28l53M01L53l17n14M17J05n2m28L06K0J17m23
4169c53J02N62l85j4o8J49K57k51l51K21K86n24P7L02J95l63j58K58M16k02k98
4190a42R8J39O8l42p2N75j4n54K57L61l69l50K58N52k19k75J20l36K50j18j26
4211b39L83J10k02k88J62J95l25k23K15N38k39m37J86O51l03m31K96L75l15j28
4231a9J0K17ln16P2K69L55o38L5J81J41j75k18L27L34l28o6Q4K01m18L2k7O71
$$ plain form
4254 521 -182 -531 -122 370 396 -210 -267 -220 54 5 -242 176 282 99 -213 -138 136 -180 -499 -9 -83 -228
4276 -228 -399 -179 -117 -250 -241 -120 10 49 -315 -281 406 -82 -48 -256 355 263 -346 -278 191 100 -36 -327 -105
4299 -105 216 -338 -150 266 -89 98 -434 -227 154 -14 -261 -107 764 82 -250 -15 291 -13 -284 -19
4319 -19 521 355 -27 -205 197 342 -205 16 271 286 -63 -168 -24 184 -137 46 -275 290 5 114 6
4340 6 -32 13 -269 110 246 54 -14 -99 -69 98 -65 -76 184 192 -122 -244 177 336 -176 -460 6 104 -183 75
4364 75 -17 304 -325 6 -34 -1 -38 -115 218 321 73 -253 34 186 -13 -369 -7 216 -24 -136 -266 -20
4386 -20 145 -279 -515 33 110 -128 -368 181 161 192 -245 79 248 -81 -315 23 45 203 -507 284 15 175
4408 175 -409 -308 403 71 -177 0 193 100 -214 -366 -121 162 -302 -51 -21 -129 211 -453 -37 -11 -253
$$ packed form
4254E21p03l49M09M92K6o06n7M7K74m9k47M18J06j83l12P5K74l16l19M90p4j45
4276b28j71K20O2j33RJ21J30L9l64L4O87m88L4k08O11r2o09O8M69r1j36k91K22
4299a05L21n54J88M16l55J87n32K07L81j68k47J54Q71o82l32K35L06l04k71K65
4319a9N40j66l82j78M02J45n47K21K55J5l49j05J44K08l21J83l21N65k85J09j08
4340Fl8M5k82L79J36j92o8q5L0J67j63j1K60Ql14j22M21J59n12k84M66R8k87K58
4364G5r2L21o29L31m0L3l7p7L33J03k48l26K87J52j99l56L62K23k40j12j30K46
4386b0J65m24k36N48P7k38k40N49k0L1m37L24J69l29k34L38K2J58p10P91k69J60
4408A75n84J01P11l32k48J77J93r3l14j52K45K83m64K51L0j08L40o64M16K6k42
$$ plain form
4429 -253 -350 -92 168 99 -69 293 137 369 -363 -280 166 -180 17 73 -71 348 86 -30 -91 -51 -310 -281
4451 -281 72 321 -311 -85 -81 262 5 -108 -250 251 112 -99 59 366 0 -363 98 38 45 -353 -524 63
4473 63 331 39 -142 -100 267 -181 -324 -183 308 -359 69 -150 410 -71 -197 165 69 -241 -523 142 222
4494 222 178 -166 248 -11 187 89 204 164 203 -255 -279 -101 15 204 -303 -10 94 -128 -196 -71 67 -10
4516 -10 -85 -316 377 -258 -196 -377 378 -67 3 -108 102 100 -200 -88 60 96 -159 84 218 -377 -572 -202
4538 -202 49 138 -76 -122 -207 26 -40 -249 -24 369 -78 -4 -310 120 46 -118 99 13 -122 -250 -104 210
4560 210 -77 -225 -148 25 319 -83 -224 152 24 196 -242 -67 169 -277 -373 -149 -139 -111 -161 277 454 54
4582 54 -240 -187 -28 -160 -339 131 262 -94 -171 -271 40 27 184 12 340 155 24 -210 -41 153 65 -145
$$ packed form
4429b53r7K58K60o9j68L62j56K32p32Q3M46l46J97N6j44M19k62j16o1M0k59K9
4451b81L53K49o32K26ML43k57j13j42N01j39k11J58L07l66l63M61o0Pl98j71N87
4473F3K68k92j81M2L67m48j43J41M91o67M28k19N60m81j26L62r6l10k82O65Q0
4494B22m4l44M14k59J98r8J15m0L9m58k4J78J16J89n07K93J04k22o8J25J38p7
4516a0p5k31O93o35O2j81P55m45P0j11K10kl00J12J48L6k55K43J34n95j95L70
4538b02K51Q9k14m6q5K33o6k09K25L93m47P4l06M30p4j64K17q6j35j28J46L14
4560B10k87j48P7J73K94m02j41L76j28J72m38J75K36m46r6K24J0K8n0M38J77m00
4582E4k94N3J59j32j79M70J31l56p7j00L11j3J57j72L28j85j31k34J69J94q8k10
$$ [...]
8191B42
##END NTUPLES=NMR FID
##END=
