##TITLE=1H_Ser 1377-1
 CDCl3, 8 sc, 
 20.12.2019
##JCAMPDX= 6.0         $$ Bruker NMR JCAMP-DX V2.0
##DATA TYPE= NMR FID
##DATA CLASS= NTUPLES
##ORIGIN= UXNMR, Bruker Analytische Messtechnik GmbH
##OWNER= root
$$ XWIN-NMR		Version 3.5
$$ Fri Dec 20 15:44:01 2019 Russian Standard Time (UT+4h)  she@DPX200
##.OBSERVE FREQUENCY= 200.1315
##.OBSERVE NUCLEUS= ^1H
##.DELAY= (6, 6)
##.ACQUISITION MODE= SIMULTANEOUS
##.ACQUISITION SCHEME= undefined
##.AVERAGES= 8
##.DIGITISER RES= 18
##SPECTROMETER/DATA SYSTEM= spect
##.PULSE SEQUENCE= zg30
##.SOLVENT NAME= CDCl3
##.SHIFT REFERENCE= (INTERNAL, CDCl3, 0, 15.7039)
##AUDIT TRAIL= $$ (NUMBER, WHEN, WHO, WHERE, WHAT)
$$ ##TITLE= Audit trail, XWIN-NMR		Version 3.5
$$ ##JCAMPDX= 5.01
$$ ##ORIGIN= Bruker BioSpin GmbH
$$ ##OWNER= she
$$ F:/spectra/data/she/nmr/H-F/1/audita.txt
$$ ##AUDIT TRAIL=  $$ (NUMBER, WHEN, WHO, WHERE, WHAT)
(   1,<2019-12-20 15:42:57.90 +0400>,<she>,<DPX200>,
      <created by zg, POWCHK disabled, PULCHK disabled
       configuration hash MD5:
       00 E9 B6 7A A2 85 ED C7 34 08 36 98 17 FE 4E 26
       data hash MD5: 16K
       EF BC 56 B3 4D 41 B6 B6 83 63 F1 27 76 9E 11 24>)
$$ ##END=
$$ 
$$ hash MD5
$$ 09 CB 1F 97 F6 F1 23 A7 08 C6 DC 1C D3 CE AD A4
##$RELAX= 
##$RELAX= 
##$RELAX= 
##$RELAX= 
##$RELAX= 
##$RELAX= 
$$ Bruker specific parameters
$$ --------------------------
##$DU= <F:/spectra>
##$EXPNO= 1
##$NAME= <H-F>
##$PROCNO= 1
##$TYPE= <nmr>
##$USER= <she>
##$AMP= (0..31)
100 100 100 100 100 100 100 100 100 100 100 100 100 100 100 100 100 100 
100 100 100 100 100 100 100 100 100 100 100 100 100 100 
##$AQSEQ= 0
##$AQ_mod= 1
##$AUNM= <au_zg>
##$AUTOPOS= <>
##$BF1= 200.13
##$BF2= 200.13
##$BF3= 200.13
##$BF4= 200.13
##$BF5= 200.13
##$BF6= 200.13
##$BF7= 200.13
##$BF8= 200.13
##$BYTORDA= 1
##$CFDGTYP= 0
##$CFRGTYP= 5
##$CHEMSTR= <none>
##$CNST= (0..31)
1 1 145 1 1 1 1 1 1 1 1 1 1 1 1 1 1 1 1 1 1 1 1 1 1 1 1 1 1 1 1 1 
##$CPDPRG= <>
##$CPDPRG1= <>
##$CPDPRG2= <>
##$CPDPRG3= <>
##$CPDPRG4= <mlev>
##$CPDPRG5= <mlev>
##$CPDPRG6= <mlev>
##$CPDPRG7= <mlev>
##$CPDPRG8= <mlev>
##$CPDPRGB= <>
##$CPDPRGT= <>
##$D= (0..31)
0 1.2 0 0 0 0 0 0 0 0.06 0 0.03 0 0 0 0 0.0002 0 0 0 0 0 0 0 0 0 0 0 0 
0 0 0 
##$DATE= 1576842177
##$DBL= (0..7)
120 120 120 120 120 120 120 120 
##$DBP= (0..7)
150 150 150 150 150 150 150 150 
##$DBP07= 0
##$DBPNAM0= <>
##$DBPNAM1= <>
##$DBPNAM2= <>
##$DBPNAM3= <>
##$DBPNAM4= <>
##$DBPNAM5= <>
##$DBPNAM6= <>
##$DBPNAM7= <>
##$DBPOAL= (0..7)
0.5 0.5 0.5 0.5 0.5 0.5 0.5 0.5 
##$DBPOFFS= (0..7)
0 0 0 0 0 0 0 0 
##$DE= 6
##$DECBNUC= <off>
##$DECIM= 24
##$DECNUC= <off>
##$DECSTAT= 4
##$DIGMOD= 1
##$DIGTYP= 9
##$DL= (0..7)
0 120 120 120 120 120 120 120 
##$DP= (0..7)
150 150 150 150 150 150 150 150 
##$DP07= 0
##$DPNAME0= <>
##$DPNAME1= <>
##$DPNAME2= <>
##$DPNAME3= <>
##$DPNAME4= <>
##$DPNAME5= <>
##$DPNAME6= <>
##$DPNAME7= <>
##$DPOAL= (0..7)
0.5 0.5 0.5 0.5 0.5 0.5 0.5 0.5 
##$DPOFFS= (0..7)
0 0 0 0 0 0 0 0 
##$DQDMODE= 0
##$DR= 18
##$DS= 0
##$DSLIST= <SSSSSSSSSSSSSSS>
$$ [...]
##$SUBNAM2= <"">
##$SUBNAM3= <"">
##$SUBNAM4= <"">
##$SUBNAM5= <"">
##$SUBNAM6= <"">
##$SUBNAM7= <"">
##$SUBNAM8= <"">
##$SUBNAM9= <"">
##$SW= 24.9337058887773
##$SWIBOX= (0..15)
0 0 2 0 0 0 0 0 0 0 0 0 0 0 0 0 
##$SW_h= 4990.01996007984
##$TD= 16384
##$TD0= 1
##$TE= 0
##$TE2= 300
##$TE3= 300
##$TEG= 300
##$TL= (0..7)
0 120 120 120 120 120 120 120 
##$TP= (0..7)
150 150 150 150 150 150 150 150 
##$TP07= 0
##$TPNAME0= <>
##$TPNAME1= <>
##$TPNAME2= <>
##$TPNAME3= <>
##$TPNAME4= <>
##$TPNAME5= <>
##$TPNAME6= <>
##$TPNAME7= <>
##$TPOAL= (0..7)
0.5 0.5 0.5 0.5 0.5 0.5 0.5 0.5 
##$TPOFFS= (0..7)
0 0 0 0 0 0 0 0 
##$TUNHIN= 0
##$TUNHOUT= 0
##$TUNXOUT= 0
##$USERA1= <user>
##$USERA2= <user>
##$USERA3= <user>
##$USERA4= <user>
##$USERA5= <user>
##$V9= 5
##$VALIST= <valist>
##$VCLIST= <CCCCCCCCCCCCCCC>
##$VD= 0
##$VDLIST= <DDDDDDDDDDDDDDD>
##$VPLIST= <PPPPPPPPPPPPPPP>
##$VTLIST= <TTTTTTTTTTTTTTT>
##$WBST= 1024
##$WBSW= 4
##$XGAIN= (0..3)
0 0 0 0 
##$XL= 0
##$YL= 0
##$YMAX_a= 168960
##$YMIN_a= -100235
##$ZGOPTNS= <>
##$ZL1= 120
##$ZL2= 120
##$ZL3= 120
##$ZL4= 120
##$ABSF1= 10
##$ABSF2= 0
##$ABSG= 5
##$ABSL= 3
##$ALPHA= 0
##$AQORDER= 0
##$ASSFAC= 0
##$ASSFACI= 0
##$ASSFACX= 0
##$ASSWID= 0
##$AUNMP= <proc_1d>
##$AZFE= 0.1
##$AZFW= 0.1
##$BCFW= 1
##$BC_mod= 2
##$BYTORDP= 1
##$COROFFS= 0
##$CY= 11.3945322036743
##$DATMOD= 1
##$DC= 2
##$DFILT= <>
##$DTYPP= 0
##$F1P= 16.9975609425685
##$F2P= -3.02152046262296
##$FCOR= 0.5
##$FTSIZE= 0
##$FT_mod= 4
##$GAMMA= 1
##$GB= 0.15
##$INTBC= 1
##$INTSCL= 1
##$ISEN= 128
##$LB= 0.24
##$LEV0= 0
##$LPBIN= 0
##$MAXI= 10000
##$MC2= 0
##$MEAN= 0
##$ME_mod= 0
##$MI= 1.114404
##$NCOEF= 0
##$NC_proc= 0
##$NLEV= 6
##$NOISF1= 3.799351
##$NOISF2= 2.8
##$NSP= 1
##$NTH_PI= 0
##$NZP= 0
##$OFFSET= 15.70392
##$PC= 1
##$PHC0= -10150.02
##$PHC1= 19.4008
##$PH_mod= 1
##$PKNL= yes
##$PPARMOD= 0
##$PSCAL= 0
##$PSIGN= 0
##$REVERSE= no
##$SF= 200.130013532006
##$SI= 16384
##$SIGF1= 3
##$SIGF2= 2
##$SINO= 400
##$SIOLD= 16384
##$SREGLST= <1H.CDCl3>
##$SSB= 0
##$STSI= 0
##$STSR= 0
##$SW_p= 3612.71676300578
##$SYMM= 0
##$S_DEV= 0
##$TDeff= 0
##$TDoff= 0
##$TI= <>
##$TILT= no
##$TM1= 0
##$TM2= 0
##$TOPLEV= 0
##$USERP1= <user>
##$USERP2= <user>
##$USERP3= <user>
##$USERP4= <user>
##$USERP5= <user>
##$WDW= 1
##$XDIM= 8192
##$YMAX_p= 0
##$YMIN_p= 0
$$ End of Bruker specific parameters
$$ ---------------------------------
##NTUPLES= NMR FID
##VAR_NAME=  TIME,          FID/REAL,        FID/IMAG
##SYMBOL=    X,             R,               I
##VAR_TYPE=  INDEPENDENT,   DEPENDENT,       DEPENDENT
##VAR_FORM=  AFFN,          ASDF,            ASDF
##VAR_DIM=   8192,          8192,            8192
##UNITS=     SECONDS,       ARBITRARY UNITS, ARBITRARY UNITS
##FACTOR=    0.0002004,     1,               1
##FIRST=     0,             0,               0
##LAST=      1.6414764,     0,               0
##MIN=       0,             -100235,         0
##MAX=       1.6414764,     168960,          0
$$ Real data points
##PAGE= N=1
##DATA TABLE= (X++(R..R)), XYDATA
$$ [...]
2444a998J656K898j449l686J215M073j23m988o48N649J533n082k998M673L762
$$ -1998 -342 2556 1107 -2579 -1364 2709 2586 -2402 -3050 2599 4132 -950 -3948 725 4487
2459D487m151m289L105M751j996n024R71M996L09m652p34L478J045l058j338K648
$$ 4487 336 -3953 -848 3903 1907 -3117 -2146 2850 3159 -1493 -2227 1251 2296 -762 -2100 548
2475E48R92j971j079J802N86j844k20K257m99k221j1K946P3l322j078M014J318
$$ 548 1540 -431 -1510 292 878 -966 -1186 1071 572 -1649 -1660 1286 1359 -1963 -3041 973 2291
2492B291m060k337L988L617l862m598L400M840j602n596R40N331M32m897j563
$$ 2291 -1769 -4106 -118 3499 -363 -4961 -1561 3279 1677 -3919 -2979 2352 2784 -2113 -3676
2507c676M895J838m063k346L390K286k101k497J714J914q59j769J229J559j523
$$ -3676 1219 3057 -1006 -3352 38 2324 223 -2274 -560 1354 495 -1274 -45 1514 -9
2522iq97J283J209j957j021K196J377k326k456K636L305k960l700K234M676j577
$$ -9 -906 377 1586 -371 -1392 804 2181 -145 -2601 35 3340 380 -3320 -1086 3590 2013
2538B013m862O12N012M30n093j439M717K681m501l284L271M030k478l945J619
$$ 2013 -2849 -2237 2775 3205 -1888 -3327 1390 4071 -430 -3714 -443 3587 1109 -2836 -1217
2553a217L533m86l227K31K807j73k181j38J836j16j370L74J249k63k015J547J786
$$ -1217 2316 1830 -1397 -1166 1641 1468 -713 -851 985 869 -501 -127 1122 859 -1156 391 2177
2570B177j078k926J093L273m81l988L5M517N28m764j505M684K312l983l284K980
$$ 2177 1099 -1827 -734 2539 2058 -1930 -1895 2622 3150 -1614 -3119 1565 3877 -106 -3390 -410
2586d10M479k891m274J567M245l55m602m1M031P39l770j233K815J505k478j074
$$ -410 4069 1178 -3096 -1529 2716 2361 -2241 -2282 1749 2488 -1282 -2515 300 1805 -673 -1747
2602a747K070N91j878o22J849M45k372R4K496j31k730j44L109Q23l434j456L456
$$ -1747 323 914 -964 -1586 263 708 -1664 -1570 926 795 -1935 -2079 1030 1853 -1581 -3037 419
2619D19K556l663l035K902M360k332m805J629N100o75n237m00M987J358m281k115
$$ 419 2975 -688 -3723 -821 3539 1207 -3598 -1969 3131 2456 -2781 -3181 1806 3164 -1117 -3232
2635c232L456K756k699k837K338K268j733k166J113J805j001j484J255J151j799
$$ -3232 224 2980 281 -2556 -218 2050 317 -1849 -736 1069 68 -1416 -161 990 -809
2650h09n45J695J075k361j440K649J855k487k540K432L445k495l823K007M387
$$ -809 -1354 341 1416 -945 -2385 264 2119 -368 -2908 -476 2969 474 -3349 -1342 3045
2665C045m02m846n81M727J325m359j648L526K854l089l132K547L271j544l680
$$ 3045 2643 -2203 -2784 1943 3268 -1091 -2739 787 3641 552 -2580 -33 3238 1694 -1986
2680a986J286K771n45k318L17J838l84j504O75R64o57j131M40J591j137j591J413
$$ -1986 -700 2071 1526 -792 -475 1363 979 -525 150 1114 457 -674 -234 1357 220 -1371 42
2697D2K326j187l585J258L578n19l757k04M044N81l557k153L730K848l014l348
$$ 42 2368 1181 -2404 -1146 2432 1913 -1844 -2048 1996 2577 -980 -3133 597 3445 431 -2917
2713b917K179L661j458l989O35L716p9k681q30K330R27k093j274J514J481j162
$$ -2917 -738 2923 1465 -2524 -1889 1827 1748 -933 -1763 567 1494 -599 -1873 -359 1122 -40
2729d0r17Q60P7r04M11J670o19j853L95J763M0k316R6K448J127l056j909L171
$$ -40 -957 -97 -20 -924 -513 1157 538 -1315 -920 843 883 -1433 -1337 1111 2238 -818 -2727 444
2747D44K270k453k988J940L541r63m140j3L607Q94l734p31K743J798k565k362
$$ 444 2714 261 -2727 -787 2754 1791 -2349 -2362 1245 2139 -1595 -2326 417 2215 -350 -2712
2763b712J858J879m40j990L66J531J4j674q1J411j39m42K33N60p97r39J383P53
$$ -2712 -854 1025 585 -1405 -1039 492 506 -1168 -1249 162 23 -419 -186 374 -423 -1362 21 774
2781G74q01j553J612J759j427k826J438L361l55l651L18L315K56l410j764L668
$$ 774 -27 -1580 32 1791 364 -2462 -1024 2337 1982 -1669 -1351 1964 2220 -1190 -2954 714
2797G14K637k553l306J645L460j232l396P34L345M40l503r85K701P65j523o10
$$ 714 3351 798 -2508 -863 2597 1365 -2031 -1297 2048 2488 -1015 -2000 701 1466 -57 -667
2813f67J249M72j258n40J201K49j153M74J257k6k436K46K394j90k588k71L071
$$ -667 582 1054 -204 -744 457 706 -447 27 1284 1258 -1178 -932 1462 1272 -1316 -1587 1484
2830A484J047l179k260L344K570k746k767K009L516j459m297M05M496J63l781
$$ 1484 2531 -648 -2908 436 3006 260 -2507 -498 3018 1559 -2738 -2333 2163 2326 -1455
2845a455p58L453J012k987j253K123J844j735j829J622J212r52j219J214R35j224
$$ -1455 -2213 1240 2252 -735 -1988 135 1979 244 -1585 37 1249 297 -922 292 1227 3
2861Cr06J598M57k253j169L104J486k945k015K973K162k703l048K424L900k104
$$ 3 -903 695 1152 -1101 -2270 834 2320 -625 -2640 333 2495 -208 -3256 -832 3068 964
2877I64m281Q85L874L26m338k31L972J505l952k059K935K297k141k055J771K161
$$ 964 -3317 -2432 1442 1768 -2570 -2801 1171 2676 -1276 -3335 -400 1897 -244 -2299 -528 1633
2893A633j230j974N44J841o41r59R22R35j032j108R94J077j544p23K140Q98j944
$$ 1633 403 -1571 -1027 814 173 -786 136 1071 39 -1069 -75 1002 -542 -1265 875 1773 -171
2910a71j923J352L320j602l376J116L922m57m428p81M299J509l180k325L117K234
$$ -171 -2094 -742 2578 976 -2400 -1284 2638 2181 -2247 -3028 1271 2780 -400 -2725 392 2626
2926B626k670k748J889L112q78k832M43K119k47j602RJ893J8j016k26P35k79q85
$$ 2626 -44 -2792 -903 2209 1331 -1501 -1058 1061 814 -788 -779 1114 1132 116 -110 625 346 -539
2944e39O29J143q83j513P79K042r04k531J149K719l71l074m34L047J072k964j808
$$ -539 90 1233 350 -1163 -384 1658 754 -1777 -628 2091 1720 -1354 -1788 1259 2331 -633 -2441
2961b441K949K504k368k774J097L304n67l148J40L328nk548j062K138R07j226
$$ -2441 508 3012 644 -2130 -1033 2271 1704 -1444 -1304 2024 2019 -529 -1591 547 1454 228
2977B28j210Q77J140q26o18L58J76n06L4R12l82j304Q9J557Q7j767m54K037Q39
$$ 228 -982 -105 1035 209 -409 -51 125 -381 -347 565 183 -1121 -1032 525 612 -1155 -1609 428 1267
2996A267k337j513K489J914j467k837J630K777q87k834m55L789N67l010j346K387
$$ 1267 -1070 -2583 -94 1820 353 -2484 -854 1923 1036 -1798 -2253 1536 2103 -907 -2253 134
3012A34J837k051j805J443J801p32j757K98J465J02j467K56O25L1n48k05N27o35
$$ 134 1971 -80 -1885 -442 1359 627 -1130 -832 633 735 -732 -476 149 180 -368 -573 -46 -681
3030f81J9R64M94j326q08Q83J468q19j788P83K494n75k548j36K784N82k477j681
$$ -681 -662 302 796 -530 -1338 -455 1013 194 -1594 -811 1683 1108 -1440 -1576 1208 1790 -687 -2368
3048b368K763K159k243k508J588K883j153k518J17K591M40k541o92J947R83j387
$$ -2368 395 2554 311 -2197 -609 2274 1121 -1397 -1280 1311 1751 -790 -1482 465 1448 61
3064F1q39R17N64p85k9P11m5p72J59J057l07j505N81K001k87k319k82K583Q80
$$ 61 -778 139 703 -82 -111 600 555 -217 -58 999 692 -813 -232 1769 1482 -837 -1119 1464 2344
3083B344k694j378K654J920k574k517K205K832j195l234L11L074J38k996r62K512
$$ 2344 -350 -1728 926 2846 272 -2245 -40 2792 1597 -1637 -1326 1748 1886 -1110 -2072 440
3099D40J460k456j246J823R25j045j485J028Q92j51p78M24K72o37K76P10K14j377
$$ 440 1900 -556 -1802 21 946 -99 -1584 -556 336 185 -593 -169 103 -534 -258 452 666 -711
3117g11l46J780O26j986j155K215J491j950j968J506K896j469l044Q37L159Ml001
$$ -711 -1057 723 1349 -637 -1792 423 1914 -36 -2004 -498 2398 929 -2115 -1278 1881 1885 -1116
3134a116j396L085J447k570j933K206J644j087k272J021J877r3k081M80J253l9
$$ -1116 -2512 573 2020 -550 -2483 -277 1367 280 -1992 -971 906 813 -1268 -788 465 426
3150D26j242M50M57k55m97M78Q31j136m29R26J341j214k056J598K162r65k737
$$ 426 -816 -366 91 -164 -661 -183 648 -488 -917 9 1350 136 -1920 -322 1840 875 -1862
3167a862M69L040n0l255m45L169R88k501k139K373K496j658k351O66K549o07j810
$$ -1862 -1393 1647 1597 -1658 -2103 1066 2054 -447 -2586 -213 2283 625 -1726 -1060 1489 882 -928
3184i28m37K122P02k074l45J138N45l45n86P52j99m52J68R16n40j010P85J134
$$ -928 -1365 757 1459 -615 -960 178 723 378 -208 544 345 -107 61 977 437 -573 212 1346
3202A346m72j951L78K215J93k411q27K179J479k575j876K348K168j369k750J019
$$ 1346 874 -1077 -699 1516 1709 -702 -1529 650 2129 -446 -2322 26 2194 825 -1925 -906
3218i06K643n72k891J53K638O62k372j001K069J409j605j146R29R78m70q48K14
$$ -906 1737 1165 -1726 -1573 1065 1727 -645 -1646 423 1832 227 -919 10 988 518 -330 -116
3235a16P27k14n35P23m32j18k19R74Q8j248o70J672P47j980j204J901J475j501
$$ -116 611 397 -138 585 153 35 -184 790 878 -370 -1040 632 1379 -601 -1805 96 1571 70
3253G0k161Q96K855l91k965l63K632Q25k132j215K080J599j793j758J477J539
$$ 70 -2091 -1195 1660 1269 -1696 -2059 573 1398 -734 -1949 131 1730 -63 -1821 -344 1195
3269A195o75j900M65J690k50q79m07N87L27m04m9M42j14n52M04P63r45o49J092
$$ 1195 520 -1380 -915 775 525 -354 -761 -174 153 -251 -300 142 28 -524 -120 643 -302 -951 141
3288A41R79j093j693R36K107n93k245J1K318M37k277j192K529J722j754k114J234
$$ 141 1120 27 -1666 -730 1377 784 -1461 -1450 868 1305 -972 -2164 365 2087 333 -1781 -547
3305e47K169k11k504J73K069J7j555l44J271O15r23j014R79O14p33j58L38q6l31
$$ -547 1622 1411 -1093 -920 1149 1166 -389 -733 538 1153 230 -784 195 809 76 -82 256 170 -161
3324a61J7R99p45q82N54J181l94j521q2K177K57k142j213K545J523j669k041J462
$$ -161 -144 855 110 -772 -218 963 569 -952 -1034 1143 1400 -742 -1955 590 2113 444 -1597 -135
3342a35K084p84k688R2L047K85k242p63J886Q49j598j281J351J323o87j302M33
$$ -135 1949 1165 -1523 -1431 1616 1901 -341 -1104 782 1631 33 -1248 103 1426 739 -563 -130
3359a30P57l44q84N68M83n68n25R08R3j248j2J328M74j360q59J427J214j190j891
$$ -130 627 283 -601 -33 450 -118 -643 265 358 -890 -902 426 900 -460 -1319 108 1322 132 -1759
3378a759J320K294q17k400q0K659J60k262q63K414J131j893j896J623J873j066
$$ -1759 -439 1855 1038 -1362 -1442 1217 1377 -885 -1748 666 1797 -96 -1992 -369 1504 438
3394D38j655N53J651q00j347K23J004k53l43O9N72l01n56M97Q49j116n75J115
$$ 438 -1217 -664 987 187 -1160 -937 67 -186 -529 -460 112 -189 -745 -248 601 -515 -1090 25
3412B5J108j176j321Q90J973q60j942L88K347k92k178p14K436J362k147j169J224
$$ 25 1133 -43 -1364 -474 1499 639 -1303 -915 1432 1140 -1038 -1752 684 2046 -101 -1270 -46
3429d6J527j058k121J055J876m21j809j51J729K80j416m71J232K03m55m18O14
$$ -46 1481 423 -1698 -643 1233 812 -997 -1148 581 861 -555 -1026 206 409 -46 -464 150
3446A50no79L57R63n13q37O65J041o88j332P35J480k70j535m69J839N91j565j054
$$ 150 145 -534 -177 786 273 -564 101 1142 454 -878 -143 1337 1067 -468 -937 902 1493 -72 -1126
3465a126J822J419j298k055P79J810j18j997J40J601N1j576q06J243J000p20r29
$$ -1126 696 2115 817 -1238 -459 1351 1233 -764 -624 977 1028 -548 -1354 -111 889 169 -760
3482g60M61O94n71k89n3K79M37J44J71k99o43l7J226j9j304k1J097M41j678n25
$$ -760 -299 395 -176 -465 -518 -239 198 342 513 214 -429 -466 760 741 -563 -584 513 954 -724 -1249
3502a249J512J360j470j591O97J923n16k084L17J802M13j699q45J174J034q44
$$ -1249 263 1623 153 -1438 -741 1182 666 -1418 -1101 701 1114 -585 -1430 -256 778 -66
3518f6j522P59J531l51j330NR33Lk44k16M86K97q0m91J39k53J45O79J91p67m48
$$ -66 -1588 -829 702 351 -979 -974 -41 -38 -282 -498 -12 285 205 -286 -147 -400 -255 424 615 -152 -600
3539f00N55Q15m77j144K32J707n67j510m05J684P97j607j015J337J500j150j876
$$ -600 -45 770 293 -851 -619 1088 521 -989 -1394 290 1087 -520 -1535 -198 1302 152 -1724
3556a724Q51J485P5j938J47J541L39j205q19J200R35l34r05M83L52j79o81P87
$$ -1724 -873 612 687 -1251 -1104 437 776 -429 -1248 -48 887 553 -352 131 483 304 -377 410
3574D10l8k22J02K36l33j25l46J252j48r01n12J372K03j044j190J740R78r51j855
$$ 410 372 150 252 488 155 30 -316 936 788 -113 -625 747 950 -94 -1284 456 1434 483 -1372
3593a372O96J946m58j869N2K094N01k054r84J802R13j016j098O30J224l60j341
$$ -1372 -676 1270 812 -1057 -1005 1089 1590 -464 -1448 354 1267 251 -847 -217 1007 647 -694
3610f94K38J156J47j097J59N29m45j26N15K18r61l60J422M3r42j368J558J335
$$ -694 -456 700 847 -250 -91 438 -7 -133 382 600 -361 -721 701 744 -198 -1566 -8 1327
3628A327j002j521R59J536o32k232m4K528N56k137q79J773J178j824q37R98J604
$$ 1327 325 -1196 -237 1299 667 -1565 -1609 919 1475 -662 -1541 232 1410 -414 -1251 -253 1351
3645A351q26j667N12J316O7j325k99J178M9o82j42K70K02l76M07J90m28n67P29
$$ 1351 525 -1142 -630 686 753 -572 -871 307 356 -326 -468 -198 4 -372 35 225 -203 -770 -41
3664d1N09m76j523J068J343n64j724K30J768N18k264k30J832J002j640j119J031
$$ -41 468 -8 -1531 -463 880 316 -1408 -1178 590 1108 -1156 -1386 446 1448 -192 -1311 -280
3681b80J884j315j620O36J401j8j347m7J310L23j104m88N89O80l96n77K4P79m87
$$ -280 1604 289 -1331 -695 706 688 -659 -706 604 927 -177 -665 -76 604 208 -369 -345 434 -53
3700e3M1N64n44n13L95P14m51j049L86J300l20j295m25J980P61j420j176J567
$$ -53 -12 552 8 -505 -110 604 153 -896 -510 790 470 -825 -1250 730 1491 71 -1105 462
3718D62R92j120j212L63K131o00j477j95J379P08j721n83J283P37r83o05M82M01
$$ 462 1454 334 -878 -515 1616 1016 -461 -656 723 1431 -290 -873 410 1147 164 -441 41 442
3736D42j68k99L3L7m7r9J58R5j35n0N70k85p27p1J119M69j423n33J147J100o44
$$ 442 274 -25 8 45 -2 -101 57 152 17 -33 537 252 -475 -546 573 1042 -381 -914 233 1333 689
3757F89j727N05J787m72j580o0J627M16j521q70J296P49q75q07J61J358l83j048
$$ 689 -1038 -533 1254 782 -798 -858 769 1185 -336 -1206 90 839 -36 -843 -682 676 293 -755
3775g55p6Q65M01m83m75L0J85R9j64r3K62j11L85m1l54l81J097L16o61p15M98
$$ -755 -831 34 435 -48 -523 -493 -308 -209 -373 -466 -204 -315 70 29 -325 -706 391 707 46 -669 -171
3796a71J193m61j325j34J601M21j547o59J069J135q95j697J129J159j61j276n81
$$ -171 1022 561 -764 -898 703 1124 -423 -1082 -13 1122 227 -1470 -341 818 657 -619 -1200
3813a200J663M62j308o53Q84N73j80p65Q9R07n24l17J04K05r2N34n0j74o21L10
$$ -1200 463 925 -383 -1036 -152 421 241 -524 -435 472 -52 -369 -265 -60 -152 382 332 158 -463 -153
3833a53J127l80j028q5J335K61j225p07J400N54q34j169O35J710p32j642MJ397
$$ -153 974 594 -434 -519 816 1077 -148 -855 545 1099 265 -904 -269 1441 709 -933 -929 468
3851D68O01j692j64J012R99r68j128P35R17l79j142K78N94L60l94l8J35k10M5
$$ 468 1069 -623 -787 225 1224 256 -872 -137 780 401 -741 -463 131 491 97 59 194 -16 29
3870B9N13k48j26k53O13L38j420k71J060O87o77j043O04J133m12j647J55J508
$$ 29 542 294 168 -85 528 866 -554 -825 235 922 245 -798 -194 939 527 -1120 -965 543
3888E43K96j448p37J347J141j236j195N45J644n40j346R2J224M34r55l86P16J92
$$ 543 839 -609 -1346 1 1142 -94 -1289 -744 900 360 -986 -894 330 764 -191 -577 139 331
3906C31k05p01O52j67J47l1K16J8o16P42j7p12o81Q31Q67l33j308K87J414R9j637
$$ 331 126 -575 77 -90 57 26 242 260 -356 386 369 -343 -1024 -193 674 341 -967 -680 734 833 -804
3927h04j39Q50Q59r55j402J064J124j38j684M01J392K62j390m75J223L72p04m06
$$ -804 -943 -93 766 -189 -1591 -527 597 459 -1225 -824 568 830 -560 -1035 188 560 -144 -550
3945e50L80N87k14m69L02J62j87M9J89q0m43L90K95k28q31N15P44J12j039n25
$$ -550 -170 417 203 -266 36 198 11 60 249 169 -274 116 411 183 -648 -133 611 723 -316 -841
3965h41J271N67j320r64J210J264j064r77Q7K018m46j489r9J177N08p67o37M19
$$ -841 430 997 -323 -1287 -77 1187 123 -854 -767 1251 805 -684 -783 394 902 135 -502 -83
3983h3J233r18m52k15J274n25k89N3k26L44q9qo4j44r2L35J21p20R8M48N17q12
$$ -83 1150 232 -220 -435 839 314 25 78 -148 196 107 99 35 -109 -201 134 255 -465 -367 81 598 -214
4005b14o68P94J049q58j118K53J749m55j347j08J486M39r86q06Q03J062o35j426
$$ -214 -882 -88 961 103 -1015 -762 987 532 -815 -923 563 1002 16 -790 13 1075 440 -986
4023i86O69J009j24q40k66Q95K0k3o65M56K05k59j19j23j40J29o7J99m72p9L85
$$ -986 -317 692 568 -272 -538 357 377 354 -311 145 350 91 -28 -151 -291 -162 -229 -30 -502 -581 -196
4044a96L73m29l73p3J325l26r11l24J161L99j226o35J234J190q01j435N29J278
$$ -196 177 -252 -625 -698 627 301 -610 -934 227 626 -600 -1235 -1 1189 388 -1047 -518 760
4062G60k15p85k85J031R1o51n79N55M80l09n66J37N50l11j15j85N23l61L9M34
$$ 760 545 -240 -525 506 597 -54 -633 -78 402 93 -473 -336 214 -97 -212 -397 126 -235 -196 238
4082B38m70j91L47J49J35o04M9P02L62q22n68J057R54j152j210O71J085j8j265
$$ 238 -232 -423 -76 73 208 -396 -347 355 717 -105 -673 384 1338 186 -1024 -353 732 714 -551
4101e51k18J741o8q63p03N93J092r63r00N24J180m21q69j88Q51K85n42R4p4P6
$$ -551 -769 972 904 41 -662 -69 1023 60 -840 -316 864 443 -426 -614 237 522 -20 74 0 76
4121G6k12MK95j64l14L43O45p58j03M17O49o49r09M44J469m24j410J92J189M31
$$ 76 -136 -132 163 -1 -315 28 673 -85 -188 229 878 229 -680 -236 1233 809 -601 -409 780 1211
4141A211j699m89J030J296j241j465P97J536m87j360K58R11K99j080k79Q05M03
$$ 1211 -488 -977 53 1349 108 -1357 -560 976 489 -871 -613 298 597 -483 -762 43 446
4158D46m05n61K74M47j71k39J55K3k21k17Q27l74l50L46Q64m26q47m14J423J47
$$ 446 41 -520 -246 201 30 -209 -54 -31 -252 -469 358 -16 -366 -20 844 418 -429 -843 580 727
4178G27j391l06J202R71j139j343J078R52n53j357M14J244k7j294j81J130M52
$$ 727 -664 -970 232 1203 64 -1279 -201 751 198 -1159 -745 499 472 -822 -1003 127 579
4195E79r33l26N19P13n42l27j42L80K66k37N78m87l25J56O80j1o67k95J090p0
$$ 579 -354 -680 -161 552 10 -317 -459 -79 187 -50 528 41 -284 -128 552 541 -126 -421 669 599
4215E99j114k16J114O28q00j232Q80J115p27j204M73J029L69j427j62P44N66j030
$$ 599 -515 -731 383 1011 211 -1021 -141 974 247 -957 -484 545 914 -513 -675 69 635 -395
4233c95k30R90K74l56m66k09P02J99n97K25M1J91M5Ml85r8K18M37l29m00j02N20
$$ -395 -625 365 639 283 -183 -392 310 509 -88 137 178 369 414 418 33 -65 153 590 261 -139 -241 279
4255B79L85p68o25P38O98o88r54O66P29j53j020QJ073N24j113n33K31J118n15
$$ 279 664 -104 -729 9 707 19 -935 -269 460 307 -713 -705 368 892 -221 -754 -523 595 80
4274H0j001O41N30J88p61k05N82N36m53l11K06J08j20o2J16o8J0M63m76m95J05
$$ 80 -921 -280 250 438 -323 -528 54 590 137 -174 32 140 20 -42 74 6 16 479 3 -492 -387
4295c87J85R33o70p32M27N99k18p54k98J256R7r39l84P13P37k75j188K96J008
$$ -387 -202 731 61 -671 -244 355 137 -617 -915 341 438 -501 -885 -172 565 290 -898 -602 406
4314D06J13n88o53R50L29o45k36K14M77L52q52j51L87K3j92L5mJ73k08K1k62l9
$$ 406 519 -69 -722 228 557 -88 -324 -110 367 719 -133 -284 103 126 -66 -31 -35 138 -70 -49 -311 -350
4336c50N51k84L41p45k5N94K11n99n06O84Q09m58r10j03J705n8j252j85J279J83
$$ -350 201 -83 258 -487 -512 82 293 -306 -812 -128 681 223 -687 -790 915 857 -395 -580 699 882
4356H82o35j216R88P71j62j233M02R80j09p95n4O03K73o68l46L29J13j71N0K38
$$ 882 247 -969 19 790 628 -605 -203 777 668 -127 -181 422 695 27 -319 10 123 -48 2 240
4376B40k57r9j68K02q6l63M49O44o05p93N13P57Jj120J59J301P5q88p95J192P07
$$ 240 -17 -116 -284 -82 -168 -531 -82 562 -43 -836 -323 434 435 -685 -526 775 850 -38 -833 359 1066
4397A066m75j234M83R62l61p01m83J308R4m19n61J42N79n16l04K24R1K58j23j13
$$ 1066 591 -643 -160 802 441 -260 -743 565 659 240 -321 -179 400 -116 -420 -196 -105 153 30 -83
4417h3q2j82k5N19k40j89k92J172j81j112K14P04L94q76n41P33J156j209p46O81
$$ -83 -165 -347 -372 147 -93 -282 -574 598 417 -695 -481 223 617 -259 -800 -67 1089 -120 -866 -185
4437a85R91m20r64K75Q96j85p48l69Q39L97n40p29P07J38j01n85L54K26J20l03
$$ -185 806 386 -578 -303 593 408 -340 -709 130 527 -13 -742 -35 103 2 -583 -229 -3 117 -186
4457a86Q6M0j42L50k15L37p04K2J080m46n67k2P90L63o09p32L78R21l44q97J20
$$ -186 -100 -60 -202 148 -67 270 -434 -412 668 222 -345 -367 423 786 177 -555 -177 744 400 -497 -377
4478c77Q96j94q60p8Q97N91p86q36L75Q99l39p37K15O16j52l20K53l32N37j76
$$ -377 519 325 -535 -613 284 875 89 -747 -372 527 188 -549 -334 282 130 -190 63 -269 268 92
4498I2j21N0k49o5N42J3k72l26N55K99k60p36P30N06l09q23M2J103j85j158O8
$$ 92 -29 21 -228 -293 249 262 -10 -336 219 518 258 -478 252 758 449 -374 -332 771 586 -572 -504
4519e04J073K70j112n70Q12Q35n01j008L28O67n1o64j49P17P7l60r9m3N09k92
$$ -504 569 839 -273 -843 -31 804 303 -705 -377 290 239 -425 -574 143 220 -140 -239 -282 227 -65
4539f5K10p7l8O1q3L35o55j49M52N92n19l43J35M29pp54m7O83J86q39m27P29O27
$$ -65 145 68 30 91 8 343 -312 -461 -9 583 64 -279 -144 285 278 -476 -523 160 346 -493 -920 -191 436
4562D36k04p29j80J295j16j063k44Q74N39q18l97O06M06j69l96K99j80K35M9l80
$$ 436 232 -497 -677 618 502 -561 -805 69 608 -210 -607 -1 405 236 -160 139 -41 194 243 -137
4582a37K19J51k09nQ4j51j01M70O4o36n4O55p8n92j56M38P43o52q45L61J127k89
$$ -137 82 233 24 19 103 -48 -149 321 385 -251 -305 350 272 -320 -476 -38 705 53 -792 -431 696 407
4604D07j166k0Q51N51r06l68M91O79m47l20Q3P13p4n47%N17N8l19l09J45M1M15
$$ 407 -759 -779 72 623 -283 -651 -160 519 72 -248 -165 548 474 -73 -73 444 502 183 -126 19 60 475
4626D75l78k52M1K45R6J53n11n77R07K18m53p58N18N09K0q19K29P39L35j170l10
$$ 475 97 -155 -114 131 227 380 -131 -708 199 417 -36 -794 -276 233 253 -566 -337 402 737 -433 -743
4647g43P69R22r15q16P03N73Pj015P0R41q4n20m03P54J4Qo71M43J68j26K35k36
$$ -743 26 948 33 -783 -80 493 500 -515 -445 496 412 -108 -511 243 257 265 -406 37 205 79 314 78
4669G8p4m8P4K92k74l55M6P51j88r15N6Q13K65j077o71J114P17n45p85N66O65
$$ 78 4 -44 30 322 48 -307 -261 490 302 -613 -557 256 521 -556 -1227 -113 604 59 -726 -160 505
4690E05j11r99K77P22J59q60l08Q50J74j34p10L51M40l63k26p6L94l78l5J68j3
$$ 505 394 -605 -328 394 553 -307 -615 235 409 275 -435 -84 356 -7 -233 -309 85 -293 -328 -160 -173
4711a73j52Q3L13k75O0j33L49J62o63k99R71M69r94l43N45P90r7j118O3J085m3
$$ -173 -325 -242 71 -204 -144 -277 72 234 -429 -728 243 712 -282 -625 -80 710 613 -505 -442 643 600
4732F00q23l46Q98O11p03n15L19O58o27l34K32N29j78l15k47L59k2p4j95J22o5
$$ 600 -223 -569 329 940 237 -278 41 699 72 -262 -30 499 321 6 -241 118 96 22 -173 -51 -116
4753a16J46J09k16l86K22N25l51k1O4J38N88l95q25L50P17J09q61R9M02O97r11
$$ -116 30 139 -77 -463 -241 284 -67 -88 -24 114 702 307 -518 -168 549 658 -203 -104 298 995 84
4774H4l17K51R19p21n62L06L02J72n90o8K64K13k44m93M69l91M72k64k69P70l42
$$ 84 -233 18 937 216 -346 -40 262 434 -156 -224 40 253 9 -484 -15 -406 66 -198 -467 303 -39
4795c9N34k56m32m4K53K33j31l40K32M60l02n31j65P63L35n15q91P29O48n97l39
$$ -39 495 239 -193 -237 16 249 118 -222 10 470 168 -363 -528 235 570 55 -836 -107 541 -56 -395
4816c95J52O67j62m76l06M71J55j55n57J27L93K37o67J94L66q1j0m24J10J50P3
$$ -395 -243 424 262 -214 -520 -49 106 -49 -606 -479 -86 151 -516 -322 44 -37 -47 -471 -361 -211 -138
4837a38N8k00j22O95K20m27l02k5M04J15l00l17N32M44l00p98J7R85k76m94m21
$$ -138 -80 -280 -402 293 513 86 -216 -241 163 278 -22 -339 193 637 337 -461 -444 541 265 -229 -650
4858f50R81N67r53n94Q75L49j13q15j52R86l53j96k52L24M05l77k82O8M03j50
$$ -650 331 898 -55 -649 226 575 462 -353 -505 481 128 -68 -320 4 409 32 -250 -182 221 71
4878G1r8r8K4O9R8J23j51n4Q7M17j38p24L64M41j01p10l7N02M31o72n38N29P30
$$ 71 -27 -125 -101 -32 66 189 38 -16 71 488 350 -374 -10 431 330 -380 -417 85 516 -156 -694 -165 565
4901E65m21n55J89N17J28j096J87P21K97n93m07P08L21m54l69J45J12L65l20J16
$$ 565 144 -411 -222 295 423 -673 -486 235 532 -61 -468 240 561 107 -262 -117 -5 360 40 156
4921A56o4Jk8J22k41l65N71K34L2r14j70Q10J52m77o39P26O11n41m91J22Q05o2
$$ 156 92 93 65 187 -54 -419 152 386 418 -496 -666 144 296 -181 -820 -94 517 -24 -515 -393 412 350
4943C50q08l05Q32L60q12k86N77R08o65n55L70K63l07k3J99J39Q0j44k36M13l10
$$ 350 -458 -763 69 429 -383 -669 -92 816 151 -404 -34 229 -78 -101 98 237 317 173 -63 350 40
4964D0qK36Lm37k52N08P8n57m0M59K71k59n01J50O91j79q67J36J051j03p46j06
$$ 40 32 268 271 -166 -418 90 168 -389 -429 30 301 42 -459 -309 382 203 -664 -528 523 420 -326 -432
4986d32N80M31m62p54L64P83j36o58L19M13k09l13j50K24K37k55J13J3m82M02
$$ -432 148 579 117 -637 -273 510 374 -284 35 448 239 -74 -224 0 237 -18 95 108 -374 28
5006B8R9j5k30l1Q3O57o23m17N14M20m85m59K78O29Q6q37m34J121k8n01j83L71
$$ 28 127 112 -118 -149 -66 591 -32 -449 65 485 0 -459 -181 448 534 -303 -737 384 356 -145 -328 43
5028D3M92j96n00J28N30o8m31K8K4M03l99k7j09K41N9l27j7j66r4L79o8k83m6
$$ 43 535 339 -161 -33 497 429 -2 26 50 453 54 27 -82 159 218 -109 -126 -292 -386 -7 -75 -358 -404
5051d04N59J11k99j59J32k0R7l93J06O14K01n95l40L48O87n29o81L37N86k37m11
$$ -404 155 266 -33 -192 -60 -80 17 -376 -270 344 545 -50 -390 -42 645 116 -565 -228 358 121 -290
5072b90J55K16K91k46n20L12M59k88n73K46M52j57j27m84L18K59qR7o47K98k3
$$ -290 -135 81 372 126 -394 -82 377 89 -484 -238 214 57 -70 -554 -236 23 15 112 -535 -237 -260
5093b60K66J27l86N0L98J77o54P8L37J24l86j92J53O23J0o97l14P03J65k18q62
$$ -260 6 133 -253 -203 195 372 -282 -204 133 257 -129 -321 -168 455 465 -232 -546 157 322 104 -758
5114g58N47O29l23l09p2N20j10l46J21L35K6j39m95K45O6K59j67k10j05J40K38
$$ -758 -211 418 95 -214 -286 234 124 -222 -101 234 260 121 -374 -129 -63 196 29 -181 -286 -146 92
5135I2M9k95j2L59J81j49k35j31N21k31k79j61O31J88m73m22O58K99l05q56O38
$$ 92 141 -154 -166 193 374 225 -10 -141 380 149 -130 -291 340 528 55 -367 291 590 285 -571 67
5156F7J76r4m05j57N44L80k46p93L19L32p5k68J48q5K28j13O5m1k00K91K66l18
$$ 67 243 149 -256 -413 131 511 265 -528 -209 123 48 -220 -72 -157 71 -42 23 -18 -218 73 339 21
5178B1n0o2L11M9o43J30N89j2m55l59K47N80k86o52L67O51l78m07k21O80J53m14
$$ 21 -29 -91 220 269 -374 -244 345 333 -122 -481 -234 346 60 -592 -225 426 48 -359 -580 100 253 -161
5200a61n26O68J40j0o98L32L20l57J53l23M12m0Q3j90ok4J73K15N9m61P8K04j08
$$ -161 -687 -19 121 111 -587 -255 65 -292 -139 -462 -50 -90 -7 -197 -203 -227 -54 161 220 -241 -163 41 -67
5223f7%l66P72j93j15n46K70M59J51r74L9Q78L29p47m07N48M0N1p03N59L59Q9
$$ -67 -67 -433 339 146 31 -515 -245 214 365 -609 -570 308 637 -110 -517 31 71 122 -581 -22 337 426
5245D26p59J3K50K57l26L0J12L51r1k21J30o8k99L34Q1k58k21N37j24j08j92j7
$$ 426 -333 -320 -70 187 -139 -109 3 354 263 42 172 104 -195 139 220 -38 -259 278 154 46 -146 -163
5267a63O51l12m51k10Q68J05p88j86N33M82o90n02O95K70N7p13q6N46Q9q1o67
$$ -163 488 176 -275 -485 383 488 -300 -486 47 529 -161 -663 32 302 359 -354 -440 106 195 114 -553
5288e53M97J75j65j57L28P0N4l91J27N4q7K70j50k18L46l55O48l76j04l38N61
$$ -553 -56 119 -46 -203 125 195 249 -142 -15 39 -48 222 72 -146 200 -155 493 117 13 -325 236
5309B36jm46j26K58O97n67n76M11M75n67k91J02O58J80q86l6N59O0j49n28L21
$$ 236 235 -211 -337 -79 618 51 -525 -114 361 -206 -497 -395 263 443 -443 -479 80 140 -9 -537 -216
5330b16M59J32m30k37J08L16k85LK98PP9l06j69M12k75K35j1j30m09L32M89l76
$$ -216 243 375 -55 -292 -184 132 -153 -150 148 155 234 -72 -241 171 -104 131 120 -10 -419 -87 402 26
5352B6r3k4L84j97l21m3L07J82l80L7K08L69n79j73L85L32k03n38M38J91O1l97
$$ 26 -67 -91 293 96 -225 -268 39 221 -159 -122 86 455 -124 -297 88 420 217 -321 117 308 369 -28
5374b8l18M23J69k71J0L25j87J30N8k47l57K27K41m7l24M3J36J07j8k52N4M47
$$ -28 -346 77 246 -25 -15 310 123 253 311 64 -293 -66 175 128 -196 -153 -17 90 72 -180 -126 321
5396C21J81q46r1Q26o5k12l20L41M52l49l62K31J55K32p08J44L17J18k02m26N69
$$ 321 502 -344 -435 391 326 114 -206 135 587 238 -124 107 262 494 -214 -70 247 365 163 -263 306
5417C06K90m92n2k51J39L58j47j97J30J39m84L00q3l28L67M11m60j82k54N70L80
$$ 306 596 104 52 -199 -60 298 151 -46 84 223 -261 39 -44 -372 -5 406 -54 -236 -490 80 460
5438D60m06k96L25N43p17l86M91Q80p09m70K36K06K86m60k32O5O02k68m72K17
$$ 460 54 -242 83 626 -91 -477 14 894 185 -285 -49 157 443 -17 -249 -184 418 150 -322 -105
5458a05K3L45m80N6K25K3j86l12K35J12JJ19k42J19J60l04K53k34Q8k1O11k62
$$ -105 -82 263 -217 -161 64 87 -99 -411 -176 -64 -63 56 -186 -67 93 -211 42 -192 -104 -125 486 224
5480B24p57M27M38k04l32j93N61rn19P8qQ77n22l73j26N25N7l48p1J59N54n75
$$ 224 -533 -106 332 128 -204 -397 164 155 -364 -286 -294 583 61 -312 -438 87 144 -204 -275 -116 438 -137
5502a37l7M60o6m84K55J44m22L23j59K90j38l50N24K94k40m93M1Q36l42q14M76
$$ -137 -174 286 220 -264 -9 135 -287 36 -123 167 29 -321 203 497 257 -236 -195 641 299 -515 -39
5523c9L45k02k96o6K56N49m23o12M81L17J45o84j01O84k69l09J44J84J81k01j86
$$ -39 306 104 -192 -258 -2 547 124 -488 -7 310 455 -229 -330 354 85 -224 -80 104 285 84 -102
5544a02j25M35J06mk58p9J5j21K09J4k54K23R6j61k27J17N45k82j19l88P09K3
$$ -102 -227 208 314 310 52 -27 -12 -133 76 90 -164 59 155 -6 -233 -116 429 147 28 -360 349 372
5566C72m55l64M58J33j68n50M16M37o3k28m59J98M94j82j54p9L66J00l81j98N20
$$ 372 -83 -447 11 144 -24 -574 -158 279 216 -12 -471 -273 221 39 -115 -194 172 272 -109 -307 213
5587B13l07L24l00J39J73l40L12k78j37J96K99j40n13M15J8J81m95K5K84J41j51
$$ 213 -94 230 -70 69 242 -98 214 -64 -201 -5 294 154 -359 56 74 255 -240 -215 69 210 59
5608E9l27M1M48j4n96m8L39K84j47m64K89O29k10k61m40M77K06M5n27L57k6K18
$$ 59 -268 -227 221 207 -389 -437 -98 186 39 -425 -136 493 283 22 -418 59 265 310 -217 140 114 332
5630C32l10j73L76K4j13k89J95Rj9q8k38J71J18M60m22l23K8M67j06k77l00N99
$$ 332 22 -151 225 249 136 -153 42 51 32 -56 -294 -123 -5 455 33 -290 -262 205 99 -178 -478 121
5652A21J54j38m42L44L28k5k27m71q5Q42o47j24N38K46n60j89L86L65l83o7J27
$$ 121 275 137 -305 39 367 342 115 -356 -441 401 -246 -370 168 414 -146 -335 51 416 33 -34 93
5673I3O8K08l08j14J40J26j06RJ6j80J8J62K31m94j69L12L22k70n59M94K91k88
$$ 93 161 369 61 -53 87 213 107 116 132 -48 -30 132 363 -131 -300 12 334 64 -495 -1 290 2
5695Bk77O4P91k08o48K3K97K93n33j36L65L56j68p85M85L55k63j30J01K70k29
$$ 2 -275 -211 580 372 -276 -253 44 337 -196 -332 33 389 221 -564 -79 276 13 -117 -16 254 25
5716B5J16o0l69K25J9R4j59n7n2M51j28j73k42L35J45l04m15K22N89L9o06j29
$$ 25 141 81 -288 -63 -44 50 -109 -166 -218 233 105 -68 -310 25 170 -134 -549 -327 262 301 -305 -434
5738d34N03K38r2m27J95M05j17o58K15M57l5m76o9O17J60n50k79K65K6J72n4k71
$$ -434 69 307 215 -212 -17 388 271 -387 -172 285 250 -226 -295 322 482 -68 -347 -82 -56 116 62 -209
5760b09K05l0j60O0K50l77L98L13k31k57l39O89m60j01j57P61K39p60k09N24L68
$$ -209 -4 -34 -194 -134 116 -261 137 450 219 -38 -377 312 -148 -249 -406 355 594 -166 -375 149 517
5781E17l74o61Q20N3n32J93q2K27K65l69Q9j50J56j51k92J29L8J73j0L27n46j4
$$ 517 143 -518 302 355 -177 16 -66 161 426 57 146 -4 152 1 -291 -162 -124 49 39 366 -180 -194
5803a94K72J36k49J9J03J48k92k39L07J85O4m93J97j05L97k04l87M89L10m00J8
$$ -194 78 214 -35 -16 87 235 -57 -296 11 196 260 -233 -36 -141 256 52 -335 154 464 64 82
5824H2k64K81K09l59m01N75K51m72j23J80L48j01l33O1O9j59J98l04j14M23p3
$$ 82 -182 99 308 -51 -452 123 374 -98 -221 -41 307 206 -127 -66 3 -156 42 -262 -376 47 -26
5845b6K88j42k20J13k69L47l82K84J66L30o85j50K27j1J37k76J84K44j07k84k12
$$ -26 262 120 -100 13 -256 91 -291 -7 159 489 -196 -346 -119 -130 7 -269 -85 159 52 -232 -444
5866d44P11N2k60m59K41K13P1k21j33L14M28p87j59K65K65J48l12R8n5r8J66k6
$$ -444 267 319 59 -400 -159 54 125 -96 -229 85 513 -274 -433 -168 97 245 -67 31 -24 -122 44 18
5888A8j30J12J00o5j90L4J95K43m17J14r7K12M2l06j20L20M87o97l24K83N30R2
$$ 18 -112 0 100 35 -155 -121 74 317 -100 14 -83 129 171 -135 -255 65 552 -145 -469 -186 344 436
5910D36o73J28J50M48n63l06O19K0k9k97P1L80k97j84J17k21N2J08j28L46K07
$$ 436 -237 -109 41 489 -74 -380 239 259 230 -67 4 384 87 -97 20 -201 -149 -41 -169 177 384
5931C84l45QR8l3q1J39kr0k64M04J70l45l96K67O13j98o85K66M89q1l40j53L90
$$ 384 39 47 145 112 31 170 168 78 -186 218 388 43 -353 -86 527 329 -356 -90 399 318 -22 -175 215
5954B15J98l98k76k8M88j31q8l22O03j16l70J00P3M55m32Q7P7l10N54n47Q2j9
$$ 215 413 15 -261 -289 199 68 -20 -342 261 145 -225 -125 -52 403 -29 58 135 -175 379 -168 -86 -105
5976a05r0K68N2l41J04J2L33j41m60K94L4J86m49R2J59J67l17p5P4N82k23m47
$$ -105 -195 73 125 -216 -112 -100 233 92 -368 -74 -40 146 -303 -211 -52 115 -202 -277 -203 379 156 -291
5998b91J98J19L81l96m18L66P5j26P1J1p5K52k42J86l59L88j30J98k52J31j66
$$ -291 -93 26 407 11 -407 -41 34 -92 -21 -10 -85 167 -75 111 -248 140 10 208 -44 87 -79
6019g9j04J93j8m2J14K07l06p5K63K64l81k74L88Q7P9m75J41K13j76j99J6K01
$$ -79 -183 10 -8 -50 64 271 -35 -110 153 417 36 -238 150 237 316 -159 -18 195 19 -180 -164 37
6041C7K49j33n61M86L45k81j84k7L17j80j21L7q7K65q5J61k23%J17J89j59l58
$$ 37 286 153 -408 78 423 142 -42 -69 248 68 -53 -16 -103 162 77 238 15 15 132 321 162 -196
6063a96j30N06p2r5k90L40M07l85l28J30N84l42j01q2R4K14l35j68K83J72J14
$$ -196 -326 180 108 13 -277 63 470 85 -243 -113 471 129 28 -54 40 254 -81 -249 34 206 320
6084C20n44L97j99J5j99m5L38j04J94l78k1K36m2J96l34j14J70N6L14o67L02l
$$ 320 -224 173 -26 -11 -210 -255 83 -21 173 -205 -226 10 -32 164 -170 -284 -114 -58 256 -411 -109 -112
6106a12J24q5O4p4M98o6n97K26p8L54k43m37J5O98l01l31M41P3J94l29j78J23
$$ -112 12 -73 -9 -83 415 349 -248 -22 -100 254 11 -426 -411 287 -14 -345 96 169 363 34 -144 -21
6128b1K56l72kN7K18n3k01K70o0L60k92o42L97PL12l05K68k20L6N9k34mQ8P2M7
$$ -21 235 -137 -139 -82 136 83 -118 152 92 452 160 -482 -85 -78 234 -71 197 -23 13 72 -162 -166 -78 -6 41
6153D1j84l8J8K23k4k08J16O60l91l76o3L59l8j43k15K45K14j17m99K81J52J17
$$ 41 -143 -181 -163 60 36 -172 -56 604 213 -163 -226 133 95 -48 -263 -18 196 79 -420 -139 13 130
6175A30j29j86L68J43k83j68O4J98l69K59j04J56p2J65j00k52P2M53k70J46l55
$$ 130 1 -185 183 326 43 -125 -61 137 -232 27 -77 79 7 172 72 -180 -108 345 75 221 -134
6196a34K8N40l28k67P8K83J34m07l86L82N52n25k32mP83l06m42L41p6L92l18j35
$$ -134 -106 434 106 -161 -83 200 334 -73 -459 -77 475 -50 -282 -286 497 191 -251 90 14 406 88 -47
6218d7K8L0l01M35j02J98k20o0J01k04K9J60j13j14k07M20k1J36n74J18L53M46
$$ -47 -19 11 -290 145 43 241 21 -39 62 -142 -113 47 -66 -180 -387 33 12 148 -426 -308 45 491
6240D91n76r9N06k10On04P8P75k12m95nM86k20m32J43L69J31m45j06K94L87j15
$$ 491 -85 -184 322 112 118 -386 -308 467 255 -240 -245 241 21 -411 -268 101 232 -213 -319 -25 362 247
6262B47n50K32K28j76j10O7J32NK13K33n26j49K08J55On12r9M33K30m28J49L3
$$ 247 -303 -71 157 -19 -129 -62 70 75 288 521 -5 -154 54 209 215 -297 -396 37 267 -161 -12 21
6284B1J91p0r8l71N62M7n82J73J96K70o66l9M08J27q3L4k73L35j00j88M23o08
$$ 21 212 142 44 -327 235 282 -300 -127 69 339 -327 -366 42 169 86 120 -153 182 82 -106 317 -291
6306b91J88R3k4K13m29L00K27j35N1k58J94O7l92K70oP5j71M7q8J81l3n04J39
$$ -291 -103 -10 -34 179 -250 50 277 142 193 -65 129 196 -196 74 68 143 -28 19 -69 112 79 -425 -286
6329b86L77J85l21k47L87L25k73l46J85KK11p1n73L69K08j6J2k62L21M7l47K36
$$ -286 91 276 -45 -292 95 420 147 -199 -14 -12 199 128 -445 -76 132 116 128 -134 187 234 -113 123
6351A23l92L97o8J78m44J48J34L14j78l19o7P47p03j00K70q6K98k57n77N86J53
$$ 123 -269 128 60 238 -206 -58 76 390 212 -107 -174 573 -130 -230 40 -46 252 -5 -582 4 157
6372A57j17l91M05P1l74J8k2M17P5k05R3J79J4l92l3n5K34j9j7m04L07Q8j66K15
$$ 157 40 -351 54 125 -249 -231 -253 164 239 34 127 306 320 -72 -105 -160 74 55 38 -366 -59 29 -137 78
6396G8j78K5K21lj78Q8J2JQ5j79k82O29p1Ll97L2N32l71l37k3K74K81k89M5M5
$$ 78 -100 -75 146 143 -35 53 65 66 151 -28 -310 319 248 251 -146 -114 418 47 -290 -313 -39 242 -47 -2 43
6421D3P0j01l88J70K90R1m8j01Q8J48k03q8L77m06kJ47N1k31K01J14m6j78R4K34
$$ 43 113 12 -376 -206 84 175 127 26 114 262 59 -29 348 -58 -60 87 138 -93 108 222 176 -2 92 326
6445C26k11j19l49K12N28n34K73m27M58L7r9k96K09M49k47o12K62N13p8m76j32
$$ 326 115 -4 -353 -141 387 -147 126 -301 157 194 95 -201 8 457 210 -402 -140 373 295 -181 -313
6466c13N67j67k73k5n2K34j20l86M94j83K44q3J67n5j79j10L22R0n70K75J49k47
$$ -313 254 87 -186 -211 -263 -29 -149 -535 -41 -224 20 -63 104 49 -130 -240 82 172 -398 -123 26 -221
6488b21j86l4N74N6m38J11LP16n56j43j7N08j86m45K6N52l38kk33K94J35k77k42
$$ -221 -407 -441 133 189 -249 -138 -135 581 25 -118 -135 373 187 -258 -232 320 -18 -20 -253 41 176 -101 -343
6511c43J33J72L63j41l66K56l29L17l83J45P9M9R5K33n85L80O7K5l1k58K16J13
$$ -343 -210 -38 325 184 -182 74 -255 62 -321 -176 -97 -48 47 280 -305 75 142 167 136 -122 94 207
6533B07j59k08J39K62k33l75M04J65m9m54L43Q8j89Q9k66L60L04k11l09k64O46
$$ 207 48 -160 -21 241 8 -367 37 202 153 -301 42 130 -59 30 -236 124 428 217 -92 -356 290
6554B90l45%Q2k86NM81j93l1P8L27j88k70j03o4K45L03o16K52L8K9o6n25N44p3
$$ 290 -55 -55 27 -259 -254 227 34 3 81 408 220 -50 -153 -217 28 331 -285 -33 5 34 -32 -557 -13 -86
6578h6J29R2n61N39J42K0m49J22K72k73J42j79J29K07j3n18K54K20k39j25p7J34
$$ -86 43 135 -426 113 255 275 -174 -52 220 -53 89 -90 39 246 233 -285 -31 189 -50 -175 -252 -118
6600a18J38P4o9J60l04J08J56n23O54k81j88J40K37j95j46N67p22rL98J57J22
$$ -118 20 94 25 185 -119 -11 145 -378 276 -5 -193 -53 184 -11 -157 410 -312 -321 77 234 356
6621C56m74l7K62L2q4n92P72k89j98j29K17M48k57j53j97K53M9j25q9J53K17j67
$$ 356 -118 -155 107 139 55 -537 235 -54 -252 -381 -164 284 27 -126 -323 -70 -21 -146 -235 -82 135 -32
6643c2j3l5O8J37o9j60q1L19N5k48k12K16o1K25k25p7N98l22j55k73K55L18l85
$$ -32 -45 -80 -12 125 56 -104 -185 134 189 -59 -271 -55 -116 109 -116 -193 405 83 -72 -345 -90 228 -157
6666a57J87k13K68k2j29l94M02K59o3l22L08r1j33L6j7L33ok78J6k32K54L8m2
$$ -157 30 -183 85 63 -66 -460 -58 201 138 -184 124 33 -100 -64 -81 252 246 -32 -16 -248 6 44 2
6689BL8r9L0j05K00pk90L96R2j60n1N1J25k50k99k7M15K52l29l39K76L55l37k06
$$ 2 40 -59 -29 -134 66 59 -231 165 257 97 46 97 222 -28 -327 -354 61 313 -16 -355 -79 276 -61 -267
6713b67R5L27m0k43Q2L03M6m28J99j49K94p3m4k30K51L10p18K14K10q9R7k96l7
$$ -267 -172 155 115 -128 -46 257 303 -125 74 -75 219 146 102 -128 123 433 -285 -71 139 50 147 -149 -186
6736a86j65L43o5%J28p7j25Q9l21K83J25j83J38N5O1L0l28j21J55N42k05mn83
$$ -186 -351 -8 -73 -73 55 -22 -147 -58 -379 -96 29 -154 -16 39 100 130 -198 -319 -164 378 173 169 -414
6759d14L01L07k12j00r9L07J47l89J22k05K31L0r8q3J58O3K27j57j40j1k16K50
$$ -414 -113 194 -18 -118 -217 90 237 -152 -30 -235 -4 26 -72 -155 3 66 293 136 -4 -15 -231 19
6781A9l40K36L46k29N1k64oJ66L3j30J8L75J37k80j30N8K6J38n56K47K70K41n12
$$ 19 -321 -85 261 32 83 -181 -187 -21 12 -118 -100 275 412 132 2 60 86 224 -332 -85 185 426 -86
6804h6l9P1K12j87l47K49R0K32m33K20P0J04K7k30j72ON19j58j50k41k3N31j50
$$ -86 -125 -54 158 -29 -376 -127 -37 195 -238 -18 52 156 183 -47 -219 -213 306 148 -2 -243 -266 265 115
6827A15j17K4M59l80k18j06J77J64q3m35L81L58j63l49J82J16J60p3k80j30L22
$$ 115 -2 22 481 101 -117 -223 -46 118 35 -400 -19 339 176 -173 9 125 285 212 -68 -198 124
6848A24J0j94l56K60M22l51Q4M0K9l0J03j68l56O29m56K54k18L2K11K08l82J32
$$ 124 134 -60 -416 -156 266 -85 -1 39 68 38 141 -27 -383 246 -210 44 -174 -142 69 277 -105 27
6870B7P4q5K4k77K37K79l24nK10j05Lj51j72J69M32m91J65N4J26j74m4k20K78
$$ 27 101 16 40 -237 0 279 -45 -50 160 55 58 -93 -265 -96 336 -155 10 64 190 16 -28 -248 30
6893C0J49j46l17L56l8r1J69o0J7k81M26m31Q9J95M5r2k04p6K75K07l38Q6K29
$$ 30 179 33 -284 72 34 -57 112 52 69 -212 214 -217 -128 67 112 20 -184 -260 15 222 -116 -30 199
6916A99j74%j47k71M16K12l17N6K07j2l10k03K42M55k60n46N62J62k37m7k73K2
$$ 199 25 25 -122 -393 23 235 -82 -26 181 169 -141 -344 -102 353 93 -453 109 271 34 -13 -286 -264
6938b64K95R0o8k11K30J9J3k04O9k62J57M39j42n61Q4N19n8j98k14O18l80P7r2
$$ -264 31 121 53 -158 72 91 104 -100 -31 -293 -136 303 161 -400 -316 203 145 -53 -267 351 -29 48 -44
6961d4kM40l86k10M01J16k12o1k55O05k30j51o17L67J90R3j38K06J10j87k9q5
$$ -44 -46 394 8 -202 199 315 103 42 -213 392 162 11 -606 -239 -49 44 -94 112 222 35 6 -79
6983g9pj14L17n0k58J66Q1K8l0l44K29J02l11l7J59K72l44J88r4j9L13k69j65
$$ -79 -86 -200 117 67 -191 -25 56 84 54 -290 -61 41 -270 -307 -148 124 -220 -32 -126 -145 168 -101 -266
7006b66J25R4K22k60J73j70L79m22m9M14o1j83L92l37n4M9k50K48o2NJ5K54j07
$$ -266 -141 -47 175 -85 88 -82 297 -125 -174 240 179 -4 388 51 -3 46 -204 44 -18 -13 2 256 149
7029A49n73M54P4j00m81N16M05m36m04J77m9M31o9J18j72L09l63j11j94L87M9
$$ 149 -424 30 104 4 -477 39 444 8 -396 -219 -268 163 94 212 40 349 -14 -125 -319 68 117
7050A17k25j48M93l09P9j3j29K62m8J7k40l7m0J81K42j83l03N34m15K13q8J74
$$ 117 -108 -256 237 -72 7 -6 -135 127 79 96 -144 -181 -221 -40 202 19 -284 250 -165 48 -40 134
7072A34O9Q4m57l4K94J67m33M9M3K58m1j17k20L02q6p0l66K74K40k61k0o9L93
$$ 134 203 287 -170 -204 90 257 -176 -127 -84 174 133 16 -204 98 12 -58 -424 -150 90 -171 -191 -260 133
7095A33J14j64q5N2J48k53l83N55m25K53j17j3J26J61L0j68J30k45J16K3p1K70
$$ 133 247 83 -2 50 198 -55 -438 117 -308 -55 -172 -185 -59 102 132 -36 94 -151 -35 -12 -83 187
7117A87j50L80k06n18k47M61N06m69j17K80O1j19l71J41O17l72Nm01L32K88l04
$$ 187 37 417 211 -307 -554 -93 413 -56 -173 107 168 49 -322 -181 436 64 69 -332 0 288 -16
7138a6J29l24L30l07j79L15L20m11M83l96r1L83N3m56L56l35J06J96o9j57k42
$$ -16 113 -211 119 -188 -367 -52 268 -143 340 -56 -147 236 289 -167 189 -146 -40 156 87 -70 -312
7159c12N43l75M16o52M63mj66K69j93L11m10j79J60J62J57l49P6m4K39M2n19J83
$$ -312 231 -144 272 -380 83 79 -87 182 -11 300 -110 -289 -129 33 190 -159 -83 -127 112 154 -365 -182
7181a82K80j23N9o2PR0J94j33m87L49j46M02k86nK6K64R1j92k50J57J61j57j20
$$ -182 98 -25 34 -28 -21 69 263 130 -357 -8 -154 248 -38 -43 -17 247 338 146 -104 53 214 57 -63
7204f3n3M17m80R2q7L39N1k33l89M39K06j46j52j18J93o4M3l53M73j33%j52L62
$$ -63 -116 301 -179 -87 -174 165 216 -17 -406 33 239 93 -59 -177 16 -48 -5 -358 115 -18 -18 -170 192
7227A92j08P7k01m06P47m70K68j25M5m2J80N5l15J72l8n0q8P6j37K16r3j94j79
$$ 192 84 161 -40 -446 301 -169 99 -26 19 -23 157 212 -103 69 31 -19 -107 -31 -168 48 -45 -239 -418
7250d18L26L22j42k28L8K93l22mj64K67K70j83j44k0J20n7j21j66P17m36m5K4
$$ -418 -92 230 88 -140 -102 191 -131 -135 -299 -32 238 55 -89 -109 11 -46 -167 -333 384 -52 -97 -73
7272g3p3nN6J41n38M47J44m5j23l18K12K52N9j79q2J86J81m33K55K17P6o62l8
$$ -73 -146 -151 -95 46 -492 -45 99 54 -69 -387 -175 77 136 -43 -125 61 242 -191 64 281 357 -305 -343
7295c43L62J3l4k15m0K7L63n45K74K5M97J7l62j91L3L58k13Q8q1K03M3k69K64
$$ -343 19 32 -2 -217 -257 -230 133 -412 -138 -113 384 401 39 -152 -119 239 26 114 33 236 279 10 274
7318B74j97J5q1J33l39rM41k7n61N25p8o4l1M6j27k26M21j42OQ0K64m95n3M97
$$ 274 77 92 11 144 -195 -204 237 210 -351 174 96 32 1 47 -80 -306 115 -27 -21 59 323 -172 -225 272
7342B72k42J01j63j52J30K01m26K75j06J15J12l72J08M41k90k79j05K67K74m9
$$ 272 30 131 -32 -184 -54 147 -279 -4 -110 5 117 -255 -147 294 4 -275 -380 -113 161 112
7362A12k2ml59O00m07k5jQ2J37m1k74O8J67P8J7l65O1L57l95J97q2J79J51k14
$$ 112 90 86 -273 327 -80 -105 -106 -24 113 72 -202 -134 33 111 128 -237 -176 181 -214 -17 -99 80 231 17
7386A7m5k75P13l77j18p2k8M30k03k12L49K38m19j67L03r1J69k58K04j08k71P0
$$ 17 -28 -303 410 33 -85 -157 -185 245 42 -170 179 417 -2 -169 134 43 212 -46 158 50 -221 -151
7408a51K36l1R4q9K7j23q8M62J2n25pJ53N6j92K68j98R7M9j65n1J90l1j6l27J25
$$ -151 85 54 148 59 86 -37 -125 337 349 -176 -183 -30 26 -166 102 -96 1 50 -115 -166 24 -7 -23 -350 -225
7433b25K84M04o32L8l8r0L74l1j03j39K68r5J34n43K43J34L07k05J08j34J94l85
$$ -225 59 463 -169 -131 -169 -259 115 84 -19 -158 110 15 149 -394 -151 -17 290 85 193 59 253 -132
7455a32Q2L29k86J33n78M47j54M36k55l98M33K47l66p9k11O07m23K69l4q5J29
$$ -132 -50 279 -7 126 -452 -5 -159 277 22 -376 57 304 -62 -141 -352 255 -168 101 67 -18 111
7476A11M5l67K17J82j64K33n56L98p5K64j64k13K62j57J26j62qJ33o1K62n43N23
$$ 111 156 -211 6 188 24 257 -299 99 24 288 124 -89 173 16 142 -20 -28 105 44 306 -237 286
7498B86m66QJ79k01L44J23o60K55J45L50l54j98J42j1K55m25j4K90K2R6k04k03
$$ 286 -180 -172 7 -194 150 273 -387 -132 13 363 9 -189 -47 -58 197 -228 -242 48 70 166 -38 -241
7520b41J03N4K00j07j07JJ77k06K23k67P5K36m58J49L15k00k06j48J30L74jj13
$$ -241 -138 -84 116 9 -98 -97 80 -126 97 -170 -95 141 -317 -168 147 -53 -259 -407 -277 97 96 -17
7542a7Q1J38J2l5k39J24k22K7J87N5o3P1J7j45P8l15K44k56J87L00j67L8k08Q8
$$ -17 64 202 214 179 -60 64 -158 -131 56 111 48 119 136 -9 69 -246 -2 -258 -71 229 62 100 -108 -20
7566b0k0J63j30j51R1p6j62K58K08k69J61j10j96r4K06L78j54m76L40J38k53J83
$$ -20 -40 123 -7 -158 -67 -143 -305 -47 161 -108 53 -57 -253 -347 -141 237 83 -393 -53 85 -168 15
7588A5k79K32J27l15L81l12L01j23L0k80O45l18j97J30J46m9J2j83j92R3M16l41
$$ 15 -264 -32 95 -220 161 -151 150 27 57 -223 422 104 -93 37 183 134 146 -37 -229 -136 280 -61
7610f1p2j9P5L69l54K44R2j46j22j86K15J8J14J6j53K26l80L81m09j5K01n2J01
$$ -61 -133 -152 -77 292 -62 182 274 128 6 -180 35 53 167 183 30 256 -124 257 -152 -167 34 -18 83
7633H3m23O0L46m20M90k56P7R0J04k65L42k03l01L26q9P6j37L19l49Q9J52P9k17
$$ 83 -340 -280 66 -354 136 -120 -43 47 151 -114 228 25 -276 50 -39 37 -100 219 -130 -41 111 190 -27
7656b7K59l36J1O1M6j7L35m94R7J10k58L21k73J72k54K03NK63n24J19K63k42J80
$$ -27 232 -104 -93 -32 14 -3 332 -162 -65 45 -213 108 -165 7 -247 -44 -39 224 -300 -181 82 -160 20
7679B0k34L41rk55l5p8M02k47Kj06J76J36K06j32l25J53l68L68L5p5J43j93J19
$$ 20 -214 127 118 -137 -172 -250 152 -95 -93 -199 -23 113 319 187 -138 15 -353 15 50 -25 118 -75 44
7702D4l05J85j4m7L46l05k8K24j56j09J08J33J27L9j81k03K39J44k57K11r4J70
$$ 44 -261 -76 -90 -137 209 -96 -124 100 -56 -165 -57 76 203 242 61 -142 97 241 -16 195 101 271
7724B71k59j67L26j03j80K7K50J31Jm07rK46j49J4m5qj66J81j2K65m11R0K27K0
$$ 271 12 -155 171 68 -112 -85 165 296 297 -110 -119 127 -22 -8 -53 -61 -227 -46 -58 207 -204 -114 113 133
7748A33k90J73jq7J53k06Q3L42m45j5O1K32j15j53j43J09K11j96O8J32J50j3l64
$$ 133 -157 16 15 -72 81 -125 -42 300 -145 -160 -99 133 18 -135 -278 -169 42 -154 -86 46 196 183 -181
7771a81K84j20J77j51M9k86L3L84j05n8P6j70q8o0L05j59J17m3q4o5K27k8j15
$$ -181 103 -17 160 9 58 -228 -195 189 84 26 102 -68 -156 -216 89 -70 47 4 -80 -145 82 54 -61
7794f1j95K7M88m82K11K93m20N74n37NL34j54j25o3J94p8j37R5J66l14K89m0L13
$$ -61 -256 -229 259 -223 -12 281 -139 435 -102 -97 237 83 -42 -105 89 11 -126 -31 135 -179 110 70 383
7817C83p47P0N82n14L63m05P3L40j84J29k10L61k13N6R9n3k28K92k05j30O2J82
$$ 383 -364 -294 288 -226 137 -268 -195 145 -39 90 -120 241 28 84 183 130 -98 194 -11 -141 -79 103
7839A03J10l61j9J96mr6K17N6L7l34L70j30o6j63r5J87O4J08l29L71j49j7l6M9
$$ 103 213 -148 -167 29 25 -71 146 202 239 -95 275 145 79 -84 -179 8 72 180 -149 222 73 56 20 69
7863F9k9R6j11j54k00J68K07J73j89r2J89J08j57l1j94M6J62l0J50n5n5j62Q2
$$ 69 40 136 25 -129 -329 -161 46 219 30 -62 127 235 78 47 -147 -101 61 31 181 126 71 -91 -9
7886ij47J54K89l16R0M8k75J4KO3K80r4k85P4p4L76O3m82K45j09L21l12j48M12
$$ -9 -156 -2 287 -29 61 109 -166 -152 -150 -87 193 99 -186 -112 -186 190 253 -229 16 -93 228 -84 -232 180
7910A80k91J06J49o1n7J95j52q0k20KL81j35k46K55l5Nr9m1L5P3R5q3oJ7K90n18
$$ 180 -111 -5 144 83 26 221 69 -11 -231 -229 152 17 -229 26 -9 -4 -103 -144 -109 -36 59 -24 -30 -13 277 -241
7936b41L29k16M02j56o7j54J77M6j81Kj60K16j5k46L76p2j07lj15j05J68r2K09
$$ -241 88 -128 274 118 51 -103 74 120 -61 -59 -219 -3 -18 -264 112 40 -67 -70 -185 -290 -122 -214 -5
7959ek0K79J7l72L50n15R7K46k92M63l33J98k84J65q1J61M2l00J29M3J27l76K28
$$ -5 -25 254 271 -101 249 -266 -169 77 -215 248 -85 113 -171 -6 -87 74 116 -184 -55 -12 115 -261 -33
7982c3p6L00l96M2l53M65Q2p7P7k07K09j98M07n13K30L29k50L5k60M01l7J8l10
$$ -33 -109 191 -205 -163 -516 -51 31 -46 31 -176 33 -165 242 -271 -41 288 38 73 -187 214 177 195 -115
8005a15K14k11K54j39J12j53Q7J27l59M38j82n2p9R7j48J60l2j52K63r4N2o1j05
$$ -115 99 -112 142 3 115 -38 49 176 -183 255 73 21 -58 39 -109 51 19 -133 130 36 88 27 -78
8028g8j10L4K49l1k11K18K07m61n2J48k6L68m18J98j57M92n26j42J16J24J66m7
$$ -78 -188 -154 95 64 -147 71 278 -183 -235 -87 -113 255 -163 35 -122 370 -156 -298 -182 -58 108 61
8050F1j24j6N71m20l70L72k2J78k27N6j51M9L2J01O9j15j12J08p0L5J05J08p9
$$ 61 -63 -79 492 72 -298 74 52 230 3 59 -92 -43 -11 90 159 44 -68 40 -30 5 110 218 139
8073A39j69j12K65j04k20J12mK17Nl46J74L66k2m12J48o0p2K80l97M15L9l6j53
$$ 139 -30 -142 123 19 -201 -89 -93 124 129 -217 -43 323 301 -111 37 -23 -95 185 -212 203 242 206 53
8096E3P7q4L8j54J18k7L57j13k26k18J28M01k62O2K0o5l9L35l39J38k68mM5L32
$$ 53 130 46 84 -70 48 21 378 265 39 -179 -51 350 88 150 170 105 66 401 62 200 -68 -72 -27 305
8120C05r5oj68R7j13Q8m4J33l29M7J23N3k3k99J40k5N88j26k78j08J12j69R5p
$$ 305 210 204 36 133 20 108 64 197 -132 -85 38 91 68 -231 -91 -116 472 346 68 -40 72 -97 -2 -9
8144iL87l40l0j61J5J08J66L2O1j61nj03K09J6j53K47k68r3p2N06k36k50J50K74
$$ -9 378 38 8 -153 -138 -30 136 168 229 68 63 -40 169 185 32 279 11 -82 -154 352 116 -134 16 290
8168B90l17M6r9L80m0n93K76k69L93K09n04j91M21J74l86J20lJ78j10p1K9L4O9
$$ 290 -27 19 -80 300 260 -333 -57 -326 67 276 -228 -419 2 176 -210 -90 -93 85 -25 -96 -67 -33 36
8191C6
$$ Imaginary data points
##PAGE= N=2
##DATA TABLE= (X++(I..I)), XYDATA
0@%%%%%%%qJ6j6J6j6K4l2L3m1N6o4P2q8J04j20J37j61J85k10K42k75L09l49L96
$$ 0 0 0 0 0 0 0 0 -8 8 -8 8 -8 16 -16 17 -24 32 -32 40 -48 56 -64 73 -88 97 -113 129 -146 163 -186 210
31B10m46M98n56O22o96P76q58R49j054J167j292J433j587J758j951K167k410K689
$$ 210 -236 262 -294 328 -368 408 -450 499 -555 612 -680 753 -834 924 -1027 1140 -1270 1419
49A419l014L398l857M413n110O018p240Q995j1753J6729k8475J04769Q2668k16115
$$ 1419 -1595 1803 -2054 2359 -2751 3267 -3973 5022 -6731 9998 -18477 86292 168960 -47155
63d7155l0189J30032M2493j35247k0724J33188M8410j42479p2547J07870Q5515
$$ -47155 -77344 52688 95181 -40066 -60790 72398 120808 -21671 -94218 13652 99167
74I9167q9080p4178P3645O8011p9300o8377O6177O0089p6563o0573Q2789P9781
$$ 99167 10087 -64091 9554 77565 -1735 -70112 -3935 56154 -20409 -80982 1807 81588
86H1588p4234r4012M6803Q1498m5323o8934P2337J06387o4001j42094K1952J40662
$$ 81588 7354 -86658 -39855 41643 -3680 -72614 -277 106110 42109 -99985 -78033 62629
98F2629R662j16166j0735J08356P106j20626k4590J27375O1556j00396p5285P2881
$$ 62629 72291 -43875 -54610 53746 60852 -59774 -84364 43011 104567 4171 -71114 1767
110A767O9400o6255p5827N1613P3385l8895o2648M0118N9455m4204p0203K9772
$$ 1767 71167 4912 -70915 -19302 54083 15188 -47460 -7342 52113 7909 -62294 -32522
122c2522P0327r202m8324J5378L7545l7397n8383L9209Q8035j1567r1321j2961
$$ -32522 37805 28603 -19721 -4343 33202 -4195 -62578 -23369 64666 53099 -38222 -51183
134e1183P3019Q977p0952l24R3274K1785r8366n2732P7707O2284o4936p4082M9213
$$ -51183 21836 30813 -40139 -40463 52811 74596 -23770 -76502 1205 63489 -1447 -75529 -26316
147b6316P9701l4053q1730J9923P6857j3410p6094Q922Q0201P351p5752k7591
$$ -26316 53385 19332 -62398 -42475 34382 20972 -55122 -46200 34001 41352 -34400 -61991
159f1991N1500K7665l0247n194M2541M778n6664k2032N4798L7166l4570k1508
$$ -61991 -10491 17174 -13073 -18267 24274 29052 -27612 -49644 5154 42320 7750 -13758
171a3758L9946J6859n4800k6106O1925M3625n6147n7038M5155O3351l6423p2530
$$ -13758 26188 43047 -11753 -37859 24066 67691 11544 -45494 -339 63012 26589 -45941
183d5941K5964P9627j2783q2386K482Q0603L59r4036k5236Q7026M6776o3843m9044
$$ -45941 -19977 59650 46867 -35519 -33037 47566 47925 -46111 -71347 15679 62455 -1388 -50432
196e0432M5390L7330m6553l8721N0302N3646l7988n9123K1238M9169j5839l4959
$$ -50432 -5042 32288 -14265 -52986 -2684 50962 12974 -46149 -24911 24258 8419 -26540
208b6540K7617L7525l3949m5950L1694N1500k5938n2001K6292O1052j7792o6218
$$ -26540 1077 38602 4653 -41297 -9603 41897 15959 -36042 -9750 51302 33510 -32708
220c2708Q173O6299p316p6755k397Q7452K2621q5577m1907P0026M9623n5570m7433
$$ -32708 -24535 41764 34448 -42307 -44704 42748 65369 -20208 -62115 7911 57534 1964 -45469
233d5469N1393N0388n0756o6649L5420P4009j2819o4273M145N3465o408n1047
$$ -45469 5924 56312 5556 -61093 -25673 48336 35517 -28756 -24611 28854 22446 -28601
245b8601N815N0857k939m7970J594M5351j054m6176l087M2806K146m6370l445
$$ -28601 -22786 28071 25132 -22838 -21244 24107 23053 -23123 -26210 16596 18742 -27628 -31073
258c1073N1844N556o3101j8854O7081L5502n9147m3662M9025M2119n0795n0389
$$ -31073 20771 26327 -36774 -55628 11453 46955 -12192 -55854 -6829 35290 -15505 -65894
270f5894M9760O7325l3115p4375J6488P4909q2o7005m973O4792J1790o0399j5911
$$ -65894 -16134 51191 18076 -56299 -39811 35098 35016 -31989 -36962 27830 39620 -20779 -36690
283c6690N8099K3597m9726k4603M3785K6261l7289k6278L1538K0685l3645j9165
$$ -36690 21409 45006 -4720 -29323 14462 40723 3434 -22844 8694 29379 -4266 -23431
295b3431M0838K5552m5192l7508L8495L7408l8966l9828L9512M4956m1864n7600
$$ -23431 17407 42959 -2233 -39741 -1246 36162 -2804 -42632 -3120 41836 -28 -57628
307e7628L4932O8672j9320p2253M760O9615M351o9141j1725O9951K3931o3998
$$ -57628 -22696 45976 26656 -45597 -40837 28778 33129 -36012 -47737 22214 46145 -17853
319a7853k9915N9626L9407n0372m3872L9359M4662k7642l8557K4668L6641k4667
$$ -17853 -47768 11858 51265 893 -42979 -3620 41042 13400 -25157 -489 36152 11485
331A1485l8018K3004M0233j9315m0926J6334L5989j9997l6171K5966M4311k5020
$$ 11485 -26533 -3529 36704 17389 -23537 -7203 28786 8789 -27382 -1416 42895 17875
343A7875n4288J6301N7193q694n9397P49O1855P341o2744j5250O5027K6005o3125
$$ 17875 -36413 -20112 37081 28387 -31010 -30261 31594 38935 -23809 -39059 25968 51973 -11152
356a1152l8299N5817M6600m4754n0783L2946M9508k4868m7647J8595M7735j4866
$$ -11152 -49451 6366 52966 8212 -42571 -9625 39883 15015 -32632 -14037 33698 18832
368A8832n0905M008M5149J301l9343m46L4169m734l6587N976L8784m914m1500
$$ 18832 -32073 -28065 17084 18385 -20958 -21404 12765 8031 -28556 -22580 16204 11290 -30210
381c0210K71M2360M450m1459m732M5886J1485m9193j8218N2483L0718m9117l9433
$$ -30210 -29939 12421 16871 -24588 -29320 16566 28051 -21142 -39360 13123 43841 -5276 -44709
394d4709M3273M8408l2000m8013K5147N0068j9167n4015R616N5132J727n2481
$$ -44709 -1436 46972 14972 -33041 -7894 42174 23007 -31008 -21392 33740 35467 -17014
406a7014j3175M4473J6638l8591j7404L2624J3772l4591j6528L0045J7663k6820
$$ -17014 -30189 14284 30922 -7669 -25073 7551 21323 -13268 -29796 249 17912 -8908
418h908j7210K3622J4583k4001j4217K7787J6588l2323k3533L4509L4651k9614
$$ -8908 -26118 -2496 12087 -11914 -26131 1656 18244 -14079 -37612 -3103 31548 1934
430A934l7747K6958M2312k1687m5214J9045N1556j0647n5796l8N7517J4241n1355
$$ 1934 -35813 -8855 33457 11770 -33444 -14399 37157 26510 -29286 -29324 28193 42434 -8921
443h921k2183M4499K5507m0536k8970L6674L1385l1517l4617K3642L5194j6529
$$ -8921 -31104 13395 38902 -1634 -30604 6070 37455 5938 -28679 -5037 30157 13628
455A3628l1325J1046K5641j2438k5103J5168K7195j4550l0509J3713L3568j2416
$$ 13628 -17697 -6651 18990 6552 -18551 -3383 23812 9262 -21247 -7534 26034 13618
467A3618l3614J1852L5608j3066m1335J0067M8302j156n1230r860M8934J8109
$$ 13618 -19996 -8144 27464 14398 -26937 -16870 31432 30276 -20954 -30814 18120 36229
479C6229m6076k5780M1763K9463m0659l6439L5542M3120k7361m6361J5410M2986
$$ 36229 -9847 -35627 6136 35599 -5060 -41499 -5957 37163 9802 -36559 -21149 21837
491B1837q080l8658L952L5261j420l3136L97L3668M093l0798m937K8570L391k5548
$$ 21837 13757 -24901 -20949 14312 12892 -20244 -19847 13821 17914 -12884 -17821 10749 14140 -11408
505a1408M13K9926j129l2745q64L7742P897l8923j4405L5838J8172l6118k3468
$$ -11408 -10995 18931 17802 -14943 -15807 21935 29832 -9091 -23496 12342 30514 -5604 -29072
518b9072L6682L0564l6188m1211K7570M6302j9887m8671R078M4396l997m3473
$$ -29072 7610 38174 1986 -39225 -11655 34647 14760 -33911 -24833 19563 15566 -27907
530b7907j550M2311P538m0365j4854L5715J8855k9360j9288K5072J8009k1504
$$ -27907 -29457 12854 20392 -19973 -34827 888 19743 -9617 -28905 -3833 14176 -7328
542g328j2729K4304J3365k4405j5360K4534J8312k1385j7212K2729J9532k5251
$$ -7328 -20057 4247 17612 -6793 -22153 2381 20693 -692 -17904 4825 24357 -894
554h94k3925K7565L3111k4625m0647J7053M2915j0954m3864O348M4803j31m6370
$$ -894 -24819 2746 35857 11232 -29415 -12362 30553 19599 -24265 -17917 26886 26755 -19615
567a9615q435M5111J6207m1821k4482L5752K9258k7763k9190K2228K7735j9603
$$ -19615 -28050 17061 33268 -8553 -33035 2717 31975 4212 -24978 -2750 24985 5382
579E382k6636J8072K7674j4920k6920R678K3816q235j9026J1498K0701j5692k7197
$$ 5382 -21254 -3182 24492 9572 -17348 -7670 16146 7911 -11115 383 21084 5392 -21805
592b1805J3608L1071j0887l3789Q362L5622o894l9055K655M2088K631m3946j0998
$$ -21805 -8197 22874 11987 -21802 -13440 22182 15288 -23767 -21112 20976 23607 -20339 -31337
605c1337M3161K0044l9645k7010L3893L1983k6203l2101K3662L3473j9959l6226
$$ -31337 11824 31868 -7777 -34787 -894 31089 4886 -27215 -3553 29920 9961 -26265
617b6265J4503L7326m629l0665O73K4975k079k3403L294K4306j963k5990L5K3743
$$ -26265 -11762 25564 20935 -9730 -9057 15918 13839 -9564 -6270 18036 16073 -9917 -9882 13861
631A3861j203k5323J831K5894k547l0659j545L2444L732l6149j1025L5013J8953
$$ 13861 12658 -12665 -10834 15060 12513 -18146 -19691 12753 16485 -19664 -30689 4324 23277
644B3277l1037k4683K6035K5874k3808k9814K2611L6357j3996l8273M707L5600
$$ 23277 -7760 -32443 -6408 19466 -4342 -34156 -11545 24812 10816 -27457 -22750 12850
656A2850K625k7876l368K6053N178k4163q495K1996J2090j6777r837J4596P437
$$ 12850 15475 -12401 -15769 10284 15462 -8701 -17196 4800 16890 113 -9724 4872 12309
669A2309j4476p022J4078N103j6631l960J9995P046k1331j3360J8525J5283j6195
$$ 12309 -2167 -9189 4889 9992 -6639 -10599 9396 16442 -4889 -18249 276 15559 -636
682f36j6153J6976K0489j7878k8931J2671L4507k444l2324l238K8091N951k7423
$$ -636 -16789 187 20676 2798 -26133 -13462 21045 18601 -13723 -16961 11130 17081 -10342
695a0342r563K6938J6842k1952k1227J5742K1794j1219k2015P389J9928l823j6990
$$ -10342 -19905 7033 23875 1923 -19304 -3562 18232 7013 -15002 -7613 12315 8492 -8498
708h498K224J3592m624j3205N305J4256k039j3749P91J0439m546j2355Q849K0884
$$ -8498 -6274 7318 2694 -10511 -5206 9050 7011 -6738 -5947 4492 -54 -12409 -3560 17324
722A7324m504k5547j556K5490N760k3386o344K6137J1320k6437j8014K3058K4906
$$ 17324 12820 -12727 -14283 11207 16967 -6419 -12763 13374 24694 -1743 -19757 3301 28207
735B8207j7873k7782J2617K9974p485l2180L51K9251K580k6172m127K3655N701
$$ 28207 10334 -17448 -4831 25143 17658 -14522 -14171 15080 17660 -8512 -12639 11016 16717
748A6717k5392j1687J8720J2883j3487r513J1817N205j6963o654J9145J0634j7729
$$ 16717 -8675 -20362 -1642 11241 -2246 -11759 58 5263 -11700 -18354 791 11425 -6304
761f304j0788J7878R854k0561j1852K4480J8076k2199k1976J9954K7003j6600
$$ -6304 -17092 786 10640 -9921 -21773 2707 20783 -1416 -23392 -3438 23565 6965
773F965l1481J2224L6052n305l4811J73L4080J941l5187p861L4946J5205k9433
$$ 6965 -24516 -12292 23760 18455 -16356 -16183 17897 19838 -15349 -23210 11736 26941 -2492
786b492j9675K0283J8060j7818j5348J7605J6975j7121j9470J2165J7595j0869
$$ -2492 -22167 -1884 16176 -1642 -16990 615 17590 469 -19001 -6836 10759 -110
798a10j3624J3605J4301j6232j6388J6715J8258j6197k0747J6283K5595j3089
$$ -110 -13734 -129 14172 -2060 -18448 -1733 16525 328 -20419 -4136 21459 8370
810H370k9460Q690L0730m986l2851K670L6296L349l8460j2362L3309J8287k6539
$$ 8370 -21090 -12400 18330 13344 -19507 -16837 19459 22808 -15652 -28014 5295 23582 -2957
823b957j8236K3062J8559k1948k3156J8028K6023j1001k3666P750K1330p252j8795
$$ -2957 -21193 1869 20428 -1520 -24676 -6648 19375 8374 -15292 -7542 13788 6536 -12259
836a2259P983J8522o750j7058Q269J7524q383j9443Q464K2094o139k2044N744
$$ -12259 -4276 14246 7496 -9562 -1293 16231 7848 -11595 -3131 18963 12824 -9220 -3476
849c476K4850o360l0196M04L3683O574l1819j2898K7401J3293k7237j7358K5040
$$ -3476 21374 15014 -15182 -14778 18905 25479 -6340 -19238 8163 21456 -5781 -23139 1901
862A901K2713k1338k7730J3255K6930q392k5142M929K3708j871k2454j71J9399
$$ 1901 24614 3276 -24454 -11199 15731 7339 -17803 -12874 10834 8963 -13491 -13662 5737
875E737J519j6902N4J6822J840j4496j589J3255L0j3801J904J9184L41k1427n177
$$ 5737 7256 -9646 -9592 7230 9070 -5426 -7015 6240 6270 -7531 -5627 13557 13898 -7529 -12706
890a2706K1072P983k0738q950K2077J1213k3134j7751J9285K2197j4612k4414
$$ -12706 8366 16349 -4389 -13339 8738 19951 -3183 -20934 -1649 20548 5936 -18478
902a8478R372K4769n715k6440KK5265L891k2562o017K0471P864j7791j1017J4194
$$ -18478 -9106 15663 9948 -16492 -16490 8775 12666 -9896 -15913 4558 12422 -5369 -16386 -2192
916b192J1396r345q693Q356O334r833o779J0995R054r944q162R951P052j3237
$$ -2192 9204 -141 -8834 -478 5856 -3977 -10756 239 9293 -651 -8813 1138 8190 -5047
930e047q953J5073J3108j4523j6009J1501J8558r819k1312O138K4079r88k4397
$$ -5047 -14000 1073 14181 -342 -16351 -4850 13708 3889 -17423 -11285 12794 11806 -12591
943a2591l428K4633O720k2860j0396K1312J5953j6651j7385J1147J7133p352j4532
$$ -12591 -16019 8614 15334 -7526 -17922 3390 19343 2692 -14693 -3546 13587 6235 -8297
956h297O381J5992l590j5723R45J2944p5j0060R99R883m007j1040L877J1239m762
$$ -8297 -1916 14076 10486 -5237 -4292 8652 8577 -1483 -484 9399 5392 -5648 -1771 9468 4706
971D706j2615L567J4674l326j8050j77J8966K484k0390n066K1358R342k1880j4850
$$ 4706 -7909 -4342 10332 7006 -11044 -11221 7745 10229 -10161 -15227 6131 15473 -6407 -21257
985b1257J8988J8455j3538j8861J0767K0479p416k1085L668K2344J749j9842m144
$$ -21257 -2269 16186 2648 -16213 -5446 15033 7617 -13468 -9800 12544 14293 -5549 -9693
998i693J7103N398j4702n362J3345N594j1515m778R928L094j1047l146J1325L154
$$ -9693 7410 12808 -1894 -7256 6089 11683 168 -4610 5318 8412 -2635 -5781 5544 8698
1012H698j1963m065J2475M417j6488p101J7332J1390j6889j5018J4010J7287j2619
$$ 8698 -3265 -7330 5145 9562 -6926 -14027 3305 14695 -2194 -17212 -3202 14085 1466
1025A466j9632J0543K2610o607k4248J183K3402L821k2134o039J9977R324j7039
$$ 1466 -18166 -7623 14987 8380 -15868 -14685 8717 12538 -9596 -15635 4342 13666 -3373
1038c373j1909J3687J2008j1063j1061R410J0720q099r977N587Q697n121p437
$$ -3373 -15282 -1595 10413 -650 -11711 -2301 8419 320 -9657 -4070 4627 -494 -7931
1051g931P418P397r346r409R785J1629r143j2430J0047J4640r275j7508P033K1024
$$ -7931 -513 6884 -2462 -11871 -2086 9543 400 -12030 -1983 12657 3382 -14126 -7093 13931
1065A3931k976k1227m16K2423M137k2035q578K0574J2435j8017j4416J4806J5246
$$ 13931 10955 -10272 -10688 11735 15872 -6163 -14741 5833 18268 251 -14165 641 15887
1078A5887j2300j6770Q437J6846m578j5506J345J1878j703j1010J747J1387k191
$$ 15887 3587 -13183 -4746 12100 7522 -7984 -6639 5239 3536 -7474 -5727 5660 3469
1091C469j0835J443J0083k581j0508M550J2464m099j3858L110J6229n05j7474
$$ 3469 -7366 -5923 4160 1579 -8929 -4379 8085 3986 -9872 -6762 9467 8962 -8512
1104h512j632J9525N858j8445r534J7777J2564j6005j4899J4685J8043j1297k0378
$$ -8512 -10144 9381 15239 -3206 -12740 5037 17601 1596 -13303 1382 19425 8128 -12250
1117a2250O642J9571k568j7846m00J6160J557j5747m205J3933M877j1529n243
$$ -12250 -5608 13963 11395 -6451 -6851 9309 10866 -4881 -9086 4847 9724 -1805 -7048
1130g048R352L271r116k485R338J910j0005j691J0899K345j2467m546J3720O157
$$ -7048 2304 5575 -3541 -6026 3312 5222 -4783 -6474 4425 6770 -5697 -10243 3477 9634
1144I634j3641q078J4569J0747j4654j4845J2572J8414q982j9534M569J9167j834
$$ 9634 -4007 -12085 2484 13231 -1423 -16268 -3696 14718 5736 -13798 -9229 9938 8104
1157H104j9033j152J9039M678j7659q332J4557R964j1594r794R492R276p412q116
$$ 8104 -10929 -12081 6958 11636 -6023 -14355 202 10166 -1428 -11222 -1730 7546 134 -7982
1171g982O092P725n751o284O125N836n513n620O587O018p710p217R602J0330r970
$$ -7982 -1890 5835 84 -6200 -75 5761 248 -5372 1215 7233 -477 -7694 1908 12238 2268
1186B268j3518P445J5248n591j6307L432J7180j312j8919l141J8514O795j7257
$$ 2268 -11250 -3805 11443 5852 -10455 -7023 10157 8845 -10074 -13215 5299 12094 -5163
1199e163j0485J3905J2245j0992j3731Q923J3458n841j2980L947J2602j594j0993
$$ -5163 -15648 -1743 10502 -490 -14221 -5298 8160 2319 -10661 -6714 5888 4294 -6699
1212f699J86R839J132o914R70O364j593p099K680R476k233r585J930J0993k425
$$ -6699 -6513 3326 4458 -2456 -1486 4878 3285 -3814 -1134 8342 6109 -3476 -1546 9447 7022
1227G022j2094J594J4232P45j6133m616J5886P766j4770j1424J2204J3567j0817
$$ 7022 -5072 -3478 10754 11499 -4634 -9250 6636 14402 -368 -11792 412 13979 3162
1240C162j5309P816J6524n631j7653K207J6528J864j4684m076J1630M666r574
$$ 3162 -12147 -4331 12193 6562 -11091 -8884 7644 9508 -5176 -9252 2378 7044 -2530
1253b530m877R798M654q401m720O940M622o667k694P176J862r028j846R901L866
$$ -2530 -7407 2391 7045 -1356 -6076 864 5486 -1181 -3875 3301 5163 -3865 -5711 4190 8056
1268H056j1618o030J1487Q286j0410j1157R696J2560q915j5604P237J8094l713
$$ 8056 -3562 -9592 1895 10181 -229 -11386 -1690 10870 1955 -13649 -6412 11682 7969
1281G969j8870o92J7882M088j5973n546J4574P801j2935r595J0905J0885p891
$$ 7969 -10901 -11593 6289 10377 -5596 -11142 3432 11233 -1702 -11297 -392 10493 2602
1294B602j0704O297R236m684q143M268O686n247o002N574O363o399p809N706P827
$$ 2602 -8102 -1805 7431 2747 -5396 -1128 5558 311 -5691 -117 6246 -153 -7962 -2256 5571
1309E571o258r426P018J1633p268j5341M603J7682j456j7260j392J7056L533j6749
$$ 5571 -687 -10113 -3095 8538 1270 -14071 -9468 8214 6758 -10502 -11894 5162 8695 -8054
1323h054n959J6373J0498j3932j2477J1697J4215q723j4034O072J4205l122j2301
$$ -8054 -14013 2360 12858 -1074 -13551 -1854 12361 3638 -10396 -4324 9881 6759 -5542
1336e542K848J0963k320j0158J628R808n68q527P88P063l222q594L744J1207k632
$$ -5542 -2694 8269 5949 -4209 -2581 7227 6659 -1868 -1080 5983 2761 -5833 -2089 9118 6486
1351F486j3459J303J3174o60j4857l63J5859L374j6887o785J5724R801j3701j2590
$$ 6486 -6973 -5670 7504 6844 -8013 -8376 7483 10857 -6030 -12815 2909 12710 -991 -13581
1365a3581J1566J5563r104j6094O061J5255l278j4628K141J5221k28j4001k355
$$ -13581 -2015 13548 4444 -11650 -5589 9666 6388 -8240 -6099 9122 8894 -5107 -7462
1378g462J1053K892p817j884P729O67q868j040Q859J183q781k93R443k20j1507
$$ -7462 3591 6483 -1334 -3218 4511 5178 -3690 -4730 4129 5312 -3469 -3762 5681 5461 -6046
1393f046q45J2432L241j2857m947J3024P619j2815j0644J0720J3041p646j3721
$$ -6046 -6891 5541 8782 -4075 -9022 4002 11621 -1194 -11838 -1118 11923 4277 -9444
1406i444N961J4435m981j5806J299J5892K531j3165m605R144M612q657m798P791
$$ -9444 -3483 10952 5971 -9835 -8536 7356 9887 -3278 -7883 1261 5873 -2784 -7582 209
1420B09N965o873n948L887M422m248k553N230K008o065k297O290K932p681l322
$$ 209 6174 -699 -6647 -2760 1662 -2586 -5139 91 2099 -3966 -6263 27 2959 -4722 -8044
1435h044Q435O139p215p922O642Q689n679r962N360J3413k451j4205j479J2719
$$ -8044 391 6530 -685 -8607 -1965 6724 1045 -8917 -3557 9856 7405 -6800 -8279 4440
1449D440M394j0371m672R128O286q311q971N889R787k726q699N84P143n10o513
$$ 4440 8834 -1537 -6209 2919 9205 894 -8077 -2188 7599 4873 -3826 -3242 3901 3391 -3122
1464c122p39N135R06l726K17K905j165l941J152M364r89l695J664N315k691q238
$$ -3122 -3861 1274 2180 -1546 -1329 1576 411 -3530 -2378 1986 997 -2698 -1034 4281 1590 -6648
1480f648J181J1090J763j0213l876R303M731q787o512R118R828o934j1630L117
$$ -6648 -5467 5623 7386 -2827 -6703 2600 7331 -1456 -7968 1150 10978 4044 -7586 -4469
1494d469J2362j125j2346k12J1487K796j0195n044Q289N174o735m891O048N817
$$ -4469 7893 6768 -5578 -5790 5697 8493 -1702 -6746 1543 6717 -18 -4909 1139 6956
1508F956m642n694K529L914k392k046M489K142n600m352O036M601o175m242P209
$$ 6956 2314 -3380 -851 3063 671 -1375 3114 5256 -344 -4696 1340 5941 -234 -4476 2733
1523B733N150q230q351O779J0874n411j2456L195J3652j785j4497j831J3920M092
$$ 2733 7883 -347 -8698 -1919 8955 3544 -8912 -5717 7935 6150 -8347 -10178 3742 7834
1537G834j2179o440J1734P362j0570q915P558J0322m793q589K817P476l052o971
$$ 7834 -4345 -10785 949 8311 -2259 -11174 -3616 6706 1913 -6676 -3859 3617 565 -6406
1551f406M300O761k402o443K840N109l632m906N191O685n320q093M533R530l926
$$ -6406 -2106 4655 2253 -4190 -1350 3759 127 -4779 412 7097 1777 -6316 -1783 7747 3821
1566C821j1333K811J2892j135j3752j308J3360L099j3633n818J2911Q416j0860
$$ 3821 -7512 -4701 8191 7056 -6696 -8004 5356 8455 -5178 -10996 1915 10331 -529
1579e29j0883Q037J0559n428j0252M480J0230k768j0499J396R184N80p743J15
$$ -529 -11412 -3375 7184 1756 -8496 -4016 6214 3446 -7053 -5657 3527 4107 -3636 -3521
1593c521O423m13n569R87O001j620n552J320P184j608q297J295R129jj0285j142
$$ -3521 2902 2489 -3080 -2093 3908 2288 -3264 -1944 5240 3632 -4665 -3370 5759 5758 -4527 -5669
1609e669J1703K597j2030o155J1418Q624r438r541P927J0289o302j1429L970J2760
$$ -5669 6034 8631 -3399 -9554 1864 10488 1050 -8491 -564 9725 3423 -8006 -4036 8724
1623H724j207j2120j086J0346K667r009k536P882K488o787k469N315K480n305
$$ 8724 7517 -4603 -5689 4657 7324 -1685 -4221 3661 6149 -638 -3107 2208 4688 -617
1637f17j967M808J560n689r29N955P68p844j808Q533L456r019n472Q622O671q021
$$ -617 -2584 2224 3784 -1905 -2834 3121 3889 -3955 -5763 2770 6226 -2793 -8265 357 7028 -993
1653i93q102P325R631n346j2010L716J2434m24j2411j546J1413L952j0081m600
$$ -993 -9095 -1770 7861 2515 -9495 -5779 6655 6231 -6180 -7726 3687 7639 -2442 -7042
1667g042Q678N709p377n501M906O542l860n579K810M233k389l419K351K824l764
$$ -7042 1636 7345 -32 -5533 -627 5915 2055 -3524 -714 3519 1130 -2289 62 2886 -878
1682h78k778L872L513m641m559M910M960n066p193N554P897l591j0165J806J0868
$$ -878 -3656 216 3729 -912 -5471 -561 4399 -667 -7860 -2306 5591 2000 -8165 -6359 4509
1697D509L78j0599k590J0785M007r720n699R026P161o870q211N129Q478k613p950
$$ 4509 4887 -5712 -8302 2483 6490 -3230 -8929 97 7258 388 -7823 -2694 5784 3171 -4779
1712d779J138O990J88o390jN656J67m918j62M456m55l761R46M124k038m559K185
$$ -4779 -3641 3349 3537 -2853 -2854 2802 2969 -1949 -2111 2345 1890 -1871 -925 3199 1161 -3398 -1213
1729a213O067j099p634J23Q469O90q410k225Q977M200r133o220Q117Q212o193
$$ -1213 4854 3755 -3879 -3756 4713 5403 -3007 -5232 3745 7945 -1188 -7408 709 8921 2728
1744B728r379M316R443j900j0015L18R389J357q516k942P140L979o262m235M438
$$ 2728 -6651 -2335 7108 5208 -4807 -4489 4900 6257 -2259 -5201 1939 5918 -344 -4579 -141
1759a41L781l472k700K661J969l427j550L877J806m102j831M644J926n547k533
$$ -141 3640 168 -2532 129 2098 -1329 -2879 998 2804 -1298 -3129 1515 3441 -2106 -4639
1774d639O622M675o649o441O085Q090m765r475L715R974j853j0279j84J0099K509
$$ -4639 1983 6658 9 -6432 -347 7743 2978 -6497 -2782 7192 5339 -4940 -5124 4975 7484
1789G484j0048m237Q672N938p650o715N374O245l976o501L616N343k535n670K060
$$ 7484 -2564 -6801 1871 7809 159 -6556 -1182 5063 1087 -5414 -1798 3545 1010 -4660 -2600
1804b600M246j333l799K049K783k727l572L374M772l806n346L855O574l526p368
$$ -2600 1646 313 -3486 -1437 1346 -1381 -4953 -1579 3193 -613 -5959 -2104 4470 944 -6424
1819f424K426R312j545r897l50J0652K651j0133m785R072O494p232p359N545Q242
$$ -6424 -3998 5314 3769 -6128 -6478 4174 6825 -3308 -8093 979 7473 241 -7118 -1573 6669
1834F669m869q316L170Q272r38p693k58N971O92m525k81L789N88m300M12M166
$$ 6669 1800 -6516 -3346 4926 3988 -3705 -3963 2008 2700 -1825 -2106 1683 2271 -2029 -1617 2549
1850B549o88m254Q21N266j494n594R85O800l90p952q60Q519K719q297m800P633
$$ 2549 1861 -2393 -1572 3694 2200 -3394 -2409 4391 4001 -3951 -4811 3708 6427 -1870 -6670 963
1866I63N764o712p094O258Q408m753r224K100R348J09q551j559P696K384p095
$$ 963 6727 15 -7079 -821 7587 2834 -6390 -4290 5058 5167 -3384 -4943 2753 5137 -1958
1881a958k630O106L315m511l334L618K980l135k058K911J564l364o43M513O74
$$ -1958 -4588 1518 4833 322 -3012 606 3586 451 -1607 1304 2868 -496 -1139 3374 4048
1896D048m959k086N494L189n518m274O002M651n977o997N130Q447l446r269N85
$$ 4048 -911 -2997 2497 5686 168 -4106 1896 6547 570 -6427 -1297 7150 3704 -5565 -4980
1911d980R683L70r340j874Q408L714p978n106O603N789n097n904L415N760k118
$$ -4980 4703 5073 -4267 -6141 2267 5981 -1997 -7103 -500 5289 192 -5712 -2297 3463 1345
1926A345m706J273L799j283l473K026L330j868l442K126K617k334l017L319M750
$$ 1345 -3361 -2088 1711 428 -3045 -1019 2311 443 -2999 -873 1744 -590 -3607 -288 4462
1941D462m065n845K711P713k293p341O62Q522p1q659k023Q839L669p599n595O706
$$ 4462 397 -5448 -2737 4976 2683 -4658 -3996 4526 4455 -4204 -6227 2612 6281 -1318 -6913 -207
1957b07O811n569p335L393P463j518o765J051N722r5n667j023M802J376l044j081
$$ -207 6604 1035 -6300 -2907 4556 3038 -3727 -2676 3046 2951 -2716 -3739 1063 2439 -605 -1686
1973a686K336j6k968J071L206m87m213L71M715j060n248P43O249R50p007j850
$$ -1686 650 634 -2334 -1263 1943 1456 -2757 -2386 2329 1269 -3979 -3236 3013 3963 -3044 -4894
1989d894O455L657o434m788N425O745l638p518K294P693j650p117N92P391J772
$$ -4894 1561 5218 -1216 -6004 -579 6166 2528 -4990 -2696 4997 3347 -3770 -3178 4213 5985
2004E985o601l330M893L955l706l309L028L145k790l208J905K609j445k059K061
$$ 5985 -616 -3946 947 4902 1196 -2113 915 4060 1270 -1938 -33 2576 1131 -928 1133
2019A133J291k964j433L113J610l777k514M346L599m388n183L344O513k781o814
$$ 1133 2424 -540 -1973 1140 2750 -1027 -3541 805 4404 16 -5167 -1823 4690 1909 -4905
2034d905J960P771p62q669j331Q640L511p209m826N709N292m886o094M283O629
$$ -4905 -2945 4826 4064 -4605 -5936 2704 6215 -994 -5820 -111 5181 295 -5799 -1516 5113
2049E113k374o468O28N971p10m552M63M063k80l559O04K686j160l012J239M346
$$ 5113 2739 -3729 -3101 2870 2160 -2392 -1929 2134 1854 -1705 -1101 1585 425 -2587 -1348 2998
2065B998j592m929J374N171j475o121Q12P871O93q721k600Q435L244p070n043
$$ 2998 1406 -3523 -2149 3022 1547 -4574 -3762 4109 4802 -3919 -6519 1916 5160 -1910 -6953
2080f953P465O476o718q086M423Q964k644q240J126Q256q83p341m93O042J569
$$ -6953 512 6988 270 -7816 -3393 5571 2927 -5313 -4187 4069 3186 -4155 -4648 1394 2963
2095B963n289j048M754Q63m578n33L936Q70l970M37M469o89n777k72O794J430
$$ 2963 -2326 -3374 1380 2243 -2335 -2868 1068 1938 -2032 -1595 2874 2185 -3592 -3864 2930 4360
2111D360o473k056P111K719p649l862P255O089o000p429M707P941l476q369J810
$$ 4360 -2113 -4169 2942 5661 -1988 -5850 1405 7494 1494 -5935 -1228 6713 3237 -5132 -3322
2126c322Q840l72p636j436O870J598o345k264N434K899l818l294K987J777k953
$$ -3322 5518 5146 -2490 -3926 2944 4542 -1803 -4067 1367 4266 448 -2846 141 1918 -1035
2141a035r35L458J506m289j246L622J162m383j023N571J955n529l841N445M904
$$ -1035 -1970 1488 2994 -1295 -2541 1081 2243 -2140 -3163 2408 4363 -1166 -5007 438 5342
2156E342m942n622M552O938l281p767J576P576J85p541p89P160K520p274l632
$$ 5342 400 -5222 -670 6268 2987 -4780 -3204 4372 4557 -2984 -3773 3387 5907 -1367 -4999
2171d999N211M266l122l891K286L542k668l698K274K958j124k191P34J324j636
$$ -4999 212 4478 1356 -2535 -249 3293 625 -3073 -799 2159 1035 -1156 -422 902 -734
2186g34j700K340K209l064k143L498K430l523m180K985N673j994o028J102O154
$$ -734 -2434 -94 2115 -949 -3092 406 2836 -687 -4867 -1882 3791 1797 -4231 -3129 3025
2201C025j7p094j365P182L236n795m824M746M587l616n096K977N880j587n544
$$ 3025 3008 -4086 -5451 1731 4967 -828 -5652 -906 3681 65 -5031 -2054 3826 2239 -3305
2216c305n7N012Q22l789m65K695Q30k412p86J955J18j612P32K107o69k804P44
$$ -3305 -3362 1650 2472 -1317 -1782 913 1743 -669 -1455 500 618 -994 -262 1845 1176 -1628 -884
2233h84K967n89l903O59M940N70n852k245N682L122m710l936M325M703l250o229
$$ -884 2083 1494 -2409 -1750 3190 3760 -2092 -4337 1345 4467 -243 -4179 146 4849 1599 -4630
2249d630K046O289m6o547n41N480J534n031k272M110L113l204k885K542K237j441
$$ -4630 -2584 3705 3659 -2888 -3429 2051 3585 -1446 -3718 392 3505 301 -2584 -42 2195 754
2265G54k736J315K419j108j150R49J084j984j409L120J683k949k078K959K454
$$ 754 -1982 -667 1752 644 -506 443 1527 -457 -1866 1254 2937 -12 -2090 869 3323
2280C323l091l364L127M727k110o291J449O507n60o174j123O290K603o094l695
$$ 3323 232 -3132 -5 4722 2612 -3679 -2230 4277 3717 -2457 -3580 2710 5313 -781 -4476
2295d476M824M104l701m486K221N267j848m579J91L971ol311pL092m89l059Q94
$$ -4476 348 4452 751 -3735 -1514 3753 1905 -2674 -2483 1488 1482 -1829 -1836 1256 767 -2292 -1398
2312a398K470q00k449J036K983j871l260J404M208j101m746N28N340P30o264j303
$$ -1398 1072 272 -2177 -1141 1842 -29 -3289 -1885 2323 1222 -3524 -2996 2344 3074 -3190 -4493
2328d493N918L127o083l504N186M804m349o044L314O332j295o361O16N489K45
$$ -4493 1425 4552 -1531 -5035 151 4955 606 -5438 -2124 4208 2913 -3448 -2832 2657 2902
2343B902n206j028M831J470m271j372L074P41k295m18K458M50k957j36L262n7
$$ 2902 -2304 -3332 1499 2969 -1302 -2674 400 1141 -1154 -1572 886 1336 -1621 -1757 1505 1448
2359A448l773k87M696O92n299j359N199K744n420l617N079M897m065n943L216
$$ 1448 -2325 -2612 2084 2776 -2523 -3882 1317 4061 -1359 -4976 103 5000 935 -5008 -1792
2374a792O092j819o565J189O581K19o250j264N297K296m248k481L247K654k571
$$ -1792 4300 2481 -4084 -2895 3686 3905 -2345 -3609 1688 3984 -264 -2745 502 3156 585
2389E85k608K068K373k030j470J579J369j762j260K326J444l004j651L515K306
$$ 585 -2023 45 2418 388 -1082 497 1866 104 -1156 1170 2614 -390 -2041 1474 3780
2404C780l868l020L457M008l367m569K855M936j738n872L10O322O52n687k390
$$ 3780 -88 -3108 349 4357 990 -3579 -724 4212 2474 -3398 -3088 3234 3886 -1801 -4191
2419d191N783K441m583l352L381M096k693l673J198L992j201l101K29K646j44
$$ -4191 1592 4033 -550 -3902 -521 3575 882 -2791 -1593 2399 1198 -1903 -1674 972 828
2434H28k300L91K161q48j602J010J964j574k044J549K969j754l198J097M377j109
$$ 828 -1472 -1081 1080 232 -1370 -360 1604 30 -2014 -465 2504 750 -2448 -1351 3026 1917
2450A917m867j4M857J704n334k150M899L084m323m280L776M396k564m766J518
$$ 1917 -2950 -2964 1893 3597 -1737 -3887 1012 4096 -227 -4507 -731 3665 1101 -3665 -2147
2465b147N038o69m778m32L737J228l272j401L057J117k613r00J962N24j441l10
$$ -2147 2891 2222 -2556 -2988 749 1977 -1295 -2696 361 1478 -1135 -2035 -73 451 -990 -1300
2481a300K175n57k089M63K492M0k959n10L479J304l920k072M250K902l858l876
$$ -1300 875 318 -1771 -1308 1184 1224 -1735 -2245 1234 2538 -1382 -3454 796 3698 -160 -4036
2497d036L443M814k756n239J684N419K2n218j415N103J879m215k388L601K625
$$ -4036 -593 4221 1465 -3774 -2090 3329 3351 -1867 -3282 1821 3700 -515 -2903 698 3323
2512C323k620k816J830K480j109k207Q68J796j513q24J495J013j979j157K597
$$ 3323 703 -2113 -283 2197 1088 -1119 -251 1545 32 -792 703 1716 -263 -1420 1177
2527A177R70k506k310K986K905l132l242K715M065k011m690J072M783J9m953j151
$$ 1177 2147 -359 -2669 317 3222 90 -3152 -437 3628 1617 -3073 -2001 2782 2801 -2152 -3303
2543c303N409J693m343l117M073L163k841l694J909L935j397l063J72L013j76
$$ -3303 2106 3799 -544 -3661 412 3575 734 -2960 -1051 2884 1487 -1576 -1404 1609 1433
2558A433k361L76J554J58j787K75J053l19j693J179J859j508k454J536L131j409
$$ 1433 -928 -552 1002 1160 -627 -352 701 382 -1311 -132 1727 219 -2235 -699 2432 1023
2574A023l649M95M302J05m335j196M450K169m426k974L598L925l077m448K154
$$ 1023 -2626 -2131 2171 2276 -2059 -3255 1195 3364 -1062 -4036 -438 3487 410 -4038 -1884
2589a884M640j128m793N48M177O89l881j292L228J379k288j278J608J123j612
$$ -1884 2756 1628 -3165 -2617 1560 2249 -1632 -2924 304 1683 -605 -1883 -275 848 -764
2604g64o30J736O06j849j31J502O25k512j56K868Q72l566j223L771K108l516l113
$$ -764 -1394 342 948 -901 -1032 470 1095 -1417 -1573 1295 2167 -1399 -2622 1149 3257 -259 -3372
2621c372L138L957k836m288K195M744j307m813n1N039R09m618j583L584K202l179
$$ -3372 -234 3723 887 -3401 -1206 3538 2231 -2582 -2633 2406 3315 -1303 -2886 698 2900 -279
2637b79k301K480K524j740k563J233K158j384j162O97J452j371j140K025R06k207
$$ -279 -2580 -100 2424 684 -1879 -646 1512 128 -1034 -337 1115 -256 -1396 629 1535 -672
2653f72j054K501J726k373k423K403L275k719l513K148M301r15n011J44M532R86
$$ -672 -1726 775 2501 128 -2295 108 3383 664 -2849 -701 3600 2685 -2326 -2182 2350 3336
2669C336m505j558M223K537l529l531K992L242k082l320J251L165r37k578M77
$$ 3336 -1169 -2727 1496 4033 504 -3027 -35 3207 1125 -2195 -944 2221 1284 -1294 -817
2684h17J889o32j150L2J349o13j092P94J268j165j441J392J980j636k763J273
$$ -817 1072 440 -710 -678 671 58 -1034 -240 1028 -137 -1578 -186 1794 158 -2605 -1332
2700a332L497o69m056M96L623O82m270j120L838K416l466l321K844L636k096l774
$$ -1332 2165 1496 -2560 -2064 1559 2241 -2029 -3149 689 3105 -361 -3682 -838 2798 702 -3072
2716c072J284L649Ml741m68K878R09k412j188K269J019j162j163Q64O11p16j8
$$ -3072 -1788 1861 1865 -1876 -2344 534 1443 -969 -2157 112 1131 -31 -1194 -330 281 -435 -453
2733d53J338k59j481L49J692l47k174nK775L17k825j393K967K016k856k483K248
$$ -453 885 626 -855 -506 1186 839 -1335 -1340 1435 1752 -1073 -2466 501 2517 -339 -2822 -574
2750e74L293j342m098O47L802L71l609p05L132J549k915k412K395K460j033k577
$$ -574 2719 1377 -2721 -2074 1728 2099 -1510 -2215 917 2466 -449 -2861 -466 1994 961 -1616
2766a616J128J568l84j659O83J508oj310K69N18p16k88J344O98j547r40J153J812
$$ -1616 -488 1080 696 -963 -280 1228 1222 -88 181 699 -17 -305 1039 1737 190 -750 403 2215
2784B215j726k214J683K792o48l842K12L512M04l396j136L390K232l328l267K361
$$ 2215 489 -1725 -42 2750 2102 -1740 -1528 1984 2388 -1008 -2144 1246 3478 150 -3117 -756
2800g56L262j355l016Q60L033k70l362m10K581R68j891p56J552N92j532m90J179
$$ -756 2506 1151 -1865 -1005 2028 1758 -1604 -2014 567 1535 -356 -1112 440 1032 -500 -990 189
2817A89N24r98p3J568o20j835M00J933j29k223J30K718N77l792j267L054K572
$$ 189 713 -285 -358 1210 590 -1245 -845 1088 959 -1264 -1134 1584 2161 -1631 -2898 156 2728
2834B728k638l226K667L200j978m034J191M693k86m501l85L786J106l332j664
$$ 2728 90 -3136 -469 2731 753 -3281 -2090 2603 2317 -2184 -2569 1217 2323 -1009 -2673
2849b673K999J696k172j525J399J336j265j344J181J295j169r83J529N26k181
$$ -2673 326 2022 -150 -1675 -276 1060 -205 -1549 -368 927 -242 -1225 304 830 -1351
2864a351l55K083Q87k507j639K858K022k755k279K478L544k351l496P72M355k16
$$ -1351 -1706 377 1264 -1243 -2882 -24 1998 -757 -3036 -558 2986 635 -2861 -2089 2266 2050
2880B050m104n76M547J113m313j880L602K435k586k163J960K387j074l083J121
$$ 2050 -2054 -2630 1917 3030 -1283 -3163 439 2874 288 -1875 85 2472 1398 -1685 -564
2895e64K029k92j625M58J191j116j092R60J574j490j172J795J425k217k187K398
$$ -564 1465 1173 -452 6 1197 81 -1011 -51 1523 33 -1139 656 2081 -136 -2323 75
2911G5K693j941l400J856L236p81l993J45M022R82l803j653L088K492l035k578
$$ 75 2768 827 -2573 -717 2519 1738 -2255 -2110 1912 2894 -909 -2562 526 3018 -17 -2595
2927b595K414L187j894k746K72K786o9k301L43J965l65j551R3R38j43q43N25J143
$$ -2595 -181 3006 1112 -1634 -1362 1424 1355 -946 -603 1362 997 -554 -461 477 334 -509 16 1159
2945A159q78j211O42J567j093j549P29K462m59l017k62L301O43l393j012L073
$$ 1159 281 -930 -288 1279 186 -1363 -634 1828 1369 -1648 -1910 1391 2034 -1359 -2371 702
2961G02K128k753k791K094K833j095k870L56K941q7k671q22K639Q80j811j308
$$ 702 2830 77 -2714 -620 2213 1118 -1752 -1396 1545 1458 -1213 -2035 604 1484 -327 -1635
2977a635J297M77n74n67N14O05p45k9L91K32j480O48J424l01j106m73K248M48
$$ -1635 -338 139 -435 -1002 -488 117 -628 -657 -266 -34 -1514 -866 558 257 -849 -1322 926 1374
2995A374k537j018K811J675j906k451J570K631j232k633L58L320J84l336p77K459
$$ 1374 -1163 -2181 630 2305 399 -2052 -482 2149 917 -1716 -1358 1962 2146 -1190 -1967 492
3011D92J810k218k095J800K126j178k175L43J802p1j289M6Q27K61o63M3M22l77
$$ 492 2302 84 -2011 -211 1915 737 -1438 -1095 707 636 -653 -607 220 481 -182 -139 283 -94
3029i4n76R82Q41j424o97J164J496j291j653J029K038m52k671j85L120M59k843
$$ -94 -670 312 1153 -271 -968 196 1692 401 -1252 -223 1815 1363 -1308 -1493 1627 2086 -757
3046g57r40K461J979k859j884J520K747j312k570M90K945q9k453k97J945O09j499
$$ -757 -1697 764 2743 -116 -2000 -480 2267 955 -1615 -1125 1820 1731 -722 -1019 926 1535 36
3063C6r65J018O78o09k28O10L81j071J10Q86l66j285M33J838l70k320K60K109
$$ 36 -929 89 767 158 -70 540 921 -150 -40 846 480 -805 -372 1466 1096 -1224 -964 1145
3081A145L98k460j153K506J927k646k393J932K459j141l017O59L275j23l067l87
$$ 1145 1543 -917 -2070 436 2363 -283 -2676 -744 1715 574 -2443 -1784 1491 1368 -1699 -2086
3097b086K550J047k488j177J872J485j309j286J136J055l97r70N48L80o80k79
$$ -2086 464 1511 -977 -2154 -282 1203 -106 -1392 -256 799 402 -568 -20 360 -320 -599
3113e99R59L41j186j66J358M48j725q10K024R67j804k251J879K485j582k790Q00
$$ -599 360 701 -485 -651 707 1155 -570 -1380 644 1611 -193 -2444 -565 1920 338 -2452 -1652
3130a652L293k85l313m04K931J123k600j761K607J914j837k158J486J840p22j441
$$ -1652 1641 1356 -1957 -2361 570 1693 -907 -2668 -61 1853 16 -2142 -656 1184 462 -979
3146i79K78J559k19r52J2J165o35l70M90M22n98j115J370R62j108j940J379K230
$$ -979 -701 858 639 -313 -301 864 229 -141 349 771 173 -942 428 1390 282 -1658 -279 1951
3164A951r06k427O65K342%k875m60L058M46k323j549K358J967j714k342J249K670
$$ 1951 1045 -1382 -717 1625 1625 -1250 -1710 1348 1794 -529 -2078 280 2247 533 -1809 -560 2110
3181B110p23k211j79K277K14j726n88J524M03j212j78P58K9p48J81N60k10q61
$$ 2110 1387 -824 -1003 1274 1488 -238 -826 698 1101 -111 -289 469 498 -250 -69 491 281 -580
3199e80N66J104p63j627O82J474Q6k376k90K506J003k703j191J976K129j996k362
$$ -580 -14 1090 327 -1300 -618 856 942 -1434 -1724 782 1785 -918 -2109 -133 1996 0 -2362
3216b362J550K555q18k813N27K401P74k622p58J791J599j564j299R72J200r25
$$ -2362 -812 1743 925 -1888 -1361 1040 1814 -808 -1566 225 1824 260 -1039 -67 1133 208
3232B08j066P41K76nn06L25K41o33q5R60P3j569k28J784O21j922j364J817J510
$$ 208 -858 -117 159 154 -352 -27 214 -419 -504 456 529 -1040 -1268 516 1137 -785 -2149 -332 1178
3251A178j455j909J352K407p63k380m27K772J082k782j250K395J567j942j625
$$ 1178 -277 -2186 -834 1573 810 -1570 -1997 775 1857 -925 -2175 220 1787 -155 -1780
3266a780J104K196q56j651M97J476j54j128j96M32M82p36R9O40m37n18Q44M9m87
$$ -1780 -676 1520 664 -987 -490 986 832 -296 -492 -60 422 -314 -215 425 -12 -530 314 363 -124
3285a24n72P54J356j059j587N92K259m48k344j1K736M07k493j040K589J292k214
$$ -124 -696 58 1414 355 -1232 -640 1619 1171 -1173 -1184 1552 1959 -534 -1574 1015 2307 93
3302I3k155J914K227j077k686Q82K396k36k017n04J776M82j184o02Q74Q16q19
$$ 93 -2062 -148 2079 1002 -1684 -802 1594 1358 -659 -1163 613 1095 -89 -691 183 999 180
3319A80p46M87L74n73K61R63q74q94L42J451l55j389j13J805O57k000j297K485
$$ 180 -566 -79 295 -278 -17 946 72 -822 -480 971 616 -773 -886 919 1576 -424 -1721 764
3337G64J382j903k003J432K563j212k696N50K687J14k747p39K114J153j728j231
$$ 764 2146 243 -1760 -328 2235 1023 -1673 -1123 1564 1678 -1069 -1808 306 1459 -269 -1500
3353a500J092J521j100j574Q12R31Nr49K78Q61o03j39M56N3n33m66J402J87j471
$$ -1500 -408 1113 13 -1561 -749 182 187 -762 -484 377 -226 -365 91 144 -389 -855 547 734 -737
3372g37q52J938J044j549j615J461K153j304k333M03K690j30k290p91K435J366
$$ -737 -1589 349 1393 -156 -1771 -310 1843 539 -1794 -1391 1299 1169 -1121 -1912 523 1889
3388A889k470j559J777J691j221j559O80J947o20j836L22J568k11n15l09N18k75
$$ 1889 -581 -2140 -363 1328 107 -1452 -772 1175 555 -1281 -959 609 398 -117 -426 92 -183
3405a83k19N00N08n60o42Q70P52q25j278J108J754p61j868K86K059l65k441j35
$$ -183 -402 98 606 46 -596 274 1026 201 -1077 31 1785 1024 -844 -558 1501 1136 -1305 -1440
3423a440K430P18k341q63J734J514j627j814Q98K265r11j887M52J553K34j117
$$ -1440 990 1708 -633 -1496 238 1752 125 -1689 -791 1474 563 -1324 -872 681 915 -202
3439b02k46Q27P28j019l04M96J20l99R7O69o46n99N17Q63k71j332M07J759k70
$$ -202 -448 379 1107 88 -216 280 400 1 98 767 121 -478 39 902 631 -701 -294 1465 1195
3458A195k418J80J850P43k221r18J956J269j493k381J536K110p52k230O34J640
$$ 1195 -1223 -1043 807 1550 -671 -1589 367 1636 143 -2238 -702 1408 656 -1574 -940 700
3474G00K09j884o42J716J042j227p67O62M47k49m44K36L20K51l92N96p14m27M26
$$ 700 909 -975 -1617 99 1141 -86 -853 -191 256 7 -437 -201 119 370 -22 574 -140 -567 -141
3493a41J002l66j440M34J073j42j166r1J146N91j223j251Q63J930r77j598R5K446
$$ -141 861 495 -945 -511 562 420 -746 -837 309 900 -323 -1574 -711 1219 242 -1356 -1261 1185
3511A185k63j629r21J547J107j031j257R83J390p51j020l02J386N07j019k40M83
$$ 1185 922 -707 -1628 -81 1026 -5 -1262 -279 1111 360 -660 -962 424 931 -88 -328 155
3528A55J89j70n10K78J19L1K07K21r79l64P55Q20r26o62M63J372o03j565K29J564
$$ 155 344 174 -336 -58 61 92 299 520 -459 -823 -68 752 -174 -836 -373 999 396 -1169 -940 624
3548F24N88j800q94J703J295j440j328R33J726k10j798j24J771J50j604l52J504
$$ 624 1212 -588 -1482 221 1516 76 -1252 -319 1407 1197 -601 -725 1046 1196 -408 -760 744
3565G44O66o73j456L86J011j55l03K7K21k89p3K76k56p25N38N90K34j454l92J248
$$ 744 1410 737 -719 -333 678 523 220 247 468 179 106 382 126 -599 -61 529 763 -691 -1083 165
3585A65O13j524p21J386J336j368j228P58J794l92k111L70K098P5k067l93J659
$$ 165 778 -746 -1467 -81 1255 -113 -1341 -583 1211 819 -1292 -922 1176 1251 -816 -1209 450
3602D50P16j180q13P20R19m78j108M99Q32j94p23j1L25J31n42K60L73l53l68R08
$$ 450 1166 -14 -827 -107 812 334 -774 -275 557 363 -360 -371 -46 85 -457 -197 176 -177 -545 363
3622C63J32j254n02J344O38r71r92O15J703p89j969Q37K200K05k548m83K096O13
$$ 363 495 -759 -1261 83 721 -250 -1242 -627 1076 287 -1682 -845 1355 1560 -988 -1471 625 1238
3640A238j643j085J442J669j296j470K65J513j59j105JJ101O5j082p5P94j7m95
$$ 1238 -405 -1490 -48 1621 325 -1145 -880 633 474 -631 -630 471 536 -546 -621 173 156 -339
3658c39Q2P16m60q07O08Q16o77p17O50J638r12j477J0J814J77j714K4J228R65
$$ -339 -257 459 -1 -808 -200 616 -61 -778 -128 1510 598 -879 -869 945 1122 -592 -568 660 1625
3677A625j602j392J394J882j406j661J113J360l35j558m69K119k53j175j54P62
$$ 1625 23 -1369 25 1907 501 -1160 -47 1313 978 -580 -1049 1070 817 -358 -512 250
3693B50J80p35k94O69R3l21M6N11n81l27N45P76n13j112O91R50N1j529l7J501
$$ 250 430 -305 -599 70 163 -158 -112 399 -182 -509 36 812 299 -813 -122 828 879 -650 -687 814
3713H14N22j621n82J223J282j334j714J228J416k06k044K6J427O46j591o39J006
$$ 814 1336 -285 -867 356 1638 304 -1410 -182 1234 1028 -1016 -990 437 1083 -508 -1147 -141
3730a41J242j355q82P77R93n66l56j49P89n49P6j78L47O8l34N14j43o56L1J192
$$ -141 1101 -254 -1136 -359 634 68 -288 -437 352 -197 -121 -299 48 116 -218 296 153 -503 -472 720
3750G20j15j056p84J607N47q94j415Q25J709p81j439M42J104P18j811j096J849
$$ 720 605 -451 -1235 372 919 25 -1390 -565 1144 363 -1076 -634 470 1188 -623 -1719 130
3767A30Q37j138r43O40J245m66j076j76J252j29k61j83L21L46m61L14l35R5o2
$$ 130 967 -171 -1114 -474 771 305 -771 -947 305 176 -85 -268 53 399 -62 252 -83 12 -50
3786e0L11M41o20oK98N92p67q08K94J488m64j540K43J421L73j429j143J394J263
$$ -50 261 702 82 76 374 966 199 -609 -315 1173 709 -831 -588 833 1206 -223 -1366 28 1291
3805A291j199j334P96J411m02j751J92J127P75j132n74Q59O62j79p20K06L33q6
$$ 1291 92 -1242 -446 965 563 -1188 -996 131 906 -226 -800 59 721 542 -178 28 361 275
3823B75m54N34k10L00J50o55J36p8n1J022m48j065P1J295K19j623L7Q16Q35j408
$$ 275 -179 355 145 445 595 -60 76 -2 -53 969 521 -544 -473 822 1041 -582 -545 271 1106 -302
3843c02j014P60J451k56j540p1J901J12j639o50J619P81j131q70M40J214n64p10
$$ -302 -1316 -556 895 639 -901 -972 929 1041 -598 -1248 371 1152 21 -849 -409 805 241 -469
3861d69K60N34J26p20K51K05R0j95l7J64l14j14M27j06l92n67P60O27j174n72
$$ -469 -209 325 451 -269 -18 187 277 82 45 209 -105 -219 208 102 -290 -857 -97 530 -644 -1216
3881a216O58J310n42j604L00J623Q8j515k96J435P21j151j317J381J168o22j105
$$ -1216 -558 752 210 -1394 -1094 529 617 -898 -1194 241 962 -189 -1506 -125 1043 421 -684
3898f84K78J060p1p42k79P94K99q68j39L76K25k37J17j70k4l32M25K21n73o33
$$ -684 -406 654 583 -159 -438 356 655 -213 -352 24 249 12 129 -41 -65 -397 28 249 -324 -957
3918i57N51J090m26j272L60J068q3j194j58J420M92j286o48P71J382n27j408M13
$$ -957 -406 684 258 -1014 -654 414 331 -863 -1021 399 891 -395 -1043 -272 1110 583 -825 -412
3936d12J393j5j416k56J485K39j148m69P71O46p15q9j80O55k97k72J21j60p7K02
$$ -412 981 966 -450 -706 779 1018 -130 -599 172 818 103 14 -166 489 192 -80 41 -119 -196 6
3956FJ92P0p15L69O51j43j286o0J559J62j260n59J115J200r57j426M23J745p39
$$ 6 198 268 -447 -78 573 430 -856 -916 643 805 -455 -1014 101 1301 344 -1082 -659 1086 347
3975C47j101L07J053N72j378m75Q22P18o75r70K52J453n74p10j63L26J10l00J45
$$ 347 -754 -447 606 1178 -200 -675 147 865 190 -780 -528 925 351 -359 -522 -196 -86 -386 -241
3994b41Q3l31K39L79j04j38m78Q87J25q69n26J271M05n93j214J007Q94j65j347
$$ -241 -158 -489 -250 129 25 -113 -591 296 421 -448 -974 297 702 109 -1105 -98 796 631 -716
4013g16j62J330J96o94p54Q65P72p19q64M90J026n30j233J58J101K9m99l08L65
$$ -716 -878 452 648 -46 -800 65 837 118 -746 -256 770 240 -993 -835 266 295 -204 -512 -147
4032a47L77l92m48M64j23J09J54j60k7l16M76N71p27n18Q14P54n38q07P4J041
$$ -147 230 -162 -610 -146 -269 -160 -6 -166 -193 -509 -33 538 -189 -707 107 861 323 -484 -410 631
4052F31J55p69p03Q91Q09n69j312M06J733o63j031k86J280J90r56n78O15R67o12
$$ 631 786 17 -686 205 1014 445 -867 -461 1272 609 -422 -708 572 762 -194 -772 -157 810 198
4071A98q78O10L20Q8n03KL40L18n22j24M84n52J50P58K5j009Q3N25L55p95j95
$$ 198 -680 -70 250 338 -165 -163 177 495 -27 -151 333 -219 -69 689 714 -295 -212 313 668 -127 -322
4092c22P68M65q59p42M58J057j50j516J07J472M31j777o43J464N32p30r82O27
$$ -322 446 911 52 -690 -232 825 675 -841 -734 738 1169 -608 -1251 213 745 15 -967 -340
4110c40J112o76n85m7Q18J05m25k14M48J60m21q6N33l16R8p6K01l39n26Q74N92
$$ -340 772 96 -489 -536 282 387 -38 -252 196 356 -65 -151 382 66 164 88 289 -50 -576 298 890
4131H90p66p29M72P95k13j197m9J396J67j556l10J300O39j165j000R34J199m77
$$ 890 124 -605 -133 662 449 -748 -797 599 766 -790 -1100 200 839 -326 -1326 -392 807 330
4149C30j630N97J221j15r92j28J045K26q00l87P46M72l46l14L24m9l31N3M58m02
$$ 330 -1300 -703 518 403 -589 -717 328 554 -246 -633 113 585 239 -75 249 200 -131 -78 380 -22
4169b2l19K62O29m66j069O24P58K17q79n23J105R15j414j254J177J209o12j220
$$ -22 -341 -79 550 84 -985 -361 397 614 -265 -788 317 1232 -182 -1436 -259 950 338 -882
4187h82K50J489n1j488l8J307Q3o54m00O46L13q4m76Q3L83j47m82N04l6n27J66
$$ -882 -632 857 806 -682 -720 587 670 16 -384 262 575 491 15 98 481 334 -148 356 320 -207 -41
4208d1J89J73m68k97R71j20j056j2J031P71j374q33R42Q29o88r93Q85Q40K5j490
$$ -41 148 321 -147 -444 527 407 -649 -661 370 1141 -233 -1066 -124 705 17 -976 -91 749 774 -716
4228g16K1J222J22q06m46J013O30o27j159P77M26Pm69j57K21m5J6r5m90L08K5
$$ -716 -695 527 649 -157 -603 410 1040 413 -746 31 457 464 -5 -162 59 14 30 -65 -555 -247 -222
4249b22L47p4q15J79P83M2o34m7M19O56p42r92N27J143P8j502r5J600p0r11n46
$$ -222 125 51 -764 -585 198 240 -394 -441 -22 634 -108 -1100 -573 570 648 -854 -949 651 581 -330 -876
4270h76Q20Q98n04j141O92P24k05r17r7O40M88n88l79K04L06O0j77l07K15K17
$$ -876 -56 842 338 -803 -111 613 408 -509 -606 34 522 -66 -445 -241 65 125 -52 -359 -144 73
4290G3l62K12k52j45R92k08m65m81J13N93M5o58L5P88L93q08p15R82N49m77j128
$$ 73 -289 -77 -329 -474 518 310 -155 -636 -523 70 115 -543 -508 280 673 -135 -850 132 681 204 -924
4311i24R14R81j94j269Q5J006J07p30o91O92O93n00l53k95P08L8n30p8K76J02
$$ -924 -10 971 777 -492 -407 599 706 -24 -715 -23 670 170 -183 -478 230 268 -262 -340 -64 38
4331C8r1j3j22J08J47J31l5k98k05N48O44p48j93J98N49l97p17K91J180k29j101
$$ 38 -53 -66 -188 -80 67 198 163 -135 -340 208 852 104 -89 109 658 261 -456 -165 1015 786 -315
4352c15r5R57M81q61p62O68Q45n95j041L30J031j11q19j38P19K39p98j13J41K13
$$ -315 -410 547 1028 167 -595 73 918 323 -718 -388 643 532 -287 -425 294 533 -265 -378 -237 -24
4372b4J35l09Q0l35L33J90L89p27j06L97N16j64p96J85R74l38r60K05Q25K34j126
$$ -24 111 -198 -118 -453 -120 70 459 -268 -374 23 539 375 -421 -236 738 400 -560 -355 470 704 -422
4393d22p10J162Q40j004p82Q34Q78o11r29n4J298Q8r02n93J337k4p85j68N31N5
$$ -422 -1132 30 870 -134 -916 -82 796 185 -744 -798 500 588 -314 -907 430 406 -379 -547 -16 39
4413C9l58L5M59j63l11N57k0l67r1J18M24K06j020J43J061Q7j051m89P13R90j085
$$ 39 -319 -284 175 12 -299 258 238 -129 -220 -102 322 528 -492 -349 712 799 -252 -741 -28 962 -123
4434a23p92P49Q71k05r25j36R76L89j537m8R38O29q69n09L21R24m06n02L20K65
$$ -123 -915 -166 705 500 -425 -561 415 804 -733 -781 157 786 -83 -592 -271 653 247 -255 65 330
4454C30k66j49J11K27j75Q2K95m88k6K00L70K35q39l00P75L08m79r43N85Q88m45
$$ 330 64 -85 26 253 78 160 455 -33 -59 141 511 746 -93 -393 382 690 211 -732 -147 741 296
4475B96j028M53Q77o0q89j91J296l1q72n04M15O18k57m65L02L39k68j49j63M88
$$ 296 -732 -279 598 538 -351 -542 754 723 -149 -653 -238 380 123 -342 -40 299 31 -118 -281 207
4495B07p7L6l2J0m5k47N25Ok92n77P54M18p73m48N02M59m35q53O84P60l13j003
$$ 207 130 166 134 144 99 -148 377 383 91 -486 268 686 -87 -535 -33 426 -9 -862 -178 582 269 -734
4517g34R4O21L35p37m75N90O89k54j024L90J025j23o94j98P97K34j078J73J39
$$ -734 -640 -19 316 -421 -896 -306 383 129 -895 -505 520 397 -297 -495 302 536 -542 -369 -230
4536b30K17k49N70l16j08J73j17J31j15k39K65K67m98j89K40M28p9j266M85P56
$$ -230 -13 -262 308 -8 -116 57 -60 71 -44 -283 -18 249 -249 -438 -198 230 151 -1115 -630 126
4556A26M48q45o12J039M16p40p39O53J005n02q51P9J142K04o38p09R88Kp8m03
$$ 126 574 -271 -883 156 572 -168 -907 -254 751 249 -602 -523 619 823 185 -524 464 466 388 -15
4576a5q1O11k24m53k26L35K61n0p3o1n79N14L60L6n19j75Q36o8p15j57N56N92
$$ -15 -96 515 291 -162 -388 -53 208 158 85 24 -555 -41 319 355 -164 -339 497 429 -286 -443 113 705
$$ [...]
8191A56
##END NTUPLES=NMR FID
##END=
