##TITLE=1H_Ser 1375
 CDcl3, 8 sc, 
 20.12.2019
##JCAMPDX= 6.0         $$ Bruker NMR JCAMP-DX V2.0
##DATA TYPE= NMR FID
##DATA CLASS= NTUPLES
##ORIGIN= UXNMR, Bruker Analytische Messtechnik GmbH
##OWNER= root
$$ XWIN-NMR		Version 3.5
$$ Fri Dec 20 15:28:07 2019 Russian Standard Time (UT+4h)  she@DPX200
##.OBSERVE FREQUENCY= 200.1315
##.OBSERVE NUCLEUS= ^1H
##.DELAY= (6, 6)
##.ACQUISITION MODE= SIMULTANEOUS
##.ACQUISITION SCHEME= undefined
##.AVERAGES= 8
##.DIGITISER RES= 18
##SPECTROMETER/DATA SYSTEM= spect
##.PULSE SEQUENCE= zg30
##.SOLVENT NAME= CDCl3
##.SHIFT REFERENCE= (INTERNAL, CDCl3, 0, 15.7039)
##AUDIT TRAIL= $$ (NUMBER, WHEN, WHO, WHERE, WHAT)
$$ ##TITLE= Audit trail, XWIN-NMR		Version 3.5
$$ ##JCAMPDX= 5.01
$$ ##ORIGIN= Bruker BioSpin GmbH
$$ ##OWNER= she
$$ F:/spectra/data/she/nmr/H-F/1/audita.txt
$$ ##AUDIT TRAIL=  $$ (NUMBER, WHEN, WHO, WHERE, WHAT)
(   1,<2019-12-20 15:26:40.39 +0400>,<she>,<DPX200>,
      <created by zg, POWCHK disabled, PULCHK disabled
       configuration hash MD5:
       00 E9 B6 7A A2 85 ED C7 34 08 36 98 17 FE 4E 26
       data hash MD5: 16K
       FD 7D A0 69 D3 FA 62 55 E8 BB DF CE 28 7F 61 09>)
$$ ##END=
$$ 
$$ hash MD5
$$ F2 36 69 3E 58 B7 91 A2 E3 C9 75 C0 E6 BD 0F 44
##$RELAX= 
##$RELAX= 
##$RELAX= 
##$RELAX= 
##$RELAX= 
##$RELAX= 
$$ Bruker specific parameters
$$ --------------------------
##$DU= <F:/spectra>
##$EXPNO= 1
##$NAME= <H-F>
##$PROCNO= 1
##$TYPE= <nmr>
##$USER= <she>
##$AMP= (0..31)
100 100 100 100 100 100 100 100 100 100 100 100 100 100 100 100 100 100 
100 100 100 100 100 100 100 100 100 100 100 100 100 100 
##$AQSEQ= 0
##$AQ_mod= 1
##$AUNM= <au_zg>
##$AUTOPOS= <>
##$BF1= 200.13
##$BF2= 200.13
##$BF3= 200.13
##$BF4= 200.13
##$BF5= 200.13
##$BF6= 200.13
##$BF7= 200.13
##$BF8= 200.13
##$BYTORDA= 1
##$CFDGTYP= 0
##$CFRGTYP= 5
##$CHEMSTR= <none>
##$CNST= (0..31)
1 1 145 1 1 1 1 1 1 1 1 1 1 1 1 1 1 1 1 1 1 1 1 1 1 1 1 1 1 1 1 1 
##$CPDPRG= <>
##$CPDPRG1= <>
##$CPDPRG2= <>
##$CPDPRG3= <>
##$CPDPRG4= <mlev>
##$CPDPRG5= <mlev>
##$CPDPRG6= <mlev>
##$CPDPRG7= <mlev>
##$CPDPRG8= <mlev>
##$CPDPRGB= <>
##$CPDPRGT= <>
##$D= (0..31)
0 1.2 0 0 0 0 0 0 0 0.06 0 0.03 0 0 0 0 0.0002 0 0 0 0 0 0 0 0 0 0 0 0 
0 0 0 
##$DATE= 1576841199
##$DBL= (0..7)
120 120 120 120 120 120 120 120 
##$DBP= (0..7)
150 150 150 150 150 150 150 150 
##$DBP07= 0
##$DBPNAM0= <>
##$DBPNAM1= <>
##$DBPNAM2= <>
##$DBPNAM3= <>
##$DBPNAM4= <>
##$DBPNAM5= <>
##$DBPNAM6= <>
##$DBPNAM7= <>
##$DBPOAL= (0..7)
0.5 0.5 0.5 0.5 0.5 0.5 0.5 0.5 
##$DBPOFFS= (0..7)
0 0 0 0 0 0 0 0 
##$DE= 6
##$DECBNUC= <off>
##$DECIM= 24
##$DECNUC= <off>
##$DECSTAT= 4
##$DIGMOD= 1
##$DIGTYP= 9
##$DL= (0..7)
0 120 120 120 120 120 120 120 
##$DP= (0..7)
150 150 150 150 150 150 150 150 
##$DP07= 0
##$DPNAME0= <>
##$DPNAME1= <>
##$DPNAME2= <>
##$DPNAME3= <>
##$DPNAME4= <>
##$DPNAME5= <>
##$DPNAME6= <>
##$DPNAME7= <>
##$DPOAL= (0..7)
0.5 0.5 0.5 0.5 0.5 0.5 0.5 0.5 
##$DPOFFS= (0..7)
0 0 0 0 0 0 0 0 
##$DQDMODE= 0
##$DR= 18
##$DS= 0
##$DSLIST= <SSSSSSSSSSSSSSS>
$$ [...]
##$SUBNAM2= <"">
##$SUBNAM3= <"">
##$SUBNAM4= <"">
##$SUBNAM5= <"">
##$SUBNAM6= <"">
##$SUBNAM7= <"">
##$SUBNAM8= <"">
##$SUBNAM9= <"">
##$SW= 24.9337058887773
##$SWIBOX= (0..15)
0 0 2 0 0 0 0 0 0 0 0 0 0 0 0 0 
##$SW_h= 4990.01996007984
##$TD= 16384
##$TD0= 1
##$TE= 0
##$TE2= 300
##$TE3= 300
##$TEG= 300
##$TL= (0..7)
0 120 120 120 120 120 120 120 
##$TP= (0..7)
150 150 150 150 150 150 150 150 
##$TP07= 0
##$TPNAME0= <>
##$TPNAME1= <>
##$TPNAME2= <>
##$TPNAME3= <>
##$TPNAME4= <>
##$TPNAME5= <>
##$TPNAME6= <>
##$TPNAME7= <>
##$TPOAL= (0..7)
0.5 0.5 0.5 0.5 0.5 0.5 0.5 0.5 
##$TPOFFS= (0..7)
0 0 0 0 0 0 0 0 
##$TUNHIN= 0
##$TUNHOUT= 0
##$TUNXOUT= 0
##$USERA1= <user>
##$USERA2= <user>
##$USERA3= <user>
##$USERA4= <user>
##$USERA5= <user>
##$V9= 5
##$VALIST= <valist>
##$VCLIST= <CCCCCCCCCCCCCCC>
##$VD= 0
##$VDLIST= <DDDDDDDDDDDDDDD>
##$VPLIST= <PPPPPPPPPPPPPPP>
##$VTLIST= <TTTTTTTTTTTTTTT>
##$WBST= 1024
##$WBSW= 4
##$XGAIN= (0..3)
0 0 0 0 
##$XL= 0
##$YL= 0
##$YMAX_a= 116106
##$YMIN_a= -76208
##$ZGOPTNS= <>
##$ZL1= 120
##$ZL2= 120
##$ZL3= 120
##$ZL4= 120
##$ABSF1= 10
##$ABSF2= 0
##$ABSG= 5
##$ABSL= 3
##$ALPHA= 0
##$AQORDER= 0
##$ASSFAC= 0
##$ASSFACI= 0
##$ASSFACX= 0
##$ASSWID= 0
##$AUNMP= <proc_1d>
##$AZFE= 0.1
##$AZFW= 0.1
##$BCFW= 1
##$BC_mod= 2
##$BYTORDP= 1
##$COROFFS= 0
##$CY= 11.3945322036743
##$DATMOD= 1
##$DC= 2
##$DFILT= <>
##$DTYPP= 0
##$F1P= 16.9975609425685
##$F2P= -3.02152046262296
##$FCOR= 0.5
##$FTSIZE= 0
##$FT_mod= 4
##$GAMMA= 1
##$GB= 0.15
##$INTBC= 1
##$INTSCL= 1
##$ISEN= 128
##$LB= 0.24
##$LEV0= 0
##$LPBIN= 0
##$MAXI= 10000
##$MC2= 0
##$MEAN= 0
##$ME_mod= 0
##$MI= 1.114404
##$NCOEF= 0
##$NC_proc= 0
##$NLEV= 6
##$NOISF1= 3.799351
##$NOISF2= 2.8
##$NSP= 1
##$NTH_PI= 0
##$NZP= 0
##$OFFSET= 15.70392
##$PC= 1
##$PHC0= -10143.96
##$PHC1= 11.8008
##$PH_mod= 1
##$PKNL= yes
##$PPARMOD= 0
##$PSCAL= 0
##$PSIGN= 0
##$REVERSE= no
##$SF= 200.130013532006
##$SI= 16384
##$SIGF1= 3
##$SIGF2= 2
##$SINO= 400
##$SIOLD= 16384
##$SREGLST= <1H.CDCl3>
##$SSB= 0
##$STSI= 0
##$STSR= 0
##$SW_p= 3612.71676300578
##$SYMM= 0
##$S_DEV= 0
##$TDeff= 0
##$TDoff= 0
##$TI= <>
##$TILT= no
##$TM1= 0
##$TM2= 0
##$TOPLEV= 0
##$USERP1= <user>
##$USERP2= <user>
##$USERP3= <user>
##$USERP4= <user>
##$USERP5= <user>
##$WDW= 1
##$XDIM= 8192
##$YMAX_p= 0
##$YMIN_p= 0
$$ End of Bruker specific parameters
$$ ---------------------------------
##NTUPLES= NMR FID
##VAR_NAME=  TIME,          FID/REAL,        FID/IMAG
##SYMBOL=    X,             R,               I
##VAR_TYPE=  INDEPENDENT,   DEPENDENT,       DEPENDENT
##VAR_FORM=  AFFN,          ASDF,            ASDF
##VAR_DIM=   8192,          8192,            8192
##UNITS=     SECONDS,       ARBITRARY UNITS, ARBITRARY UNITS
##FACTOR=    0.0002004,     1,               1
##FIRST=     0,             0,               0
##LAST=      1.6414764,     0,               0
##MIN=       0,             -76208,          0
##MAX=       1.6414764,     116106,          0
$$ Real data points
##PAGE= N=1
##DATA TABLE= (X++(R..R)), XYDATA
$$ [...]
$$ plain form
2211 15 295 49 -281 466 552 -569 -767 103 748 126 -189 -230 77 -643 -521 -17 352 218 -342 -437 -467
2232 -467 -32 -214 -667 -499 -517 -249 -419 -806 -41 -275 -540 -1133 -269 322 -461 -707 -192 -129 -169 -1080 -120
2253 -120 744 -289 -842 -619 -99 -80 -852 -313 785 139 -1205 -782 260 698 -492 -339 690 321
2271 321 -931 -1281 524 1006 -271 -832 129 1081 -402 -752 751 1090 -170 -981 431 1377 216
2288 216 -976 397 1041 19 -520 394 1532 510 -829 -180 1096 890 -463 576 1436 453 -968
2305 -968 -292 1343 940 -307 -343 662 494 -407 -544 803 954 -466 -870 405 827 -56 -476 577
2323 577 841 -34 -724 484 816 286 -478 -209 1071 162 -260 364 539 422 -612 -168 584 666 -216
2342 -216 -351 283 411 -494 -512 408 289 -167 -968 -489 598 -83 -681 -139 425 -461 -800 -280 61 101
$$ packed form
2211A5K80k46l30P47Q6j121j98Q70O45o22l15m1L07p20J22N04L69j34n60r5l0
2232d67M35j82m53J68j8K68j70l87P65k34k65n93Q64N91p83k46N15O3m0r11R60
2253a20Q64j033n53K23N20J9p72N39J098o46j344M23J042M38j190J53J029l69
2271C21j252l50J805M82j277n61R61R52j483l50J503L39j260q11J412R46j161
2288B16j192J373O44j022n39R14J138j022j339O49J276k06j353J039Q60r83j421
2305i68O76J635m03j247l6J005j68r01j37J347J51j420m04J275M22q83m20J053
2323E77K64q75o90J208L32n30p64K69J280r09m22O24J75j17j034M44P52Q2q82
2342b16j35O34J28r05j8R20j19m56q01M79J087o81n98N42N64q86l39N20L41M0
$$ plain form
2362 101 -793 -664 249 -63 -708 -813 -158 232 -668 -993 -147 427 -168 -504 -247 189 -652 -1115 -287 633
2382 633 -540 -694 -267 551 188 -858 -504 286 415 -655 -319 603 232 -592 -715 -8 463 -319 -717
2401 -717 645 703 -199 -851 148 896 -121 -462 252 889 288 -566 -68 1173 -6 -834 -25 1014 195
2420 195 -409 63 1001 240 -729 -376 802 705 -540 41 902 710 -149 -235 662 773 -96 -586 398 926
2440 926 -309 -385 594 848 57 -326 360 943 365 -432 -46 793 308 -534 -34 901 489 -247 -315 588
2460 588 719 -86 -299 496 560 -383 -578 602 772 -579 -492 121 729 -450 -603 320 507 -48 -770 -86
2480 -86 652 -38 -1068 -259 340 -3 -906 -802 270 182 -682 -692 -12 418 -485 -685 -348 395 -534 -750
2500 -750 -162 154 -390 -753 -65 473 -488 -840 -263 148 -163 -721 -337 252 75 -662 -340 553 195 -621
$$ packed form
2362A01q94J29R13l12o45j05O55L90r00l25Q46N74n95l36K57M36q41m63Q28R20
2382F33j173j54M27Q18l63j046L54P90J29j070L36R22l71q24j23P07M71p82l98
2401g17J362N8r02o52R99P48j017l41P14O37o01q54M98J241j179q28Q09J039q19
2420A95o04M72R38p61r69L53J178r7j245N81Q61j92q59q6Q97J11q69m90R84N28
2440I26j235p6R79K54p91l83O86N83n78p97L86Q39m85q42N00R35m12p36o8R03
2460E88J31q05k13P95O4r43j95J180J70j351Q7O13O08j179j53R23J87n55p22O84
2480h6P38o90j030Q09N99l43r03J04J072q8q64j0O80M30r03k00L37P43r29k16
2500g50N88L16n44l63O88N38r61l52N77M11l11n58L84N89j77p37L22Q93l58q16
$$ plain form
2520 -621 -755 295 207 -579 -393 211 596 -225 -345 -22 523 -42 -470 173 926 -7 -734 68 510 -130
2540 -130 -694 -190 573 112 -441 -146 782 529 -224 -79 517 690 -420 -184 262 537 -224 -568 480
2559 480 601 126 -509 79 784 190 -562 59 527 388 -189 480 969 443 -209 -33 1129 732 -467
2578 -467 -75 920 466 -239 -32 399 549 -305 -195 366 768 -291 -394 289 769 -16 -673 239 669 31
2598 31 -620 -146 432 -181 -1041 -315 314 97 -747 -232 342 -112 -777 -499 457 289 -577 -567 256 96 -280
2619 -280 -664 51 559 -179 -634 141 338 -510 -606 256 468 -85 -556 -137 97 -194 -857 -183 358 -82
2639 -82 -697 -592 226 -222 -547 -464 259 204 -409 -643 15 240 -449 -425 -129 435 -118 -665 37 385 -50
2660 -50 -235 -15 374 101 -434 -113 654 214 -216 -52 43 233 -519 -314 405 634 -222 -83 281 707 130
$$ packed form
2520f21j34J050q8p86J86O04L85q21j20L23N45n65m28O43P53r33p27Q02M42o40
2540a30n64N04P63m61n53K95R28k53p53J45N96J73j110K36M46K75p61l44J048
2559D80J21m75o35N88P05n94p52O21M68j39n77O69M89n26o52J76J162l97j199
2578d67L92R95m54p05K07M31J50q54J10N61M02j059j03O83M80p85o57R12M30o38
2598C1o51M74N78o13q60P26O29k17q44N15N74m54o65K78R56j68q66J0Q23j60l76
2619b80l84P15N08p38m55P75J97q48r6Q62K12n53m71M19K34k91o63O74N41m40
2639h2o15J05Q18m48l25Q3P23n5o13k34O58K25o89K4K96N64n53n47P02L48m35
2660e0j85K20L89k73n35L21P67m40m30J64R5J90p52K05P19K29q56J39L64M26n77
$$ plain form
2681 130 -473 442 586 33 -240 287 694 91 -356 -58 893 392 -528 87 773 500 -520 -211 813
2700 813 676 -395 -105 605 988 -89 -448 426 691 -51 -461 305 825 66 -597 209 593 49 -438
2719 -438 192 882 21 -581 9 1003 277 -698 -357 495 151 -492 -565 670 277 -594 -550 427 283 -535
2739 -535 -581 131 184 -586 -563 189 281 -327 -728 -261 207 -454 -662 -11 362 -274 -546 -405 168 -209 -558
2760 -558 -556 11 -94 -400 -460 200 192 -382 -321 171 99 -371 -376 85 103 -383 -503 -430 359 -29 -662 -235 135 232
2784 232 -241 14 395 9 -662 -216 223 338 -296 -411 388 89 -242 -599 631 505 213 -307 -89 248
2804 248 -460 -438 225 971 -164 -680 79 748 397 -212 96 796 368 -416 -190 636 579 -628 -323 781
2824 781 694 -244 -243 445 648 -225 -559 1052 1289 -204 -760 197 174 99 -425 621 900 -287 -804 -39
$$ packed form
2681A30o03R15J44n53k73N27M07o03m47K98R51n01r20O15O86k73j020L09J024
2700H13j37j071K90P10L83j077l59Q74K65p42m10P66N20p59o63Q06L84n44m87
2719d38O30O90q61o02N90R94p26r75L41Q52l44o43p3J235l93q71M4R77j44q18
2739e35m6P12N3p70K3P52R2o08m01M67M68o61k08O51L73o36k72J41N73l77l49
2760e58KN67j05l06o0O60qn74O1M92p2m70nM61J8m86j20P3P89l88o33M27L70R7
2784B32m73K55L81l86o71M46M39J15o34j15P99k99l31l57J230j26k92n20K18L37
2804B48p08K2O63P46j135n16P59O69l51o09L08P00m28p84K26Q26n7j207L05J104
2824G81q7r38JO88K03q73l34J611K37j493n56R57k3p5n24J046K79j187n17P65
$$ plain form
2844 -39 952 140 -437 610 554 -241 -518 62 674 401 -623 -166 555 203 -522 -136 932 306 -683 -698
2864 -698 459 452 -239 -350 222 183 -226 -253 312 387 -557 -673 -33 238 -301 -384 95 330 -656 -709 -87 75
2886 75 -204 -930 -132 60 -416 -571 -181 227 -384 -471 -481 -250 175 -187 -88 -279 -4 -196 -238 130 153 -50
2908 -50 -583 -195 -115 -45 66 -361 -4 -190 13 -146 -33 -27 -132 -230 -309 80 67 10 -18 431 123 -224 19
2931 19 577 493 -104 -152 389 -48 -190 -197 403 629 -99 -666 127 618 -191 28 680 524 -198 -723 6 814
2953 814 237 -167 -18 544 -119 -515 215 786 379 -381 -132 306 178 -634 -195 445 201 -536 16 944
2973 944 123 -318 -393 326 359 -342 -367 556 483 -568 -366 383 626 -364 -359 148 516 -196 -758 419 732
2994 732 52 -525 -184 328 -291 -683 41 530 -279 -803 -10 732 -151 -475 -89 368 -302 -743 -217 293
$$ packed form
2844c9R91q12n77J047n6p95k77N80O12k73j024M57P21l52p25L86J068o26r89j5
2864f98J157po91j11N72l9m09k7N65P5r44j16O40K71n39q3M79K35r86n3O22J62
2886G5k79p26P98J92m76j55L90M08o11q7j0K31M25l62R9j91K75j92m2L68K3k03
2908e0n33L88Q0P0J11m27L57j86K03j59J13Oj05r8p9L89j3n7k8M49l08l47K43
2931A9N58q4n97m8N41m37j42pO00K26p28n67P93M91q09K19O52j56p22n25P29Q08
2953H14n77m04J49N62o63l96P30N71m07p60K49M38j28q12M39O40k44p37N52R28
2973I44q21m41p5P19L3p01k5R23p3j051K02P49K43r90NN07L68p12n62J177L13
2994G32o80n77L41N12o19l92P24M89q09n24P93P42q83l24L86M57o70m41N26N10
$$ plain form
3014 293 181 -365 -446 464 274 -424 -276 220 52 -344 -667 219 400 -400 -303 -171 261 -483 -618 231 68
3035 68 -340 -593 -226 241 -135 -324 -256 274 -146 -564 -138 269 311 -452 -384 -1 86 126 23 149 456 7
3057 7 -99 44 384 237 -337 34 62 180 105 41 -13 -58 18 -247 -92 415 122 -243 -55 350 89 54 363
3080 363 559 146 -416 237 300 354 -163 43 526 24 -492 -6 334 141 -291 183 552 278 -409 26 273
3101 273 319 -282 -178 421 485 206 -187 427 270 -192 -450 139 481 62 -470 -119 646 139 -482 196 433
3122 433 -146 -473 -58 251 -52 -446 -407 -27 113 -316 41 106 248 -684 -435 -28 247 -218 -637 311 331
3143 331 -423 -450 59 494 -385 -396 -49 340 -249 -439 127 403 37 -604 130 271 151 -526 -440 261 40
3164 40 -157 -282 256 424 -173 -226 68 336 -220 -606 385 253 -343 -317 114 190 -98 -158 23 413 286 -359
$$ packed form
3014B93j12n46q1R10j90o98J48M96j68l96l23Q86J81q00R7J32M32p44j35Q49j63
3035F8m08k53L67M67l76j89O8N30m20m18M26M07M2p63O8L83Q7M0j03J26L07m49
3057Gj06J43L40j47n74L71K8J18p5o4n4m5P6k65J55N07k93l65J88M05k61l5L09
3080C63J96m13n62O53O3N4n17K06M83n02n16M86L40j93m32M74L69k74o87M35K47
3101B73M6o01J04N99O4k79l93O14j57m62k58N89L42m19n32L51P65n07o21O78K37
3122D33n79l27M15L09l03l94L9L80J40m29L57O5J42r32K49M07K75m65m19R48K0
3143C31p54k7N09M35q79j1L47L89n89j90N66K76l66o41P34J41j20o77Q6P01k21
3164D0j97j25N38J68n97n3K94K68n56l86R91j32n96K6M31P6k88o0J81L90j27o45
$$ plain form
3186 -359 -76 95 196 -290 163 517 596 -55 -441 305 97 -96 -47 319 427 -157 -216 253 642 196 -211
3207 -211 391 257 -169 -292 -17 470 33 -371 -5 402 254 112 -46 593 138 -16 -273 423 159 -183
3227 -183 -300 462 360 0 32 212 328 -276 37 24 592 124 -269 308 147 94 -276 213 236 -16 -92 -215
3249 -215 304 -295 -371 -249 229 -151 -517 -473 87 266 -433 -289 -100 228 -259 -639 220 120 -237 -507 -34
3270 -34 57 -107 -595 -23 217 135 -407 87 100 -121 -210 -245 46 -36 -258 -284 95 1 -119 -66 43 -56 -249 -375
3294 -375 184 77 -372 -374 191 9 -78 -289 -294 101 -274 -434 -128 178 49 -113 -165 196 128 -132 55 291
3316 291 325 -150 117 169 126 -130 -315 -39 267 238 -127 62 549 -27 -86 -214 493 100 -162 33 212 295
3338 295 147 -106 288 358 -235 53 266 266 25 -106 243 240 66 -292 413 214 -121 35 -31 319 -19 -239
$$ packed form
3186c59K83J71J01m86M53L54P9o51l86P46k08j93M9L66J08n84n9M69L89m46m07
3207b11O02j34m26j23K75M87m37m04L66M07j48j42j58O39m55j54k57O96k64l42
3227a83j17P62j02l60L2J80J16o04L13j3N68m68l93N77j61n3l70M89K3k52p6j23
3249b15N19n99p6J22M78l80l66M4N60J79o99J44J89L28m87l80Q59j00l57k70M73
3270c4R1j64m88N72K40q2n42M94J3k21q9l5K91q2k22k6L79r4j20N3J09r9j93j26
3294c75N59j07m49kN65j82q7k11nL95l75j60L06L06j29j62n2L61o8k60J87K36
3316B91L4m75K67N2m3k56j85K76L06k9l65J89M87n76n9j28P07l93k62J95J79Q3
3338B95j48k53L94P0n93K88K13%k41j31L49lj74l58P05j99l35J56o6L50l38k20
$$ plain form
3360 -239 226 407 144 -376 68 111 153 -517 79 38 353 -85 -417 192 118 -226 -296 117 246 -193 -289 189
3382 189 289 -165 -354 396 305 -33 -651 -69 279 -461 -319 10 318 -29 -504 -25 157 16 -305 12
3402 12 194 -74 -285 -396 255 -144 28 -251 106 150 -100 -290 222 451 -509 -200 197 301 -337 -451 28
3423 28 16 -189 -331 -236 291 -142 -109 58 105 85 -604 6 133 170 -338 -6 366 121 -112 -210 31 -62 -198
3446 -198 -239 10 201 -479 -24 417 68 -21 171 132 215 113 -75 83 69 -81 -261 56 113 285 -348 119
3468 119 567 168 267 -81 261 440 -274 -397 221 435 379 -102 249 326 -196 228 85 334 215 -205 104
3489 104 283 -151 157 110 316 179 -200 -190 421 -185 -256 -152 101 8 -314 -37 60 380 -173 -90 -18 182
3511 182 190 -431 179 227 -99 -153 -129 256 41 -357 -25 123 -178 28 82 468 92 -210 -418 -105 36 -217
$$ packed form
3360b39M65J81k63n20M44M3M2o70N96m1L15m38l32O09p4l44p0M13J29m39r6M78
3382A89J00m54j89P50r1l38o18N82L48p40J42L29L08l47m75M79J82j41l21L17
3402A2J82k68k11j11O51l99J72k79L57M4k50j90N12K29r60L09L97J04o38j14M79
3423B8j2k05j42R5N27m33L3J67M7k0o89O10J27L7n08L32L72k45k33r8K41r3j36
3446a98m1K49J91o80M55M41l49q9J92l9Q3j02j88J58j4j50j80L17N7J72o33M67
3468A19M48l99R9l48L42J79p14j23O18K14n6m81L51P7n22M24j43K49j19m20L09
3489A04J79m34L08m7K06j37l79J0O11o06p1J04K53r3l22K77R7L20n53Q3P2K00
3511A82Qo21O10M8l26n4K4L85k15l98L32J48l01K06N4L86l76l02k08L13J41k53
$$ plain form
3533 -217 -236 138 122 -381 -390 278 169 -232 -381 -169 44 -214 -273 -115 211 -316 -691 -154 253 209 -130 -276
3555 -276 361 -71 -532 -251 446 23 -476 -107 556 -132 -156 -179 315 221 -210 -286 547 239 -91 -449 214
3576 214 457 -144 -11 653 150 -315 -210 175 -55 -50 -65 -84 357 -501 196 196 210 150 -277 -119 260 425 -220
3599 -220 225 225 -70 45 128 203 136 179 -71 183 -31 -112 164 -90 405 69 -405 -86 355 655 161 79 11
3622 11 115 -16 -56 -60 366 238 -399 258 172 146 22 96 173 -34 -205 -24 118 -182 -144 -294 92 80 -313
3645 -313 -228 228 25 -282 -191 161 174 -368 -172 -12 107 -327 -102 52 -20 -53 -343 -171 -4 67 -78 157
3667 157 113 -336 -477 -203 260 38 -403 23 31 -185 -185 -123 345 -118 -188 -465 75 240 -530 44 253 -203
3689 -203 39 -68 255 -17 -241 -174 175 74 -264 -408 224 298 -48 -299 43 196 -4 -205 254 -33 -215
$$ packed form
3533b17j9L74j6n03rO68j09m01j49K12K13k58n9J58L26n27l75N37M07m4l39j46
3555b76O37m32m61K81O97m23m99L69O63o88k4k3M94r4m31p6Q33l08l30l58O63
3576B14K43o01J33O64n03m65J05L85k30Nj5j9M41q58O97%J4o0m27J58L79J65o45
3599b20M45%k95J15Q3P5o7M3k50K54k14q1K76k54M95l36m74L19M41L00m94q2o8
3622A1J04j31m0mM26j28o37O57q6k6j24P4P7k07j71J81J42l00L8j50L86j2l93
3645c13Q5M56k03l07R1L52J3n42J96J60J19m34K25J54p2l3k90J72J67P1j45K35
3667A57m4m49j41K74M63k22m41M26Qk16%O2M68m63p0k77N40J65p70N74K09m56
3689b03K42j07L23k72k24O7L49j01l38j44O32P4l46k51L42J53k00k01M59k87j82
$$ plain form
3710 -215 71 -22 198 -282 -130 143 63 219 -310 -49 413 187 -89 -32 -22 334 -231 135 290 124 -20
3731 -20 -36 551 205 407 -34 -59 72 -36 -187 273 148 145 -303 -14 -46 224 18 -110 488 57 76 48 245
3754 245 31 -162 -71 -417 154 110 98 76 117 155 -275 -244 202 84 9 7 -142 -24 -138 62 197 86 -227
3777 -227 -16 -194 557 -32 -358 -73 0 -72 -86 225 200 -274 -231 241 106 -126 -86 -103 230 -255 21 -150
3799 -150 108 140 -317 -112 57 296 -146 -128 -42 221 -166 -273 265 469 -219 -248 12 296 -127 -247 45
3820 45 -100 -111 -285 30 168 -5 -126 130 146 60 -81 207 232 -118 -432 265 369 206 -61 54 125 257
3842 257 -21 -180 389 175 348 -24 295 170 -11 -134 241 134 -2 -169 123 103 183 82 -2 303 -139
3863 -139 -472 -230 216 -139 -69 -16 23 -6 -449 -315 339 413 -309 -96 -54 97 -156 103 113 337 74 -131
$$ packed form
3710b15K86r3K20m80J52K73q0J56n29K61M62k26k76N7J0L56n65L66J55j66j44
3731b0j6N87l46K02m41k5J31j08j51M60j25lm48K89l2K70k06j28N98m31J9k8J97
3754B45k14j93R1l46N71m4j2k2M1L8m30L1M46j18p5kj49J18j14K00J35j11l13
3777b27K11j78P51n89l26K85P3p2j4L11k5m74M3M72j35k32M0j7L33m85K76j71
3799a50K58L2m57K05J69K39m42J8Q6K63l87j07N38K04o88k9K60K84m23j20K92
3820D5j45j1j74L15J38j73j21K56J6q6j41K88K5l50l14O97J04j63k67J15P1J32
3842B57k78j59N69k14J73l72L19j25j81j23L75j07j36j67K92k0Q0j01q4L05m42
3863a39l33K42M46l55P0N3L9k9m43J34O54P4p22K13M2J51k53K59J0K24k63k05
$$ plain form
3885 -131 441 71 -20 -125 -90 360 32 35 -298 48 189 -130 216 36 -5 57 179 -105 216 -148 -335 190
3907 190 137 285 -267 13 194 -137 -148 166 -14 -44 -23 -46 35 38 -26 117 213 -117 -68 99 -2 -202 83 -245
3931 -245 82 -14 161 -84 96 338 -188 -123 -64 -56 -26 -209 138 273 -294 -243 -67 199 -399 -274 63 292
3953 292 12 -78 -76 41 -77 -433 -17 328 355 -105 12 9 109 -309 -172 315 24 -266 -142 97 250 86
3975 86 -45 55 61 34 -51 21 433 -95 20 -89 -54 137 -273 73 294 315 290 -210 262 301 -255 -137 39
3998 39 -48 47 -41 232 220 47 -127 -151 -107 -2 36 33 228 62 -31 46 -124 193 -284 412 147 156 -315 -75 320
4023 320 -119 -129 -231 84 -43 190 -72 335 156 -202 -157 65 18 32 -284 111 173 -114 -411 -230 -140 -91
4045 -91 69 227 83 23 97 -160 100 -323 -127 -193 39 -20 -24 -171 -12 263 -218 -8 39 -31 -365 -62 16
$$ packed form
3885a31N72l70r1j05L5M50l28Ll33L46J41l19L46j80m1O2J22k84L21l64j87N25
3907A90n3J48n52K80J81l31j1L14j80l0K1k3Q1Lo4J43R6l30M9J67j01k00K85l28
3931b45L27r6J75k45J80K42n26O5N9QL0j83L47J35n67N1J76K66n98J25L37K29
3953B92k80r0KJ17j18l56M16L45K7m60J17lJ00m18J37M87k91k90J24K39J53j64
3975H6j31J00Ok7q5P2M12n28J15j09L5J91m10L46K21K1k5n00M72L9n56J18J76
3998C9q7R5q8K73j2j73j74k4M4J05L8lJ95j66r3P7j70L17m77O96k65Rm71K40L95
4023C20m39j0j02L15j27K33k62M07j79l58M5K22m7J4l16L95O2k87k97J81R0M9
4045i1J60J58j44o0P4k57K60m23J96o6K32n9mj47J59K75m81K10M7p0l34L03P8
$$ plain form
4068 16 215 -72 -178 91 211 -160 -507 -63 -110 257 73 -12 31 -8 -81 221 -189 107 -259 23 20 -75 -227
4091 -227 -146 174 59 -126 90 68 365 151 -81 452 -149 -116 -459 148 266 87 -102 38 192 -249 -178
4112 -178 -204 106 81 -196 184 -153 232 369 -141 332 25 -36 -226 33 4 -276 -8 413 -163 -50 131
4133 131 361 167 -41 -71 257 -18 38 30 -200 327 57 -123 12 66 -155 -107 -148 348 160 110 -107 -33 -103
4156 -103 -174 -43 451 -43 -141 -74 178 72 102 74 -198 -155 -206 -122 197 111 149 -182 -191 -22 114 60 207 119 -68
4181 -68 118 -50 282 290 205 -6 -10 59 -234 -57 75 -7 45 -315 -119 95 -202 -12 79 315 224 -402 -183 328
4205 328 -176 59 -342 -149 325 -321 -5 -47 103 63 -417 -103 251 13 208 -234 140 -319 -372 80 371
4226 371 250 -260 -21 442 112 -364 44 -18 31 102 6 187 160 -23 -193 265 287 28 114 187 -24 -377 -88
$$ packed form
4068A6J99k87j06K69J20l71l47M44m7L67j84q5M3l9p3L02m10K96l66K82lr5j52
4091b27Q1L20j15j85K16k2K97k14k32N33o01L3l43O07J18j79j89J40J54m41P1
4112a78k6L10k5k77L80l37L85J37n10M73l07o1j90K59k9k80K68M21n76J13J81
4133A31K30j94k08l0L28k75N6qk30N27k70j80J35N4k21M8m1M96j88n0k17P4p0
4156a03p1J31M94m94r8O7K52j06L0k8k72M3n1Q4L19q6L8l31rJ69J36n4J47q8j87
4181f8J86j68L32Qq5k11mO9k93J77J32q2N2l60J96K14k97J90R1K36r1o26K19N11
4205C28n04K35m01J93M74o46L16m2J50m0m80L14L54k38J95m42L74m59n3M52K91
4226C71j21n10K39M63l30m76M08o2M9P1r6J81k7j83j70M58K2k59Q6P3k11l53K89
$$ plain form
4249 -88 221 238 -5 -182 -60 149 -69 -31 101 88 15 -145 -166 144 62 -63 92 194 -71 155 188 641 141
4272 141 -355 -129 275 -280 -64 -150 -38 -125 -129 -55 231 -7 -84 -145 146 -83 -7 -411 129 335 -143 -131 -184
4295 -184 288 -88 317 -156 161 -49 -22 103 178 -124 316 87 -42 -23 -104 -86 44 206 -275 70 91 -51
4317 -51 173 4 -58 -279 -45 -320 243 17 131 124 -361 85 -219 132 -12 -17 -41 -208 -212 -30 -6 -160 -152 96
4341 96 0 -64 -80 258 354 -178 -214 191 61 44 236 8 285 217 -42 -155 244 120 31 -54 -148 -11 206 -222
4365 -222 236 174 59 -158 82 191 93 -192 -262 203 90 -137 -112 200 105 -123 155 -110 40 -31 63 97 -92
4388 -92 -231 -68 106 356 -112 -138 498 82 51 -74 119 178 400 139 305 275 121 -217 187 209 105 -155
4410 -155 -110 -50 -2 13 -83 -200 102 240 195 133 49 -80 -121 -43 6 29 -111 55 -51 -61 159 85 48 88 -65
$$ packed form
4249h8L09J7k43j77J22K09k18L8J32j3p3j60k1L10q2j25J55J02k65K26L3M53n00
4272A41m96K26M04n55K16q6J12q7mP4K86k38p7o1K91k29P6m04N40K06m78J2n3
4295a84M72l76M05m73L17k10K7J25P5l02M40k29j29J9q1J8J30J62m81L45K1j42
4317e1K24j69o2k21K34k75N63k26J14pm85M46l04L51j44nk4j67mJ82K4j54QK48
4341I6r6o4j6L38R6n32l6M05j30j7J92k28K77o8k59j13L99j24q9q5r4J37K17m28
4365b22M58o2j15k17K40J09r8k85p0M65j13k27K5L12r5k28K78k65J50p1R4L4j89
4388i2j39J63J74K50m68k6O36m16l1j25J93N9K22k61J66l0j54l38M04K2j04k60
4410a55M5O0M8J5r6j17L02J38m5o2q4j29m1P8M9K3j40J66j06j0K20p4l7M0j53
$$ plain form
4435 -65 148 257 130 -77 64 -16 31 -318 23 -84 108 -316 40 -168 -159 116 193 23 20 12 -170 -104 -270 -157
4459 -157 127 -203 -29 -92 9 -38 -79 233 96 -112 20 220 -280 -66 37 -94 -175 135 322 -94 -41 -106
4481 -106 -180 108 18 -157 158 228 -156 -151 160 118 -22 -251 -24 175 -485 -307 -7 166 -80 -202 23 -20
4503 -20 -8 -274 212 182 219 60 -117 167 261 86 229 75 131 100 23 44 43 381 21 69 293 -1 -103 210
4527 210 353 -341 -50 -212 82 79 -49 189 252 75 74 11 32 -163 -22 326 42 222 189 74 -56 -128 29
4550 29 -67 -120 -152 -145 -95 217 -317 -175 143 -3 -103 266 98 35 306 3 -213 43 -85 107 -44 -115 60
4573 60 86 -199 -147 178 31 -44 -103 -84 153 25 -212 -157 -47 -165 183 -143 -283 62 -101 -33 -122 17 319
4596 319 194 -252 144 18 40 104 175 77 -423 -339 -205 49 6 184 300 -34 -98 -148 129 -17 31 -51 60
$$ packed form
4435f5K13J09j27k07J41q0M7l49L41j07J92m24L56k08RK75P7j70lqj82O6j66J13
4459a57K84l30J74o3J01m7m1L12j37k08J32K00n00K14J03j31q1L10J87m16N3o5
4481a06p4K88r0j75L15P0l84NL11m2j40k29K27J99o60J78L00J73k46j22K25m3
4503b0J2k66M86l0L7j59j77K84R4j75J43j54N6l1p7K1jL38l60M8K24k94j02L13
4527B10J43o94K91j62K94lj28K38O3j77jo3K1j95J41L48k84J80l3j15j30p2J57
4550B9r6n3l2PN0L12n34J42L18j46j00L69j68o3K71l03k16K56j28J92j51p1J75
4573F0K6k85N2L25j47p5n9J9K37j28k37N5J10j18L48l26j40L45j63O8q9J39L02
4596C19j25m46L96j26K2O4P1r8n00Q4J34K54m3J78J16l34o4n0K77j46M8q2J11
$$ plain form
4619 60 -296 -278 269 -85 -246 -77 -99 172 30 -90 111 -67 -32 -302 74 253 52 21 -235 137 -273 -183
4641 -183 -96 342 123 -104 51 137 -146 -84 -51 -71 13 85 -68 -398 190 -24 -116 266 262 -172 -109 67 169 166
4665 166 147 -19 130 168 92 -80 205 -64 -26 49 109 203 -74 -21 90 181 100 40 205 247 -226 -65 -34 -106 99
4690 99 75 -176 -157 -298 -297 -167 26 -214 -15 -134 78 181 -125 -109 -282 -338 64 -39 59 242 182 -129 -280
4713 -280 274 -59 182 1 -214 -216 56 178 17 -255 -223 -43 117 95 -149 -106 246 35 -161 26 285 -127
4735 -127 -146 -207 103 233 201 -17 77 -97 -89 -138 -167 -20 -136 -24 -75 80 -491 -237 149 17 -178 -26 -198
4758 -198 214 -117 68 100 -66 266 -12 -117 107 -19 -76 95 7 494 -161 -382 35 137 -86 -155 151
4779 151 75 -92 1 153 -199 434 -197 -90 80 6 -84 -37 1 81 -153 -14 7 328 -338 -98 131 -31 -125
$$ packed form
4619F0l56J8N47l54j61J69k2K71j42j20K01j78L5k70L76J79k01l1k56L72m10R0
4641a83Q7M38k19k27J55Q6k83O2L3k0Q4P2j53l30N88k14r2L82mm34O3J76J02l
4665A66j9j66J49L8p6j72K85k69L8P5O0R4k77N3J11R1q1o0J65M2m73J61L1p2K05
4690I9k4k51J9j41JJ30J93k40J99j19K12J03l06J6j73n6M02j03R8J83o0l11j51
4713b80N54l33K41j81k15kK72J22j61k72L2J80J60k2k44M3L52k11j96J87K59m12
4735a27j9o1L10J30l2k18R4j74Qm9k9J47j16J12n1J55n71K54L86j32j95J52j72
4758a98M12l31J85L2j66L32k78j05K24j26n7J71q8M87o55k21M17J02k23o9L06
4779A51p6j67R3J52l52O33o31J07J70p4r0M7L8Q0k34J39K1L21o66K40K29j62r4
$$ plain form
4802 -125 126 119 401 309 114 -11 -75 -23 -108 205 -123 -78 145 -63 -78 273 -71 289 173 -224 -132 -82 265
4825 265 -46 -301 -211 133 -187 236 -81 141 81 -182 -180 222 208 -33 191 -203 -57 -135 -215 337 21 -48 -78
4848 -78 169 -38 39 -134 73 164 -152 -35 191 166 83 -147 175 137 68 -7 -119 109 164 -33 -190 23 168
4871 168 -271 54 -78 -86 -178 125 145 -86 -151 -258 -98 -3 -33 219 164 225 17 -103 -205 84 110 10 -71 151
4895 151 297 277 -45 -261 -55 8 -71 222 283 62 -56 -291 -9 -210 -507 -7 172 76 -111 10 -57 228
4917 228 261 -316 -222 -30 -139 17 12 -210 29 -285 114 -65 -78 280 -19 76 -73 78 275 91 -155 -88
4939 -88 215 112 -29 -50 170 168 -143 -176 -303 14 212 24 60 153 -161 -207 80 51 -257 -41 -42 -58 238 -75
4963 -75 -240 -62 301 65 -200 212 234 62 -12 -27 -220 25 158 -37 11 -151 -151 49 -85 -43 -194 -18 207
$$ packed form
4802a25K51pK82r2j95j25o4N2q5L13l28M5K23k08j5L51l44L60j16l97R2N0L47
4825B65l11k55R0L44l20M23l17K22o0k63KM02j4k41K24l94J46p8q0N52l16o9l0
4848g8K47k07P7j73K07R1l16J17K26k5q3k30L22l8o9p5j12K28N5j97j57K13J45
4871A68m39L25j32qr2L03K0k31o5j07J60R5l0K52n5O1k08j20j02K89K6j00q1K22
4895A51J46k0l22k16K06O3p9K93O1k21j18k35K82k01k97N00J79r6j87J21o7K85
4917B28L3n77R4J92j09J56nk22K39l14L99j79j3L58k99R5j49J51J97j84k46O7
4939h8L03j03j41k1K20kl11l3j27L17J98j88L6R3l14m6K87k9l08K16jj6K96l13
4963g5j65J78L63k36k65M12K2j72p4j5j93K45J33j95M8j62%K00j34M2j51J76K25
$$ plain form
4986 207 -60 -34 -88 -49 151 -104 57 -3 0 -88 -172 -74 126 -83 160 -4 17 -276 5 -215 -190 -243 111 -23
5010 -23 -47 287 -26 9 50 -331 112 26 -158 -99 -67 -22 -73 -75 -118 158 -132 -26 -151 -55 -24 -529 33 311 -167
5035 -167 -35 107 216 -108 -329 367 128 -18 232 92 73 -24 -199 -152 127 -17 349 87 -15 -191 50
5056 50 109 216 -3 156 169 -201 -278 -112 1 105 -179 89 113 18 -74 -381 213 -48 133 -81 -220 -95
5078 -95 62 -142 85 -22 167 -130 -29 57 -153 -63 -290 85 19 -231 6 -356 -363 8 199 -142 287 -100
5100 -100 278 -36 -202 -98 -52 -23 141 -68 -137 124 173 -56 74 -75 -44 146 -182 -233 235 -164 -131 73
5122 73 320 18 261 -40 -120 381 -146 -56 -88 -154 148 126 9 126 107 -127 67 215 -23 130 -140 -52 184
5145 184 -76 -122 -200 -24 49 -167 331 145 -137 -307 222 -54 70 109 -158 96 -140 -138 102 178 -239 29
$$ packed form
4986B07k67K6n4L9K00k55J61o0Lq8q4R8K00k09K43j64K1k93K81k20K5n3L54j34
5010b3k4L34l13L5M1l81M43q6j84N9L2M5n1km3K76k90J06j25R6L1n05N62K78m78
5035a67J32J42J09l24k21O96k39j46K50j40j9r7j75M7K79j44L66k62j02j76K41
5056E0N9J07k19J59J3l70p7J66J13J04k84K68K4r5r2l07N94k61J81k14j39J25
5078i5J57k04K27j07J89k97J01Q6k10R0k27L75o6k50K37l62pL71J91l41M29l87
5100a00L78l14j66J04M6K9J64k09o9K61M9k29J30j49L1J90l28n1M68l99L3K04
5122G3K47l02K43l01q0N01n27R0l2o6L02k2j17J17j9k34J94J48k38J53k70Q8K36
5145A84k60m6p8J76P3k16M98j86k82j70N29k76J24L9k67K54k36KK40P6m17K68
$$ plain form
5167 29 9 -105 -132 85 -76 264 -165 287 73 91 -192 -80 -69 -65 246 -189 -110 30 179 24 63 -37 -41 176
5191 176 -176 79 213 -86 -160 -27 226 -210 -154 -84 136 35 -326 133 -91 -48 90 64 -118 42 -189 -171
5213 -171 97 -9 -148 107 246 42 26 144 56 34 -58 318 125 164 150 181 63 -21 -149 112 -308 -119 19
5236 19 28 310 152 -123 -384 -136 -100 133 -247 -124 177 74 -115 195 32 138 -248 223 13 16 -173 -396
5258 -396 85 -89 -67 194 51 -46 -259 -103 -302 4 -9 -96 -125 268 40 -38 67 31 -161 -110 -215 2 101
5281 101 -270 -138 -201 -153 116 204 36 160 99 -10 -436 -70 3 -12 -27 -299 -139 -244 -131 51 185 153 -252
5304 -252 -7 -290 90 -3 232 40 176 44 88 -223 138 32 150 168 25 178 9 -74 174 -163 203
5325 203 393 46 91 12 -152 -146 65 -7 -11 -330 -101 25 113 173 119 -115 263 -16 271 203 133 152 83 -412 -100
$$ packed form
5167B9k0j14k7K17j61L40m29M52k14J8k83J12J1ML11m35P9J40J49j55L9j00mK17
5191A76l52K55J34k99p4J33K53m36N6P0K20j01l61M59k24M3J38k6j82J60k31J8
5213a71K68j06j39K55J39k04j6J18q8k2r2L76j93L9j4L1j18q4j28K61m20J89J38
5236A9RK82j58k75k61K48L6K33l80J23L01j03j89L10j63J06l86M71k10Lj89k23
5258c96M81j74K2K61j43r7k13J56j99L06j3q7k9L93k28p8J05l6j92N1j05K17R9
5281A01l71J32o3M8K69Q8j68J24o1j09m26L66P3j5j5k72J60j05J13J82J34l2m05
5304b52K45k83L80r3K35j92J36j32M4l11L61j06J18J8j43J53j69q3K48l37L66
5325B03J90l47M5p9j64OK11p2ml19K29J26Q8O0n4k34L78k79K87o8p0J9o9m95L12
$$ plain form
5350 -100 -134 -104 38 -126 -105 -245 -105 284 -82 -236 -192 -199 87 -13 -2 -73 26 -141 -144 109 -151 25 -279 315
5374 315 -4 -97 166 67 146 -220 -214 283 69 -227 305 108 -142 19 -143 -262 -36 5 187 -248 316 -31
5396 -31 122 -94 -60 323 -221 -102 -122 144 -32 -407 19 177 -219 42 -101 158 -184 -42 -103 162 47
5417 47 -34 -111 51 130 63 293 -11 231 -368 147 -170 -71 -103 105 13 -16 48 -239 -25 -288 -274 -14 -45 255
5441 255 1 67 141 -89 -89 13 7 -147 52 -93 56 88 -163 -318 149 -231 130 -428 -12 -227 -165 174 20
5464 20 96 -72 -281 -16 -133 -146 121 -26 -178 225 245 -105 -60 71 68 -116 -390 -2 -93 196 -396 -23 175
5487 175 -172 -187 -199 -38 -40 79 -46 2 174 -147 -28 181 43 72 -124 202 47 18 48 129 -71 142 -11
5510 -11 -220 91 -120 51 46 34 -48 139 163 268 -238 -139 95 -5 208 -161 -142 79 1 251 -61 -96 -24 259
$$ packed form
5350a00l4L0J42j64K1j40J40L89l66j54M4pK86j00J1p1R9j67lK53k60J76l04N94
5374C15l19r3K63r9P9l66OM97k14k96N32j97k50J61j62j19K26M1J82m35N64l47
5396c1J53k16L4L83n44J19k0K66j76l75M26J58l96K61j43K59l42J42o1K65j15
5417D7q1p7J62P9o7K30l04K42n99N15l17R9l2K08r2k9O4k87K14k63J4K60l1L00
5441B55k54O6P4k30%J02oj54J99j45J49L2k51j55M67l80L61n58M16k15O2L39j54
5464B0P6j68k09K65j17j3K67j47j52M03K0l50M5J31lj84k74L88r1K89n92L73J98
5487A75l47j5j2J61kJ19j25M8J72l21J19K09j38K9j96L26j55k9L0Q1k00K13j53
5510a1k09L11k11J71nj2q2J87K4J05n06R9K34j00K13l69J9K21p8K50l12l5P2K83
$$ plain form
5534 259 -44 -85 54 73 225 43 164 148 -130 75 62 142 -89 -155 -34 -61 -25 -94 89 32 -78 -44 30 93
5558 93 -325 -104 46 66 -24 135 -84 -149 298 72 172 241 50 -2 198 -279 -105 -47 -151 -96 100 -62 50
5581 50 -79 76 97 205 -182 -103 48 -229 2 439 73 -168 -503 70 72 -53 -68 148 -51 -141 116 -85
5603 -85 227 183 41 2 192 -157 102 -52 -48 110 -94 -93 222 -220 95 -156 93 -3 -46 64 -257 153 -253
5626 -253 -88 -84 -105 -76 39 139 -44 -30 -118 24 213 -131 221 -36 -90 -11 -254 -447 -65 -60 -112 -107 -114 103 97 85
5652 85 -292 -59 111 -111 100 -41 -221 -354 196 -139 1 -329 -90 -71 112 29 -83 63 206 -77 338
5673 338 10 -201 -24 403 203 -60 139 55 82 103 156 -17 -216 -176 -120 83 221 81 89 -76 -33 -169 205
5696 205 38 47 150 -120 178 67 16 -77 69 -191 213 -177 -92 -14 11 81 106 92 -127 -160 -87 -82 36 81 -153
$$ packed form
5534B59l03m1J39J9J52j82J21j6k78K05j3Q0k31o6J21k7L6o9J83n7j10L4P4O3
5558I3m18K21J50K0r0J59k19o5M47k26J00O9j91n2K00m77J74N8j04N5J96j62J12
5581E0j29J55K1J08l87P9J51k77K31M37l66k41l35N73Kj25j5K16j99r0K57k01
5603h5L12m4j42l9J90l49K59j54MJ58k04JL15m42L15k51K49r6m3J10l21M10m06
5626b53J65Mk1K9J15J00j83J4q8J42J89l44L52k57n4P9k43j93L82Nn2NpK17oj2
5652H5l77K33J70k22K11j41j80j33N50l35J40l30K39J9J83q3j12J46J43k83M15
5673C38l28k11J77M27k00k63J99q4K7K1N3j73j99M0N6K03J38j40Qj65M3j36L74
5696B05j67RJ03k70K98j11n1r3J46k60M04l90Q5P8K5P0K5j4k19l3P3NJ18M5k34
$$ plain form
5721 -153 -4 96 233 -47 56 183 -122 49 166 112 110 -95 -206 63 194 -191 45 13 66 169 95 6
5743 6 -201 -2 -315 69 108 -168 -105 -189 268 -11 147 -100 53 166 13 -75 -104 -126 194 -121 -122 -85 359 -126
5767 -126 123 54 -171 -25 133 -316 -30 -134 -9 250 68 -2 251 -259 -279 -153 197 -151 -26 -8 -58 -77
5789 -77 -240 -279 111 188 257 129 -28 -23 55 -61 156 50 -246 94 -288 26 183 -56 3 173 -15 110 -116
5812 -116 -284 35 95 267 155 101 -185 69 158 322 -62 12 0 -105 -33 -265 -73 39 240 272 -129 -216 -271
5835 -271 89 31 123 -210 444 -197 -330 -148 51 -396 -21 40 -236 -210 196 136 29 189 -102 201 4 -83
5857 -83 -20 -227 221 301 -179 -198 10 61 129 175 -219 21 36 2 336 -136 192 -165 -187 20 -146 -91 -131 -116
5881 -116 -127 109 310 81 -284 -1 -300 146 141 -133 37 228 54 47 104 104 -90 4 44 -78 222 -92 -83 -14
$$ packed form
5721a53J49J00J37k80J03J27l05J71J17n4kk05j11K69J31l85K36l2N3J03p4q9
5743Fk07J99l13L84L9k76O3q4M57k79J58k47J53J13j53q8k9k2L20l15jL7M44m85
5767a26K49o9k25J46J58m49K86j04J25K59j82p0K53n10k0J26L50l48J25J8n0j9
5789g7j63l9L90P7O9j28j57NP8j16K17j06k96L40l82L14J57k39N9J70j88J25k26
5812a16j68L19O0J72j12n4k86K54Q9J64l84P4j2j05P2k32J92J12K01L2m01q7n5
5835b71L60n8R2l33O54o41j33J82J99m47L75O1k76K6M06o0j07J60k91L03j97q7
5857h3O3k07M48Q0m80j9K08N1O8M6l94K40J5l4L34m72L28l57k2K07j66N5m0J5
5881a16j1K36K01k29l65K83k99M46nk74J70J91j74pN7%j94R4M0j22L00l14RO9
$$ plain form
5905 -14 27 33 -55 -15 -144 -78 -357 -80 151 -99 -21 181 -121 -162 -49 -151 201 -160 -74 198 315 -246 -339 123
5929 123 -38 -53 194 -286 132 -86 -314 187 -13 -79 -40 139 -16 -138 134 -97 -26 -75 -80 205 218 -134 -2
5952 -2 -111 332 115 171 31 -220 304 0 457 170 14 -232 159 -107 222 -65 -2 -172 108 230 -23
5973 -23 -296 319 -229 -40 -64 154 -244 -154 166 40 -155 -277 200 -130 208 63 82 89 49 -147 215 44
5995 44 76 -166 164 -27 -50 54 -186 104 227 119 68 -153 -86 -97 -37 157 154 44 -178 74 176 101 13 153
6019 153 1 221 61 57 -6 300 133 199 -39 138 128 130 -19 63 -390 -154 -88 -50 259 -115 -187 136 166 -57
6043 -57 18 -103 -8 67 148 147 -212 165 160 -211 25 131 -45 145 -104 23 -25 -181 291 -26 -37 35 158 9
6067 9 -216 30 221 -148 70 -118 469 -181 118 362 -132 43 -9 -321 -225 -119 -14 -175 -2 257 -137
$$ packed form
5905a4M1Oq8M0j29O6k79K77K31k50P8K02l02m1J13j02L52l61Q6K72J17n61r3M62
5929A23j61j5K47m80M18k18k28N01k00o6L9J79j55j22K72k31P1m9nK85J3l52J32
5952bj09M43k17N6j40k51N24l04M57k87j56k46L91k66L29k87O3j70K80J22k53
5973b3k73O15n48J89k4K18l98R0L20j26j95j22M77l30L38j45J9Pm0j96L62j71
5995D4L2k42L30j91k3J04k40K90J23j08n1k21O7j1O0J94lj10k22K52J02p5q8J40
6019A53j52K20j60mo3L06j67O6k38J77j0Kj49Q2m53K36O6L8L09l74p2L23L0k23
6043e7P5j21R5P5Q1jl59L77nl71K36J06j76J90k49J27m8j56M72l17j1P2J23j49
6067Ik25K46J91l69K18j88N87o50K99K44m94J75n2l12R6J06J05j61J73K59l94
$$ plain form
6088 -137 204 72 -203 189 87 -106 82 -141 -172 9 57 208 42 -49 122 -74 -84 -204 122 64 -101 -240
6110 -240 100 -65 -55 27 161 -1 -112 -78 -205 -262 -10 -185 -108 56 33 -213 0 -258 -20 192 -18 123
6132 123 -68 -37 -185 97 93 -187 17 -161 -78 -102 -19 103 -153 32 80 -94 137 5 -8 81 -86 311 -116
6155 -116 -159 -233 151 -141 -85 -44 56 87 -122 -111 -79 -119 -228 147 78 68 185 -66 77 260 -137 39 -291
6178 -291 36 -74 459 84 63 -59 150 -3 -87 86 -73 325 73 90 -41 -43 40 15 189 187 56 142 20
6201 20 73 -83 -181 -83 -14 95 -44 111 -81 103 -235 -189 30 -119 74 118 -36 248 -168 -53 186 45
6223 45 104 -46 103 -154 164 94 -65 -195 205 141 -24 59 -52 44 -265 134 -319 52 -136 40 -240 -106
6245 -106 263 7 284 -39 48 15 -7 127 -2 -26 114 -172 136 83 -62 94 -1 157 -314 -48 -142 55
$$ packed form
6088a37L41j32k75L92j02j93J88k23l1J81M8J51j66r1J71j96j0j20L26n8j65j39
6110b40L40j65J0Q2J34j62j11L4j27n7K52j75P7J64k3k46K13k58K38K12k10J41
6132A23j91L1j48K82mk80K04j78Q3k4Q3J22k56J85M8j74K31j32j3Q9j67L97m27
6155a16m3p4L84k92N6M1J00L1k09J1L2m0j09L75o9j0J17k51J43J83l97J76l30
6178b91L27j10N33l75k1j22K09j53q4J73j59L98k52J7j31kQ3k5J74kj31Q6j22
6201B0N3j56r8R8O9J09j39J55j92J84l38M6K19j49J93M4j54K84m16J15K39j41
6223D5N9j50J49k57L18p0j59j30M00o4j65Q3j11R6l09L99m53L71j88J76k80J34
6245a06L69k56K77l23Q7l3k2J34j29k4J40k86L08n3j45J56r5J58m71K66r4J97
$$ plain form
6267 55 -176 66 -138 -138 -619 37 158 95 2 127 86 41 -158 176 56 52 230 91 -153 -1 -104 -117 232
6290 232 20 -210 147 -71 -113 71 64 167 -45 -120 -70 247 -54 -299 -221 51 -108 -22 177 -20 171 -342
6312 -342 -3 151 94 127 -105 185 -40 -24 -22 295 86 9 59 93 93 -117 48 90 266 -121 -132 -184 -90 20 150
6337 150 -48 -100 -48 27 -24 235 -72 67 -49 -244 173 -182 -8 156 -6 90 54 87 -8 -101 327 127 -191
6360 -191 -13 249 -238 -133 -226 -171 99 -126 98 -88 -73 118 -217 119 199 47 201 -223 -246 59 18 -39
6382 -39 -273 384 -214 -353 28 107 -30 292 -51 69 -229 101 252 217 -60 -75 -114 -41 150 39 49 163
6404 163 58 -46 -135 117 64 -71 -21 -8 126 -118 158 -165 163 99 -261 -5 -167 87 -165 3 -120 129
6426 129 -87 -139 -4 -196 217 -267 177 119 90 91 -313 187 53 171 -32 228 359 31 53 -92 64 -324
$$ packed form
6267E5k31K42k04%m81O56J21o3r3J25m1m5j99L34j20mJ78j39k44J52j03j3L49
6290B32k12k30L57k18m2J84pJ03k12p5N0L17l01k45P8K72j59Q6J99j97J91n13
6312c42L39J54n7L3k32K90k25J6KL17k09p7N0L4%k10J65M2J76l87j1n2R4J10J30
6337A50j98n2N2P5n1K59l07J39j16j95M17l55J74J64j62R6l6L3r5r3M28k00l18
6360a91J78K62m87J05r3N5K70k25K24j86J5J91l35L36Q0j52J54m24k3L05m1n7
6382c9k34O57n98j39L81P9j37L22l43J20k98L30J51l5k77j5l9P3J91j11J0J14
6404A63j05j04q9K52n3j35N0J3J34k44K76l23L28o4l60K56j62K54k52J68j23K49
6426A29k16n2J35j92M13m84M44n8k9Jm04N00j34J18k03K60J31l28K2j45J56l88
$$ plain form
6448 -324 -92 148 -97 -97 39 -44 55 216 229 211 339 -186 6 -146 -52 14 73 160 239 104 -16 228 -82 188
6472 188 -113 92 114 -127 423 244 82 5 48 -37 -31 -261 44 350 81 114 -44 -97 -172 -17 -29 71 -51
6495 -51 169 -34 77 59 159 0 -48 -128 204 29 -2 247 191 10 -325 -96 21 26 -188 -161 52 178 124
6518 124 -61 -208 -300 -184 214 181 55 21 265 141 27 -173 -131 -23 76 -11 -72 -17 126 35 54 -102 -186 21
6542 21 509 160 -139 -51 -129 -313 10 -159 50 -265 -72 -130 -17 -5 82 -33 -193 -24 406 -123 162 103
6564 103 -114 -76 36 128 1 7 91 39 -13 289 -149 57 126 -112 -50 159 -145 262 -27 123 397 72 -245
6587 -245 -132 238 -209 288 111 90 177 -87 60 -139 95 -27 230 -98 69 -87 -43 180 19 -79 -32 -44
6609 -44 -91 -34 -365 -184 -173 -339 89 232 -169 -3 264 -37 69 84 113 465 4 -10 32 -136 145 23 115
$$ packed form
6448c24K32K40k45%J36q3R9J61J3j8J28n25J92j52R4O6N9Q7P9j35j20K44l10K70
6472A88l01K05K2k41N50j79j62p7M3q5Ok30L05L06k69L3j58n3p5J55j2J00j22
6495e1K20k03J11j8J00j59m8q0L32j75l1K49n6j81l35K29J17Nk14K7K13J26n4
6518A24j85j47r2J16L98l3j26l4K44j24j14k00M2J08R9q7o1N5J43r1J9j56q4K07
6542B1M88l49k99Q8p8j84L23j69K09l15J93n8J13J2Q7j15j60J69M30n29K85n9
6564A03k17L8J12R2j27OQ4n2n2L02m38K06O9k38O2K09l04M07k89J50K74l25l17
6587b45J13L70m47M97j77k1Q7k64J47j99K34j22K57l28J67j56M4K23j61r8M7j2
6609d4m7N7l31J81J1j66M28J43m01J66K67l01J06J5K9L52m61j4M2j68K81j22R2
$$ plain form
6632 115 -177 209 -82 -124 100 16 -244 -104 -25 -18 38 95 189 -115 157 -63 -405 210 -243 -157 -325 24 30 143
6656 143 -138 40 33 97 36 -281 -148 -196 -5 -166 -70 287 -42 -24 144 313 261 189 -103 17 156 -87 133
6679 133 126 -55 -221 -75 21 16 33 16 -97 119 -158 66 8 -66 99 215 3 154 -57 -81 -83 -68 190 36
6703 36 -45 -67 303 11 77 -82 19 42 66 165 55 -164 42 12 3 60 71 6 384 -177 -129 -335 -10 85 -248
6728 -248 196 107 218 83 -228 72 -180 -196 -236 147 -31 106 100 -46 -4 134 140 -77 49 -37 151 -187 48
6751 48 -230 126 -37 -47 6 89 -7 -305 -26 307 -126 134 93 -303 -15 168 -6 169 200 62 135 -92 324
6774 324 49 230 -77 -89 -305 -55 -75 128 5 -158 147 -119 89 -303 27 39 102 62 -30 -5 -170 -105 79
6797 79 18 -363 28 14 146 -108 29 -53 170 0 -243 -96 -29 -296 -67 76 -107 195 -244 51 -1 -2 287
$$ packed form
6632A15k92L86k91m2K24q4k60J40P9PN6N7R4l04K72k20l42O15m53Q6j68L49OJ13
6656A43k81J78pO4o1l17J33m8J91j61R6L57l29J8J68J69n2p2k92J20J39k43K20
6679A33pj81j66J46R6nJ7j7j13K16k77K24n8p4J65J16k12J51k11k4kJ5K58j54
6703C6q1k2L70k92O6j59J01K3K4R9j10k19K06l0rN7J1o5L78n61M8k06L25R5l33
6728b48M44q9J11j35l11L00k52j6m0L83j78J37oj46M2J38Ok17J26q6J88l38K35
6751D8k78L56j63j0N3Q3r6k98K79L33m33K60m1l96K88J83j74J75L1j38P3k27M16
6774C24k75J81l07j2k16K50k0K03j23j63L05k66K08l92L30J2O3m0r2K5j65O5J84
6797G9o1l81L91j4J32k54J37q2K23j70k43J47O7k67K29J43j83L02m39K95n2jK89
$$ plain form
6820 287 -112 158 -86 151 260 -219 -18 210 13 83 39 -12 0 -193 -66 166 185 15 5 -210 176 124
6842 124 -222 138 228 17 -35 7 68 113 -118 99 176 37 162 55 309 -210 -41 131 176 34 74 148 -72
6865 -72 100 20 -143 -191 -268 -41 142 36 60 11 -33 -54 44 42 -244 -272 163 -102 201 83 10 102 -22 -34 -110
6890 -110 49 -82 92 -232 -17 -78 -197 -294 -182 275 -22 -5 -8 -313 -265 37 16 13 -57 43 36 -23 211 -176
6914 -176 -312 -137 16 -114 131 -41 -46 -162 -44 67 148 -118 -29 45 82 -222 23 70 -2 -148 119 80 -81
6937 -81 137 90 -90 212 -14 102 176 -295 0 141 -6 -156 78 239 -210 -209 -127 -116 -360 94 22 85 -5
6960 -5 -272 -20 -179 24 3 -122 -44 106 -6 108 -120 103 193 76 90 -78 -221 -255 -123 173 177 -350 -19
6983 -19 -130 -60 246 150 199 334 -17 -184 40 -112 -267 384 -50 -81 122 -68 -90 -108 -5 99 44 143 89
$$ packed form
6820B87l99K70k44K37J09m79K01K28j97P0m4n1J2j93J27K32J9j70j0k15L86n2
6842A24l46L60R0k11n2M2O1M5k31K17P7j39J25j07K54n19J69J72M5j42M0P4k20
6865g2J72q0j63m8p7K27J83j06K4m9m4k1R8kk86k8M35k65L03j18p3R2j24j2p6
6890a10J59j31J74l24K15o1j19r7J12M57k97J7ll05M8L02k1lp0J00pn9K34l87
6914a76j36J75J53j30K45j72nj16J18J11Q1k66Q9P4L7l04K45M7p2j46K67l9j61
6937h1K18m7j80L02k26J16P4m71K95J41j47j50K34J61m49JQ2J1k44M54p2O3r0
6960ek67K52j59K03k1j25P8J50j12J14k28K23R0j17J4j68j43l4J32K96Mn27L31
6983a9j11P0L06r6M9J35l51j67K24j52j55O51m34l1K03j90k2j8J03J04n5R9n4
$$ plain form
7006 89 -84 52 96 -63 -69 -117 391 237 18 0 324 40 -129 159 -276 26 93 11 -19 47 -56 -166 288
7029 288 150 66 -19 52 -133 147 -131 58 266 163 -76 73 -175 28 -176 -141 -16 -93 53 -114 249 -204
7051 -204 -254 94 -37 -63 -137 -13 -75 -62 -4 -193 -156 7 -124 -237 71 67 43 -173 289 105 -12 -173 6
7074 6 -141 90 5 -130 52 119 -258 -116 -172 -213 111 -29 -175 -209 71 -113 -210 9 107 -95 43 -28 -11 -37
7098 -37 162 27 282 -137 -83 180 -71 141 -192 -37 207 60 0 15 42 25 18 -126 -130 100 -116 180 217 226
7122 226 133 -83 -27 -154 -32 174 -458 185 -83 -154 90 -28 55 -102 -155 -223 9 99 -180 211 91 7 178
7145 178 89 -417 175 199 160 166 170 120 70 -104 121 -111 92 -114 447 67 12 150 -236 -2 -65 68 -3 -180
7169 -180 124 172 -29 -17 304 25 251 -2 -31 -265 174 -30 -30 -129 60 -114 103 -14 -365 144 380 93
$$ packed form
7006H9j73J36M4j59om8N08j54k19j8L24k84j69K88m35L02O7q2l0O6j03j10M54
7029B88j38q4q5P1j85K80k78J89K08j03k39J49k48K03k04L5J25p7J46j67L63m53
7051b04n0L48j31k6p4J24o2J3N8j89L7J63j31j13L08mk4k16M62j84j17j61J79
7074Fj47K31q5j35J82O7l77J42n6m1L24j40j46l4K80j84r7K19R8k02J38p1J7k6
7098c7J99j35K55m19N4K63k51K12l33J55K44j47o0J5K7j7pj44mK30k16K96L7R
7122B26r3k16N6j27J22K06o32O43k68p1K44j18Q3j57n3o8K32R0k79L91j20q4J71
7145A78q9n06N92K4l9OMn0n0j74K25k32K03k06N61l80n5J38l86K34o3J33p1j77
7169a80L04M8k01J2L21k79K26k53k9k34M39k04%r9J89j74K17j17l51N09K36k87
$$ plain form
7191 93 -72 -285 -81 -8 -69 23 88 -80 -97 238 15 442 -77 -109 -13 -203 57 85 6 90 -200 -176 13 54
7215 54 -54 -33 -98 4 -94 -4 52 -10 35 27 -71 -78 -60 -255 -99 46 -136 -161 71 61 -117 56 -208 -38 -115 -230
7241 -230 -60 -216 133 113 -175 -165 218 -112 -87 -195 -237 -92 18 -97 118 -22 -67 27 -259 129 18 -137
7263 -137 -76 -251 102 -25 110 -39 223 -61 -147 213 214 149 -182 -101 10 -107 302 -102 68 -58 81 111
7285 111 203 -54 30 -178 -5 -46 125 245 30 323 48 288 -31 -113 50 40 -201 75 60 -128 283 -215
7307 -215 222 91 -302 261 -191 -313 96 183 -63 -240 -27 24 -64 -197 258 293 -127 19 165 -191 15
7328 15 -107 -47 156 45 -38 -134 75 -119 -15 -26 124 6 101 97 -91 -105 81 -6 -14 128 -17 221 249 -299
7352 -299 40 -63 81 410 228 99 -121 138 -2 62 114 -60 -29 148 -24 -89 48 48 -249 -34 -113 -91 -131
$$ packed form
7191I3j65k13K04P3o1R2O5j68j7L35k23M27n19l2R6j90K60K8p9Q4k90K4J89M1
7215E4j08K1o5J02r8R0N6o2M5qr8pJ8j95J56J45j82k5K32j0j78J73k64J70p7j15
7241b30J70j56L49k0k88J0L83l30K5j08m2J45J10j15K15j40m5R4k86L88j11j55
7263a37O1j75L53j27J35j49K62k84q6L60Jo5l31Q1J11j17M09m04J70j26J39L0
7285A11R2k57Q4k08J73m1J71J20k15K93k75K40l19q2J63j0k41K76j5j88M11m98
7307b15M37j31l93N63m52j22M09Q7k46j77K13N1q8j33M55L5m20J46J46l56K06
7328A5j22O0K03j11q3r6K09j94J04j1J50j18R5mj88j4J86q7qJ42j45K38K8n48
7352b99L39j03J44L29j82j29k20K59j40O4N2j74L1J77j72o5J37%k97K15p9K2m0
$$ plain form
7375 -131 73 0 -115 108 -23 -105 -25 -268 184 18 29 -14 47 -360 -184 19 -61 -5 18 -47 -331 99 107 -177
7399 -177 -61 -213 -461 44 166 -170 71 104 -43 84 130 71 -78 217 -176 -97 279 -136 -107 -137 -203 -284 82
7422 82 -153 243 -37 151 -76 20 -87 -52 -210 144 -157 -143 149 -100 -54 -66 125 69 167 111 78 103 -48 294
7446 294 -14 -259 173 -158 193 -52 225 -86 38 24 -96 89 80 -71 9 223 -22 -403 167 133 39 27
7468 27 -103 -222 -12 -170 -118 -107 -7 -132 -104 132 182 -222 -44 113 -40 -39 213 72 184 -53 66 65 -32
7491 -32 43 -9 -83 36 -362 85 211 -158 78 43 -196 91 142 -121 140 103 533 -109 82 -71 -183 8
7513 8 178 -269 48 15 -111 314 -118 143 -97 304 -184 -296 -34 101 -49 215 -24 -44 32 -82 -118 94
7535 94 -169 75 108 118 314 -143 -178 22 -97 -300 123 105 69 -156 -169 -323 143 -144 -31 -201 -92 53
$$ packed form
7375a31K04p3j15K23j31q2Q0k43M52j66J1m3O1m07J76K03q0N6K3o5k84M30Qk84
7399a77J16j52k48N05J22l36K41L3j47J27M6n9j49K95l93P9L76m15K9l0o6q1L66
7422H2k35L96k80J88k27R6j07L5j58L54l01J4K92k49M6j2J91n6R8n6l3K5j51L42
7446B94l08k45M32l31L51k45K77l11J24j4j20J85rj51Q0K14k45l81N70l4r4j2
7468B7j30j19K10j58N2J1J00j25K8K36N0m04J78J57j53JK52j41J12k37J19jr7
7491c2P5n2p4J19l98M47J26l69K36l5k39K87N1k63K61l7M30o42J91j53j12J91
7513HJ70m47L17l3j26M25m32K61k40M01m88j12K62J35j50K64k39k0P6j14l6K12
7535I4k63K44L3J0J96m57l5K00j19k03M23j8l6k25j3j54M66k87J13j70J09J45
$$ plain form
7557 53 235 239 66 -32 -41 -268 -36 -128 -190 -83 244 -166 -274 -158 60 -34 -50 -125 -1 -10 293 112 74 190 458
7582 458 98 -200 -68 55 -339 -119 154 -72 24 -282 -139 205 159 -12 117 124 -170 -11 10 5 13 430 230
7605 230 190 -24 62 127 102 -276 -117 -25 -40 363 -61 21 296 87 24 100 135 -89 -113 13 89 303 39 52
7629 52 -266 136 40 -172 -101 -171 27 132 -48 64 -7 -80 -195 240 285 242 12 -12 65 7 -146 29 66 -270
7653 -270 -113 -15 -23 -62 214 213 255 199 -67 129 -10 -61 193 374 156 17 75 89 9 86 -145 -241 -61 -116 -108 -23
7679 -23 -325 213 35 38 102 -142 -178 -332 86 -53 134 116 -92 10 -121 -59 -130 -9 332 76 -129 2 258
7702 258 88 260 -73 -205 107 239 -193 -102 71 -176 -42 1 -333 222 -28 -149 -236 34 -418 27 69
7723 69 -293 -175 -51 194 -65 72 -75 -14 -98 120 -153 -348 193 107 40 -141 175 66 40 252 144 79
$$ packed form
7557E3J82Mj73r8rk27K32r2o2J07L27m10j08J16K18r4j6p5J24rL03j81l8J16K68
7582D58l60k98J32J23l94K20K73k26R6l06J43L44m6j71J29Pk94J59K1nQM17k00
7605B30m0k14Q6O5k5l78J59R2j5M03m24Q2K75k09o3P6L5k24k4J26P6K14k64J3
7629E2l18M02r6k12P1p0J98J05j80J12p1p3j15M35M5m3k30k4P7n8j53J75L7l36
7653b70J57R8ql9K76jM2n6k66J96j39n1K54J81k18j39N8J4q0P7k31r6J80n5QQ5
7679b3l02N38j78LO4k44l6j54M18j39J87j8k08J02j31O2p1J21L41k56k05J31K56
7702B58j70J72l33j32L12J32m32R1J73k47J34M3l34N55k50j21q7K70m52M45M2
7723F9l62J18J24K45k59J37j47O1q4K18k73j95N41q6o7j81L16j09k6K12j08o5
$$ plain form
7745 79 -219 95 252 -164 229 44 -151 132 9 68 -57 -261 125 166 191 64 -32 -45 -43 97 50 -1 65 118
7769 118 -35 -142 102 116 -158 -30 -67 199 -128 -143 -129 -238 29 50 -131 -17 -171 41 -47 -50 -106 80 -44
7792 -44 131 141 -140 53 101 232 -296 14 13 -242 49 -124 56 91 -17 118 -288 -132 -4 -32 88 215
7814 215 -118 111 -1 -61 -196 -162 -247 230 45 349 102 190 172 86 104 -324 269 -242 -74 84 -192 53
7836 53 -142 83 -168 4 365 51 68 -41 123 -94 96 -48 51 25 35 66 -47 -96 -21 -249 -274 -347 -386 -226
7860 -226 15 -68 -133 -168 -182 -184 -92 -153 -16 -145 246 -88 -116 -197 -65 20 -91 -63 -135 -187 29 68 -138 -83 80
7885 80 -30 200 -145 -25 219 69 203 204 -170 -211 -20 319 -57 -124 -70 83 -257 229 -103 -28 -73 -78 -101 294
7909 294 -111 -86 6 80 -142 227 140 -228 -37 217 -114 -78 -22 106 84 59 114 -114 -72 -172 208 -127 -80 -111
$$ packed form
7745G9k98L14J57m16L93j85j95K83j23N9j25k04L86M1K5j27r6j3KJ40m7n1O6N3
7769A18j53j07K44J4k74J28l7K66l27j5J4j09K67K1j81J14j54K12q8ln6J86j24
7792d4J75J0k81J93M8J31n28L10jk55K91j73J80L5j08J35m06J56J28k8J20J27
7814B15l33K29j12o0j35L4q5M77j85L04k47Q8j8q6J8m28N93n11J68J58k76K45
7836E3j95K25k51J72L61l14J7j09J64k17J90j44R9k6J0L1j13m9P5k28k5p3l9J60
7860b26K41q3o5l5j4kR2o1J37j29L91l34k8q1J32Q5j11K8p2n2K16L9k06N5J63
7885H0j10K30l45J20K44j50J34Jl74m1J91L39l76o7N4J53l40M86l32P5m5nk3L95
7909B94m05K5R2P4k22L69q7l68J91K54l31L6N6J28k2k5N5k28M2j00L80l35M7l1
$$ plain form
7933 -111 -193 -23 -215 270 288 211 84 83 13 -22 -236 14 -37 89 33 234 182 65 274 180 167 -196 -263 13
7957 13 -178 -39 -20 -31 39 354 -162 -126 27 -79 -6 -89 34 -240 -121 -8 44 117 -247 -4 180 -114 175
7980 175 25 165 93 -27 271 -342 -17 -228 -230 73 -174 -17 310 60 -52 129 132 -58 -41 43 28 56 -104
8003 -104 -63 141 -149 -103 -264 439 157 52 42 110 139 -46 139 42 186 5 0 -29 -30 -103 54 -94 35 -17
8027 -17 49 -116 19 -147 -14 259 -147 67 61 -37 256 -11 2 -39 -67 -34 -50 57 88 276 5 117 127 234
8051 234 226 -136 -6 20 -360 346 10 388 -39 153 -88 -20 24 246 128 105 0 70 111 -131 -186 -73 118
8074 118 -4 143 -267 -28 -256 -148 -78 26 114 159 -112 374 -16 67 -407 100 259 -222 -306 -38 -241 219
8096 219 -116 -355 71 -63 104 -113 22 -186 34 -247 57 372 -272 65 87 -1 -102 -230 -310 42 0
$$ packed form
7933a11q2J70j92M85J8p7j27jp0l5k14K50n1J26n6K01n2j17K09r4j3l63o7K76
7957A3j91J39J9j1P0L15n16L6J53j06P3q3J23k74J19J13N2P3l64K43J84k94K89
7980A75j50J40p2j20K98o13L25k11kL03k47J57L27k50j12J81Lj90J7Q4j5K8j60
8003a04M1K04k90M6j61P03k82j05j0O8K9j85J85r7J44j81nk9jp3J57j48J29n2
8027a7O6j65J35j66J33K73m06K14or8K93k67J3m1k8L3j6J07L1J88k71J12J0J07
8051B34ql62J30K6l80P06l36L78m27J92k41O8M4K22j18k3j05P0M1k42n5J13J91
8074A18j22J47m10K39k28J08P0J04Q8M5k71M86l90Q3m74N07J59m81q4K68k03M60
8096B19l35k39M26j34J67k17J35k08K20k81L04L15o44L37K2q8j01j28q0L52m2
$$ plain form
8117 0 14 -155 -154 -185 -62 144 218 47 -40 143 -74 179 86 2 124 123 -85 -313 39 -60 -281 -154 84 44 -106
8142 -106 -105 -165 -59 -140 -215 256 -11 -104 156 -240 120 58 -272 -121 -221 -18 264 5 32 50 117 23 102 -306
8166 -306 -2 -61 230 -147 -208 136 -54 231 -255 -73 -98 -69 40 -26 191 -17 98 -141 -80 -83 16 -180 200
8189 200 113 -104
$$ packed form
8117@J4j69Jl1J23K06P4j71q7J83k17K53r3q4J22jk08k28L52r9k21J27K38m0j50
8142a06Jo0J06q1p5M71k67r3K60l96L60o2l30J51j00K03K82k59K7J8O7r4P9m08
8166c06L04n9K91l77o1L44j90K85m86J82k5K9J09o6K17k08J15k39O1lR9j96L80
8189B00q7k17
8191a04
$$ Imaginary data points
##PAGE= N=2
##DATA TABLE= (X++(I..I)), XYDATA
$$ plain form
0 0 0 0 0 0 0 0 0 0 0 -8 8 -8 8 -8 16 -16 16 -24 24 -32 38 -40 48 -56 64 -74 86 -96 110 -123 138 -156 175
33 175 -196 218 -244 271 -301 334 -370 409 -453 501 -556 617 -683 760 -847 945 -1062 1201
51 1201 -1365 1571 -1831 2171 -2641 3337 -4468 6624 -12233 56391 116106 -21513 -57181 7425
65 7425 47762 -2700 -3349 52008 48225 -40228 -56020 28370 74012 7905 -37617 2798 29914
78 29914 -19915 -36302 32395 66621 -12326 -76208 -20208 58671 35568 -28672 -26322 8186
90 8186 -10068 -37835 2216 54492 19343 -53454 -44894 22748 33820 -10234 -13471 22201 10418
103 10418 -38268 -28334 36292 48211 -12586 -44397 -4873 26885 3431 -16824 6718 18013
115 18013 -15477 -31343 10005 41816 8203 -34570 -19554 18534 15442 -9206 -3328 16797
$$ packed form
0@%%%%%%%%%qJ6j6J6j6K4l2L2m0M8n6P0p8Q8j04J20j38J60j82K06k33K61k94L31
33A75l71M14m62N15n72O35p04P79q62R54j057J173j300J443j607J792k007K263
51A201k566K936l402M002m812N978p805J1092j8857O8624N9715j37619l5668O4606
65G425M0337n0462o49N5357l783q8453j5792Q4390M5642o6107m5522M0415K7116
78B9914m9829j6387O8697L4226p8947o3882N6000P8879k3103o4240K350L4508
90H186j8254k7767M0051N2276l5149p2797Q560O7642J1072m4054l237L5672j1783
103A0418m8686R934O4626J1919o0797l1811L9524L1758k3454k0255K3542J1295
115A8013l3490j5866M1348L1811l3613m2773J5016L8088l092k4648N878K0125
$$ plain form
127 16797 2192 -29531 -18237 25397 31195 -9798 -31388 -5731 14267 -645 -10017 9285
139 9285 15260 -14673 -31904 -978 29515 8900 -28357 -22176 9063 7201 -17537 -10730 15188
152 15188 3539 -32405 -25874 17503 25769 -13036 -31230 -3805 12531 -7394 -14616 12822 21849
165 21849 -15636 -38938 -2241 35347 14045 -21427 -10033 16551 2151 -21011 2899 37779
177 37779 16363 -29499 -21653 24630 29087 -7523 -12112 19247 17179 -19455 -16563 29837 36195
190 36195 -13414 -32733 9084 33533 2072 -17210 12164 25622 -11818 -31696 9862 43571
202 43571 9330 -32315 -13252 22230 7065 -19812 2271 31098 3252 -38414 -18334 30353
214 30353 24138 -18317 -19760 13041 11564 -20596 -14869 24198 22943 -22373 -32164 10737 29501
$$ packed form
127A6797j4605l1723J1294M3634N798m0993k1590K5657J9998j4912r372J9302
139I285N975k9933j7231L0926L0493k0615l7257O181L1239j862k4738O807K5918
152A5188j1649l5944O531M3377Q266l8805j8194K7425J6336j9925p222K7438R027
165B1849l7485k3302L6697L7588k1302l5472J1394K6584j4400k3162K3910L4880
177C7779k1416m5862P846M6283M457l6610m589L1359k068l6634K892M6400O358
190C6195m9609j9319M1817K4449l1461j9282K9374J3458l7440j9878M1558L3709
202D3571l4241m1645J9063L5482j5165k6877K2083K8827k7846m1666K0080M8687
214C0353o215m2455j443L2801j477l2160N727L9067j255m5316r791M2901J8764
$$ plain form
227 29501 -4067 -22577 4348 18302 -9654 -21894 12401 32599 -952 -31536 -7398 26179
239 26179 13500 -13771 -3004 18992 2025 -24271 -5647 29654 18513 -20101 -20761 11149
251 11149 16192 -8432 -11073 12358 11776 -17773 -22418 10836 24403 -5509 -27138 -6302 14012
264 14012 -1564 -17520 -79 14070 -8031 -29670 -8525 21246 9669 -21831 -19399 6093
276 6093 5580 -14581 -9730 14286 7943 -23983 -24117 10863 21570 -6832 -22023 -590 11523
289 11523 -7358 -15250 9167 21032 -5669 -26540 -2506 25906 11765 -14661 -5963 15396
301 15396 5187 -14689 889 26923 13505 -19844 -15254 18412 23297 -3796 -10443 11109 13348
314 13348 -11454 -12777 17930 25880 -7579 -25102 1209 21566 3087 -14242 1737 14950
$$ packed form
227B9501l3568j8510K6925J3954k7956j2240L4295K0198l3551l0584K4138L3577
239B6179j2679k7271J0767K1996j6967k6296J8624L5301j1141l8614o60L1910
251A1149N043k4624k641K3431n82k9549m645L3254J3567k9912k1629K0836K0314
264A4012j5576j5956J7441J4149k2101k1639K1145K9771j1577l1500K432K5492
276F093n13k0161M851K4016o343l1926j34L4980J0707k8402j5191K1433J2113
289A1523j8881p892K4417J1865k6701k0871K4034K8412j4141k6426Q698K1359
301A5396j0209j9876J5578K6034j3418l3349M590L3666M885k7093o647K1552K239
314A3348k4802j323L0707P950l3459j7523K6311K0357j8479j7329J5979J3213
$$ plain form
326 14950 -6136 -23175 521 25730 7133 -23642 -14203 14223 10330 -12827 -5874 16434 6395
339 6395 -21110 -12852 20644 21474 -10298 -18116 7505 16152 -4030 -8874 14682 19199 -9320 -20391
353 -20391 8687 27979 5360 -16562 -1038 16727 1925 -13018 4783 22578 2755 -22322
365 -22322 -9051 19939 13794 -12329 -11202 9464 6254 -15240 -9281 16262 13092 -16683 -21890
378 -21890 5753 16276 -5093 -15356 1636 9246 -10016 -17566 5026 19024 -3360 -24093
390 -24093 -7632 14453 4242 -14199 -5087 10773 -1248 -19591 -7401 16560 9439 -16645
402 -16645 -16739 6068 9661 -8837 -10722 7514 7948 -14115 -17256 7579 17400 -4466 -18471 -1753
416 -1753 12018 -814 -11429 3081 14790 -2130 -18233 -3123 18875 9737 -12333 -7574 11397
$$ packed form
326A4950k1086j7039K3696K5209j8597l0775R439K8426l893k3157O953K2308j0039
339F395k7505Q258L3496Q30l1772p818K5621Q647k0182m844K3556M517k8519j1071
353b0391K9078J9292k2619k1922J5524J7765j4802j4943J7801J7795j9823k5077
365b2322J3271K8990o145k6123J127K0666l210k1494N959K5543l170k9775n207
378b1890K7643J0523k1369j0263J6992P610j9262p550K2592J3998k2384k0733
390b4093J6461K2085j0211j8441R112J5860j2021j8343J2190K3961p121k6084
402a6645r4K2807L593j8498j885J8236M34k2063l141K4835R821k1866j4005J6718
416a753J3771j2832j0615J4510J1709j6920j6103J5110K1998r138k2070M759J8971
$$ plain form
429 11397 7585 -9401 -3245 15920 10389 -13134 -12186 12143 17177 -3853 -11641 4756 11475 -5247
443 -5247 -11201 8078 17067 -4263 -19346 -872 16505 3498 -13179 -2997 11644 628 -14634
456 -14634 -2518 16738 7161 -15345 -10764 11732 11798 -7979 -7884 10506 9656 -10728 -10319 13212
470 13212 17640 -5091 -14323 5534 16315 625 -9990 6040 15924 -1312 -14176 3155 20216
483 20216 5475 -13552 -3909 14429 6422 -10729 -1997 14901 5479 -14795 -8825 13249 11737
496 11737 -10112 -11969 6752 8824 -9590 -11043 7942 10505 -10773 -17214 3310 12864 -4228
509 -4228 -15481 -1415 8928 -4844 -15113 -718 12235 -1687 -18052 -6915 10674 3606
521 3606 -12868 -6959 8599 1877 -13522 -7158 11282 7791 -11504 -12302 5885 9352 -5557 -9536
$$ packed form
429A1397l812j6986O156J9165n531k3523R48K4329N034k1030p788J6397O719j6722
443e247n954J9279Q989k1330j5083J8474J7377j3007j6677J0182J4641j1016j5262
456a4634J2116J9256r577k2506M581K2496O6j9777R5J8390q50k0384M09K3531
470A3212M428k2731r232J9857J0781j5690j0615J6030R884j7236j2864J7331J7061
483B0216j4741j9027R643J8338q007j7151Q732J6898r422k0274N970K2074j512
496A1737k1849j857J8721K072j8414j453J8985K563k1278o441K0524R554j7092
509d228j1253J4066J0343j3772j0269J4395J2953j3922j6365J1137J7589p068
521C606j6474N909J5558o722j5399O364J8440l491j9295p98J8187L467j4909l979
$$ plain form
535 -9536 5350 8770 -7063 -11673 5463 14093 -2018 -13119 -888 10795 1361 -8489 335
548 335 10344 426 -12217 -3506 11939 7368 -8588 -7725 6267 5813 -6962 -5437 8337 7681
562 7681 -8461 -11168 4364 10573 -2280 -9818 826 7718 -2126 -9656 1716 11123 85 -12388
576 -12388 -3246 11080 5732 -7636 -3991 7906 4005 -7719 -3337 11461 10043 -6422 -8625
589 -8625 6577 11362 -1356 -5628 7432 11198 -3096 -9429 6181 15225 1963 -9360 1238
602 1238 12600 2940 -8675 884 13481 3974 -10616 -2909 13262 7166 -10392 -6658 9686
615 9686 7386 -8597 -6827 9115 7411 -10272 -11081 6770 11069 -5712 -12049 2768 8903 -5384
629 -5384 -12515 2994 11371 -3323 -14397 -642 11301 -558 -12309 -2751 10314 1116 -11920
$$ packed form
535i536J4886L420j5833m610J7136Q630j6111j1101J2231J1683r434r850Q824
548C35J0009r918j2643Q711J5445m571j5956Q63J3992m54j2775J525J3774o56
562G681j6142k707J5532O209j2853p538J0644O892r844p530J1372R407j1038j2473
576a2388R142J4326n348j3368L645J1897l901j1724M382J4798j418j6465k203
589h625J5202M785j2718m272J3060L766j4294o333J5610R044j3262j1323J0598
602A238J1362r660j1615R559J2597r507j4590P707J6171o096j7558L734J6344
615I686k300j5983J770J5942j704j7683q09J7851M299j6781o337J4817O135j4287
629e384p131J5509Q377j4694j1074J3755J1943j1859j1751R558J3065r198j3036
$$ plain form
642 -11920 -3963 9961 2554 -12387 -6411 9983 6816 -10269 -9199 6113 5791 -8480 -7606 7554
656 7554 7764 -8281 -12368 3488 9892 -2753 -9241 1044 7543 -4044 -10733 1995 11526 -75
670 -75 -11486 -3370 8649 3204 -7554 -2485 7305 2249 -8976 -4250 9023 6885 -7725 -9049
684 -9049 4077 7138 -3481 -6110 3966 5002 -7312 -10249 3412 11182 -195 -10515 -3668
697 -3668 5187 -210 -6482 1183 9726 1112 -11853 -6316 9004 8161 -4013 -4082 6079 5017 -5506
712 -5506 -3861 9760 11039 -3171 -7641 5073 11954 1702 -5195 4388 10387 -60 -6893 4826
726 4826 14033 2719 -9729 -2375 10296 5524 -5488 -444 9813 2101 -11328 -5769 10577
739 10577 8920 -7121 -8150 4526 4634 -8380 -7525 7785 8791 -7047 -11685 2551 8438 -4156
$$ packed form
642a1920P957J3924p407j4941N976J6394l167j7085J070J5312l22j4271Q74J5160
656G554K10j6045m087J5856O404j2645o488J0285O499j1587o689J2728R531j1601
670g5j1411Q116J2019n445j0758N069R790n056j1225M726J3273k138j4610j324
684i049J3126L061j0619k629J0076J036j2314k937J3661P770j1377j0320O847
697c668Q855n397o272P665Q543q614j2965N537J5320q43j2174o9J0161j062j0523
712e506J645J3621J279j4210m470J2714O881j0252o897R583N999j0447o833J1719
726D826R207j1314j2448P354J2671m772j1012N044J0257p712j3429N559J6346
739A0577j657j6041j029J2676J08j3014Q55J5310J006j5838m638J4236N887j2594
$$ plain form
753 -4156 -9934 2770 9181 -3267 -11402 499 9956 -1419 -11402 -1018 10605 1466 -10587
766 -10587 -2552 8881 2035 -9721 -2851 9979 4492 -9230 -6000 6991 5464 -7810 -5795
779 -5795 7198 6661 -7130 -8578 4260 6242 -5337 -7607 4144 7282 -4296 -10149 19 6493
793 6493 -1712 -6995 898 6464 -2735 -10550 -2500 6907 2015 -6648 -3497 3514 -452 -7343 -3088
808 -3088 5338 2899 -6238 -6336 1817 3818 -2750 -4435 1521 3339 -3448 -4982 2067 6217 46 -5604
824 -5604 -1513 4742 3104 -1808 -73 4302 1528 -4150 -1540 7136 6911 -1441 -3993 2155 5048
839 5048 672 -339 5281 6582 -1416 -6136 1394 8439 4388 -3439 -677 5176 1190 -4771 490
854 490 8456 4197 -5931 -4543 5125 5435 -2898 -3618 4382 4586 -4905 -5932 4845 7503 -3120
$$ packed form
753d156n778J2704O411j2448q135J1901R457j1375r983J0384J1623r139j2053
766a0587Q035J1433o846j1756O870J2830n487j3722L230J2991j527j3274K015
779e795J2993n37j3791j448J2838J982j1579k270J1751L138j1578n853J0168O474
793F493q205n283P893N566r199p815Q050R407m892q663L151P011l966o891M255
808c088Q426k439r137r8Q153K001o568j685N956J818o787j534P049M150o171n650
824e604M091O255j638m912J735M375k774n678K610Q676k25q352k552O148K893
839E048m376j011N620J301p998m720P530P045m051p827K762N853l986n961N261
854D90P966m259j0128J388R668L10q333p20Q000K04r491j027J0777K658j0623
$$ plain form
869 -3120 -8063 1536 7000 -1178 -6497 1809 6768 -2297 -8986 462 9154 1660 -7953 -2452 6691
884 6691 1631 -7154 -944 8797 3285 -8819 -5343 7011 5363 -5762 -4181 6079 4749 -6767
898 -6767 -5998 5727 6808 -4489 -7522 3400 6830 -3749 -8092 2397 6851 -2902 -8527 1097
912 1097 7103 -2281 -9484 -1401 6642 -510 -8329 -1823 6005 106 -9142 -3728 6231 2119 -7482
927 -7482 -5129 4798 2484 -6835 -5480 4292 3486 -5924 -5601 3321 4321 -4369 -6520 1894 5508 -2061
943 -2061 -5566 1295 5210 -1554 -5682 1407 6773 1181 -5321 -1008 5037 2689 -3186 -179 5933
958 5933 2822 -3492 -1727 5896 5696 -1795 -2732 3793 4941 -1046 -2082 3623 5349 -1288 -4135 1849
974 1849 6065 1407 -3865 -423 3970 576 -4005 -392 5048 1302 -5075 -3377 3810 3276 -2894
$$ packed form
869c120m943R599N464q178n319Q306M959r065o689R448Q692p494r613N501R143
884F691n060q785O210R741n512j2104L476J2354j648j1125J581J0260j330j1516
898f767P69J1725J081j1297l033J0922L430j0579m343J0489M454r753n625R624
912A097O006r384p203Q083Q043p152p819O506P828n899r248N414R959m112r601
927g482K353R927k314r319J355R772q06r410L23Q922J000q690k151Q414L614p569
943b061l505O861L915o764m128P089N366n592o502M313O045k348n875L007O112
958E933l111o314J765P623k00p491r37O525J148n987j036N705J726o637k847N984
974A849M216m658n272L442M393l394m581L613N440l746o377J698P187n34o170
$$ plain form
989 -2894 -3056 2360 2345 -3385 -3350 3022 4600 -1987 -4967 1213 5027 306 -3418 1106 5006 -269
1005 -269 -4247 838 6296 2279 -4073 -1155 4890 3065 -2768 -832 4528 2665 -4382 -3358 4625
1020 4625 4455 -3286 -4633 1656 3224 -2633 -4156 1739 3287 -3530 -6569 -234 4573 -1189 -6567
1035 -6567 -1924 2988 -1334 -5795 -1542 3934 -245 -6603 -3421 3805 1595 -4693 -3805 2280 1546
1050 1546 -4978 -3660 2873 3128 -4355 -5411 1695 3841 -2189 -4949 1033 3544 -1976 -4724 1087
1065 1087 4752 -932 -5701 -730 4582 865 -4210 -1111 4105 953 -4510 -1482 5086 3086 -3484
1080 -3484 -3053 3437 3534 -1891 -2254 3225 3609 -2266 -3735 3413 5343 -916 -3986 1094 4996 -44
1096 -44 -3292 1450 4770 96 -4464 -120 4907 1813 -3815 -1513 3858 1812 -3414 -1223 4623
$$ packed form
989b894j62N416j5n730L5O372J578o587k980O180L814m721l724M524L900n275
1005b69l978N085N458m017o352K918O045j825n833J936N360j863p047J024P983
1020D625j70p741j347O289J568n857j523N895J548o817l039O335M807n762n378
1035f567M643M912m322m461M253N476m179o358L182P226k210o288Q88O085p34
1050A546o524J318O533K55p483j056P106K146o030k760N982K511n520k748N811
1065A087L665n684m769M971N312l717n075L099N216l152n463L028O568k000o570
1080c484M31O490R7n425l63N479L84n875j469P148J930o259l070N080L902n040
1096d4l248M742L320m674m560M344N027l094n628K302N371k046n226K191N846
$$ plain form
1111 4623 2449 -3348 -2641 3415 4048 -1829 -3012 2322 3789 -1469 -2368 2681 5018 -415 -3524 1242
1127 1242 4899 1104 -2890 502 4379 1008 -3011 37 4917 2350 -3580 -1444 4028 2826 -2211
1142 -2211 -1933 3209 2648 -3060 -2928 2646 3558 -2692 -4259 869 2845 -2016 -3979 390 2845 -1838
1158 -1838 -4898 -531 3435 -561 -5065 -2090 2593 -104 -4606 -2198 2874 446 -4538 -3276 2006
1173 2006 1523 -3533 -3697 1130 1618 -3059 -3491 1504 2833 -2769 -4676 740 3317 -897 -4125 215
1189 215 3147 -730 -3885 285 4060 274 -4045 -1571 3741 1576 -2964 -1225 3268 1752 -3015
1204 -3015 -1546 3158 3136 -2173 -2298 2268 3024 -1569 -2601 1588 3233 -957 -3343 1477 3809 -163
1220 -163 -3033 107 3421 328 -2860 -83 3296 808 -3247 -1107 3381 2046 -1925 -1544 2496
$$ packed form
1111D623k174n797P07O056O33n877j183N334J467n258q99N049K337n433l109M766
1127A242L657l795l994L392L877l371m019L048M880k567n930K136N472j202n037
1142b211K78N142n61n708J32N574R12o250j567N128J976m861j963M369K455m683
1158a838l060M367L966l996m504K975M683k697m502K408N072k428m984J262N282
1173B006m83n056j64M827M88m677m32M995J329n602j907N416K577m214l228M340
1189B15K932l877l155M170L775l786m319K474N312k165m540J739M493j516m767
1204c015J469M704k2n309j25M566P56m593j032M189J645m190k386M820K332l972
1220a63k870L140L314l093l188K777L379k488m055K140M488j335l971L81M040
$$ plain form
1235 2496 2177 -2025 -1408 3235 3136 -1383 -2337 2369 3444 -30 -1772 1736 3623 -19 -2058 1401
1251 1401 4022 1002 -2321 226 3782 1978 -1211 -399 2874 1691 -2205 -709 2926 2496 -1655
1266 -1655 -2566 1507 2391 -1222 -2481 800 2170 -1801 -3909 -57 2829 -858 -3744 -987 2208
1281 2208 -539 -4352 -1790 2381 476 -3907 -2292 2321 1327 -3802 -2968 1982 1881 -3042 -3139 1754
1297 1754 2136 -3044 -3900 1852 2981 -1991 -4033 364 2911 -1251 -4280 105 3435 -632 -4805
1312 -4805 -279 3460 -238 -4637 -1641 3302 587 -4088 -1630 3002 863 -4172 -2186 4186 3068
1327 3068 -3227 -3207 2542 2472 -2870 -2506 3212 3197 -2803 -4095 1996 3631 -809 -2802 1345 3320 -1632
1344 -1632 -3675 1297 4503 25 -3860 -397 3585 358 -2969 -55 3226 409 -3747 -593 4021
$$ packed form
1235B496l19m202O17M643r9m519r54M706J075l474j742L508J887l642k039L459
1251A401K621l020l323K547L556j804l189Q12L273j183l896J496L635m30m151
1266a655r11M073Q84l613j259L281J370l971k108L852K886l687k886K757L195
1281B208k747l813K562M171j905m383J615M613r94n129Q34M950j01m923r7M893
1297A754L82n180q56N752J129m972k042M397K547m162l029M385L330m067m173
1312d805M526L739l698m399K996M943k715m675K458M632k139n035J986O372j118
1327C068o295K0N749p0n342L64N718j5o000j292O091J635m440j993M147J975m952
1344a632k043M972L206m478l885L463L982l227l327K914L281k817m156L154M614
$$ plain form
1359 4021 2043 -2667 -1234 2838 1732 -1545 -711 3187 2369 -2025 -1842 2702 3441 133 -756 1732
1375 1732 2365 -370 -810 2573 3757 865 -1935 64 2588 1373 -447 1338 2210 640 -2193 -1056
1391 -1056 2040 1554 -1031 -1211 291 527 -1290 -1711 750 1250 -959 -2431 -600 1241 -395 -2381
1407 -2381 -899 930 81 -1867 -720 1261 277 -2332 -2214 615 1786 -780 -1688 511 949 -2060
1423 -2060 -2477 871 3059 -202 -2442 -750 1150 -898 -2323 282 2932 546 -3386 -1827 1842
1438 1842 619 -2521 -870 2487 1013 -3310 -2409 1958 1925 -2425 -2478 1526 1863 -2316 -2722 1183 1948
1455 1948 -2071 -3428 1056 3086 -879 -3614 -65 1928 -1320 -2859 1025 3632 -90 -3862 -1073
1470 -1073 2759 740 -2084 308 3213 634 -3833 -1588 3377 2582 -1600 -1008 2580 1500 -2180
$$ packed form
1359D021j978m710J433M072j106l277Q34L898q18m394J83M544P39l308q89K488
1375A732O33k735m40L383J184k892k800J999K524j215j820J785Q72j570k833J137
1391a056L096m86k585j80J502K36j817m21K461N00k209j472J831J841j636j986
1407b381J482J829q49j948J147J981r84k609J18K829J171k566r08K199M38l009
1423b060m17L348K188l261k240J692J900k048j425K605K650k386l932J559L669
1438A842j223l140J651L357j474m323R01M367l3m350n3M004L37m179m06L905P65
1455A948m019j357M484K030l965k735L549J993l248j539L884K607l722l772K789
1470a073L832k019k824K392K905k579m467K245M965p95m182N92L588j080l680
$$ plain form
1485 -2180 -1024 3804 3108 -901 -2070 1809 2785 -350 -1024 2407 3023 -683 -1916 1667 3907 535
1501 535 -1737 592 2752 650 -1128 975 2909 269 -2330 -959 2399 1898 -1062 -795 933 523
1517 523 -1675 -987 2029 1928 -1360 -2465 -56 1100 117 -1047 469 963 -1326 -2581 -167 2213
1533 2213 974 -1922 -1178 617 184 -1705 -302 1678 1219 -1926 -2163 693 1455 -576 -1736 373
1549 373 739 -992 -2437 545 2047 -875 -2831 -733 1889 -11 -2250 -708 1287 -585 -2872
1564 -2872 -1264 2030 989 -2662 -2306 709 160 -2308 -1333 1542 1055 -2533 -2975 782 1907 -1072
1580 -1072 -2130 843 1578 -1531 -2835 622 2704 -641 -2621 24 1798 -669 -2539 127 2205
1595 2205 129 -2453 -567 1908 700 -1810 -680 2307 1092 -1431 -970 2158 1429 -1262 -1166 2194
$$ packed form
1485b180J156M828o96m009j169L879R76l135o74L431O16l706j233L583K240l372
1501E35k272K329K160k102j778K103J934k640k599J371L358n01k960K67J728m10
1517E23k198O88L016j01l288j105K409J156r83j164J516M94k289j255K414K380
1533B213j239k896P44J795m33j889J403J980m59l145k37K856P62k031j160K109
1549C73L66j731j445K982J502k922j956K098K622j900k239J542J995j872k287
1564b872J608L294j041l651L56L015n49k468R75K875m87l588m42L757J125k979
1580a072j058K973P35l109j304L457K082l345j980K645J774k467j870K666K078
1595B205k076k582J886K475j208k510J130K987j215k523M61L128p29k691R6L360
$$ plain form
1611 2194 2388 -558 -756 2392 2251 -718 -1247 1765 2958 620 -889 1187 2051 152 -1159 1210
1627 1210 3050 804 -1406 -123 1665 802 -825 147 2026 438 -1314 -1009 1619 1187 -861 -991
1643 -991 525 893 -881 -723 736 1145 -898 -1591 264 1629 -14 -930 -61 1042 -189 -1102 506
1660 506 1405 527 -917 -841 1175 1239 -273 -439 1024 521 -757 -971 951 1375 -352 -1590 -423 846
1678 846 -291 -1105 -459 865 -532 -2099 -785 887 110 -1790 -1565 282 -308 -1570 -1397 759 500
1695 500 -1758 -1887 -62 646 -1241 -1748 114 650 -830 -1386 157 1207 -502 -1950 -335 1363
1711 1363 -112 -1458 -468 1630 35 -1709 -655 1658 858 -1734 -614 1367 1054 -1027 -725 1220
1727 1220 1592 -814 -1322 1196 1850 -628 -1156 953 1829 -191 -1014 674 1809 446 -1020 466
$$ packed form
1611B194J94k946j98L148j41k969n29L012J193k338j509K076Q64j899j311K369
1627A210J840k246k210J283J788q63j627R72J879j588j752L05K628m32k048j30
1643i91J516L68j774J58J459M09k043o93J855J365j643r16Q69J103j231r13J608
1660E06Q99q78j444P6K016O4j512j66J463n03j278k14J922M24j727j238J167J269
1678H46j137q14O46J324j397j567J314J672p77j900K25J847n90j262J73K156k59
1695E00k258j29J825P08j887n07J862N36j480n56J543J050j709j448J615J698
1711A363j475j346R90K098j595j744J054K313q00k592J120J981l13k081L02J945
1727A220L72k406n08K518O54k478n28K109Q76k020q23J688J135j363j466J486
$$ plain form
1743 466 1955 582 -1066 60 2180 959 -1030 84 1709 1161 -994 -458 1555 1627 -527 -962
1759 -962 1468 1437 -841 -892 1140 1212 -572 -1369 729 1744 -121 -1304 349 1838 125 -1108 338
1776 338 1917 313 -1229 -160 1705 430 -891 -405 1502 694 -935 -458 1135 1354 -1254 -1200 814
1793 814 932 -790 -1032 642 1063 -854 -1518 418 1104 -865 -1929 -303 1054 -170 -1918 -844
1809 -844 742 -104 -1943 -1159 745 16 -1667 -1421 361 114 -1374 -1087 201 634 -1540 -1603 181
1826 181 584 -995 -1841 235 864 -962 -1442 -54 1113 -180 -1675 -401 1027 96 -1302 -520 779
1843 779 282 -1090 -582 1033 362 -1157 -734 814 1030 -587 -522 633 1058 -215 -729 612 1192 -218
1861 -218 -1267 608 1345 272 -510 125 1416 356 -1060 140 1717 925 -743 -418 905 965 -559
$$ packed form
1743D66J489j373j648J126K120j221j989J114J625n48k155N36K013P2k154m35
1759i62K430l1k278n1K032P2j784p97K098J015j865j183J653J489j713j233J446
1776C38J579j604j542J069J865j275j321M86J907q08j629M77J593K19k608N4K014
1793H14J18j722k42J674M21j917o64J936O86j969j064J626J357j224j748J074
1809h44J586q46j839P84J904p29j683K46J782k47j488K87J288M33k174o3J784
1826A81M03j579q46K076O29j826m80J388J167j293j495J274J428r31j398P82J299
1843G79m97j372N08J615o71j519M23J548K16j617O5J155M25j273n14J341N80j410
1861b18j049J875P37j073p82O35J291j060j416J200J577p92j668L25J323O0j524
$$ plain form
1878 -559 -200 1119 873 -545 -732 854 1288 -409 -773 951 1288 134 -659 455 1171 -37 -876
1895 -876 478 1517 801 -704 87 1601 599 -648 -238 1664 1127 -785 -618 1455 1653 -560 -707
1912 -707 732 1160 -319 -862 935 1181 -567 -1184 541 1058 -458 -1299 -215 887 -345 -1356 -544
1929 -544 715 -162 -1785 -769 338 233 -1424 -1115 437 99 -1519 -993 502 402 -1113 -1546 65
1946 65 621 -706 -1348 195 720 -555 -1450 47 745 -439 -975 -115 925 -97 -1283 -610 824
1963 824 170 -1189 -537 863 424 -1097 -1208 597 986 -530 -940 675 738 -627 -1394 420 1393 -460
1981 -460 -1295 39 1060 188 -1038 70 1430 376 -1126 -229 1424 472 -951 -372 1500 798 -760
1998 -760 -160 1611 701 -1172 -617 1266 1651 -341 -487 627 1075 -135 -476 983 1816 -495 -1106
$$ packed form
1878e59L59J319k46j418j87J586M34j697l64J724L37j154p93J114P16j208q39
1895h76J354J039p16j505P91J514j002j247M10J902n37j912J67K073J98k213j47
1912g07J439M28j479n43J797K46j748o17J725N17j516q41J084J102j232j011Q12
1929e44J259q77j623J016J107j05j657L09J552l38j618N26J495j00j515m33J611
1946F5N56j327o42J543N25j275q95J497O98j184n36Q60J040j022j186O73J434
1963H24o54j359O52J400m39j521j11J805L89j516m10J615O3j365p67J814R73j853
1981d60q35J334J021q72j226J108J360j054j502Q97J653r52j423N79J872p02j558
1998g60O00J771r10j873N55J883L85j992j46J114M48j210l41J459Q33k311o11
$$ plain form
2015 -1106 620 1514 73 -648 485 1420 -39 -1188 543 2039 611 -697 -19 1297 538 -804
2031 -804 288 1435 922 -798 -267 1309 911 -585 -192 825 786 -715 -512 922 968 -645 -873 13
2049 13 404 -153 -671 -14 353 -678 -1010 -38 538 68 -1026 -687 -40 -236 -1124 -529 495 -212 -1089
2068 -1089 -919 -336 223 -223 -701 -84 64 -924 -1113 126 619 -200 -672 -750 346 293 -722 -521 -155
2087 -155 83 -616 -878 60 238 -644 -1169 -437 718 -250 -579 -252 516 229 -1287 -296 979 686 -712
2106 -712 -639 513 93 -1381 -699 1418 1125 -994 -1495 110 650 -509 -710 1124 1199 -625 -1721 509
2124 509 1304 -103 -904 566 1587 -220 -1558 443 2112 428 -1038 85 1740 400 -1080 245
2140 245 1734 541 -1236 135 2341 1142 -1144 -711 1597 1166 -692 -245 1964 1434 -1274 -1325 1592
$$ packed form
2015a106J726Q94j441p21J133R35j459j149J731J496j428j308O78J316p59j342
2031h04J092J147n13j720N31J576l98j496L93J017l9j501K03J434M6j613k28Q86
2049A3L91n57n18O57L67j031l32R72N76m70j094L39O47j96q88N95J024p07q77
2068a089J70N83N59m46m78O17J48r88j89J239M93q19m72p8J096n3j015K01L66
2087a55K38o99k62R38J78q82n25P32J155r68l29L27P68k87j516R91J275k93j398
2106g12P3J152m20j474O82K117k93k119n01J605N40j159k01J834P5j824j096K230
2124E09P95j407q01J470J021j807j338K001J669j684j466J123J655j340j480J325
2140B45J489j193j777J371K206j199k286M33K308m31j858M47K209n30k708n1K917
$$ plain form
2157 1592 1738 -232 -608 1079 1039 -1410 -1383 1350 2248 -426 -1455 434 906 -572 -1168 689 1417
2174 1417 -672 -1869 -292 1242 -100 -1373 -185 901 -565 -1277 171 1292 -80 -1582 -457
2189 -457 833 393 -927 -402 809 -280 -1440 -520 1227 584 -995 -1000 -158 49 -862 -812 588 563 -903
2208 -903 -1322 -215 533 -271 -504 229 -17 -827 -952 -300 442 -304 -477 -521 -2 -467 -490 -161 -199 44 -524
2229 -524 -794 217 -12 441 -499 -486 -62 -330 -301 15 304 214 -181 -487 38 865 356 -240 -17 206 -104
2250 -104 -354 394 988 198 -885 -138 727 647 -177 -95 950 151 -597 -283 796 1136 74 -339 751
2269 751 714 -413 -281 1215 1580 101 -618 532 1261 29 -332 1258 1478 -88 -743 529 1462 358
2287 358 -968 407 1045 -109 -575 447 1357 196 -967 -447 797 608 -911 -367 470 -14 -1181
$$ packed form
2157A592J46j970l76J687m0k449K7K733Q98k674j029J889M72j478n96J857P28
2174A417k089j197J577J534j342j273J188J086j466p12J448J121j372j502J125
2189d57J290m40j320N25J211j089j160R20J747o43j579nQ42K07r11N0J400k5j466
2208i03m19J107P48q04k33P33k46q10j25O52P42p46j73m4N19m65k3L29l8K43n68
2229e24k70J011k29M53r40J3M24k68K9L16K89r0l95l06N25Q27n09n96K23K23l10
2250a04k50P48N94p90j083P47Q65q0q24Q2J045p99p48L14J079L40j062m13J090
2269G51l7j127J32J496L65j479p19J150P29j232l61J590K20j566o55J272R33j104
2287C58j326J375O38j154m66J022R10j161j163N20J244j89j519N44Q37m84j167
$$ plain form
2304 -1181 -390 913 897 -723 -1499 109 338 -608 -631 504 650 -571 -940 486 861 -446 -347 296
2322 296 184 -319 -783 -69 783 -149 -869 -274 367 35 -859 -511 522 -387 -883 -458 272 120 -1047
2341 -1047 -928 -290 -165 -997 -766 123 313 -514 -1239 -378 92 -352 -904 -75 159 -628 -533 -271 665 11
2361 11 -769 -706 197 33 -523 -219 539 537 -723 -513 21 588 -298 -482 226 513 14 -345 55 603 -232
2382 -232 -851 322 787 307 -202 -183 897 530 -397 -315 1101 572 -291 -24 557 924 -185 -211 654 780
2402 780 -165 -547 552 849 -99 -484 295 950 241 -455 341 883 386 -711 -92 886 501 -453 -98
2421 -98 748 460 -656 -541 696 661 -397 -518 922 427 -659 -491 485 489 -501 -520 413 645 -458 -634
2441 -634 138 541 85 -823 -154 546 196 -249 -208 558 -221 -1013 -323 763 8 -761 -724 524 107 -716
$$ packed form
2304a181P91J303j6j620p76J608K29r46k3J135J46j221l69J426L75j307R9O43
2322B96j12n03m64P14Q52r32p20N95O41l32q94L48J033r09m96M25P30j52j167
2341a047J19O38J25q32K31Q89J90q27p25Q61M70m44n52Q29K34p87R5K62R36o54
2361A1p80O3R03j64n56L04P58kj260K10N34N67q86j84P08K87m99l59M00N48q35
2382b32o19J173M65m80n09J9J080l67r27Q2J416n29q63K67N81L67j109k6Q65J26
2402G80r45l82J099K97r48l85P79O55p09o96P96N42m97j097O19R78l85r54L55
2421i8Q46k88j116J15J237l5j058j21J440m95j086J68R76Mr90j9R33K32j103j76
2441f34P72M03m56r08O69P00l50m45M1P66p79p92O90J086p55p69L7J248m17q23
$$ plain form
2461 -716 -435 58 222 -578 -689 -225 386 -604 -903 -100 166 -253 -1073 47 355 -498 -919 -450 740
2480 740 -310 -807 -297 387 20 -496 -466 326 300 -667 -776 399 587 -477 -369 180 527 -634 -244
2499 -244 234 246 -225 -538 249 718 -62 -581 272 655 99 -462 239 696 329 -642 92 693 493 -234
2519 -234 -430 479 574 -221 -301 647 655 -174 -211 348 949 87 -212 502 743 338 -248 311 888 -74 -584 79
2541 79 649 701 -489 166 513 534 -522 -174 858 440 -532 -376 593 510 -439 -563 460 664 -168 -284
2561 -284 -89 603 176 -435 -64 611 14 -442 -167 789 262 -402 -29 718 181 -658 -438 494 331 -638
2581 -638 -616 477 172 -643 -1014 -102 334 -917 -1006 -214 108 -739 -587 -58 414 -627 -894 -360 425 -357
2601 -357 -1119 -296 405 16 -635 -61 292 102 -558 -571 109 196 -639 -490 346 403 -593 -357 207 481 -584
$$ packed form
2461g16K81M93J64q00j11M64O11r90k99Q03K66m19q20J120L08q53m21M69J190
2480G40j050m97N10O84l67n16L0P92k6r67j09J175J88j064J08N49L47j161L90
2499b44M78J2m71l13P87M69p80n19Q53L83n56n61P01M57l67r71P34O01k00p27
2519b34j96R09R5p95q0R48Qq29l7N59O01q62k99P14K41m05n86N59N77r62n10O63
2541G9N70N2j190O55L47K1j056L48J032m18r72J56R69q3r49j24J023K04q32j16
2561b84J95O92m27o11L71O75n97m56K75R56n27o64L73P47n37q39K20R32j63r69
2581f38K2J093l05q15l71R12M36j251q9P92L22q47J52N29M72j041k67N34P85p82
2601c57p62Q23P01l89o51N74L53j90o60j3O80Q7q35J49Q36N7r96K36N64K74j065
$$ plain form
2622 -584 -631 -78 341 25 -659 137 288 -83 -599 -123 722 50 -573 -358 360 33 -710 -261 619 199
2642 199 -277 -208 250 543 -182 -119 471 767 -161 -167 424 715 160 -334 241 730 392 -552 -63 507 317
2663 317 -391 219 481 356 -368 -123 574 296 -313 12 551 630 -152 -210 335 527 32 -362 294 698 -150
2684 -150 -270 166 595 316 -667 151 588 299 -518 -354 504 447 -637 -186 576 118 -924 -643 287 322
2704 322 -436 -631 230 423 -527 -846 198 527 -360 -846 -147 601 -315 -900 130 185 -131 -702 -567 494
2724 494 133 -977 -266 440 50 -708 -382 255 24 -1023 -221 413 480 -702 -780 312 302 -313 -530 768
2744 768 549 -307 -952 102 395 -154 -275 128 521 -61 -669 381 437 -39 -509 -312 496 -64 -425 -87
2764 -87 463 321 -482 -561 532 266 -36 -253 426 49 -65 -583 -39 823 -77 -390 39 506 495 68 234
$$ packed form
2622e84m7N53M19l16o84P96J51l71n16M76Q45o72o23K15P18l27p43M49Q80m20
2642A99m76O9M58K93p25O3N90K96r28oN91K91n55m94N75M89l38r44M89N70j90
2663C17p08O10K62j25p24K45O97k78o09L25N39P9p82n8N45J92m95l94O56M04q48
2684a50j20M36M29k79r83Q18M37k89q17J64Q58n7j084M51P62m58j042K81R30L5
2704C22p58j95Q61J93r50l19J044L29q87m86O99P48r16n85J030N5l16n71J35J061
2724D94l61j110P11P06l90p58L26O37k31j047Q02O34O7j182p8J092j0o15k17J298
2744G68k19q56o45J054K93n49j21M03L93n82o08J050N6m76m70J97Q08n60l61L38
2764h7N50j42q03p9J093k66l02k17O79l77j14n18N44Q62r00l13M29M67j1m27J66
$$ plain form
2785 234 625 117 -497 200 927 648 -89 9 196 484 -57 -34 875 685 -138 -478 145 539 -103 -28 435
2806 435 780 30 -709 -61 896 410 -716 -99 532 284 -535 37 592 462 -732 -455 510 397 -185
2825 -185 -506 449 478 -429 -560 604 621 -856 -987 306 464 -118 -449 345 325 -703 -943 -40 591 -274
2845 -274 -901 -476 118 -608 -973 -67 694 24 -862 -465 401 62 -547 -283 493 -416 -1086 -448 360 597
2865 597 -422 -516 -111 49 -862 -364 408 377 -489 -264 38 295 -282 -394 286 328 -349 -625 197 812 -124
2886 -124 -366 35 113 -70 -24 319 135 39 -448 -216 503 198 -59 -120 350 91 -143 194 379 280 202 -181
2908 -181 60 83 -1 72 -208 184 -261 217 176 236 109 -28 -151 123 227 258 122 309 204 51 -311 171
2930 171 412 431 -454 63 170 43 -295 105 342 407 -33 -305 188 701 37 -489 242 342 -159 -624 199
$$ packed form
2785B34L91n08o14O97P27k79p37R8J87K88n41K3R09j90q23l40O23L94o42P5M63
2806D35L45p50p39O48R57m86j126O17O31k48q19N72N55j30j194K77R65j13n82
2825a85l21R55K9r07j31J164J7j477j31J293J58n82l31P94k0j028k40R03O31q65
2845b74o27M25N94p26l65R06P61o70q86L97Q66l39o09K64P76r09o70O38Q08K37
2865E97j019r4M05J60r11M98P72l1q66K25L02K57n77j12O80M2o77k76Q22O15r36
2886a24k42M01P8j83M6L43j84r6m87K32P19l05k57o1M70k59k34L37J85r9p8l83
2908a81K41K3q4P3k80L92m45M78m1O0j27j37j23K74J04L1j36J87j05j53l62M82
2930A71K41J9q85N17J07j27l38M00K37O5m40k72M93N13o64n26P31J00n01m65Q23
$$ plain form
2951 199 718 16 -646 8 388 -16 -492 -31 831 23 -864 -561 272 -269 -609 -125 386 246 -1007 -207
2971 -207 682 492 -850 -583 250 217 -526 -252 442 436 -806 -668 467 224 -216 -512 125 424 -435 -405
2991 -405 407 564 -255 -828 -127 31 -304 -732 164 542 -346 -1104 -254 583 83 -693 -31 333 -94 -746
3011 -746 -168 298 38 -629 -550 475 233 -422 -139 184 393 -186 -292 166 425 -143 -354 132 502 353
3031 353 -18 -22 229 -190 -413 302 304 496 -24 158 332 -58 -555 -44 548 44 143 -2 424 624 239 -228
3053 -228 465 217 148 38 501 717 284 21 -22 73 189 73 -185 438 79 -314 -411 292 492 -19 -438
3074 -438 -40 34 -49 -262 218 438 -261 -485 -194 53 156 -110 -333 328 277 -227 85 284 68 -540 1
3095 1 206 191 -480 -81 516 167 -248 -418 399 47 -198 -362 177 224 -415 -495 42 582 170 -462 -165 91
$$ packed form
2951A99N19p02o62O54L80m04m76M61Q62q08q87L03Q33n41l40M84N11j40j253Q00
2971b07Q89j90j342K67Q33l3p43K74O94oj242J38J135k43m40k96O37K99q59L0
2991d05Q12J57q19n73P01J58l35m28Q96L78q88p58Q50Q37n00p76O62L64m27o52
3011g46N78M66k60o67P9J025k42o55K83L23K09n79j06M58K59n68k11M86L70j49
3031C53l71mK51m19k23P15KJ92n20J82J74l90m97N11N92n04R9j45M26K00l85m67
3053b28O93k48o9j10M63K16m33k63m3R5J16j16k58O23l59l93r7P03K00n11m19
3074d38L98P4q3k13M80K20o99k24K91K47J03k66k23O61n1n04L12J99k16o08N41
3095AK05j5o71L99N97l49m15j70Q17l52k45j64N39M7o39q0N37N40m12o32K97K56
$$ plain form
3117 91 -240 -578 -85 119 59 -267 -144 76 16 -607 -371 134 115 -296 -149 301 162 -531 -178 90 387
3138 387 -353 -478 397 244 -286 -569 -70 282 -17 -754 55 372 404 -587 -45 181 16 -458 49 234
3158 234 128 -295 42 400 478 -160 -331 342 268 -120 -480 -41 261 -31 -95 228 208 -110 55 451 257
3179 257 -203 -145 322 802 178 -233 591 408 229 -94 184 466 328 -452 86 336 111 -134 -117 230 410
3200 410 -30 -379 116 266 -33 -224 153 430 47 -277 -46 191 -48 -180 -61 8 45 -408 29 317 -49
3221 -49 -433 -311 113 8 -396 -136 266 531 -173 -295 97 107 -180 -447 -26 138 -439 -501 77 133 -47
3242 -47 -324 -190 475 29 -652 -18 336 -55 -591 -96 265 -1 -43 -174 127 11 -315 -208 23 -72 -259
3263 -259 -327 388 474 13 -117 78 -60 3 -61 319 504 97 -286 -139 493 14 -175 -110 66 281 -366 -416
$$ packed form
3117I1l31l38M93K04o0l26J23K20o0o23K36N05j9m11J47M50j39o93L53K68K97
3138C87p40j25Q75j53n30k83M99L52k99p37Q09L17L2r91N42K26j65m74N07J85
3158B34j06m23L37L58P8o38j71O73p4l88l60M39L02k92o4L23k0l18J65L96j94
3179B57m60N8M67M80o24m11Q24j83j79l23K78K82j38p80N38K50k25k45J7L47J80
3200D10m40l49M95J50k99j91L77K77l83l24K31K37k39j32J19O9L7m53M37K88l66
3221d9l84J22M24j05m04K60M02K65p04j22L92J0k87k67M21J64n77o2N78N6j80
3242d7k77J34O65m46o81O34L54l91n36M95L61k66m2j31L01j16l26J07K31r5j87
3263b59o8P15Q6m61j30J95j38O3o4L80J85m07l83J47O32m79j89O5J76K15o47n0
$$ plain form
3285 -416 222 153 -250 -33 165 265 -97 -102 260 270 160 -251 170 192 -186 -482 115 -5 171 -248 -7 573
3307 573 390 -294 -1 475 -191 -283 129 377 223 277 -7 72 203 -104 -204 169 349 -53 -13 378 397 139
3329 139 -181 153 221 126 -90 -89 672 30 -155 76 256 350 -52 -3 -52 276 -369 -3 341 -60 -109 -219 321
3352 321 239 -278 -325 -6 184 -220 -290 -119 53 -58 -412 -67 108 -335 -273 -408 221 96 -306 -284 102 -172
3374 -172 -591 -28 206 -34 -116 -282 17 287 -189 -480 145 444 22 -585 84 65 -283 -593 -238 131 151
3395 151 -455 -46 267 -68 -132 -182 558 23 -368 -305 73 -175 -395 -171 490 100 -470 64 186 254 -270
3416 -270 -438 253 172 -314 -146 560 517 -45 -251 -35 533 -92 -58 230 517 -118 -421 47 553 278 -244
3437 -244 114 232 77 -440 18 550 74 -196 -168 388 117 -66 79 394 174 -159 -142 57 428 -194 -275
$$ packed form
3285d16O38o9m03K17J98J00l62nL62J0j10m11M21K2l78k96N97j20J76m19K41N80
3307E73j83o84K93M76o66r2M12K48j54N4k84P9J31l07j00L73J80m02M0L91J9k58
3329A39l20L34O8r5k16JP61o42j85K31J80R4m02M9m9L28o45L66L44m01m9j10N40
3352C21q2n17m7L19J90m04p0J71J72j11l54L45J75m43O2j35O29j25m02K2L86k74
3374a72m19N63K34k40q2j66K99K70m76k91O25K99m22o07O69j9l48l10L55L69K0
3395A51o06M09L13l35o4n0P40n35l91O3L78k48k20K24O61l90n70N34J22O8n24
3416b70j68O91q1m86J68P06m3n62k06K16N68o25L4K88K87o35l03M68N06k75n22
3437b44L58J18j55n17M58N32m76k70K8N56k71j83J45L15k20l33J7J99L71o22q1
$$ plain form
3458 -275 90 62 -218 -462 149 718 -36 88 -138 96 100 -61 106 258 -32 -262 -73 -39 73 -5 10 41
3480 41 118 -182 -289 116 291 -435 -75 -242 -73 74 -75 191 -139 -137 -187 -66 -193 -100 -229 -193 -7 -82 -159
3503 -159 -30 202 376 -156 -283 -185 166 -174 -262 61 252 -292 -346 -57 116 87 -664 -470 193 176 -354 87
3525 87 185 -288 -672 -167 292 210 -376 -284 -63 330 -412 -222 124 7 -272 15 99 282 -106 -393 94 327
3547 327 53 -492 491 467 309 -434 -48 394 92 48 177 363 -162 -147 -181 270 22 -183 -14 325 201
3568 201 -346 -276 346 239 5 116 162 395 280 -88 176 359 -176 -174 203 146 -11 -139 24 61 -50 169
3590 169 51 573 -24 -325 -54 -126 -76 74 1 34 110 -14 -43 214 151 -180 -233 -25 111 19 153 86 106 -131
3614 -131 45 -386 108 134 -203 242 -31 47 -257 -65 172 -167 -362 -312 -71 102 -18 -12 -25 -169 -92 -103 -179
$$ packed form
3458b75L65k8k80k44O11N69p54J24k26K34Mj61J67J52k90k30J89L4J12p8J5L1
3480D1P7l00j07M05J75p26L60j67J69J47j49K66l30Kn0J21j27R3j29L6J86p5p7
3503a59J29K32J74n32j27R8L51l40q8L23J91n44n4K89J73k9p51J94O63j7n30M41
3525H7R8m73l84N05M59q2n86R2K21L93p42J90L46j17k79K87Q4J83l88k87M87K33
3547C27k74n45R83k4j58p43L86M42l02m4J29J86n25J5l4M51k48k05J69L39j24
3568B01n47P0O22j07k34J11M6K33j15l68K64J83n35KL77n7j57j28J63L7j11K19
3590A69j18N22n97l01K71p2N0J50p3L3P6j24k9K57o3l31n3K08J36r2J34o7K0k37
3614a31J76m31M94K6l37M45k73P8l04J92K37l39j95N0K41J73j20Oj3j44P7j1p6
$$ plain form
3637 -179 282 121 -73 -109 -213 -214 -231 25 239 -64 -440 -260 -99 62 -470 -218 222 331 -2 -136 206
3658 206 202 -390 -272 -117 261 -298 -257 78 172 142 -68 268 -57 -178 -492 107 320 12 -171 62 575 -3
3680 -3 -421 -142 357 24 -230 -150 91 263 -308 -435 589 377 201 -237 225 242 237 -63 454 571 -151 -411
3702 -411 491 402 -7 -138 -192 248 56 -208 52 500 -88 -439 405 355 -53 165 213 95 -34 71 98 296
3724 296 -47 -28 134 190 -128 61 104 188 112 -107 -348 129 274 192 -133 0 295 -118 -203 -24 -36 -19 -86
3747 -86 152 -54 -29 73 -3 -83 169 -192 -186 8 44 -25 -274 20 262 39 -134 -328 -153 47 1 50 3 197
3771 197 -100 -113 103 -102 -169 -69 -260 3 -275 -432 -75 -197 -273 -95 236 -41 -42 -96 -27 160 -167 -48
3793 -48 118 8 15 -246 -153 -66 -108 -445 -54 429 82 -87 -103 484 92 -258 -143 52 0 -161 -202 -59 374
$$ packed form
3637a79M61j61j94l6j04jj7K56K14l03l76J80J61J61n32K52M40J09l33j34L42
3658B06mn92J18J55L78n59M1L35R4l0k10L36l25j21l14N99K13l08j83K33N13n78
3680cm18K79M99l33k54Q0K41J72n71j27J024k12j76m38M62J7nl00N17J17p22k60
3702d11R02q9m09j31n4M40j92k64K60M48n88l51Q44n0m08K18M8j18j29J05K7J98
3724B96l43J9J62N6l18J89M3Q4p6k19k41M77J45q2l25J33K95m13q5J79j2J7o7
3747h6K38k06K5J02p6q0K52l61OJ94L6o9k49K94K42k23j73j94J75K00m6M9m7J94
3771A97k97j3K16k05o7J00j91K63k78j57L57j22p6J78L31k77jn4O9J87l27J19
3793d8J66j10Pk61R3Q7m2l37L91M83l47j69j6N87l92l50J15J95n2j61m1J43M33
$$ plain form
3816 374 -68 -340 282 148 89 -5 219 305 10 -452 339 348 230 -122 -123 115 182 -331 -160 225 420 -156 121
3839 121 -140 31 -88 -16 416 77 75 -95 74 372 -193 55 126 136 111 -155 46 -45 273 -331 -35 241
3861 241 62 -164 45 124 247 44 -65 94 -119 -209 -119 39 -144 87 -103 137 92 -260 277 144 14
3882 14 -97 -136 91 38 -115 -348 -227 269 -100 -153 37 202 -111 -336 -210 320 147 -66 -287 -235 -137 -175
3904 -175 120 236 69 -39 -204 171 98 80 -174 -17 2 130 -3 -113 469 -333 -355 103 10 242 -315 -37
3926 -37 258 121 -166 162 86 158 -276 -83 112 116 -280 -72 40 85 192 -159 25 200 -197 -324 -117 195
3948 195 154 24 84 449 157 -97 -22 268 175 -303 75 -31 140 -54 -59 -115 346 -113 -126 66 -26 46 42 119
3972 119 203 -109 -277 113 321 -137 21 -90 12 80 41 -84 405 -133 -229 18 237 53 -221 88 -7 -181
$$ packed form
3816C74m42k72O22j34n9r4K24Q6k95m62P91Rj18l52jK38O7n13J71L85J95n76K77
3839A21k61J71j19P2M32l39kj70J69K98n65K48P1J0k5k66K01r1L18o04K96K76
3861B41j79k26K09P9J23k03j09J59k13r0R0J58j83K31j90K40m5l52N37j33j30
3882A4j11l9K27n3j53k33J21M96l69n3J90J65l13k25J26N30j73k13k21N2R8l8
3904a75K95J16j67j08j65L75p3j8k54J57J9J28j33j10N82q02k2M58r3K32n57K78
3926c7K95j37k87L28p6P2m34J93J95Ml96K08J12M5J07l51J84J75l97j27K07L12
3948A95m1j30O0L65k92k54P5K90r3m78L78j06J71j94nn6M61m59j3J92r2P2mP7
3972A19Q4l12j68L90K08m58J58j11J02O8l9j25M89n38r6K47K19j84k74L09r5j74
$$ plain form
3994 -181 -544 95 334 -170 -234 -4 114 -97 -13 -290 -106 137 -39 -114 -213 9 -313 -71 169 -60 -56 99
4016 99 31 -245 -25 -346 -11 88 48 -232 -176 135 -251 -495 -274 67 221 -134 -394 44 314 -228 -128 -238
4038 -238 216 -54 -339 -230 45 53 -276 -128 163 84 -446 -46 -155 196 -230 -35 174 3 -335 -241 -45
4059 -45 -268 244 113 300 80 -40 -169 181 142 -22 -212 -176 219 -118 -180 102 259 -78 -251 -100 -48 74
4081 74 30 205 213 -153 -93 -37 351 2 -284 60 184 96 88 -237 -156 373 122 -335 300 118 12 -317 249
4104 249 138 -325 -107 78 253 206 -139 -22 70 157 -130 -29 339 250 -320 -70 -18 93 -175 -312 279 157
4126 157 105 -393 82 118 84 -213 88 0 -6 -335 -160 49 -198 -313 -10 26 -210 -90 7 120 21 -59 188
4149 188 -119 68 -22 -196 -37 -229 -263 72 -126 71 -408 -141 -237 -6 -129 -112 -15 10 59 -283 53 -81
$$ packed form
3994a81l63O39K39n04o4K30J18k11Q4k77J84K43j76p5r9K22l22K42K40k29MJ55
4016I9o8k76K20l21L35R9m0k80N6L11l86k44K21L41J54l55k60M38K70n42J00j10
4038b38M54k70k85J09K75Ql29J48K91p9n30M00j09L51m26J95K09j71l38R4J96
4059d5k23N12j31J87k20j20j29L50l9j64j90L6L95l37o2K82J57l37j73J51N2J22
4081G4m4J75Ql66O0N6L88l49k86L44J24q8ql25Q1N29k51m57O35j82j06l29N66
4104B49j11m63K18J85J75m7l45J17R2Q7k87J01L68q9n70K50N2J11k68j37N91j22
4126A57n2m98M75L6l4k97L01q8ol29J75K09k47j15L03L6k36J20R7J13r9q0K47
4149A88l07J87r0j74J59j92l4L35j98J97m79K67r6K31j23J7R7K5M9l42L36j34
$$ plain form
4171 -81 -258 -78 -275 40 -128 -132 259 10 -21 -173 -211 -22 70 161 -335 119 141 111 -142 92 113 -78 -265
4194 -265 -88 82 127 -411 -319 -51 300 104 -71 245 212 -131 -399 18 61 51 -43 74 178 -297 -215 122
4216 122 368 -38 -128 122 18 99 90 261 268 -83 -441 153 495 28 -144 -305 116 100 -43 41 198 -79 -65
4239 -65 -416 -30 201 -59 -178 135 -11 -435 -292 251 120 -256 -61 31 358 -390 -218 272 144 -207 115
4260 115 -113 279 20 83 -237 -191 -156 -427 -86 165 140 -431 155 58 -11 -342 19 232 -103 48 -22 102
4282 102 -237 -411 105 -102 117 -237 -387 -13 64 -401 41 -92 184 -216 -188 272 -42 78 -200 280 163
4303 163 -58 -9 23 114 -51 -59 149 -139 21 -298 -337 -225 -99 -143 131 28 -58 40 -196 14 203 97 290
4326 290 -188 10 -24 86 -47 -84 127 -148 -238 362 211 175 -8 168 28 254 73 -37 4 122 283 -357
$$ packed form
4171h1j77J80j97L15j68mL91k49l1j52l8J89R2R1m96M54K2l0k53K34K1j91j87
4194b65J77J70M5n38R2K68L51j96j75L16l3l43k68M17M3j0r4J17J04m75Q2L37
4216A22K46m06r0K50j04Q1rJ71Pl51l58N94L42m67j72j61M21j6j43Q4J57k77J4
4239f5l51L86K31k60j19L13j46m24J43N43j31l76J95R2L27p48J72M90j28l51L22
4260A15k28L92k59O3l20M6L5k71L41K51k5n71N86r7o9l31L61K13l35J51p0J24
4282A02l39j74N16k07K19l54j50L74P7m65M42j33K76m00K8M60l14J20k78M80j17
4303A63k21M9L2R1j65qK08k88J60l19l9J12J26m4K74j03q6R8k36K10J89j06J93
4326B90m78J98l4J10j33l7K11k75r0O00j51l6j83J76j40K26j81j10M1J18J61o40
$$ plain form
4348 -357 258 228 2 -158 33 -75 168 75 232 260 -206 59 -152 34 -26 115 72 206 72 -187 179 12
4370 12 123 43 -166 300 276 -383 174 426 -221 37 -120 -7 -81 -38 100 255 -5 -259 -80 140 86 -98
4392 -98 -86 -139 4 -138 -182 -93 202 34 -310 -121 247 98 -441 165 53 -273 -158 254 204 56 -437 -77
4414 -77 174 -94 69 -145 -243 -303 -386 -314 -18 -14 -128 -171 -232 -59 -207 322 -157 -70 -144 -275 -41 6 -16 97
4438 97 -204 152 -109 -19 -159 -9 280 -324 -57 -7 61 67 -251 20 316 -158 -45 -114 30 296 86 5 265
4461 265 87 -125 280 19 -14 -365 -77 -142 -102 -101 95 92 221 200 -105 87 85 110 -139 -190 148 160 177 -230 592
4486 592 -101 38 -4 73 262 1 228 15 -104 154 152 -156 100 -297 41 -231 -65 20 -72 -72 306 -116 3
4509 3 145 174 -126 159 80 219 148 31 7 99 12 -214 220 -117 -215 1 115 242 135 5 6 177 -81 -132
$$ packed form
4348c57O15l0k26j60J91j08K43r3J57K8m66K65k11J86o0J41m3J34j34k59L66j67
4370A2J11q0k09M66k4o59N57K52o47K58j57J13p4M3J38J55k60k54J79K20n4j84
4392i8J2n3J43j42m4Q9K95j68l44J89L68j49n39O06j12l26J15M12n0j48m93L60
4414g7K51k68J63k14r8o0q3P2K96Mj14m3o1J73j48N29m79Q7p4j31K34M7k2J13
4438I7l01L56k61R0j40J50K89o04K67N0O8Ol18K71K96m74J13o9J44K66k10q1K60
4461B65j78k12M05k61l3l51K88o5M0JJ96lJ29k1l05J92kK5k49n1L38J2J7m07Q22
4486E92o93J39m2P7J89k61K27k13j19K58kl08K56l97L38k72J66Q5r2%L78m22J19
4509CJ42K9l00K85p9J39p1j17k4R2q7k26M34l37r8K16J14J27j07j30JJ71k58n1
$$ plain form
4533 -132 -48 -164 27 -11 243 -193 -126 -47 -350 261 53 -279 -187 266 294 -51 101 182 38 120 136 106 -90
4556 -90 6 213 -3 -72 157 -194 99 260 54 88 71 96 -279 -71 -65 54 73 77 198 47 79 -215 101 85
4580 85 198 -242 -32 88 80 -33 123 -38 -5 106 50 112 -22 -89 -33 -136 69 98 80 -73 98 -283 -184 140
4604 140 -178 5 -6 110 -81 -51 111 -154 178 -7 -73 -39 34 306 -75 -85 -34 -194 -95 -55 113 -99 -38
4627 -38 -356 -37 -38 126 32 163 173 194 58 10 327 -214 -32 -375 200 125 -64 -326 306 29 128 177 -120
4650 -120 -16 -29 30 -132 -1 86 -155 -172 181 101 31 -169 97 199 -269 -262 156 -207 6 -219 -277 116 -405
4673 -405 -265 -169 159 -22 228 239 -131 -91 -67 -118 162 280 -95 206 174 1 -13 -72 129 72 18 -2 -75 143
4697 143 -116 -40 123 189 -1 -287 -43 -32 -208 230 -25 -282 -219 -312 46 284 -152 31 0 -147 304 244
$$ packed form
4533a32Q4j16J91l8K54m36O7P9l03O11k08l32R2M53K8l45J52Q1j44Q2J6l0j96
4556i0R6K07k16o9K29l51K93J61k06L4j7K5l75K08OJ19J9MJ21j51L2k94L16j6
4580H5J13m40K10J20qj13J56j61L3J11n6O2j34o7N6j03K05K9j8j53J71l81R9L24
4604A40l18J83j1J16j91L0J62k65L32j85o6L4P3K72l81j0N1j60R9M0J68k12O1
4627c8l18L19jJ64r4J31J0K1j36m8L17n41J82l43N75p5j89k62O32k77R9M9k97
4650a20J04j3N9j62J31Q7k41j7L53q0p0k00K66J02m68PM18l63K13k25n8L93n21
4673d05J40R6L28j81K50J1l70M0K4n1K80J18l75L01l2j73j4n9K01n7n4k0p3K18
4697A43k59P6J63O6j90k86K44J1j76M38k55k57O3r3L58K38m36J83l1j47M51o0
$$ plain form
4719 244 -98 41 -594 -178 68 70 228 254 -90 108 134 182 48 219 15 56 38 167 -5 -313 224 252 247
4742 247 -179 258 105 224 -22 -259 -130 -80 80 229 -6 107 234 -166 -111 168 -145 141 -184 -7 498
4763 498 -198 91 -133 95 111 -334 32 135 -214 -113 12 -42 -251 -282 -69 211 -65 1 -37 269 -187 -39
4785 -39 -225 65 268 93 54 85 230 -24 -95 32 -27 -277 -324 11 -60 -323 -49 72 246 -122 -74 47 203
4808 203 -196 -304 278 173 -234 -26 220 -51 -207 -192 174 181 -26 -370 152 296 -100 36 -52 -65 30 -23
4830 -23 -54 -39 11 -46 0 -102 206 39 87 37 305 227 14 305 264 26 -316 55 -1 -166 -6 -19 -64 -30 263
4855 263 -116 19 269 141 -187 84 193 200 -100 209 341 -262 -212 -62 86 220 -256 445 -11 104 -53
4876 -53 -32 -6 81 57 108 109 -78 7 -179 -131 -19 118 -90 180 53 -65 -34 259 451 182 -188 -52 183 -61
$$ packed form
4719B44l42J39o35M16K46KJ58K6l44J98K6M8j34J71k04M1j8J29j72l08N37K8n
4742B47m26M37j53J19k46k37J29N0J60J49k35J13J27m00N5K79l13K86l25J77N05
4763D98o96K89k24K28J6m45L66J03l49J01J25n4k09l1K13K80k76O6l8L06m56J48
4785c9j86K90K03j75l9L1J45k54p1J27n9k50m7L35p1k63K74J21J74l68M8J21J56
4808B03l99j08N82j05m07K08K46k71j56J5L66Pk07l44N22J44l96J36q8j3R5n3
4830b3l1J5N0n7M6j02L08j67M8n0K68p8k13K91m1k38l42L71n6j65J60j3m5L4K93
4855B63l79J35K50j28l28K71J09Pl00L09J32o03N0J50J48J34m76P01m56J15j57
4876e3K1K6Q7k4N1Jj87Q5j86M8J12J37k08K70j27j18L1K93J92k69l70J36K35k44
$$ plain form
4900 -61 169 16 123 -202 15 152 -16 65 -203 -4 50 65 -133 -171 9 278 -9 -194 -176 329 115 -366
4922 -366 -31 141 -110 -170 3 -41 32 -333 -119 31 144 -17 180 290 -164 -10 24 -292 14 -271 -58
4943 -58 402 10 65 275 -17 172 -10 -345 15 -103 88 131 -41 -4 34 139 -310 90 19 -96 -181 143
4965 143 -360 -150 49 107 115 99 -403 -373 -269 119 89 11 96 -200 -44 75 20 -132 -32 -152 125 -71 76
4988 76 357 221 4 -24 -47 56 -74 -109 91 -218 24 254 152 -155 263 55 8 11 -76 -82 165 60 67 91
5012 91 -75 -279 -195 194 -60 266 -74 87 56 -61 -155 1 -33 -93 118 280 231 -259 281 -449 170 -140
5034 -140 -220 226 -87 -106 -81 85 103 12 277 154 -110 -163 -55 -4 -89 -77 200 254 -74 -171 216 43 154 -253
5058 -253 -147 -188 124 24 -413 -64 192 6 -51 -17 -277 -357 -13 57 -35 -160 -134 195 125 0 -180 -85 152
$$ packed form
4900f1K30j53J07l25K17J37j68Q1k68J99N4J5j98l8J80K69k87j85J8N05k14m81
4922c66L35J72k51o0J73m4P3l65K14J50J13j61J97J10m54J54L4l16L06k85K13
4943e8M60l92N5K10k92J89j82l35L60j18J91M3j72L7L8J05m49M00p1j15q5L24
4965A43n03K10J99N8Qj6n02L0J04L88l0p8Q5k96J56J19n5j52J00j20K77j96J47
4988G6K81j36k17k8k3J03j30l5K00l09K42K30j02l07M18k08m7Lq7oK47j05PK4
5012I1j66k04Q4L89k54L26l40J61l1j17r4J56l4o0K11J62m9m90N40p30O19l10
5034a40q0M46l13j9K5J66J8r1K65j23k64n3J08N1q5J2K77N4l28r7L87j73J11m07
5058b53J06m1L12j00m37L49K56j86n7L4k60q0L44P0r2j25K6L29p0j25j80R5K37
$$ plain form
5081 152 -252 -171 -208 -106 75 -7 47 6 151 6 -62 33 -102 -51 61 -8 -240 -195 -134 -129 180 -156 141 168 -135
5106 -135 -395 -54 273 11 -95 60 87 162 219 20 65 84 -156 -201 26 150 114 -172 -85 23 23 126 27 -42
5130 -42 231 0 42 -70 -114 -31 -123 54 -30 70 -29 125 244 -196 101 42 -22 28 -96 -307 154 151 -49 25
5154 25 -24 65 140 -215 303 -199 -30 -161 32 179 -167 137 -10 109 371 103 15 -70 -33 -19 -243 56 11
5177 11 -115 -70 78 -135 -36 -6 -112 -31 -81 -69 -121 142 -94 -238 43 79 -220 -82 -219 114 -138 -205 11
5200 11 -279 217 137 -125 121 -127 -354 311 -142 65 -209 45 149 -237 355 26 -11 -94 -169 -100 -36 -179
5222 -179 -273 -67 91 223 -87 -193 -7 -18 95 153 180 187 4 280 45 -131 -138 -244 26 142 -11 -185 -43
5245 -43 -29 168 -3 -132 205 -74 -229 -72 -321 25 214 202 222 22 -48 -61 -18 -68 9 223 149 -255 46
$$ packed form
5081A52m04Q1l7J02J81q2N4m1J45j45o8R5j35N1J12o9k32M5O1NL09l36K97K7l03
5106a35k60L41L27k62j06J55K7P5N7j99M5J9k40m5K27J24l6k86Q7J08%J03r9o9
5130d2K73k31M2j12m4Q3r2J77q4J00r9J54J19m40K97n9o4N0j24k11M61lk00P4
5154B5m9Q9P5l55N18n02J69j31J93J47l46L04j47J19K62k68q8q5L7J4k24K99m5
5177A1j26M5J48k13R9L0j06Q1n0J2n2K63k36j44K81L6k99J38j37L33k52o7K16
5200A1k90M96q0k62K46k48k27O65m53K07k74K54J04l86N92l29l7q3p5O9O4j43
5222a79r4K06J58J32l10j06J86j1J13N8K7Pj83K76k35j76pj06K70J16j53j74J42
5245d3J4J97j71j29L37k79j55J57k49L46J89j2K0k00p0j3M3n0P7K14p4m04L01
$$ plain form
5268 46 -107 30 222 121 15 -273 -135 -123 136 33 214 -186 -83 61 -75 25 2 279 -21 178 18
5289 18 -150 103 15 -34 -91 -47 22 97 -240 -174 131 102 3 -117 -21 -682 -55 128 -104 -31 91 -49 -1 41 -62
5314 -62 -210 -49 180 -187 137 -249 -1 -114 197 -159 5 -176 -28 -206 -234 -440 118 -131 61 83 469
5335 469 152 25 -201 -49 -286 179 -76 149 174 127 107 81 -189 24 32 -68 319 87 206 -123 -154 18
5357 18 291 60 -314 103 -286 131 -127 -62 100 243 235 244 28 8 -96 -89 141 113 139 -13 95 -27 -64 -127
5381 -127 -98 226 -114 -157 43 -142 64 -139 -74 87 52 40 217 170 98 83 -16 5 -570 194 36 -212 328
5404 328 64 98 -4 -33 -271 112 15 35 47 136 -96 65 -82 -114 191 142 180 18 42 -34 22 -437 -30 79
5428 79 -241 105 -74 388 -16 -215 -259 62 16 115 -238 61 177 199 -36 -191 61 28 37 -153 -143 -71 -37 -108
$$ packed form
5268D6j53J37J92j01j06k88J38J2K59j03J81m00J03J44j36J00k3K77l00J99j60
5289A8j68K53q8m9n7M4O9P5l37O6L05k9r9j20R6o61O27J83k32P3J22j40M8M2j03
5314f2j48J61K29l67L24l86K48j13L11l56J64j81J48j78k8k06N58k49J92K2L86
5335D69l17j27k26J52k37M65k55K25K5m7k0k6k70K13Qj00L87k32J19l29l1J72
5357A8K73k31l74M17l89M17k58O5J62J43qRk16k0j04PK30k8K6j52J08j22l7o3
5381a27K9L24l40m3K00j85K06k03O5J61l5j2J77m7p2j5r9K1n75P64j58k48N40
5404C28k64L4j02k9k38L83r7K0J2Q9k32J61j47l2L05m9L8j62K4p6N6m59M07J09
5428G9l20L46j79M62m04j99m4L21m6R9l53K99J16K2k35j55K52l3Rj90J0P2L4p1
$$ plain form
5452 -108 -175 -135 -27 148 132 38 149 359 -189 310 -171 10 119 -161 -45 -200 67 385 -56 137 -57
5473 -57 -102 -452 -125 303 65 139 155 93 93 319 182 50 60 -123 -38 51 -23 49 15 -84 -167 98 -55 -200 202
5498 202 -76 -112 26 140 62 -396 -365 151 92 -47 58 -5 9 61 90 -100 90 153 -52 63 -44 132 -211
5521 -211 -12 417 -163 29 -315 407 -16 -227 218 -94 138 -13 28 128 327 -63 3 109 3 -178 31
5542 31 -41 -291 47 -234 -57 296 -39 -34 -21 8 5 95 9 119 -44 119 79 -148 -116 318 105 -193 -13 -54
$$ packed form
5452a08o7M0J08J75j6r4J11K10n48M99m81J81J09k80J16j55K67L18m41J93j94
5473e7m5l50L27M28k38P4J6o2%K26j37j32J0j83Q5Q9p4P2l4r9q3K65j53j45M02
5498B02k78l6J38J14p8m58L1N16n9j39J05o3J4N2K9j90J90O3k05J15j07J76l43
5521b11J99M29n80J92l44P22m23k11M45l12K32j51M1J00J99l90O6J06j06j81K09
5542C1p2k50L38k81J77L53l35NJ3K9lR0q6J10j63J63m0k27L2M34k13k98J80m1
$$ [...]
8191a50
##END NTUPLES=NMR FID
##END=
