##TITLE=1H_Ser 1370
 CDcl3, 8 sc, 
 20.12.2019
##JCAMPDX= 6.0         $$ Bruker NMR JCAMP-DX V2.0
##DATA TYPE= NMR FID
##DATA CLASS= NTUPLES
##ORIGIN= UXNMR, Bruker Analytische Messtechnik GmbH
##OWNER= root
$$ XWIN-NMR		Version 3.5
$$ Fri Dec 20 15:31:22 2019 Russian Standard Time (UT+4h)  she@DPX200
##.OBSERVE FREQUENCY= 200.1315
##.OBSERVE NUCLEUS= ^1H
##.DELAY= (6, 6)
##.ACQUISITION MODE= SIMULTANEOUS
##.ACQUISITION SCHEME= undefined
##.AVERAGES= 8
##.DIGITISER RES= 18
##SPECTROMETER/DATA SYSTEM= spect
##.PULSE SEQUENCE= zg30
##.SOLVENT NAME= CDCl3
##.SHIFT REFERENCE= (INTERNAL, CDCl3, 0, 15.7039)
##AUDIT TRAIL= $$ (NUMBER, WHEN, WHO, WHERE, WHAT)
$$ ##TITLE= Audit trail, XWIN-NMR		Version 3.5
$$ ##JCAMPDX= 5.01
$$ ##ORIGIN= Bruker BioSpin GmbH
$$ ##OWNER= she
$$ F:/spectra/data/she/nmr/H-F/1/audita.txt
$$ ##AUDIT TRAIL=  $$ (NUMBER, WHEN, WHO, WHERE, WHAT)
(   1,<2019-12-20 15:30:21.73 +0400>,<she>,<DPX200>,
      <created by zg, POWCHK disabled, PULCHK disabled
       configuration hash MD5:
       00 E9 B6 7A A2 85 ED C7 34 08 36 98 17 FE 4E 26
       data hash MD5: 16K
       60 DD F6 A7 E3 F2 DC F7 22 7A 08 96 6F 44 C3 25>)
$$ ##END=
$$ 
$$ hash MD5
$$ AD 93 CD D8 E1 2C 21 B9 84 3E E7 6C E1 64 1B C8
##$RELAX= 
##$RELAX= 
##$RELAX= 
##$RELAX= 
##$RELAX= 
##$RELAX= 
$$ Bruker specific parameters
$$ --------------------------
##$DU= <F:/spectra>
##$EXPNO= 1
##$NAME= <H-F>
##$PROCNO= 1
##$TYPE= <nmr>
##$USER= <she>
##$AMP= (0..31)
100 100 100 100 100 100 100 100 100 100 100 100 100 100 100 100 100 100 
100 100 100 100 100 100 100 100 100 100 100 100 100 100 
##$AQSEQ= 0
##$AQ_mod= 1
##$AUNM= <au_zg>
##$AUTOPOS= <>
##$BF1= 200.13
##$BF2= 200.13
##$BF3= 200.13
##$BF4= 200.13
##$BF5= 200.13
##$BF6= 200.13
##$BF7= 200.13
##$BF8= 200.13
##$BYTORDA= 1
##$CFDGTYP= 0
##$CFRGTYP= 5
##$CHEMSTR= <none>
##$CNST= (0..31)
1 1 145 1 1 1 1 1 1 1 1 1 1 1 1 1 1 1 1 1 1 1 1 1 1 1 1 1 1 1 1 1 
##$CPDPRG= <>
##$CPDPRG1= <>
##$CPDPRG2= <>
##$CPDPRG3= <>
##$CPDPRG4= <mlev>
##$CPDPRG5= <mlev>
##$CPDPRG6= <mlev>
##$CPDPRG7= <mlev>
##$CPDPRG8= <mlev>
##$CPDPRGB= <>
##$CPDPRGT= <>
##$D= (0..31)
0 1.2 0 0 0 0 0 0 0 0.06 0 0.03 0 0 0 0 0.0002 0 0 0 0 0 0 0 0 0 0 0 0 
0 0 0 
##$DATE= 1576841421
##$DBL= (0..7)
120 120 120 120 120 120 120 120 
##$DBP= (0..7)
150 150 150 150 150 150 150 150 
##$DBP07= 0
##$DBPNAM0= <>
##$DBPNAM1= <>
##$DBPNAM2= <>
##$DBPNAM3= <>
##$DBPNAM4= <>
##$DBPNAM5= <>
##$DBPNAM6= <>
##$DBPNAM7= <>
##$DBPOAL= (0..7)
0.5 0.5 0.5 0.5 0.5 0.5 0.5 0.5 
##$DBPOFFS= (0..7)
0 0 0 0 0 0 0 0 
##$DE= 6
##$DECBNUC= <off>
##$DECIM= 24
##$DECNUC= <off>
##$DECSTAT= 4
##$DIGMOD= 1
##$DIGTYP= 9
##$DL= (0..7)
0 120 120 120 120 120 120 120 
##$DP= (0..7)
150 150 150 150 150 150 150 150 
##$DP07= 0
##$DPNAME0= <>
##$DPNAME1= <>
##$DPNAME2= <>
##$DPNAME3= <>
##$DPNAME4= <>
##$DPNAME5= <>
##$DPNAME6= <>
##$DPNAME7= <>
##$DPOAL= (0..7)
0.5 0.5 0.5 0.5 0.5 0.5 0.5 0.5 
##$DPOFFS= (0..7)
0 0 0 0 0 0 0 0 
##$DQDMODE= 0
##$DR= 18
##$DS= 0
##$DSLIST= <SSSSSSSSSSSSSSS>
$$ [...]
##$SUBNAM2= <"">
##$SUBNAM3= <"">
##$SUBNAM4= <"">
##$SUBNAM5= <"">
##$SUBNAM6= <"">
##$SUBNAM7= <"">
##$SUBNAM8= <"">
##$SUBNAM9= <"">
##$SW= 24.9337058887773
##$SWIBOX= (0..15)
0 0 2 0 0 0 0 0 0 0 0 0 0 0 0 0 
##$SW_h= 4990.01996007984
##$TD= 16384
##$TD0= 1
##$TE= 0
##$TE2= 300
##$TE3= 300
##$TEG= 300
##$TL= (0..7)
0 120 120 120 120 120 120 120 
##$TP= (0..7)
150 150 150 150 150 150 150 150 
##$TP07= 0
##$TPNAME0= <>
##$TPNAME1= <>
##$TPNAME2= <>
##$TPNAME3= <>
##$TPNAME4= <>
##$TPNAME5= <>
##$TPNAME6= <>
##$TPNAME7= <>
##$TPOAL= (0..7)
0.5 0.5 0.5 0.5 0.5 0.5 0.5 0.5 
##$TPOFFS= (0..7)
0 0 0 0 0 0 0 0 
##$TUNHIN= 0
##$TUNHOUT= 0
##$TUNXOUT= 0
##$USERA1= <user>
##$USERA2= <user>
##$USERA3= <user>
##$USERA4= <user>
##$USERA5= <user>
##$V9= 5
##$VALIST= <valist>
##$VCLIST= <CCCCCCCCCCCCCCC>
##$VD= 0
##$VDLIST= <DDDDDDDDDDDDDDD>
##$VPLIST= <PPPPPPPPPPPPPPP>
##$VTLIST= <TTTTTTTTTTTTTTT>
##$WBST= 1024
##$WBSW= 4
##$XGAIN= (0..3)
0 0 0 0 
##$XL= 0
##$YL= 0
##$YMAX_a= 137224
##$YMIN_a= -100103
##$ZGOPTNS= <>
##$ZL1= 120
##$ZL2= 120
##$ZL3= 120
##$ZL4= 120
##$ABSF1= 10
##$ABSF2= 0
##$ABSG= 5
##$ABSL= 3
##$ALPHA= 0
##$AQORDER= 0
##$ASSFAC= 0
##$ASSFACI= 0
##$ASSFACX= 0
##$ASSWID= 0
##$AUNMP= <proc_1d>
##$AZFE= 0.1
##$AZFW= 0.1
##$BCFW= 1
##$BC_mod= 2
##$BYTORDP= 1
##$COROFFS= 0
##$CY= 11.3945322036743
##$DATMOD= 1
##$DC= 2
##$DFILT= <>
##$DTYPP= 0
##$F1P= 16.9975609425685
##$F2P= -3.02152046262296
##$FCOR= 0.5
##$FTSIZE= 0
##$FT_mod= 4
##$GAMMA= 1
##$GB= 0.15
##$INTBC= 1
##$INTSCL= 1
##$ISEN= 128
##$LB= 0.24
##$LEV0= 0
##$LPBIN= 0
##$MAXI= 10000
##$MC2= 0
##$MEAN= 0
##$ME_mod= 0
##$MI= 1.114404
##$NCOEF= 0
##$NC_proc= 0
##$NLEV= 6
##$NOISF1= 3.799351
##$NOISF2= 2.8
##$NSP= 1
##$NTH_PI= 0
##$NZP= 0
##$OFFSET= 15.70392
##$PC= 1
##$PHC0= -10147
##$PHC1= 14.6008
##$PH_mod= 1
##$PKNL= yes
##$PPARMOD= 0
##$PSCAL= 0
##$PSIGN= 0
##$REVERSE= no
##$SF= 200.130013532006
##$SI= 16384
##$SIGF1= 3
##$SIGF2= 2
##$SINO= 400
##$SIOLD= 16384
##$SREGLST= <1H.CDCl3>
##$SSB= 0
##$STSI= 0
##$STSR= 0
##$SW_p= 3612.71676300578
##$SYMM= 0
##$S_DEV= 0
##$TDeff= 0
##$TDoff= 0
##$TI= <>
##$TILT= no
##$TM1= 0
##$TM2= 0
##$TOPLEV= 0
##$USERP1= <user>
##$USERP2= <user>
##$USERP3= <user>
##$USERP4= <user>
##$USERP5= <user>
##$WDW= 1
##$XDIM= 8192
##$YMAX_p= 0
##$YMIN_p= 0
$$ End of Bruker specific parameters
$$ ---------------------------------
##NTUPLES= NMR FID
##VAR_NAME=  TIME,          FID/REAL,        FID/IMAG
##SYMBOL=    X,             R,               I
##VAR_TYPE=  INDEPENDENT,   DEPENDENT,       DEPENDENT
##VAR_FORM=  AFFN,          ASDF,            ASDF
##VAR_DIM=   8192,          8192,            8192
##UNITS=     SECONDS,       ARBITRARY UNITS, ARBITRARY UNITS
##FACTOR=    0.0002004,     1,               1
##FIRST=     0,             0,               0
##LAST=      1.6414764,     0,               0
##MIN=       0,             -100103,         0
##MAX=       1.6414764,     137224,          0
$$ Real data points
##PAGE= N=1
##DATA TABLE= (X++(R..R)), XYDATA
0@%%%%%%%%%Lj1J6j6J6j6K4l2L5m3N1n9P1q3R4j08J24j42J63j87K11k36K65l00
33a60L38l76M19m67N20n78O41p10P85q70R64j066J182j312J459j627J818k040
51a080K306k628L022l522M182n102O477q784J3643m4317Q0312M6578j34684l1982
65g5579Q7044L2724r1259j1938J00737L1615j14695n8752Q8949P8391n4518n2219
77c9500M7720L6910o7006m4558P3300P1313n6646q2481K0683O4105r687l3690
89a9537K9079L3589m8057n5599L9805P3299j2141o0754m67L8622j3602l6496K9168
102c091N8939j9467p2885r190O2063K8448l1211j4994K1319n839l8277J690N2559
115C0064K0293m3742l6547J7704K8006j651m392J3947N00l1779k0546K3498L4921
$$ plain form
0 0 0 0 0 0 0 0 0 0 0 3 -8 8 -8 8 -8 16 -16 19 -24 27 -32 39 -44 50 -58 66 -76 87 -100 111 -125 140 -160
33 -160 178 -198 221 -246 274 -304 337 -373 412 -458 506 -560 622 -690 769 -858 960 -1080
51 -1080 1226 -1402 1620 -1902 2280 -2822 3655 -5129 8514 -35803 44509 91087 -43597 -75579
65 -75579 11465 44189 -47070 -59008 41729 73344 -41351 -100103 -11154 67237 12719 -39500
77 -39500 8220 45130 -21876 -66434 6866 78179 21533 -60948 -40265 23840 14153 -19537
89 -19537 9542 43131 -4926 -60525 -20720 52579 40438 -20316 -20783 17839 4237 -32259 -3091
102 -3091 55848 36381 -36504 -45694 16369 44817 13606 -1388 19931 14092 -24185 -22495 30064
115 30064 50357 6615 -29932 -12228 15778 14127 9735 23682 24182 -7597 -28143 -4645 30276
128C0276L31k4410j3288L211K477O572J6933J0785j7088l0727o425K5847K5155
141B9649k985j8232p305K847l877l718J5519K2078j2137m1775j4330L6799L3227
154C5760j6144k7525R003J5439k3575k3525L2072M3264k6273o3955N67O0509J8243
167C3860m3165j3214M0350M230n4867j5285O3396L5929n5621n3221L3248M9085
179B4725k0399l4417K9616L5473l9638n1858L0874O4200j0959n8001j698M0502
191H420n654l5979J8530M9180j4270o0541j197N8277J4920m1969p969L6060m889
204A2919m9446J755O2961J5476n8936k9093M6796K9967l4625j7649M2349J6938
216C9412n5680l4827M9496M8500l3554m6592K2373L6824k2805l0895L3350M2010
$$ plain form
128 30276 30607 6197 -7091 -3880 -1403 5169 22102 32887 15799 -14928 -21353 4494 29649
141 29649 26664 8432 1127 3974 97 -3621 11898 33976 21839 -19936 -34266 2533 35760
154 35760 19616 -7909 1094 16533 -7042 -30567 1505 44769 18496 -45459 -44892 15617 33860
167 33860 -9305 -22519 17831 22061 -32806 -48091 15305 51234 -4387 -57608 -24360 24725
179 24725 4326 -30091 -475 34998 -4640 -56498 -25624 38576 27617 -30384 -32082 8420
191 8420 2766 -33213 -14683 34497 20227 -40314 -41511 16766 31686 -10283 -18252 17808 12919
204 12919 -36527 -34772 28189 43665 -15271 -44364 2432 32399 -2226 -19875 22474 39412
216 39412 -16268 -51095 -1599 46901 13347 -33245 -10872 25952 3147 -27748 5602 47612
228D7612l2746n7198J4819N2974k874m0594N064L4706j3573m1524J5029N4280
240C5975j810n5250j4042M2009J4203l3906n361L9192N309m9458j9102M8631L4348
253D0738l5084l7895K1404L0182k0147k5720K6764L4853k4092m7700P115M7022
265A7440Q071l4743j1136K5097O484k5781m866L2732J6842l0336k9825J4270K9238
278A3487j186j8301J053J2381o914j6582P106K5062L919k3992j4711J1928J4381
291G631l167m268O522L81j5328q356J5224J7612o734j7047p44J0049p49m805J0608
306F829J1294j3385k3800K938K4675N819j7141n367J4224O93j7028J986K7010
319A8747O321k9932j9837J9867K0597j2151j4622J4569J3384j9336j9190K2047
$$ plain form
228 47612 14866 -42332 -27513 25461 22587 -18007 -12943 21763 8190 -33334 -18305 35975
240 35975 34165 -21085 -35127 6882 21085 -12821 -18182 21010 26319 -23139 -42241 6390 40738
253 40738 5654 -32241 -10837 19345 -802 -26522 242 35095 11003 -36697 -29582 17440
265 17440 25511 -9232 -20368 4729 11213 -14568 -19434 13298 30140 -196 -30021 -15751 13487
278 13487 12301 -6000 -4947 7434 520 -16062 -8956 16106 20025 -3967 -18678 -6750 7631
291 7631 4464 196 6718 7099 -8229 -16585 -1361 16251 9517 -7530 -8274 1775 1026 -3779 6829
306 6829 18123 4738 -19062 -16124 8551 14370 -2771 -8138 6086 6779 -10249 -8263 18747
319 18747 25068 -4864 -24701 -4834 15763 3612 -11010 3559 16943 -2393 -21583 464
331D64K8852j3803l2340K425K4749l448k0038Q893K5138r855l3608L518L6694
344A7641O821l0891r762K4800M215k7790l244L5472J1047l8617k2341L1831K7134
357B6316k3271k3635K3225K2806k6563k9277K6530L9112j8680m4515N640L8752
369A6440J09l3118K805L5855m03m0698p263M0411J7316l3427k3411K2612J9411
382A6639j9682j5304K3299K0222k1891k6302J4327K7646o402k3082L467J6074
394I011p782j6422J0838K2479n511k4863j677J9732K492j4373R37J5236m241k0694
408a4838N02K4888P041k2272j1647J5048Q734j5144o772J9900J1410k1050j8567
421b2767J7083K2740r422k1701M548J7373p596j8424R088K5199k728k7183l819
$$ plain form
331 464 29316 15513 -16827 -14402 10347 6899 -13139 -4246 20892 11037 -22571 -19053 17641
344 17641 24462 -6429 -16191 8609 12824 -14966 -18210 17262 28309 -10308 -32649 -818 26316
357 26316 3045 -20590 2635 25441 -1122 -30399 -3869 35243 16563 -27952 -22312 16440
369 16440 16549 -16569 -13764 22091 21688 -19010 -26273 14138 31454 -1973 -25384 -2772 16639
382 16639 -3043 -18347 4952 25174 3283 -23019 -8692 18954 12552 -10530 -7063 9011
394 9011 1229 -15193 -4355 18124 12613 -12250 -13927 5805 8297 -6076 -5139 10097 5856 -14838
408 -14838 -14336 10552 17593 -4679 -16326 -1278 7456 -7688 -14460 5440 16850 -4200 -22767
421 -22767 -5684 17056 7634 -14067 -9519 7854 258 -18166 -9078 16121 13393 -13790 -17609
434a7609K3520Q861j7907p718J6820M882k0200q154K3287J5269j8462j9186J3014
447c583J7899j0351j4466J3077J7382j5010k2698J0853K7326l864k6482r69K2498
460A1612M60k2448P54K7706M878k9382j3125K5915J7998k0443j9882J5039J7574
473A6656j6084k0070J7247K6395j0658k8967K895K5188J515k2127l160J8413J475
486H718k0680m488K2278J1253j7547j3704J1540J0334q964p713R720P047j2053
499d259j0967J0349J3646n310j1058L973P761p008p829R692J1870q069j5444L946
513h707J5005j151j2593J483J3013l442j5970J166K0496N091j8320r753J3909
526B27J0242j2586r417J2406J0993j3493j5503J1266K0086n164j8845N45J5587
$$ plain form
434 -17609 5911 14772 -3135 -10853 5967 10849 -9351 -17505 5782 21051 2589 -16597 -3583
447 -3583 14316 3965 -10501 2576 19958 4948 -17750 -6897 20429 16565 -9917 -10886 11612
460 11612 12072 -10376 -9622 18084 22962 -6420 -19545 6370 24368 3925 -15957 -918 16656
473 16656 572 -19498 -2251 24144 13486 -15481 -12586 12602 14117 -8010 -11170 7243 8718
486 8718 -11962 -16450 5828 17081 -466 -14170 -2630 7704 -1260 -8973 747 7794 -4259
499 -4259 -15226 -4877 8769 3459 -7599 -3626 4135 -2873 -10702 -1010 10860 2791 -12653 -8707
513 -8707 6298 5147 -7446 -5963 7050 3608 -12362 -11196 9300 14391 -3929 -13682 227
526 227 10469 -2117 -11534 872 11865 -1628 -17131 -5865 14221 9057 -9788 -9243 6344
539F344o76j5974J167J7385R78j9278n533J7914R946j4320r773J2138P503j4037
553f216r264J5711J3771j3304j7909R992J8213o946j7234O802J7858p277k1430
566a7233N027K5989J595k4917n935K2325P470k1168q663K1664J1903k2502j6543
579b0988K1272K1769j3818k2042J0244K0072q892k0725P778K2721n458k3657O29
592a1095K3371L618j8981l385J6451K158j7589l187J8636N384j7302p656J4503
605D926O639j2650n194J4786M879j7400p789J7768J1115j5370j2210J3044J1313
618A3857j4767j2700J5475J6123j4453k0174J1234K1329o522j9928M958J8887
630A3319n134k1300J909K2632J638k1419n476J9212P703j5700o854J5037P131
$$ plain form
539 6344 5668 -10306 -9139 8246 9224 -10054 -15587 2327 12273 -2047 -11820 318 7821 -6216
553 -6216 -15480 231 14002 698 -17211 -7219 10994 4048 -13186 -6384 11474 4197 -17233
566 -17233 -12206 13783 15378 -9539 -15474 6851 14321 -6847 -15510 6154 18057 -4445 -20988
579 -20988 284 22053 8235 -13807 -3563 16509 7617 -13108 -5330 17391 11933 -11724 -11095
592 -11095 12276 15894 -3087 -6472 9979 12137 -5452 -8639 9997 15381 -1921 -9577 4926
605 4926 11565 -1085 -6279 8507 13386 -4014 -11803 5965 17080 1710 -10500 2544 13857
618 13857 -910 -13610 1865 17988 3535 -16639 -5405 15924 9402 -10526 -5568 13319
630 13319 8185 -13115 -11206 11426 13064 -8355 -13831 5381 13084 -2616 -9470 5567 12698
643A2698j6645r858J3865J2661j1131j2116P905J1609o952j0296P703J1862p757
656C548j4446M290J4345q75j2528m25J1405k08j2655j147J3809M183j3485q237
670a2426J0243R867p515r473O034R160o052j1810L625J3113L80j2795m180J0726
684a103O363q017o731P385O624p394j0033N836J1623k665j0892o44R940J904p572
699e376j708Q505J681r365l979R222N676o440n206N522M259o275l163Q528M457
714F338q438o464Q233P807o851o335P338P882r725j0287R630J3896p220j4761
728h957N695J5628l528j5597L586J7348k798j9966j183K0387M523j8888n764J7513
742G999P867j7406q383J7977J0315j8003j4217J4964J4925j2237j4662J1509J5070
$$ plain form
643 12698 -3947 -13805 60 12721 1590 -10526 -2621 8988 2036 -8260 -557 11305 3548
656 3548 -10898 -6608 7737 6862 -5666 -6091 5314 5106 -7549 -8696 5113 9296 -4189 -12426
670 -12426 -2183 7684 169 -9304 -3270 5890 -162 -11972 -8347 4766 5146 -7649 -11829 -1103
684 -1103 5260 -2757 -9488 -2103 4521 -2873 -12906 -7070 4553 1888 -9004 -9648 292 2196 -5376
699 -5376 -7084 1421 3102 -6263 -10242 -1020 4656 -1784 -6990 -1468 2791 -3484 -6647 1881 6338
714 6338 -2100 -8564 -331 7476 625 -5710 1628 9510 -215 -10502 -872 13024 5804 -8957
728 -8957 -3262 12366 8838 -6759 -3173 14175 11377 -8589 -9772 10615 15138 -3750 -9514 7999
742 7999 15866 -1540 -9923 8054 18369 366 -13851 1113 16038 3801 -10861 648 15718
755A5718j1295j6501J0602J8026q651j9463N728J8456m506j8287L682J9761l313
768I957k1541N84K1670K605k0405m813J8705N780j8056p109J7678R210j8245j2407
782a6387J4892J3946j1778j3042J0028J3062r191j3370P709J3876n458j4750K751
795g712J1994j198j0063K016R836j852j0034Q47R711K25r014r29P636n26p151
810f214J245Q552l22r187j268Q500K928p747k646P048K787p515l730Q361N464
825F256o284p516L663P476k022o396J825O959o32p804n89P492L717o086o140L926
841b155N988j994n256K101O025p50p213q00P666L313p342m735N296N164m911m680
857d283N392O669n328q357M338R167k266r247J306Q994j144r933J432J1325O5
$$ plain form
755 15718 4423 -12078 -1476 16550 7899 -11564 -5836 12620 8114 -10173 -6491 13270 9957
768 9957 -11584 -11000 10670 13275 -7130 -11943 6762 12542 -5514 -12623 5055 14265 -3980 -16387
782 -16387 -1495 12451 673 -12369 -2341 10721 1530 -11840 -4131 9745 4287 -10463 -7712
795 -7712 4282 3084 -6979 -4963 4873 3021 -7013 -6166 3545 3770 -5244 -6173 1463 937 -6214
810 -6214 -4969 3583 3261 -5926 -7194 1306 4234 -3513 -6159 889 3676 -3839 -7569 792 6256
825 6256 -28 -7544 -3881 3595 1573 -4823 -2998 3961 3329 -4475 -5064 2428 6145 59 -6081 -2155
841 -2155 3833 1839 -3417 -1316 4709 3959 -3254 -4054 3612 6925 -417 -5152 144 5308 397 -4283
857 -4283 1109 7778 2450 -5907 -1569 7598 5332 -3915 -2609 6385 5241 -4692 -3260 8065 8130
872H130j2406k673J2091M513j1482m682J1725N585j2338p356J1784R939j1274
885A556j1995Q810J2665p454j2566P468J3592o268j5182M127J5478k469j5309
898g547L64J3751J64j2876l81J4002J542j4023l416J2881L807j1811m204J1235
912C488K991j1755l714J2659N172j2315o414J1063O421j0965p381J1995P578j2162
926c339r763J1243J1600r866j2941Q680J3058q146j3146P080J5119n373j6318
939a2112K760J6085r69j4523j510J4640J470j3610k721J3956N113j2558o199J0089
953h9O835r033o756Q556O774q026p023O761Q414m639p779L196P300l012o791K810
969b502P529j856p924Q41P246J383o284j853N864J363n066k080N610L406m157
$$ plain form
872 8130 -4276 -6949 5142 9655 -1827 -6509 5216 10801 -1537 -8893 2891 12830 1556
885 1556 -10439 -1629 11036 3582 -8984 -1516 12076 5808 -9374 -5247 10231 7762 -7547
898 -7547 -7183 6568 6732 -6144 -6525 7477 9019 -5004 -8420 4461 8268 -3543 -7747 3488
912 3488 6479 -5276 -8990 3669 8841 -3474 -9888 1175 7596 -3369 -10750 1245 8823 -3339
926 -3339 -13102 -1859 9741 -125 -13066 -4386 8672 526 -12620 -5540 9579 4206 -12112
939 -12112 -9352 6733 5764 -8759 -10269 4371 5841 -7769 -10490 3466 8579 -3979 -10178 -89
953 -89 6746 -2287 -9043 -487 6287 -1739 -8762 -2001 6413 1774 -6005 -2809 4491 1479 -5312 -2502
969 -2502 5027 3171 -4753 -3912 3334 4717 -1567 -3420 2444 3807 -1259 -3339 2271 5677 1520
984A520n030K754M843j090m371L29M254k18m426n31N095K247l825m071K514L897
1000C891j639l559P16L731p73m052L04N342J046m762j835L553J468l423j140L706
1016B574J311m437j927M861K756m110k906M492J948m640k983N914M639o461n745
1031d714N220O250m535p296M902P616m655r430M224J1068k151j2107N5J1057P90
1046F294j1557j709J1464L347j2377m872J2284O450j0412p879Q641P319q562q379
1060i948P957R729p434j0613N793J0615m052j0631L935R708l852j0484L252J0944
1074D919j430j1003l41J1057M09r819j083J0362J736j0725k880J0660M797r408
1088b749n425P979O069q011o166P934P319o889p722N577Q629l624p976K510P327
$$ plain form
984 1520 -3510 -756 4087 2997 -1374 -1045 3209 2991 -1435 -1966 3129 5376 1551 -2520 -6 3891
1000 3891 2252 -1307 -591 3140 2367 -1685 -1381 3961 5007 245 -1590 1963 3431 8 -1132 2574
1016 2574 3885 -552 -2479 2382 5138 1028 -1878 2614 4562 -78 -3061 2853 7492 1031 -4714
1031 -4714 506 6756 2221 -5075 -173 7443 2788 -6642 -2418 8650 6499 -5608 -5553 5504 6294
1046 6294 -5263 -6972 4492 7839 -4538 -9410 2874 9324 -1088 -8967 -326 6993 -1569 -9948
1060 -9948 -1991 7738 304 -10309 -4516 6099 2047 -8584 -4649 5059 1207 -9277 -6025 4919
1074 4919 3489 -7514 -7855 3202 3611 -6208 -7291 3071 4807 -5918 -8798 1862 6659 -2749
1088 -2749 -8174 -195 5874 -2137 -8303 -369 6950 61 -7661 -2084 6545 2921 -5055 -2545 4782
1103D782k606p026J955P790p76p207j24O588P66n495k44M993L88n863q32O026
1119C115J456n224k252M757K239n065j740N440K606n561m536M747N582l559n363
1134c358K526N526k550n824J286P121R1p410j974P107L474n855l905N040M122
1149E417m586n884M293O728k509p013P44P103N73o312j161O175J129o483k321
1164d107N654M334n045m581L929M333l532m063L414M250l388n404K376N752j527
1179B395n430J184N075j555n654J107O444l49o770j403O933J627o331k377N988
1194H84K701o436l812O137M700n159n784L878O289l421n526K360N838k535o899
1209f785J752O772po159j97N588J88n334P0N363L08n455j329N283K022m719j320
$$ plain form
1103 4782 2176 -4850 -2895 4895 4119 -3088 -3212 3376 4142 -1353 -1597 3396 3784 -2079 -2911 3115
1119 3115 4571 -653 -2905 1852 4091 -974 -2714 2726 5332 -229 -4765 -18 5564 2005 -3358
1134 -3358 -832 4694 2144 -3680 -2394 4727 4818 -2592 -4566 2541 6015 160 -3745 1295 5417
1149 5417 831 -5053 -760 5968 3459 -3554 -2810 4293 4866 -1446 -2607 3568 4697 -1786 -4107
1164 -4107 1547 5881 836 -3745 184 4517 985 -3078 336 4586 1198 -4206 -1830 3922 2395
1179 2395 -3035 -1851 3224 1669 -3985 -2878 3566 3217 -3553 -4956 1977 3604 -2727 -5104 884
1194 884 3585 -2851 -6663 -526 4174 -985 -6769 -2891 3398 -23 -5549 -3189 2649 114 -6785
1209 -6785 -5033 1739 1732 -4427 -4624 964 1152 -4182 -4112 1251 1559 -3896 -5225 58 2080 -2639 -3959
1226c959M819J501n333j831O073L180n221m528N279M659m706m485M099N889m081
1241A355o896L379P933j488q090O61P561O99p565j285P861K457p487m335O576
1256A336N663n103n787M046O189l747o101L196O378j960o981M40O727M62n714
1271i56l15N463M66n429j446N490K064n089k804M550K536m249k556M423L079m855
1287C72m046M307M829l332n285K530M992k449n094J989O352j567p261p5O725J405
1303D392o080j485N610J561n768k123N224L180n253m223M375L672l337l229L159
1318c25L890l770m252L335M303k659m664J877M156k020m104K206M973k387n598
1333e039J350N699r8o233J77N893K95o413q48O369K564o483l402M944M794m485
$$ plain form
1226 -3959 860 2361 -2972 -4803 1270 4450 -771 -5299 -20 4639 -67 -4552 -453 5436 1355
1241 1355 -5541 -2162 5771 4283 -3807 -3146 4415 5114 -2451 -3736 4125 6582 -905 -5240 1336
1256 1336 6999 1896 -3891 155 6344 2597 -3504 -308 6070 4110 -2871 -2431 4296 4758 -956
1271 -956 -1271 4192 4658 -771 -2217 3273 5337 248 -2556 1994 4530 281 -2275 2148 5227 372
1287 372 -3674 633 5462 2130 -3155 -625 4367 1918 -3176 -1187 5165 3598 -3663 -3738 2987 4392
1303 4392 -1688 -3173 2437 3998 -1770 -3893 1331 4511 -742 -4965 -590 3082 -255 -3484 -325
1318 -325 3565 -205 -4457 -1122 3181 522 -4142 -2265 1891 -129 -4233 -2027 2946 559 -5039
1333 -5039 -3689 2010 1912 -4321 -4144 1749 2044 -4369 -5217 1152 3716 -2767 -6169 -1225 3569 -916
1349i16m435M085M789l631n638K827O243j215o354J55N805M98m714q72M618J573
1365B818m531k417M054L354l232l257K465K806j494k893J772L287j398l792Q22
1380a636L691L82l485j6K630M4k848j55L700R15l654j670L227J986k926j707K612
1397A090K356k532l420K456M095j779l921N32M011k01l896K53M294K31m480j471
1413b382M703J847m118k187L275K120l280k226L792K781l455l953K706M032k456
1428A199l811K004M192k676m437K445N148k009n491R38N753j206n526O77O048
1443C248P4o917r06O815K072o834k779O212L285n777m308O284M923o108n599M882
1459a433O271l613o527K614O589k179o910J892P032p24o934k06O272Q84n688j110
$$ plain form
1349 -916 -5351 -1266 3523 -108 -5746 -2919 3324 2109 -4245 -4090 1715 2213 -2501 -3373 1245 2818
1365 2818 -1713 -4130 -76 3278 46 -3211 -746 2060 566 -2327 -555 2732 1334 -2458 -1636
1380 -1636 2055 2437 -1048 -1064 1566 1610 -1238 -1393 2307 3222 -432 -2102 1125 3111 185 -1522 1090
1397 1090 3446 914 -2506 -50 4045 2266 -1655 -1123 2888 2687 -1209 -956 3338 3569 -911 -2382
1413 -2382 2321 4168 50 -2137 1138 3258 -22 -2248 1544 4325 870 -3083 -377 3655 1199
1428 1199 -2612 -608 3584 908 -3529 -1084 4064 2055 -3436 -2498 3255 2049 -3477 -2800 3248
1443 3248 3322 -3595 -4501 2314 4386 -2448 -5227 985 4270 -1507 -5815 469 5392 -716 -6315 -1433
1459 -1433 4838 1225 -5302 -2688 3901 1722 -5188 -3296 3736 3012 -3922 -4128 2144 3028 -2660 -3770
1475c770N463J253n683j340N327K437m778k623M130K165l926k143M171K854m516
1490i79k944L663L658k986l869L116L171k635l725K499M236j864m496J082M151
1505B078k10l942R1L901J16l961l54L651J251k797j629K092J717j983j780K550
1521G91J331j722k211K076K208j392j658M31J751n24j832N31K501m53k477l18
1537i67K507N18j709p41J428Q44j682j658K220K362j598k799O65L023j49l048
1553g84m04L585M13m325j063L940K387l533l091K472L695k418l767J960M299j843
1569A523m830P85N280J51m903j191M361P75m052j331M775J625m815k271M239K686
1585B807l732k829L760K404l291l159L800L253l181m065K558M186k169l587J803
$$ plain form
1475 -3770 1693 2946 -2737 -4077 1250 3687 -1091 -3714 416 2581 -1345 -3488 683 3537 -979
1490 -979 -3923 -260 3398 412 -3457 -341 2830 195 -3530 -1031 3205 1341 -3155 -2073 2078
1505 2078 1868 -2074 -1983 1918 2034 -1927 -2281 1370 2621 -176 -1805 287 2004 21 -1759 791
1521 791 2122 400 -1811 265 2473 1081 -577 -146 1605 1081 -751 -220 2281 1828 -649 -967
1537 -967 1540 2058 349 -392 1036 1880 198 -1460 760 3122 1524 -1275 -610 2413 2264 -784
1553 -784 -1188 2397 2810 -1515 -2578 1362 3749 216 -2875 -403 3292 874 -2893 -933 3366 1523
1569 1523 -3307 -2522 2758 2909 -1994 -3185 1176 1951 -2101 -3432 1343 2968 -1847 -4118 121 2807
1585 2807 -925 -3754 6 2410 -881 -4040 -240 3013 -168 -4233 -1675 2511 342 -3245 -1442
1600a442M452k539m814K238N071r88n870J173N270o01n271L70N746J39n831j124
1616d021N655J827m987k000M859K051m613k702N251K600m412l458L683L964l473
1631B24l547L107M088l528m044K962M363k072m639J646M426j580m319J246M940
1646C273j123n466N24N281M61m767q88M451J093m036k072M592K664l957l293L265
1662BL222k194k982J604K969j350l342P17L770k61k995o77K574M67j732n33J779
1679A038N29j445j280J638J071q22q66j23J140j82q68L31Q70p06j001M35J327
1696A086J40j255l57R70k68j032k04J415Q42j376j446Q14J744q57j689J101J416
1713A044p79k351O31K425K00k763p13K524J389k856j222K383J926k845k344K846
$$ plain form
1600 -1442 3010 471 -4343 -2105 2966 1978 -3892 -2719 2551 1950 -3321 -2951 2795 2934 -2897 -4021
1616 -4021 1634 3461 -1526 -3526 1333 3384 -1229 -3931 1320 3920 -492 -3950 -267 3697 224
1631 224 -3323 -216 3872 344 -3700 -738 3625 1553 -3086 -1440 2986 1406 -2913 -1667 3273
1646 3273 2150 -3316 -2792 2489 2950 -1817 -2705 1746 2839 -1197 -3269 1323 3987 30 -3263 2
1662 2 3224 1030 -1952 -348 2621 1271 -2071 -1354 2416 2155 -840 -1517 1057 1524 -208 -741 1038
1679 1038 1567 122 -1158 480 1551 729 -137 -260 880 698 -170 161 1031 325 -676 -241 1086
1696 1086 1226 -29 -386 584 316 -716 -920 495 1337 -39 -1485 -671 1073 216 -1473 -372 1044
1713 1044 265 -2086 -1455 970 1170 -1593 -2306 218 1607 -1249 -2471 -88 1838 -1007 -3351 -505
1729e05K496j950k858J868K974j989k942J628L431j577l835J458L731m80l869
1744b419R36L549p13m057L06M674K73m554j166M719R68l869j485M551J803m492
1760i76k854M670L422m115l546L264M048k561m525K527M610j957n042J084N192
1775C241m69m895M71M222M1m289n22M491N18l908j246L507J502k871j276K683
1791A200J285l161j343L068K169l216j880K167K093k259k018K565K300k665k656
1806b351J826L259j450l303J457L073j419l060O11L658n99l385QK678R34k853
1822i16r88K735R83k364j649K363J650j903j653J238J463r27j775J023J886q72
1838B94j721j18K095k11j398l43J450M10j779J6J510O36j794r35J506J223j186
$$ plain form
1729 -505 1991 41 -2817 -949 2025 36 -2906 -1278 2153 576 -3259 -1801 1930 1450 -2419
1744 -2419 -1483 2066 1353 -2704 -2398 2276 2549 -2005 -3171 1548 2516 -1353 -2838 1713 3516 -976
1760 -976 -3830 840 4262 147 -3399 -135 3913 1352 -3173 -646 3964 2007 -3035 -1951 3241
1775 3241 2772 -2123 -1652 2570 2611 -1678 -2200 2291 2809 -1099 -2345 1162 2664 -207 -1483 1200
1791 1200 2485 -676 -2019 1049 3218 2 -1878 289 2382 123 -1895 670 2970 305 -2351
1806 -2351 -525 2734 1284 -2019 -562 2511 1092 -1968 -1357 2301 1702 -1683 -1675 1003 1937 -916
1822 -916 -1904 831 1814 -550 -2199 164 1814 -89 -1742 -504 959 32 -1743 -720 1166 294
1838 294 -1427 -1545 550 339 -1059 -1402 48 458 -1321 -1305 205 841 -953 -1888 -382 841 -345
1855c45j264P66J683n96k326R41K176m6k641l97K238J206k296j131J942J487k046
1872f49j841J873K418j324k838J072K454j49k812L95L037P3k945n08K584J090
1888A930k386r28K247Q34k041r84K130J635k307j787K085J867j738j658J520J857
1904B276j908k182K136K359j691k931J278L202r83l433J308L038r08l342M98L607
1920B324l8l708k40L259R38l435j183L710R32l209j817K954K303k848k006K396
1936C32K295k194k431J997K606j674l073J326L171j171k829Q87K425n61l042M40
1952a496K854N9k698o30L051L64k893n53K762R96k560j875K591J998j959k191
1968b180J388K051r65k654J232K704o46k854K12K744J85k215n89K152N84k133
$$ plain form
1855 -345 -1609 -843 840 244 -2082 -1141 1035 989 -1652 -2049 189 1395 -901 -2032 -90 1397 -649
1872 -649 -2490 -617 1801 477 -2361 -1289 1165 1016 -1796 -1401 1636 1709 -1236 -1744 840 1930
1888 1930 -456 -1384 863 1697 -344 -1328 802 2437 130 -1657 428 2295 557 -1101 419 2276
1904 2276 368 -1814 322 2681 990 -1941 -663 2539 1556 -1877 -569 2469 1561 -1781 -1283 2324
1920 2324 2286 -1422 -1662 1597 2535 -900 -2083 1627 2559 -650 -2467 487 2790 -58 -2064 332
1936 332 2627 433 -1998 -1 2605 931 -2142 -816 2355 1184 -1645 -758 1667 1106 -1936 -1496
1952 -1496 1358 1417 -1281 -1911 1140 1504 -1389 -1942 820 1816 -744 -2619 -28 1970 11 -2180
1968 -2180 -792 1259 294 -2360 -1128 1576 930 -1924 -1712 1032 1217 -998 -1587 565 1149 -984
1984i84r52K312Q83j589j462J133J452p43j065J012Q74q80j276N68J578k83j797
2001a219M25J415l89j098R3J501q0j776j07J738M75j545o67J572Q80k002o68J872
2019D20J308j445j834J228J885j169k022J033K343j126k177M23K591L11k428n74
2035a233K119N34j666j055K267R99k091j604K046J564j555j268R10J928j549j649
2051a303J352K054r06k510P29K171n39j729p7K237j89k100m43K827K44k293r31
2068a406K022J269k431q30J527J779j721k115J604K094r82k081M05K166m67k178
2084a345L44K076j68j829q87K271N34j538r80J692N29j607n78J235R26r54j495
2101a774J601J074j306j009J076J376r82j733R36J788n76k054N42J516j98j687
$$ plain form
1984 -984 -1936 376 1259 -330 -1792 -659 793 50 -1015 -3 871 -9 -1285 -717 861 578 -1219
2001 -1219 -794 621 232 -866 -773 728 648 -1128 -1235 503 978 -567 -1234 338 1218 -784 -1452 420
2019 420 1728 283 -1551 -323 1562 393 -1629 -596 1747 621 -1556 -1133 1458 1769 -659 -1233
2035 -1233 886 1420 -246 -1301 966 1965 -126 -1730 316 1880 325 -943 -33 1895 346 -1303
2051 -1303 49 2103 1197 -1313 -584 1587 1048 -681 -758 1479 1290 -810 -1253 1574 1818 -475 -1406
2068 -1406 616 1885 -546 -1376 151 1930 209 -1906 -302 1792 810 -1271 -866 1300 833 -1345
2084 -1345 -1001 1075 907 -922 -1809 462 996 -542 -1522 170 699 -908 -1486 -251 675 -279 -1774
2101 -1774 -173 901 -405 -1414 -338 1038 56 -1677 -741 1047 471 -1583 -1041 475 277 -1410
2117a410M40K182p25j874k60K609L62j830j130J649J620k126j222K190J347j736
2133H6k143J472K062o60k202R32J968o27k204Q3K442J10k327m84K395L68j853
2150e82o50K340N39k027j411K057J836k063j245R45J784j335j499J279K025j233
2166G60k105O50K306k04k460K15K463l09k261J45K095M72j974j334K223J241j723
2183B00j299J750J143j797j353J479J638j002j716R84J392n55j740P28J611o08
2199H55j553n8J941j07j789K54R73N2j303K40J251j56j304k94J523L90j217p62
2217a064J017R64j575p01J087J115p01j363N16J296n40r49j36J690J63k093J1
2234a263J577M36j311n69J076O42r54p02P58J496j379j243N06J611m77j192J04
$$ plain form
2117 -1410 -970 1212 487 -1387 -1647 962 1324 -506 -1636 13 1633 -493 -1715 475 1822 86
2133 86 -2057 -585 1477 817 -1385 -453 1515 888 -1316 -1233 1209 1319 -1008 -1492 903 1271 -582
2150 -582 -1232 1108 1647 -380 -1791 266 2102 39 -1206 -261 1523 188 -1311 -32 1993 760
2166 760 -1345 -695 1611 1407 -1053 -838 1625 1316 -945 -800 1295 1767 -207 -1541 682 1923 200
2183 200 -1099 651 1794 -3 -1356 123 1761 759 -957 27 1419 864 -876 -148 1463 855
2199 855 -698 -756 1185 1078 -711 -457 516 568 -735 -495 756 600 -704 -998 525 915 -302 -1064
2217 -1064 -47 917 -658 -1359 -272 843 142 -1221 -705 591 51 -898 -1034 656 819 -1274 -1263
2234 -1263 314 750 -561 -1130 -54 588 -366 -1068 -310 1186 -193 -1436 -930 681 204 -988 -884
2251h84J238Kj185p6J304N36j643j61J185O19r83j405J365J021j421r04J176J813
2269A597j015j910Q24J719p93j310N27J768m07k191K89K011M43k084q13K133P72
2286A560k125p20J912J041j351j848J572J506r09j823J163J823j139j970J136
2301a72K036r55j938M10J614k53j566M66J590k93k115M25K079P1j968j95J884
2318A120N00k506j72K265N69k222r95J788J800k266j233J698J573j924j670J867
2334A92K088j596k351J124J998p57j970L87K363p89j876k4J907N63k379J04J406
2351C90O32j641o84J585O07j713n80J282J074j158j081J092M88p96q55Q87R99
2368E28o38j168M41J302k63r67k65J346k61j220k3J468J83j100o61R21M95j74
$$ plain form
2251 -884 354 356 -829 -905 399 935 -708 -869 316 935 -48 -1453 -88 933 -488 -1392 -216 1597
2269 1597 582 -1328 -504 1215 422 -888 -361 1407 1000 -1191 -902 1109 1552 -532 -1345 788 1560
2286 1560 -565 -1285 627 1668 317 -1531 41 1547 638 -1185 -22 1801 662 -1308 -172
2301 -172 1864 909 -1029 -619 995 742 -824 -358 1232 939 -1176 -751 1328 1399 -569 -764 1120
2318 1120 1620 -886 -1058 1207 1776 -446 -1441 347 2147 -119 -1352 346 1919 -5 -1675 192
2334 192 2280 684 -1667 -543 1455 698 -1272 -885 1478 689 -1187 -1211 696 1259 -1120 -1016 390
2351 390 1022 -619 -1303 282 889 -824 -1404 -122 952 -206 -1287 -195 293 -503 -1358 -471 528
2368 528 -110 -1278 -837 465 202 -765 -1030 316 55 -1165 -1188 280 463 -637 -1298 -377 118 -56
2386e6j017N69J102l55j165J35J182m6p54l35P51M70l61j017R73P33o54o85J35
2405c95J009J4r56j8R49k55o89L94O51Rj022N3J095L29j215k52J239k73q99k06
2425d38J289K57r11j034J826N49j507m64R88J220j285j298O93J913r44j708O27
2442b27J622l96k235P06J664J27j853k60J892N58j958o43J807L12j746o69J815
2459E16J071j722j193J201J316j023j328J337J085r44j983J384J600j085j551
2474a319P58J617n69j790M62J749m02j815J8K091n3j846k62J483N77j641m56J436
2492C8O31j491n62J077Q81p54j014P35R42r00r02P75J212m49j381L59J109k29
2510G7r86O7J371l12j305M8J273nj237N86O14J72r97r4R14O90j421l88J183L80
$$ plain form
2386 -56 -1073 -504 598 243 -922 -787 395 349 -405 -740 11 481 120 -897 76 809 155 -530 -395
2405 -395 614 628 -328 -346 603 348 -341 53 704 713 -309 -256 839 1168 -47 -299 940 667 -232 -438
2425 -438 851 1108 197 -837 989 1538 31 -433 555 1775 490 -808 -115 1798 854 -854 -227
2442 -227 1395 999 -1236 -530 1134 1261 -592 -852 1040 1598 -360 -1003 804 1116 -630 -1299 516
2459 516 1587 -135 -1328 -127 1189 166 -1162 175 1260 316 -1667 -283 1317 232 -1319
2474 -1319 -561 1056 487 -1303 -841 908 506 -1309 -1291 800 747 -1099 -1361 122 699 -942 -1398 38
2492 38 669 -822 -1384 -307 574 -180 -1194 -459 483 -417 -1319 -544 668 219 -1162 -803 306 77
2510 77 -909 -842 529 217 -1088 -1040 233 228 -1009 -423 191 363 -634 -728 186 876 -545 -933 250 630
2530F30r67j74N34P05q12n83L98J176l92j093J42P30L49p30m44O89N20o84m85
2549d91N84J145p84r01J43R58j12p75L6P52K93r94k10Q35O94j068o92J111N65
2568A089p99o51R54N62n80j068N58J032m59r61K37J145m46r84kJ409R9j506q8
2587d59J262N7j078n78J635L42j499n11J150Q36j172q88R09Q73p75j179R17P98
2605F40l84j373P56J250p61q50K53J019k09j222M87R84l96j053k28J330J23j046
2623f80k24J425k11j348k22J447O78j596o94J477P17j098j038J116J175j067j343
2640a486J009P67Kj606R44J191n63j397J12J779q1j571r7J352L68j387l47J401
2658C90K85j154m03Q86J005j242m97N81Q63o02q08P40P50m86j164Q35J041n79
$$ plain form
2530 630 -337 -511 23 728 -84 -667 -269 907 515 -578 -436 294 643 -87 -531 158 678 -6 -491
2549 -491 93 1238 454 -447 -304 654 542 -233 -197 555 848 -146 -356 479 1173 105 -587 524 1089
2568 1089 290 -361 593 1155 575 -493 65 1097 638 -323 -86 1059 613 -371 -373 1036 1135 -371 -459
2587 -459 803 860 -218 -796 839 1181 -318 -829 321 1157 -15 -903 6 879 104 -1075 -158 640
2605 640 256 -1117 -361 889 128 -722 -469 550 341 -881 -394 590 194 -859 -1087 243 366 -680
2623 -680 -904 521 310 -1038 -1260 187 865 -731 -1425 52 769 -329 -1367 -251 924 -143 -1486
2640 -1486 -477 290 292 -1314 -370 821 258 -1139 -1027 752 671 -900 -997 355 723 -664 -1011 390
2658 390 675 -479 -882 4 1009 -233 -730 -149 714 112 -696 44 794 308 -856 -21 1020 441
2676D41q73J59R44k55p78j85J145L53j043j56R66j7m38o28P61M74p90k26L21R21
2696A096o28o08L87L80O0r35K68O73K8r01m7J123K12q44m11K54M81l60m08M69
2716B89N64m85o38M70O26p29n58L45N46j88o16K28P99l43r57L98P59j3o97k72
2736d72R34K5j125j74R60M63p49q15N90Q32m49j069P75P37o89p71N91P88j11j184
2756i13j34J236J38j054l17J348J8j007l04O20P35q39n12R31N38q67q89J010J011
2775G49o66j253Q74M69n0j087M51J181m50j215N16J145j22j045k30R25L73j074
2793e09r9R92N26j446m41J113L85o21n09J158N39q83o33M03Q70k93j182L23Q60
2812E53k89o78O09O31l23p52O8Q91L6j014K17N61K14q95j22M41P49j086j62J054
$$ plain form
2676 441 -432 -273 671 416 -362 -547 598 951 -92 -248 718 701 263 -365 396 870 80 -146 175 1096
2696 1096 468 -140 247 627 687 -248 20 693 721 -180 -227 896 1108 264 -147 107 588 228 -180 289
2716 289 853 368 -270 200 826 97 -461 -116 430 242 -374 -146 653 310 -647 -249 510 497 -200 -472
2736 -472 462 487 -638 -812 148 611 -138 -953 -363 469 20 -1049 -274 463 -226 -997 -406 382 271 -913
2756 -913 -1047 189 327 -727 -1044 304 322 -685 -989 -369 366 -473 -985 -54 484 -383 -1272 -262 749
2775 749 83 -1170 -296 173 123 -964 -513 668 218 -997 -481 664 542 -503 -733 192 565 -509
2793 -509 -608 384 910 -536 -977 136 521 -100 -609 549 1088 205 -428 -25 845 552 -630 -307 553
2812 553 264 -414 195 826 503 -249 -181 710 746 -268 -51 510 724 -171 -293 148 897 -189 -351 703
2832G03K32n47n36P60K29l20j171P92Q45n57o36O5R58k54q41q9J067R8j379L97
2852a84N94N49r56n28P08O54n25n59M18K95j96p85N12N70K06j197K33N15j68m65
2872c09m82J020K1o29O1M10L59r79P4M43L02m48o04N33M92m14o41L15Q32l88n31
2893e63K11O00l70p49K5J065J39j464M42N71K91p84J99M19M16j017j33Q08M53
2912E59q80k87N12K64k68n68M91N98k06p06K41Q81k04j191L01P77k07l43j78Q60
2932D46M04j198l5O39J38m23l79J001L31q20o49M40R50l75j000N51P31j71p61
2951a80K9J025k42j073K92J019l5q58o4L21M56n82o09J004N24n46r47O36P94l11
2971F53j207O65O41m60q97K92J124j32r08J81M34K81q45k59Q86m0p32j58Q41Q7
$$ plain form
2832 703 935 388 -148 612 841 521 -650 142 987 430 -206 -141 817 563 -278 -367 700 798 -581 -184
2852 -184 410 959 3 -525 183 837 312 -247 171 466 270 -515 -3 567 773 -424 -191 324 156 -309
2872 -309 -791 229 250 -379 -318 92 451 -528 -454 -11 291 -157 -761 -228 264 -150 -791 -476 356 -32 -563
2893 -563 -352 248 -122 -871 -846 219 358 -1106 -664 -93 198 -586 -387 32 448 -569 -702 106 559
2912 559 -321 -608 -96 168 -100 -668 -177 421 215 -491 -250 631 427 -764 -463 314 107 -236 -414 446
2932 446 850 -348 -383 256 394 -29 -408 593 924 104 -545 -105 845 470 -530 21 752 581 -180
2951 -180 -151 874 632 -441 -149 870 835 -23 -87 234 690 108 -501 503 1027 481 -466 170 964 653
2971 653 -554 111 752 292 -605 -313 811 679 -229 -48 386 667 -178 -437 449 409 -323 -481 360 447
2991D47n86p15R21L37m55n80P82J34m74m20j27J153l25r78M66Q77m37o80J20Q98
3011C58l6j331O59N74j67m35n38J258k42o01l63Q83M99j173L4L39R58r66o62O57
3031b95Q56j120l90P98M57k97r69N75R15p32q36N16P28J73p28l55J134j97n92
3050c59l38P82N86q38o83Q23L78o32k09L59O52j71q41O84M21j69q80J78Q33n3
3070E23q10M6M63L38m79j02O18J01p93k76R02J81l11l27L91K2l68P3L10j05n4
3091C43k66MJ75J74k07k21O63j06p82M14Q6K09k59m5J05K93l46o30O92O30n34
3112C92m95o0Q73l05q78M21P72j90j033K41O26j4m52j24K12L24n72l09O05L96
3132D30n89o39R79L84n77o13M28L53j54p36O62M59l33q44K62P29j1p64oR04o2
$$ plain form
2991 447 -139 -854 67 404 -51 -631 151 285 -189 -609 -736 417 92 -886 -420 457 20 -660 -540 358
3011 358 322 -1009 -350 224 57 -378 -916 342 100 -501 -864 19 518 -655 -621 -282 676 -290 -952 -295
3031 -295 561 -559 -949 -151 306 9 -960 -385 530 -202 -1038 -522 206 379 -349 -704 430 233 -359
3050 -359 -697 85 671 -167 -850 -27 351 -281 -490 -131 521 350 -491 193 614 445 -435 -257 576 523
3070 523 -287 -241 222 560 81 -21 597 698 -95 -371 531 712 401 74 465 487 119 192 502 397 343
3091 343 77 81 256 430 223 2 665 559 -223 191 277 486 227 182 287 580 234 -396 296 926 392
3112 392 -103 -163 710 405 -473 -52 720 530 -503 -262 364 350 -102 -226 -14 310 -262 -571 34 430
3132 430 -159 -798 181 565 -12 -625 -197 156 2 -734 -72 387 54 -790 -528 201 190 -574 -580 324 262
3153B62q58J0R17n6q10m47J033M08n55o45P28O70q96p09N20R71n92r29O43P75
3173D40k00j093L58J001o12o49K3R74j84n10K4N41K03q60J74Q54n2r01j42R03
3193B92%n27k02P33L0l29l07M12N79o50n05M82P86n91o54O19K09j97n73N82P11
3214I00n30m80k22N48K2m72k18R86J07n42j54N7O37m04k13K25L40n27O2j51O52
3235F23n31l82O73l61L19l56n6K68p5j42j6L41J58n73K37RJ74l80l15J42L17P5
3257A49k52kL68k62l58J41K86K36l26j81M9N05o31m73Q26K56n67k68K00N07m4
3278A59j068N73O77k97m62m0K68K43m89Q7P71J3r20j5O75q9j97n86P07K17q10
3299e83q3O10N86r08l02R51O25o96p35Q1R71m47o52M64N16l96n21K67R42l15p59
$$ plain form
3153 262 -596 -586 331 275 -535 -982 51 459 -96 -741 -13 657 -239 -948 -428 543 -49 -978 -335 440
3173 440 240 -853 -495 506 -106 -755 -732 242 58 -452 -428 113 316 -544 -370 484 432 -469 -611 292
3193 292 292 -235 -437 296 326 -3 -310 102 681 31 -474 8 794 203 -451 168 377 180 -393 189 900
3214 900 370 -110 -332 216 238 -234 -452 534 641 99 -55 2 639 235 22 247 587 60 122 -29 623
3235 623 92 -290 383 22 341 -15 -71 197 122 -20 -36 305 463 -110 127 136 310 -70 -385 -243 74 149
3257 149 -103 -105 263 1 -357 -216 70 306 -20 -201 -152 353 -278 -751 75 331 -236 -504 -304 203 159
3278 159 -909 -336 341 44 -418 -458 -190 53 -436 -349 422 435 -485 -500 175 86 -111 -697 10 227 -583
3299 -583 -666 -56 530 -378 -680 271 896 200 -535 -454 517 70 -582 -118 398 2 -519 -252 690 375 -384
3320c84J60O13J62r68J63Q30o2q13l46Q00K61o56k88Q42L72j072K64K76M95q35
3340a86l2M43L49m88p24M28R28l77o37K87O94k69n30K74N1P6n51k36P88P3n62
3361b01L2L48N23q19m43N19Q09q59m03M88M02j02p85M26M44k24n60M57L67l99
3381B0l60M24J69K52o41Q3K09j8n01J40L76P6k51m97K58L24j2k32k1L44l44l16
3403e18M45M09k24k17Q3Pk27j18j2K34K61k82m47M18L63k59k67J33L29j50j81
3424b20j96L04j8k92J80L40k67p5N8J93L29o17k31O74K03n45k68M12O00o58l56
3445d50O33L6k09n01M88M60pr93J8J028l30j16n05R65j00q72n4O75J50n32k5N59
3467C18K50n61k23P60j37n94j52O10K26m37j71K87K88m74l25J69P80o29j50R8
$$ plain form
3320 -384 -224 389 551 -417 -254 576 514 -299 -645 155 416 -240 -528 314 686 -386 -122 154 649 -186
3340 -186 -218 225 574 86 -638 -210 718 341 -296 -9 685 416 -114 160 211 287 -264 -500 288 361 -201
3361 -201 -169 179 702 -117 -560 -41 768 -91 -494 -6 396 294 -491 -65 379 155 -405 52 419 20
3381 20 -340 84 253 505 -136 -53 156 138 -363 -223 153 229 -22 -519 -261 63 51 -181 -202 142 -202 -518
3403 -518 -73 336 112 -105 -22 -15 -242 -360 -372 -138 123 -159 -606 -188 175 -84 -351 -218 111 -39 -220
3424 -220 -416 -112 -130 -422 -242 98 -169 -244 -186 7 336 -281 -512 162 365 -180 -448 -36 564 -94 -450
3445 -450 183 219 10 -491 -3 457 450 -543 -525 503 173 57 -448 517 417 -455 -509 166 316 -216 -241 318
3467 318 568 7 -216 544 407 -187 -339 271 497 60 -111 176 464 -10 -335 -166 614 -15 -165 -67
3487f7O61k9p48j24P27J8q01J00Q09j96n44j15N00K03m84j34M81K99j022J88R9
3508a79O75n93j24l3O89l22o26O05J79k70m71K93K25M3q29M91M51Jm07l07O00
3529I1J63n87m14J037O6p90o9M53j1j13k69K26M63p1p57K35N48m20J6k2L01J43
3551B19q35J54N89k01j4l46N15J05k01k60J85L80k65m32K48L22o4k90P5M01j10
3572A75k01JK38J78n25P0J41J70L7o12N77M79o23j38j3K56J03l21J76K24rl73
3594A0J11O54o46k35K18Q4K43l17j56K66L66o22M5J78O0l54j40L78L84n46j64
3615a83N17J99o13Lj36M62M6m68J33K79O4o65L44L99l63l07J12K53K18n06K65
3636E3J85M0j63o03N71J63m48j9K91L79l65k41M6M14m70o4K15L13j27n78Q3M53
$$ plain form
3487 -67 594 565 -183 -307 420 438 -363 -263 546 350 -194 -309 191 394 -90 -224 257 556 -466 -278 -179
3508 -179 496 -97 -221 -254 435 113 -513 92 271 1 -470 -177 48 91 -738 -247 204 205 -202 -509 91
3529 91 254 -333 -747 290 356 -434 -503 -50 -61 -174 -443 -217 246 175 -582 -347 201 -219 -203 -225 76 219
3551 219 -616 -462 127 -74 -88 -434 81 186 -15 -275 -90 290 25 -407 -159 163 99 -191 -116 285 175
3572 175 -26 -25 213 391 -134 -64 77 247 284 -328 249 728 105 -33 -46 210 313 -8 168 392 383 10
3594 10 121 775 129 -106 112 196 439 122 -34 232 598 -24 21 199 259 -95 -235 143 527 -19 -183
3615 -183 334 533 -80 -77 -213 249 295 -173 -40 239 303 -362 -18 381 18 -289 -177 76 294 -212 53
3636 53 238 278 115 -488 83 246 -202 -221 70 449 84 -157 -111 303 -167 -231 -16 297 170 -408 -325 128
3658A28J62n93QM81J4l84j62M97J06m48k43L77J44o30R5O38J77n92k52J82L69
3679G4l47m04N58K16O5o56J28P82j30q44J3N75J8k67K5O38m56l90j0J49M15j67
3701a5j75Q3M80n91pK19K30l04j30J57J74K2k04j5M88k5m22N7L08J6o18M24Q7
3724B39K06o12j17N32k27K28j40J91J95k43l12J64N12l27m21Q0P22n13j53K0N99
3745F23l02m90J74J19j21O1j18J40J38J00n36J51M18l36l74M08K70l69N9J37L00
3766D52l59l39J60L11l60l17J98J39J83k92q5K01k07O8L0K62m1o9l25L59K81j10
3788A40p61M32Q6k65J5R2L48j55k50K24J20p8j36m14N68j32m96K90K16J75k19
3809b00l84N31J67k57m1QL55j91j58J35M41p04K3M22J57k29l05M0M08p3l59NL06
$$ plain form
3658 128 290 -303 -295 186 200 -184 -346 151 257 -191 -434 -57 87 -543 -448 190 367 -225 -477 -295 74
3679 74 -273 -677 -119 97 162 -494 -366 416 286 -558 -545 30 48 -219 -194 444 -12 -402 -412 -263 152 -15
3701 -15 -190 -107 373 -218 -225 -6 224 -80 -210 -53 121 143 -61 -76 412 387 -35 22 330 346 -272 152 239
3724 239 445 -167 -284 248 21 249 109 300 495 252 -60 104 616 289 -132 -52 670 157 4 24 623
3745 623 321 -169 5 124 3 64 -54 86 224 324 -212 -61 357 21 -353 55 325 -44 15 152 452
3766 452 93 -246 -86 225 -135 -452 -254 -115 68 -224 -309 -108 -315 -247 -217 45 4 -65 -390 -31 250 140
3788 140 -621 -189 -103 -368 -353 -261 87 -68 -318 -94 26 -52 -188 -602 -34 -166 -662 -372 -156 19 -200
3809 -200 -584 -53 114 -143 -184 -176 179 -12 -170 -35 406 -298 -275 147 304 75 -230 -190 218 145 -214 -209 97
3832I7Qm14M6M70J37j91m23N16m2o0l13J62M59n30j67L05K83k03m30L33M86k69
3854B60m60N7O56M2q88M91K39ko38K02L95J97l83m41N01J00m70j33L18M67k19
3875B91l45q6N94k06o01K20L81O0m01J83L16l01pk23N00J13q03N7K91K95o11p0
3897c53L01O85q19K65K72ol59n6j11K80j00k91L6L27j26j17j6J50o3j29n4L10
3919B6N2m63k15M31K58k00k58M36K8j48o44O20P7k6n41L02L90l80Q7q4L6N2q3
3942b47r9L74n7o6k31K97J40k93R9l2PK8j77K00K29J63m81L2L51l62pO5K75j85
3966B3l13M93j17n5j17p5L78o6k44K20J31o2j53l54L60J54n3k05j9L24n8k06o8
3989h2N88o06J66K07j16n0j92J14N56l74l31j57M18L71n24l16M13M28n59m6k34
$$ plain form
3832 97 105 -309 -263 207 344 153 -270 246 204 144 -169 -7 452 -78 -245 60 343 140 -290 43 529 260
3854 260 -200 -143 513 555 -333 158 397 395 -243 -41 354 551 168 -273 228 328 -142 -275 43 510 291
3875 291 -54 -140 454 248 -353 -133 248 308 -93 90 406 105 98 -125 375 488 -315 -258 33 328 -283 -353
3897 -353 -52 633 -186 79 351 345 -14 -70 -181 99 -1 -292 -256 71 -55 -172 -188 -38 -101 -230 -284 26
3919 26 78 -385 -600 -169 89 -111 -369 67 95 -53 -697 -77 0 -26 -567 -265 125 -255 -168 -252 -216 -164 -247
3942 -247 -346 28 -29 -95 -326 -29 111 -182 -83 -115 -108 -80 -257 -57 172 335 -146 -114 237 -125 -132 -67 208 23
3966 23 -290 203 86 31 -86 -161 217 151 -93 127 258 196 43 -311 49 203 150 -55 -74 250 192 -14 -82
3989 -82 506 -100 66 273 157 107 -85 29 585 211 -120 -277 141 512 -12 -328 85 513 -46 -92 -326
4010c26N30j5l07N38j20J27o74M52L58n68k39m3M57l1k70P1L07j86k94K08M03
4031C78l62j89j06L83l8k13k23M63M08p74P2P7M68n51k90L73J87j06n8j10L76
4052A65n35N8P2J60N2p4o3K16n4p8l40L79m9K7j43j55P22p23J33J45L32l22j48
4075b23M8J8o8j10K42N34l63k01k32O95j78k79J25j64J39J65l76L32q3j32j99
4096c10L28J91k41j19L00Mr6K8J45j5l96L42j2K00k55j04J1J57m8j39j62M04J09
4119C22k98M4P6m2r2K0j23O59n17M5k14L30k9k70N9K33O4o46K08J33Q4r1L2L05
4143B92Om47O7J98m5N2l49K64J80J57p97M56J79j09l99J53M34k48m77L80R4L49
4165C90m06j07J32K07k15m3N7J28j22k04K87q4R2m42L79l3m4m87J33N58n5m79
$$ plain form
4010 -326 204 189 -118 420 300 427 -247 205 563 -5 -244 -287 170 139 -131 -60 247 61 -233 -25 378
4031 378 16 -173 -279 104 66 -147 -370 93 501 -273 -201 -124 344 -207 -497 -124 63 -43 -101 -211 165
4052 165 -370 -312 -240 -80 -28 -102 -165 51 -3 -81 -421 -42 -91 -64 -207 -362 360 -363 -230 -85 247 -75 -223
4075 -223 -175 -157 -225 -335 -93 441 78 -123 -355 340 162 -117 8 -156 -17 148 -228 104 21 -111 -310
4096 -310 18 209 -32 -151 149 153 57 85 230 215 -181 161 149 349 94 -10 1 158 110 -29 -191 213 322
4119 322 24 68 144 102 10 30 -93 566 49 94 -120 210 181 -89 -30 203 267 -379 -171 -38 46 -45 -13 292
4143 292 298 -149 -82 116 71 123 -226 38 218 375 -422 34 213 104 -295 -142 292 44 -433 -53 41 390
4165 390 -16 -123 9 216 1 -42 15 143 21 -183 104 20 112 -330 49 16 -28 -515 -382 176 121 -358
4187c58K55Q3l00j80O12j4j73k39K60K5n4r0P7L05k45j38PL23P9k32l42K49K60
4210A70m00j2N40M1k31m77M88R5k69k43L54L79o21j46L35K48j30k46n7K35L3r3
4232gj29L07j37J44n4q2N36o88K13r1J98j37q4J13J69J32l92J26K65k04m50J14
4254a38O21l02j10p9L56o1j61l9K53j07j18k46j45M94j16j85K11L38l02j98m7
4275h1K10j2J07k66j4J97k02PK20QJ05n10q4M33j93j90K32K72k27l43J20j0l2
4298b53N0q3K64J24k13l38M83r6j97J23J47k64q9k9O97q5n74o4O38O2n95J28n4
4321b18L05j02k65J74PK13o02K03P61o18j38J61K02j97k01K2rK00l31K80L28L4
4343B09l72J01J80j64k1j72L83R8l52k95N06P1j74j60M8L22j43O0j97J79J49l85
$$ plain form
4187 -358 -103 -20 -320 -500 112 98 -75 -314 -54 -29 -83 -173 -96 209 -36 -174 -167 156 235 3 -339 -90 170
4210 170 -230 -242 298 339 108 -369 119 214 -55 -298 56 435 -186 -332 3 251 121 -125 -182 53 86 -7
4232 -7 -136 171 34 178 124 42 578 -110 103 12 210 73 -11 102 271 403 11 137 402 198 -252 -138
4254 -138 483 181 71 -8 348 287 126 87 340 233 115 -131 -276 218 102 -83 128 466 164 -34 -81
4275 -81 129 117 224 -42 -56 141 -61 -54 166 174 279 -231 -315 118 -75 -265 -33 239 12 -331 -211 -221 -253
4298 -253 -203 -286 -22 102 -111 -449 34 -62 -259 -136 11 -253 -342 -371 326 241 -333 -397 241 303 -292 -164 -218
4321 -218 87 -15 -280 -106 -99 114 -488 -285 476 -142 -280 -119 83 -114 -315 -293 -302 -102 -433 -153 175 209
4343 209 -163 -62 118 -46 -67 -239 144 242 -110 -405 101 172 -2 -162 -114 208 65 125 -72 107 256 -129
4365a29K07J54J90m05l54N25l2R8n52K91K32k22p3m2L38j72N8l0J64j0l86L57
4387B07r9k07N44l66J68k02l1k7K60J5l77K11J10J09o75N46j80J18k33j99L20
4408A2M9J44j38j57K75p9l70J24L08N2n01K74j9K80k32n22P03j38p3j57q7J12
4430a40N4j98K55L22l17k94R9k29L47k88J68N08m39j61L01J62j11m57J43K30J97
4451A52l21Q1j62K21M1n0nM2q3Lj04M76k98o9j0k51J18j48L85J36l01q1K04p2
4475i6J79k20L7K17K0k64j9J16N2j08j49J69L26j39j97J68N1j73J59n8K74k53
4497I2k9J09k33m5J94n5N7j12J38p6P8J32k20J63P7pj58j58L46P0l65J23J81j83
4521A19K57m99L11J30k85p7j84L63k19J42m3M1K04k09p9K13k5q3j77L76J09n35
$$ plain form
4365 -129 78 232 422 17 -337 188 156 254 -298 -7 225 3 -70 -112 226 54 112 82 246 236 -150 207
4387 207 108 -99 445 79 247 45 14 -13 247 262 -115 96 206 315 -360 186 6 124 -109 -308 12
4408 12 61 205 67 -90 185 106 -264 -140 168 220 -281 -7 -26 254 22 -500 203 65 -8 -165 -252 -140
4430 -140 -86 -284 -29 293 -24 -318 -219 -448 -101 -389 -221 287 -152 -313 -12 150 39 -418 -275 -45 152
4451 152 -169 -88 -250 -29 12 -38 -43 -1 -84 -81 -185 291 -7 -76 -86 -337 -219 -367 18 154 -147 -228 -24 -96
4475 -96 83 -137 -100 117 137 -127 -146 -30 22 -86 -235 -66 260 121 -76 92 143 -30 129 71 345 92
4497 92 63 172 -61 -106 88 33 90 -22 116 40 118 250 30 193 270 263 105 -53 293 363 -2 121 302 119
4521 119 376 -123 188 318 33 -44 -228 135 -84 58 15 56 260 51 -28 185 160 77 -100 276 385 -150
4543a50J28K0K19n29o9K5L58j32j70L8L85L4j09l4K24k82R0k69L03j92l7N9K02
4566A12q1k72l16M83K71l95K83k42O5K87k13J37n6k8j79K37J01o15O7M18L2Mm65
4589c65J95M92k21j34n4J74m3l88L27q0R4m9k37mL22j47j96L04J93k72j03K98
4611A06K2p4k51O2K26j09j00L17j66k4L8r0P0o2j53J13K20J49n1m08L37p6O8j59
4635EJ52K1m4j29K61k56M28n00K45N3j99j00O8k06M40k47q8K46J40jk84J17J08
4658B30j92j50p1M30j38j77N3n7Qj45p8N06N0n9j65J07n3k70J2L2K21k70o8L96
4682A52K93m98k51J21P0L37n49L83M33n77o8m3J84j9j26K04K27j26l20k87M05
4703e5j8j63J76j44K46r0j25P3K22k08m70N77J39k32r6k70M31j75j32J25P8K11
$$ plain form
4543 -150 -22 -2 217 -312 -381 -356 2 -130 -300 -262 123 157 48 14 238 -44 46 -223 80 -112 -149 -90 112
4566 112 31 -241 -557 -74 197 -198 85 -157 -92 195 -18 119 63 35 -144 93 194 -421 -354 64 96 100 -365
4589 -365 -170 322 101 -33 -87 87 44 -344 -17 -97 -3 -52 -289 -293 29 -118 -314 -10 183 -89 -192 106
4611 106 128 54 -197 -135 91 -18 -118 199 33 9 47 -43 27 -35 -188 -75 145 294 243 -165 172 96 164 5
4635 5 157 178 134 5 266 10 438 -62 183 236 37 -63 5 -201 239 -8 -96 150 290 289 5 122 230
4658 230 38 -112 -183 247 109 -68 -15 -72 -64 -209 -287 219 269 210 45 152 99 -171 -159 -127 94 -176 -244 152
4682 152 445 -53 -304 -183 -113 224 -325 58 491 -86 -154 -197 -13 -32 -158 46 273 147 -173 -460 -55
4703 -55 -73 -236 -60 -204 42 -48 -173 -100 122 -86 -556 21 160 -72 -168 -438 -7 -182 -314 -189 -111 100
4725A00n23J40N93k08j90O3Q7k84q7L46j04J08n84K97O01k85j67M6Q0J69l76m3
4747b21K80JN3l61L67J89l50m52P54j15n8l46J72J75j07l8r7R9L37m13P2J94K26
4770C61k81N4j51O8J76k02K07K80o37m0M55k19K28K6m7o1k59k29L08j48j4P2Q
4793d5oJ32J06p6K6q8q0r6J01L03j59l26L28j58K02K45l54J19om0l63J27J62r7
4817d3l10L45j3l4j72L32Ll10P1l5L48k29k20K98j0q7l88Q6M92j08k79M16k06
4840e3l8n4k30M07K85m37k8R1R7m8j44j29K55N8m58M35R4K4m40N13j06j24l69
4863c99M06J17P7l8k26J23j08p3J17M4L05m16lM56k01p7k35R0M71k81k78j36N45
4886B80k59j41L75M3K3m56R5L89k14k6O1J22P5l36J16O2J93n08l2K76j96M6K4
$$ plain form
4725 100 -423 -283 310 102 -88 -25 62 -222 -309 37 -67 41 -543 -246 355 70 -97 -51 29 198 -178 -221
4747 -221 59 60 113 -248 119 308 -42 -494 260 145 87 -259 -87 88 -19 -57 -154 -55 282 -131 -59 135 361
4770 361 80 134 -17 51 227 25 232 512 -125 -165 290 71 299 325 278 217 -42 -271 37 -111 -125 -53 -45
4793 -45 -51 81 187 111 137 49 -31 -127 -26 277 118 -208 120 -38 164 409 55 174 168 128 -235 -108 54 -43
4817 -43 -353 -8 -21 -55 -227 105 108 -202 -131 -166 182 -47 -267 31 21 -66 -454 -368 124 16 -263 153 -53
4840 -53 -91 -145 -375 32 317 -120 -148 -57 40 -8 -152 -281 -26 32 -426 9 103 127 -313 200 94 -30 -399
4863 -399 7 124 201 163 -63 60 -48 -121 -4 40 345 -71 -74 382 181 104 -131 -41 430 149 -129 -265 280
4886 280 21 -120 255 298 321 -135 -40 349 135 109 170 292 367 31 147 209 402 -106 -138 138 -58 -12 12
4909A2M1J74K2m17N12l21o3K93j07P7m76K28M10l14K16p32L42J42K53j10P2l40
4931h6K75l9l63M28Q8k55p3J37j36n7K12k36j95N91k09o4jl14K86J19p8l6k2P3
4955D5Q5k09j03J6O9Q5j64n5L83k73l4k78O25j56l9n02P08j19j39q3L3J18J00
4978A13k11k2N3J85l9k99Q2J67l35M4L4L89j52m08L53J6J0k27J98J06rr0OK02
5002A66k15O2K1O7Q2l15K82k3%l75J85J72Nj9j33Q7Pj05J59j0r4M6K7M8K67m35
5028d1O8l05M86N9l30k35O83J6m37p3L80l26K16m21M27p5l3J06qm9J6k75L37O6
5052B52j15o9j13L15l71r0L48L2Q1k78m2K0j66L61K99l98k3j26L57l12J82j58
5074a4l32L0K14k1p2L16M2k33j29j90N05r3j95L02l35Q8Q2l1k16K95k38N0J70
$$ plain form
4909 12 53 227 249 -168 344 23 -40 253 146 223 -253 -25 385 71 287 -445 -103 39 292 182 254 -86
4931 -86 189 150 -213 215 303 48 -25 112 -24 -81 131 -105 -300 291 82 18 17 -297 -11 108 30 -6 -28 45
4955 45 130 -79 -182 -166 -97 -12 -176 -231 152 -121 -155 -433 192 36 -3 -505 203 84 -55 -138 -105 13 113
4978 113 -98 -120 -67 118 79 -220 -138 29 -306 -262 -228 161 9 -399 -46 -30 -20 -247 -49 57 48 -42 -36 166
5002 166 -49 13 34 101 183 -132 150 127 127 -248 -63 109 114 95 -38 49 56 -49 110 100 6 52 79 127 394 -41
5028 -41 27 -278 208 267 -63 -298 385 401 -36 -109 271 -55 161 -260 167 92 59 165 157 108 124 -151 186 252
5052 252 137 68 -45 270 -101 -191 157 189 270 -8 -50 -30 -196 165 464 66 43 -83 274 -38 144 -14
5074 -14 -346 -316 -102 -123 -195 121 163 -70 -199 -389 116 23 -172 130 -205 -117 -35 -66 -282 13 -225 -175 -5
5097eo0r3L3P9L12l79J81n2J23r8nQ7Nl29J11L92j49l39J20k3J55K31k39q2N2
5122B8r2k61L70k41K49k35J18J19k29l4J76J35n4q4j23M37k33k86J40K46K57k00
5144B03k13j4K26k75K87l0j61%J9J76j17Mk4l31L05o8K7L43k20J91j68J45k77
5167B8L66j92k47J32K26j42l03J68Lj48J31J90j59j79n8q3M20l69N13k87K83l11
5189a8K97m01K00M5k61m9J87m8j20r8J81K1m1n4l0J14j05r5L33N9q7k70p8M29
5213A11j07k57K85k3K8q2j80j8K79k4k57O6K6j04J23rK07J77k72j92P2K48l20
5236b23K51K29l74J19n5J09O5k55L9J29K31k94k33K33L9J82m28K91j6l6L89k82
5258A10K14l64J52j77L9L56m17k60K02K84k41j5J62m6J64j71Q8K25k87J2Q%po4
$$ plain form
5097 -5 -65 -158 -125 -46 266 -113 68 16 139 41 36 123 128 -201 -90 302 153 -186 -66 -89 66 297 58 -24 28
5122 28 -64 -325 45 -196 53 -182 -64 55 -174 -208 -32 103 49 -35 -158 279 46 -240 -100 146 403 203
5144 203 -10 -24 202 -73 214 184 23 23 42 218 101 105 81 -250 55 -13 14 357 137 328 160 305 28
5167 28 394 202 -45 87 313 171 -132 36 39 -109 22 212 53 -126 -184 -267 153 -216 297 10 293 -18
5189 -18 279 -122 78 123 -138 -187 0 -48 -168 -266 -85 -64 -105 -159 -189 -75 -180 -275 58 117 30 -240 -318 111
5213 111 4 -253 32 9 37 -45 -225 -243 36 12 -245 -179 -153 -257 -134 -143 64 241 -31 -223 -151 97 -223
5236 -223 28 257 -117 2 -53 56 121 -134 -95 34 265 -29 -262 -29 10 192 -236 55 39 3 392 110
5258 110 324 -40 112 -65 -26 330 -87 -347 -145 139 -102 -117 45 -1 163 -8 80 305 18 30 38 38 31 -33
5282c3M7J83R2j25j22N2r9j10MJ21k5o1K10J04r2k11j10N47l52p7K24J08j52j71
5306d8m6K54k78Q4N0j20K29o9l3o6r3q5K93l36M60k56N5qJ6k57J35K35l8N3k72
5331a41j04K04L94m97k94L98l4lK13m30L45k09L2J19j41Q3j10J4M3K77m78K57
5353f2K70k25n1J36j06R5l06J94J70j69o6R9N7j52J33J1j42M04m05l30L75L91
5375C21n26J08K88j86J54k48j21K27k1J30k65L14j80J10o07L52Q9L32m13n7L62
5396A63j63q9J58q6K10m29J33J82k1J6JQ4l5k46K05m7J11J72l21K75k09K14m60
5419a82K34L48k07o07M13J65LK8l31J65O8k02qK50J39n05J86l2j2j77J79K45Q2
5442B42P7m92K53Q9j73l72J73K46K1k43M82N8l31j29p0n5K24J38k45L61p4k73
$$ plain form
5282 -33 14 197 289 164 42 94 -5 -115 -111 10 -15 -76 134 238 146 -65 -175 372 20 -57 167 275 123 -48
5306 -48 -94 160 -118 -34 16 -104 125 56 23 -43 -136 -221 72 -264 196 -60 -5 -13 3 -254 -119 116 78 131 -141
5331 -141 -245 -41 353 -144 -438 -40 -74 -77 136 -294 51 -158 -126 -7 -148 -65 -175 -161 -118 159 -319 -62
5353 -62 208 -17 -68 68 -38 57 -249 -55 115 -54 -120 -21 36 -116 17 28 -114 290 -115 -445 -70 321
5375 321 -205 -97 191 5 159 -89 -210 17 -4 126 -139 175 -5 105 -502 -150 -61 271 -142 -199 163
5396 163 0 -89 69 -17 193 -236 -103 79 58 74 75 159 124 -122 83 36 147 319 -2 273 64 278 -182
5419 -182 52 400 193 -414 -1 164 167 195 -136 29 97 -105 -113 137 276 -229 -43 -75 -87 -264 -85 160 242
5442 242 319 -173 80 169 -4 -376 -203 43 64 -179 303 361 30 -99 -169 -224 0 138 -107 254 180 -93
5464i3P5k3J3k26M96o72N77l19J46J68k93r9J8K83J02j91J13J08l19K3L5m8M31
5487C05l74r3J34M0j23J00J9j40L80k83K95j73N4mm8r7J43nj92J40l10K25j23
5510a30k10L67K47j91l49N85l47J64l43L03j03O0K0J83J06l69K22K83p55L48j83
5531i2p3qL42l78N8J34J50q1r8J09r6pQ8L62m37L21l20K52k31o7j21K29L41k51
5555A26k9j06j94L12m13J2M02m4Pk57L15J2m12J98K05J31q1j64k0K74j60K0j00
5578C4%J14j85j53M57k38j22K78N2j25k1J85j27k43M4L01l02j29k2J89l08L82
5600F1O5k68L61k19j13l90L57J18m3N7J8j16l5O5J39k08j79L54M4N0k71kJ27P5
5624D7J30l53K42j21J67l2k22L04j35m03L79j97J81J21m75N25k74R4K3K54k74
$$ plain form
5464 -93 -18 -41 -28 -254 242 -430 147 -172 -26 142 -151 -250 -232 51 153 -38 75 183 -136 -113 -78 -126 305
5487 305 -69 -162 -28 12 -111 -11 8 -132 248 -35 260 87 141 137 89 -8 135 130 -62 78 -232 -7 -130
5510 -130 -340 27 274 83 -266 319 -28 136 -207 96 -7 53 73 256 362 -7 215 498 -257 91 -92
5531 -92 -165 -173 169 -209 -151 -17 133 52 -46 63 -33 -40 48 410 -27 294 -26 226 -5 -72 -193 36 377 126
5555 126 97 -9 -203 109 -304 -292 110 66 73 -184 131 143 -269 -71 134 265 184 20 0 274 114 134 34
5578 34 34 148 -37 -190 267 29 -93 185 237 112 91 276 149 -94 -50 251 -51 -180 -202 -13 -321 61
5600 61 126 -142 219 0 -113 -503 -146 -28 -71 -14 4 -112 -147 -82 57 -151 -330 24 68 118 -153 -155 -28 47
5624 47 177 -176 66 -55 112 80 -142 162 27 -376 3 -194 -13 108 -367 158 -116 -22 1 255 -19
5645a9Rk27K90O5l16N26m08J15J76m54J55J02j17K63r4K01k85R6j41J94K42m11
5667c8J75k29K14j67J21J13k63J87r8J32k1O0J9m50J48J96j84P0J80l36J39k3
5689e5OK27k47J73m63N33P3k70j36L34j90j60L49J39j44k46M7J72m2l7k24K98
5711A37K4k76J42O7k48K82P6j18L93n63O0J27R5Q9l10j08K67j85l03J81J33J25
5733H7j30l40M48j3l31J1L53k45k73K29K58j25P7j3K56j77j90L8O0j64J75k4M9
5756A6J20l14L34l15K06n1O6j39q3J13m3R9N8J12l61L93j33%j42K98J36k74j63
5779f7R1L7r0oj11L9K03l0j53J79j40j56J28O5k8J20L71n40J99J97k32m9J08k7
5803A08j45J60K40k37k25mJ27j21K34k38M71m28J08M3r9k49L1R3K89k00K71l03
$$ plain form
5645 -19 -10 -237 53 118 -198 328 -80 35 211 -243 -88 14 -103 160 66 267 -18 78 -63 131 373 -38
5667 -38 137 -92 122 -45 76 189 -74 113 15 147 126 186 205 -245 -97 99 -85 -15 165 -171 -32 -55
5689 -55 -49 178 -69 104 -359 174 247 -23 -159 175 -15 -175 174 313 169 -77 -30 142 100 63 -161 137
5711 137 161 -115 27 94 -154 128 204 86 479 -84 -24 103 198 287 -23 -131 136 -49 -352 -171 -38 87
5733 87 -43 -383 65 52 -279 -268 85 -160 -433 -204 54 -71 6 -7 249 72 -118 -80 -20 -184 -9 -33 16
5756 16 136 -178 156 -159 47 -4 62 -77 -160 -47 -90 9 67 179 -182 211 78 78 -64 234 370 96 -67
5779 -67 24 61 -29 -35 -146 -107 96 66 -87 92 -48 -204 -76 -11 -39 81 452 -88 111 308 76 27 135 108
5803 108 -37 123 363 126 -99 -103 24 -97 137 -101 370 -58 50 93 -6 -255 -224 -131 158 -42 229 -74
5825g4K6K1j33L17k73j9Q7k44K71J13p8j72J62M3j21q7J30P0RL40n79J44l3j16
5849a96J50J22l2P6j11J44j21q3k11K07L6j70J01J04K8j96Jo2j15L04J37m13K75
5872b5O7k22j92M46r3O8k09m0M52l01K8N3o5m0j26Q6K99Q0m19L5j20K80p4J08
5896G6L9m86L44j89J33l8N4j1J76K7rn54L56KL38k91J7K31k78o6M9L67n08L56
5920A35l4q9m4j05J82J16j95QM1J09K7j59k4j29J71J51M67l73p0m74J79m1L97
5943B46J13l23J00j3J01K04n28K52qj08R7k19P6k05M42l02K7K76k14r1J0j06P7
5966i6J24m7p2J55Nl28M40k21O7r1l11R9M77l39k7L53k69K34J19m24Q9k48L74
5989F3P9J61j95p0l70L02j9J7j36J46J68N0K4l29OJ24p5p5m9J59j17J08q4k91
$$ plain form
5825 -74 -48 -27 -160 157 -116 -135 -48 -292 -21 92 14 -158 4 47 -74 -161 -31 39 48 388 -191 -47 -80 -196
5849 -196 -46 76 44 120 9 153 32 -51 -262 -55 -19 -189 -88 16 44 -152 -151 -213 -328 -24 113 -300 -25
5872 -25 42 -180 -372 74 -19 49 -160 -200 252 -49 -21 32 -33 -73 -199 -113 186 266 -153 -118 -238 42 -32 76
5896 76 115 -371 -27 -216 -83 -121 -67 -78 98 125 116 -438 -82 -80 258 -33 -16 215 -63 -129 -80 287 -221 135
5920 135 101 12 -32 -137 45 161 -34 -26 15 124 151 -8 -32 -161 10 161 628 255 185 -289 -110 -151 246
5943 246 359 36 136 123 224 428 -100 152 144 36 133 -86 -10 -215 227 -75 -48 228 14 -77 -67 -173 -96
5966 -96 28 -19 -91 64 69 -259 181 -40 27 -64 -375 -276 201 -138 -165 188 -81 153 272 -152 -63 -311 63
5989 63 142 303 108 38 -332 -30 -49 -32 -168 -22 146 196 220 -109 -103 21 -54 -129 -178 -19 -136 -28 -112 -403
6013d03K76J56q6M5k08J60K4Q3k26K49k87k42K96J76J51m3R4m01K63P7q3j1J21
6036A81q9j8L8k41Q3l4K7j7K20k31J37n6j03j25K84k67J2K60k99L15J41j12P7
6059A83j41Q9M0j21o7J06j27j00L26o1J39m21K11K30j73k8j7K31j76k98L77k31
6081b9N6j24M45m39J91j38MJ93m01Q1L32klj04P2k95K07O8l04Q9N5L4n4k33L83
6106H4k3r3J91l23Q1L72n83L10q7j00L6K39L7j90Q9p5K85m39J79J56k98o1K01
6129a2j15Q8j67L11k29j5Q0m8J62p1l2K04l78Q9N0K41j47l62L67K1p2Kq0k6j31
6154b70J86L79m36J36n4N0K9k28K19p8K73p7o5K1k27M3K29J47m29J10J69j65l2
6177g0l4K92Lk0j25L01J4m45M98k64k7l89K36j09K74J9j62Q1M9j11j4J74k58K46
$$ plain form
6013 -403 -127 29 -57 -12 -220 -60 -36 47 -179 70 -217 -459 -163 13 164 121 215 -186 77 154 71 60 181
6036 181 92 74 112 -129 -46 -80 -53 -70 150 -81 56 0 -103 -228 56 -211 -199 61 -238 77 218 106 183
6059 183 42 131 171 50 -17 89 -38 -138 188 127 266 -155 56 286 113 85 68 299 123 -175 202 -29
6081 -29 27 -97 348 -91 100 -38 -34 159 -242 -161 171 169 166 62 134 -161 46 114 -190 -101 -46 -12 -66 -299 84
6106 84 61 -32 159 -164 -83 289 -294 16 -71 -171 -135 104 141 -49 40 -35 250 -189 -10 146 -152 -213 -12
6129 -12 -127 -39 -206 105 -124 -139 -59 -107 55 -16 -48 156 -222 -133 -83 158 11 -351 16 37 -35 -33 -113 -139 -270
6154 -270 -84 295 -141 -5 -59 -9 20 -208 11 -67 206 129 64 85 -142 -99 130 277 -152 -42 127 -38 -70
6177 -70 -104 188 191 171 46 347 361 -84 414 150 123 -266 -30 -139 135 154 -8 73 122 11 -3 171 -87 159
6201A59n23M78R2j87N2MJ40l89L53j0o6L3N4j05J26j63j23K76n8p9k35J26J35
6224I0K2k87L02n6j37K4j69K31K6k1R8k17K55j87K45n03J70K36j45M8j74K12J2
6247G5j31R5L2q1K48m53K05R5m35J56k8L14r7k42L03j99m8J13j66n1K22j01J96
6270B2K24j64l60J40mO7J79o4K2nj91J35l02K75r3JJ01L07j77j95k79K63j8R1
6294b5J01k36M42k83J54k15J05k44qL34nk19J86nK7j91K67J49j84K09n03K81O
6317A43P3l99J92K5k36K32J18k43M39j52j49J45K42o48L88J38k72J22k92K72k25
6338h7J18J15m6j24N2r2J42j51J54L8m6m1o6J22m6K2q9J92op1L33m79j26L8N9
6363h5n5K89k14J11j16K99k76J16k6n9j71j7L79j54m59J93J32J00Q5K74m59p8
$$ plain form
6201 159 -364 114 206 19 71 75 215 -174 179 169 103 136 190 85 211 48 -75 201 143 64 -171 -45 90
6224 90 112 -175 127 71 -66 -42 -211 20 46 25 123 -94 161 -26 219 -284 -114 122 -23 25 -149 63 75
6247 75 -56 39 71 -10 238 -215 -10 85 -350 -194 -222 92 -5 -247 56 -143 -191 -78 -244 -295 -73 -174 22
6270 22 246 82 -278 -138 -142 -75 104 40 62 57 -134 1 -301 -26 -119 -118 -17 290 113 -82 -361 -98 -116 -25
6294 -25 76 -160 282 -1 153 -62 43 -201 -209 125 120 -99 87 82 109 -82 185 334 150 359 -144 137 143
6317 143 216 -183 9 34 -202 30 148 -95 344 192 43 188 430 -218 170 308 36 158 -134 138 -87
6338 -87 31 146 100 -24 28 -64 78 -73 81 119 73 32 -34 88 42 64 -25 167 161 90 423 -56 -182 -144 -85
6363 -85 -140 149 -65 46 -70 229 -47 69 43 -16 -187 -204 175 21 -438 -245 -113 -13 72 346 -113 -191
6385a91K8J35j36K55j12k5K79o15N45j08p5J09k94J55M26n01k5K88j71Rj40K19
6407E5j10j76K64J16k51j50L25j63J93m08L04o9j61K92m4n7K30k28n2m8K91L95
6429E48n91R7n2n4n2K17j25k7r9j48O19m05j17M5Q5K85l37L80l10J40j89nL00
6452B05j61M5p2J16j73J75l14L91k05j9O3l7j13j18K21Q5j44J15K36m24L32j12
6474I2K0j42j57K60j44j03J05M7J41q9qj41J44k8k24P18n69O5m7o4J38l0L33l30
6498a3J52j83L50l11j34J72r6P3J52l11q8Q5K4J37J20j36R5J8K16o53K39J23k88
6521b57K50nJ8K06m49J81Q0o9j8J78k8n01J88K08k2n1M3j9r8K95j49j88N86j25
6545B54l15m3R1J33J62j47o3q7K7O2m9P3k64q3J7K44J10q9j52K05K25k65M2n31
$$ plain form
6385 -191 -163 -28 -164 91 -21 -46 233 -382 163 55 -20 89 -205 -50 376 -125 -150 138 -33 -24 -164 55
6407 55 -55 -231 33 149 -102 -252 73 -90 103 -305 -1 -70 -231 61 17 -40 190 -38 -90 -138 153 548
6429 548 -43 54 2 -52 -104 113 -12 -39 -138 -286 333 -72 -189 -144 -59 226 -111 269 -41 99 -90 -95 205
6452 205 44 89 17 133 -40 135 -179 212 7 -12 51 14 -99 -217 4 89 -55 60 296 -128 204 92
6474 92 112 -30 -187 73 -71 -174 -69 -22 119 30 22 -119 25 -3 -227 491 -78 -13 -60 -124 14 -16 317 -13
6498 -13 139 -44 306 -5 -139 33 -63 10 162 -149 -237 -152 -128 9 129 -7 88 106 322 -331 -92 31 -257
6521 -257 -7 -12 6 212 -237 -56 24 -45 -63 115 87 -414 -226 -18 -40 -91 -48 -67 -165 130 -19 -207 379 254
6545 254 -61 -104 -13 120 282 135 72 -15 12 74 25 98 -166 -249 -232 12 122 33 -119 86 311 46 88 -443
6569d43L84L78n25J42k6P5o5K13j77o8o9K10J37J90n16K84j26J43j27k7L5j32
6591a10M08k15L25l53J02o9L3r7K6j3n9Q9L9j62q1K63j2q4j81K04P0J13o1j23
6615E2r9j04L81m82K73r2J26k54R3q3l2K84l20K00m8l6K49j72K9q2L02K1k35l9
6639f8J16M6k31kPJ74j62J77J3O9m08J51J44K11k57l4K02l40J46j1J04o4m5oP
6664f1Q4Q7k26k6J33p4l4J8J70j62K81m54K86K8K8j46L5O6j38N2j7j9K51j83j22
6689a43J68J6j93j10M45k46N3J97k47J38L2K32n35rK88J12n1m30L78J78j10l36
6711a73L14j65J48m7k2O7k22J20j43L46k43J80o0J11j44q8L70k00j09K20k19L
6733D4m6m1K35j39k22O75m36k96J95J97j94pK74k18j13R7Q4k73R5L02l12J27N8
$$ plain form
6569 -443 -59 319 -206 -64 -90 -15 -80 133 -44 -112 -181 29 166 356 -160 124 -2 141 14 -13 22 -110
6591 -110 298 83 408 55 157 88 121 24 50 37 -22 67 106 -56 -137 126 114 30 -151 53 123 236 175 52
6615 52 -47 -151 230 -252 21 -71 55 -199 -106 -189 -221 63 -257 -57 -105 -141 108 -64 -35 -117 185 206 -29 -68
6639 -68 48 94 -137 -139 -132 42 -120 57 70 139 -269 -118 26 237 -20 -54 148 -192 -46 -57 47 -17 -62 -68 -61
6664 -61 23 110 -116 -142 -9 -83 -117 -99 71 -91 190 -264 22 50 78 -68 -33 33 -105 -53 -70 -89 162 -21 -143
6689 -143 25 41 -152 -262 183 -63 -10 187 -60 78 110 342 -193 -202 86 198 147 -283 95 273 163 -173
6711 -173 141 -24 124 77 55 122 -100 20 -123 223 -20 160 100 211 67 -21 349 149 40 260 41 44
6733 44 -2 -43 192 53 -169 506 70 -226 -31 166 -28 -35 239 21 -92 5 89 -184 -89 213 -99 28 86
6756H6J9q8K04p2j37NK7oq5K05j69K67m70L06l78N49J04n62J04O2m5j18R1j7J32
6781A4k23J25K02l15J91j03n6K67j60J91P7k68K86k47m7O3K5l18J09M3J44k95
6803b95R4J66r8jR4m8L6J0k38K51j10K2n8M2j74M48j94J69j32J59Q1k16j5R5L48
6828D36o53M81n8N0j55K30j49j94J97J19j07k39J85j9k10r1J14J32J01o6M0j32
6850A2J30j25j53j44P34q2l28L50l51k24M19m11J23k3J90k14K71l02M02m48kL78
6872B02j82j32Q9j33O8J93k23L13l73l51N96k38q2L48l23K29J32l18J3p9K00k01
6894b52J37N7n9L71j65j71M75m58k0L31m22L16l69M86k75m2j79K92j88Q0j60K62
6916D7j04k3K5k0n7k1M7j10L09k14K00l62J58J94k74j97L39n1K01j17J04P6k18
$$ plain form
6756 86 105 17 221 149 12 17 44 38 -47 158 -11 256 -214 92 -286 263 367 -195 -91 -29 -74 -192 -101 -118 14
6781 14 -209 -84 118 -197 -6 -109 -165 102 -58 133 210 -58 228 -19 -66 -3 22 -296 -187 -144 0 -295
6803 -295 -201 -35 -133 -134 -40 -88 -52 -42 -280 -29 -139 -117 -175 -133 -307 141 -53 116 -16 143 224 8 -7 88 436
6828 436 -217 264 206 256 101 331 182 -12 185 304 197 -42 143 124 -86 -177 -63 69 170 104 144 12
6850 12 142 17 -136 -280 454 372 44 394 43 -181 238 -173 -50 -73 117 -97 174 -128 274 -174 -176 202
6872 202 20 -112 -23 -156 -88 105 -118 195 -178 -529 67 -171 -253 95 -228 1 133 -185 -172 -251 -51 -252
6894 -252 -115 -58 -117 254 89 -82 393 -65 -85 246 -176 140 -229 257 -18 -60 -239 53 -135 -55 -215 47
6916 47 -57 -80 -55 -75 -132 -153 -106 -216 93 -121 79 -283 -125 69 -205 -402 -63 -114 87 -30 74 150 -68
6939f8L38l58l6J68n6N7J4m8l18M04j40J25M3o2k10J69o7J91o2j72Q9j19o5k4
6963b07M09l5K0r6Rk30J55k09Q7o4%K20j90K53j27J09j35K05j71j49K35M3l77
6986b45M47J4o0p4n4q0j43J10J64n0k94K12K29j76K48k31J63k59J20j81J08k9
7008f1n7O8J07Jj18Q9k49J89J51n0R2j36R0J25l83P3J68j61j18N3j29M25k93K48
7032A24k79R2M3k00J1L53L00m68J05l93K82J36J4n13N62k28n1L73m04L07k51M7
7054c8j28p7O7K33P4k07J02R8j03J18k32j63p6L57j33p0O7K42k3k86K18k03L07
7077A44O0l08L2m6K11mK6k49K42j37K19l53P3K83l25j26K96j76L63k97J11n2m1
7100e4K92l93J89O0j23K49p5J52j83k46j4J54K56l02L8J11K5L3j07n6p4P4K56
$$ plain form
6939 -68 270 -88 -124 44 -12 45 59 11 -307 97 -43 82 125 63 -147 22 -45 146 84 -88 1 -118 -183 -207
6963 -207 202 167 187 91 100 -130 25 -184 -97 -161 -161 59 -131 122 -5 104 -31 174 3 -146 89 132 -245
6986 -245 202 216 156 82 28 -52 -195 -85 79 29 -265 -53 176 0 248 17 180 -79 41 -140 -32 -61
7008 -61 -118 -50 57 58 -60 29 -220 -31 120 70 162 26 116 241 -142 -69 99 -62 -180 -127 -256 169 -124 124
7032 124 -155 -63 -20 -220 -209 144 444 -24 81 -312 -30 106 120 -393 169 -59 -110 263 -141 166 -85 -38
7054 -38 -166 -243 -176 57 131 -76 26 124 21 139 -93 -256 -332 25 -108 -178 -111 131 108 -178 40 -163 144
7077 144 204 -104 -72 -118 93 89 115 -134 108 -29 190 -163 -90 193 -132 -258 38 -138 225 -72 39 -13 -54
7100 -54 238 -155 34 94 -29 220 145 297 114 -132 -146 8 264 -38 0 111 136 169 62 6 -68 6 262
7123B62j29J75k58J10O4k14n0L70M2k17km89K8r3K52L41l07m5M64j46k83J78J43
7146A96r8m4L8J98l36J71l32L76l44J39k79M36L2N7k26l01L66k5p0l1k69K76K04
7169A34l31J82j9j40K67j06q0oJ55j0l34J72j21N7jK72l8Q4j31j10pJ25j51L8
7193i9J80l53L05J53L1k67J04M2k77K32p2J02j46K69l51L71m03j36K20L08j80
7214C3j00P7j82J23p8M80k04O6o9k99M35k08J09k49j80NJ64J33J98l47K02o8l
7237C8J59m52J59N2K13j20m6P2j68k2K14j55k9J88PjO6J64k23j67m5J54k64M67
7261B61Q9n19K9n9J62J42K4k68L19N6j2k83M0L6l48L12k8OL0n2k01J73J30j14
7285g5J47p6j81K46k50K16j24j18J21k25L80n10N61j22K45l42j11L33j04Lj95
$$ plain form
7123 262 133 308 50 160 224 10 -40 330 372 155 153 -336 -308 -401 -149 192 -115 -160 304 158 -125 53 196
7146 196 98 54 92 290 -46 125 -207 169 -175 -36 -315 121 153 210 -16 -317 49 24 -46 -77 -346 -70 134
7169 134 -197 -15 -34 -174 93 -13 -93 -99 56 46 -288 -116 -237 -180 -181 91 53 137 6 -104 -111 14 -137 -99
7193 -99 81 -272 33 186 217 -50 54 96 -181 51 -21 81 -65 204 -147 224 -179 -315 -95 213 33
7214 33 -67 10 -172 -49 -127 353 149 215 146 -153 282 74 183 -66 -246 -241 -77 56 254 -93 109 41 38
7237 38 197 -255 -96 -44 169 49 3 75 -93 -115 99 -56 -85 103 110 109 175 339 116 -51 -96 58 -206 261
7261 261 350 -169 -140 -199 -37 105 129 -139 180 236 224 -59 -19 17 -331 -19 -47 -41 -11 -63 -264 -91 39 -75
7285 -75 72 -4 -185 61 -189 27 -97 -215 -94 -319 61 -449 112 -10 235 -107 -218 115 11 14 -181
7306a81L60k69K24k04k1J22jj21N9J76K2k91J19j40J40J74m62L77k8k02J13J99
7328A65j76J83m48NN09l05rL3K45j64J4k02l1r1R3Q5J76L82k47j01J67k93K9Q4
7352A03j30M9n8mk7J3J15j66J11m4p1j9M4J71ll32L26j12O8j36J0k4J53m0l24
7377c27M70j72N2R0p0o2j05M9n9J12J0j1k49M42k57J21pP2l06l54O09j74J8K56
7401A48l06L24k01o3J02NN3r4J25M4R3l23J50j21K02l59K23j11L28j79k62K05
7423a7r3K57po0j50k3Q6O2J50k40j96P6q2L91j70l0N7J19m2MJ27n41L04j40qL41
7449A75p4K49m61MJ24M2n1n9l6l3l2J96J47p1R7m78K75k7J08Mk3p6o0Q5kM5j31
7476f3k4J54l8j62J1K47q2k46K73l31M19j20L0j39pJ47l10L26K68j81j20q5J84
$$ plain form
7306 -181 179 -90 134 -70 -91 31 30 -91 -32 144 166 -125 -6 -146 -6 168 -294 83 55 -147 -34 165
7328 165 -11 172 -276 -271 238 -67 -76 -43 202 38 52 -150 -181 -272 -179 -94 82 464 217 116 283 -10 19 103
7352 103 -27 22 -36 -40 -67 -54 61 -105 6 -38 -109 -128 -84 87 84 -248 78 -34 34 -102 -92 -116 37 -3 -327
7377 -327 143 -29 23 113 43 -19 -124 -75 -134 -22 -12 -23 -272 170 -87 34 27 99 -207 -561 48 -126 -108 148
7401 148 -158 166 -35 -98 4 9 62 -32 93 137 230 -93 57 -64 138 -221 2 -109 219 40 -222 -17
7423 -17 -110 147 140 80 -70 -93 -7 55 205 -35 -231 -155 -237 154 -16 -46 11 130 88 92 219 -322 -18 -158 -166 175
7449 175 101 350 -111 -107 17 59 8 -51 -87 -120 -152 44 191 120 217 -261 14 -13 95 99 76 0 -60 25 23 68 -63
7476 -63 -87 67 29 -133 -122 125 43 -203 70 -261 158 38 68 -71 -78 69 -241 85 353 172 52 -33 151
7499A51k52M1K33J39m39K05j34J59p7J48r9K09j20r6k11K70L4k66Q2Q1l31M11
7521A38j14O9J92l70M07l46J81K7k14N5j19K30q3j95J05J36m5j35j8L77k11J39
7543B06ol00R0k9K49m16K76j8J97K4m10r6J69K1K53n86M14k66k3j23K45K26l19
7566b22J78j42J77j25K46n40M32N9l66K67N2j72L39N4l26Mj70r2L46o8J7J79j24
7589CJ77j90j22K66j93L4R7k01J63j40K24o6Rl78J25J91j48o5K00j25P2K63j57
7612C9J12j87J88j57L2k2K42l21L62j67J39N4m85K8J6J14M1l9K65l66J45k45m7
7635b59L6L30j01Q2K8K2J21k49L53l16o3K14K9j87J27j62k50M55k13P2k75L48
7657A42K9l49K98k31J49l4O5k7r4k07L77K10j94l65K43P9R5J02m52J10l5m0k43
$$ plain form
7499 151 -101 -60 173 312 -127 78 -56 103 26 174 75 284 164 68 -143 127 161 -105 -23 58 -273 138
7521 138 24 93 285 -85 322 -24 157 184 -30 25 -94 136 53 -142 -37 99 54 -81 -99 278 67 206
7543 206 200 -100 -10 -39 210 -206 70 52 249 273 -137 -233 -64 -43 210 -376 38 -228 -251 -374 -129 97 -222
7566 -222 -44 -186 -9 -134 112 -428 4 63 -303 -36 16 -156 183 237 -89 -85 -255 -347 -1 -69 -52 127 3
7589 3 180 -10 -132 134 -59 -25 72 -129 34 -106 118 52 61 -317 -192 -1 -149 -214 -14 -139 -67 196 39
7612 39 151 -36 152 -5 27 5 247 -74 288 121 260 314 -171 -143 -127 -13 28 -11 254 -112 33 -212 -259
7635 -259 -223 107 6 88 116 138 259 10 363 47 -16 198 227 40 167 5 -245 210 -3 69 -206 142
7657 142 171 -178 120 -111 38 4 69 42 -52 -259 118 328 134 -231 12 91 186 288 -164 -54 -89 -129 -372
7680c72J71M51k56j00K62L2k01o9J23m1l70J05K21p7m5M46k85J17l6J09K4j91
7702A8J92r1j50K09k26j0K7l08J90M9J14K02J7j38K64l42j48J73K20k75K2J00
7724A09n1l03j8L13o3j79J77jk0j04N9J27k15m2J22J78J43j22j45q4lN4P8l2k21
7749b43O59l54J25j27k13K51o8k07J97M3k8j54J56rL1R0k01jJ67j30J62J4k48
7772h8N1L18k70M9l2o6N2j09L8J04j59Q6QN0L18k17J10j84l58J77R3J93j3j36
7796A5j03J31k26M95k77j40K03k85L54k67J33l93K85J51p2j18j41J82o3J19J9
7817BJ76o33M74P0k41J7R7j8j35K16J77j62k94J20O9j62M54l50J25j08j55M20
7839A59J08m30N09k48j72R3r7m1n7J8K9K71m1j21P1m41N35j92j5K2j09K53J67
$$ plain form
7680 -372 -201 250 -6 -106 156 188 -13 -82 41 0 -370 -265 -44 -121 -166 280 -5 112 76 185 209 18
7702 18 210 119 -31 178 -48 -58 -31 -339 -149 -100 14 216 233 95 359 17 -131 42 262 -13 9 109
7724 109 58 -245 -263 50 -13 -192 -15 -16 -36 -140 -81 46 -169 -211 -89 89 232 110 -35 -119 -122 -68 10 -22 -243
7749 -243 416 62 187 60 -153 98 30 -177 20 63 35 -119 37 28 59 149 -52 -53 114 -16 146 160 -88
7772 -88 -37 281 11 60 28 -38 14 -95 -57 47 -112 -26 -18 32 350 133 243 59 -299 -122 -29 164 151 15
7796 15 -88 43 -183 312 35 -105 98 -187 167 -100 33 -360 -75 76 4 -114 -255 -73 -136 -17 2
7817 2 178 -455 19 89 -152 -135 -38 -56 -191 25 202 40 -254 -134 -65 -227 227 -123 2 -106 -261 159
7839 159 267 -163 346 98 -74 19 -78 -119 -176 -158 -129 142 101 -20 51 -390 145 -47 -62 -40 -149 104 271
7862B71k11J05Q5k72N0O1J69k27j5K5L0o9R8J11k38k0Qj15L86l60L92J9k42p3
7886c2K3n1J0k9R1M7r2O42o84M2L2J53k7k20M89l07k41K85j20J75n17M42o6M4
7910H9P6j83N39q59K38q2K41O1J16m10K02j57j8Rj08K81l22M88k77J01J70j61
7932C4J47j51J40j34j11r7J40j06K5l9O1j58J27j73L39m7j53Q3q9l9J44n7O4J95
7956A45j58L05n6m60M07l81J64m66L01p6P7P9Q1l47N84k95J24r4J27k87L17j93
7978a02K4L66m85M67o00L28q1p6K09j18J14n6P2k2K4l9J53j41K25j16k20n4j51
8001b79K12M1J02o0M6j32M3J93P4Kr4k9p4j60K04p3J00k93J97K2kk4P6k41J01
8026d8R0K3j9K62k05n6NJ05m20M05J14j60M3J34o09J79L73p2k10JQ4p9K6j03k7
$$ plain form
7862 271 60 165 250 -22 28 89 258 31 16 41 71 2 100 211 -27 -47 -39 -154 232 -128 264 283 41 -32
7886 -32 -9 -60 -50 -79 12 59 -33 609 -75 -33 -1 152 125 -95 394 87 -154 131 11 186 -331 111 45 89
7910 89 165 -18 521 -338 -100 -182 59 120 236 -174 28 -129 -147 -138 -246 35 -287 201 -76 25 195 34
7932 34 181 30 170 36 -75 -172 -32 -138 -113 -152 -91 -249 -122 -295 44 -3 -156 -73 -162 -201 -57 -114 -50 145
7956 145 -13 292 236 -224 183 -198 -34 -500 -199 -275 -198 -119 -38 -385 199 -96 28 -66 61 -226 91 -102
7978 -102 -78 288 -197 270 -330 -2 -83 -159 50 -68 46 -10 62 40 64 25 178 37 262 146 -74 -128 -279
8001 -279 -67 -26 76 16 62 -70 -27 166 240 242 148 119 45 -115 89 16 116 -177 20 42 40 16 92 -149 -48
8026 -48 42 65 46 308 103 47 52 157 -263 142 256 96 139 273 -336 -157 216 144 -66 -65 19 -60 -34 -137 -164
8051a64k0J15R0j33j68K97m0m3k42L03j72K35l65K13nK77m8k87K89k45L60k81
8073c4K10j25Lj52K62k33j60L37r9q2K4j40O8L21M7k67L62m85O0K15O8j50O1j44
8097c3K27k25l7j7N0J84j09J9k73lQ3K08j16K59j33k45M01k30l9K0q5ll3L70j80
8122F0J09n2k15j47K67k62J19j58K19r0K25j08j39m0K18J5j29J42J09p0mK13j38
8145A44%m2q5n6j94M56k38j2J91k58L15m23K03J42j78K6O0l05J31R7J50K3m7q4
8169A6j94p9l5L22J35j14L7n4J01j72j70Q2L8L26j00k7q6K34jo16L98j05
$$ plain form
8051 -164 -184 -69 21 -112 -280 17 -23 -66 -308 -5 -177 58 -307 -94 -99 178 130 -157 132 -113 247 -34
8073 -34 176 51 54 -98 164 -69 -229 108 9 -73 -49 -189 -121 200 247 -20 342 -143 -83 132 200 50 111 -33
8097 -33 194 -31 -68 -85 -35 149 40 59 -214 -217 -134 74 -42 217 84 -161 240 10 -29 -9 -94 -97 -130 240 60
8122 60 169 117 -98 -245 22 -240 -121 -279 -60 -150 75 -33 -172 -212 6 21 -108 34 143 73 69 282 144
8145 144 144 102 17 -39 -233 223 -15 -27 164 -94 221 -202 1 143 -35 -9 51 -254 -123 -26 124 147 100 16
8169 16 -178 -257 -292 30 165 51 88 34 135 -37 -207 -125 -87 239 139 112 26 260 259 -357 41 -64
8191f4
$$ Imaginary data points
##PAGE= N=2
##DATA TABLE= (X++(I..I)), XYDATA
0@%%%%%%%%Qj6J6j6J6k4L2l3M1m8N6p2Q6r7J10j29J50j69J93k22K51k83L20l60
32a90M03m50N02n61O25o94P71q54R45j047J159j282J419j574J751j949K175k438
50a289K745l114L564m127M854n837P251r464J3450k2855Q3810O8236j64916k7346
64e5038R6005M0937r2681j6015Q9572K1311j14686m2789J02655P5062p3227o7189
76c6083M2879M1796n9300l7583P0826N7097p0623q0449L7169P7049j2240m6651
88a6113J6052K8928m1803m3311M7055O7008k7428p0905K204M8658n037l3975K3280
101e387M5988k8119o8540N772P1289K1778m7064k5354K1772K571k8239P291M7936
114B1694Q570n1153l0593L1366L6487n954j5881N147j018k4564q741L1627L0936
$$ plain form
0 0 0 0 0 0 0 0 0 0 8 -8 8 -8 8 -16 16 -17 24 -24 32 -40 46 -51 59 -70 80 -89 104 -118 133 -150 170 -190
32 -190 213 -237 265 -296 329 -365 406 -448 497 -550 609 -673 746 -828 923 -1026 1149 -1289
50 -1289 1456 -1658 1906 -2221 2633 -3204 4047 -5417 8033 -14822 68988 137224 -27692 -55038
64 -55038 40967 81904 -10777 -26792 62780 84091 -30595 -73384 29271 104333 31106 -36083
76 -36083 6796 48592 -10708 -48291 22535 79632 9009 -71440 -34271 42778 30538 -16113
88 -16113 -61 28867 -12936 -56247 -9192 57816 30388 -40517 -38313 10345 5308 -28667 -5387
101 -5387 40601 12482 -56058 -50286 21003 42781 -4283 -29637 -7865 -5294 -33533 -26242 21694
114 21694 30264 -20889 -51482 -20116 16371 10417 -5464 -317 -1335 -25899 -34640 -3013 27923
127B7923j1591l1713r107J3651J1150N190Q393J35k1047k2160P075L1615J8743
140B8257j4607k4295n302R829K927r21J0857J1349j7140l3956O92M2880K6636
153C7206k6842l3162R195J9957j5363j7148K9403L2745l1863n5106J5047O5939
165C0008J1799n1918j7932L8607P081m6960p270O1054K5355o1826m6562M5613
177a2951N4542k4322m0541K3102L1934l5612m3250L7890O0023k1262o3166K449
189c1164M9368M76l5336J3591M1806j8472n6106P518O2005R899n0461j4371L6288
202A5041J294m1586O098N7920O474o3015k3088N3627L1347l9305k4546L5869J4339
215C0469n0717k5072N4991M3483m1763m9354K6823M2307k1204l2635K7772L4265
$$ plain form
127 27923 16332 -15381 -24488 -10837 313 5503 13896 14031 -7016 -29176 -22101 9514 28257
140 28257 13650 -10645 -15947 -6118 -3191 -4112 6745 18094 954 -33002 -32310 10570 37206
153 37206 10364 -22798 -13603 6354 -9009 -26157 3246 35991 4128 -50978 -35931 30008
165 30008 41807 -10111 -28043 10564 17645 -29315 -36585 24469 49824 -12002 -58564 -12951
177 -12951 41591 17269 -23272 -170 31764 -3848 -47098 -9208 50815 29553 -33613 -31164
189 -31164 18204 18680 -16656 -3065 38741 20269 -35837 -28319 33686 43585 -6876 -21247 15041
202 15041 16335 -25251 -19153 38767 45241 -17774 -40862 12765 44112 4807 -19739 16130 30469
215 30469 -20248 -45320 9671 53154 11391 -37963 -11140 31167 9963 -22672 5100 39365
227C9365l6409n1177K4710N7261o833m7062K625L5850r373l6852J5968M8396j0115
240B6354n7100p962M9492J5718l6294r841L4887L733m5362j0923N0669K7337m2972
253b264l7875K7282L4491j9514k6287K3009K9052k7949m2216J6816M9199K182
265B5926m0976j1689K9138R031k3633m648K9289R607l3694k4149K3214L1625o347
278A2694k3991k40J4269l596j3394Q223K1048k309k5954r946J8613J6283o105
291E595r784L617P54j0260l655J7034J4681j1372j8677K483J4126J742n877N396
305E803O793j4131j7530R521K6349K747k0792o087J5352L406j4492J450K1927
318B0316N85l0564j3541K5848K1757j4719j7275J3167J3283j7455j5421K1936
$$ plain form
227 39365 2956 -48221 -23511 33750 26917 -20145 -17520 18330 8957 -27895 -11927 36469 26354
240 26354 -30746 -38708 10784 26502 -9792 -19633 15254 18987 -26375 -37298 13371 40708 -2264
253 -2264 -40139 -12857 21634 2120 -24167 -1158 27894 -55 -42271 -25455 23744 25926
265 25926 -15050 -26739 2399 11430 -12203 -16851 12438 22045 -11649 -35798 -12584 19041 12694
278 12694 -11297 -11537 2732 -864 -14258 -6035 15013 12704 -13250 -23196 -4583 11700 5595
291 5595 -4189 -572 182 -10078 -13733 3301 17982 6610 -12067 -9584 4542 6284 407 5803
305 5803 12596 -1535 -19065 -9544 16805 19552 -1240 -7327 8025 11431 -3061 -1611 20316
318 20316 20901 -9663 -23204 2644 24401 9682 -7593 5574 18857 1402 -14019 7917
330G917K3673j9004l2995P477K9511j626k1327O296K2103j0696k9680P528L6303
343B5480J695l4955r380K6800P320k5399l003L1764N520l8309j6648L5931K5804
356C2620k6757k5923K2033K1959k4669k5992K7140L3631k3480m3258J1486M3130
368B1920j736l5376J124L3807l114l8486l341M0629J2634l8430k1763K7878K2022
381A7768j9922j6708K1812J7018k3911k4257J8578K7803j0711k5785L574J8889
393D148m849j5169R657J9373r129k5044J843K2864L021j6592j426J4267k861j8333
407a8230L027K3827L314k4251j0428J8479J1039j3843p022J7828Q836k1116j5005
420b3545J9788K1754j3061k3234O615J9399n238j6324R180K2039n999k6612j058
$$ plain form
330 7917 31590 12586 -20409 -12932 16579 14953 -6374 -78 22025 11329 -18351 -10823 25480
343 25480 27175 -7780 -17160 9640 16960 -8439 -11442 20322 25842 -12467 -29115 6816 32620
356 32620 5863 -20060 1973 23932 -737 -26729 411 34042 10562 -32696 -21210 21920
368 21920 20184 -15192 -14068 19739 16625 -21861 -25202 15427 28061 -10369 -32132 -4254 17768
381 17768 -2154 -18862 2950 19968 -3943 -28200 -9622 18181 7470 -18315 -14741 4148
393 4148 -701 -15870 -6213 13160 4031 -21013 -19170 3694 6715 -9877 -11303 2964 103 -18230
407 -18230 -15203 8624 11938 -12313 -22741 -4262 6777 -7066 -14088 3740 12576 -8540 -23545
420 -23545 -3757 17997 4936 -18298 -11683 7716 2478 -13846 -4666 17373 11374 -15238 -16296
433a6296K6352P211k0983q374J6556O275j7669n475K2536J1998k1432j7685J5609
446a377J8696j0361j5642J1522J4949j4678j9925J3499K5754p477k7490J045K4140
459A2655J531k1294K67K5140J244k9804r244K8139J6103k3828j9481J7890J8454
472A7772j5137j7521J7232K2556j4464k8266N711K7562l85k3703k881J9610K707
485A0793j9298k020K2499P638k0350j3499J3816J2557r839r365Q767P353j0928
498a876q909J1545J2812p768j2800L552Q999n350o834Q280R528r581j4446N949
512f899J5351j883j4460J289J2147k751j4272K466J8861J488k0437q312J5828
525a584J0092j2956r664J1977R843j3084j2847J3043J7800q340k0404K499J6946
$$ plain form
433 -16296 10056 17267 -3716 -12090 4466 10741 -6928 -12403 10133 22131 699 -16986 -1377
446 -1377 17319 6958 -8684 2838 17787 3109 -16816 -3317 22437 14960 -12530 -11485 12655
459 12655 14186 -7108 -6841 18299 19543 -10261 -19505 8634 24737 909 -18572 -682 17772
472 17772 2635 -14886 2346 24902 10438 -17828 -12117 15445 15060 -8643 -11524 8086 10793
485 10793 -8505 -10525 11974 19612 -738 -14237 -421 12136 2297 -7068 1699 9052 -1876
498 -1876 -10785 760 13572 5804 -6996 -3444 5555 205 -6629 1651 11179 1598 -12848 -6899
512 -6899 8452 6569 -7891 -6602 5545 2794 -11478 -9012 9849 11337 -9100 -17412 -1584
525 -1584 8508 -4448 -14112 -2135 7708 -5376 -18223 -5180 12620 4280 -16124 -13625 3321
538C321n70j5030J290J6116o7j8482k744J9577P994j6103r951J2331Q960j2427
552e785p744J5404J1786j4730j6247J2632J8390p956j7417O872J7369o490j9350
565a3266P382K4473j925k5878m215K4037P343k1792p891K1560J0544k1885j3665
578a5178K2068J9849j7647k2624J1243K0807r071k0248Q554K1449o706k3593L349
591g748K3533K062k1119m585J7226K411j7178k448J8113M094j8605p002J5731
604D485P868j3782n947J3630M283j6527n975J7392R657j7195j2128J3906J1352
617A1019j3956j1249J5057J4140j5145j7676J2297K0810q049k1505N235J8857
629I835m956k0408M388K2262P7k1972l924K0494P025j7174p992J4776O461j5693
$$ plain form
538 3321 2751 -12279 -10989 5127 5060 -13422 -16166 3411 11405 -4698 -14649 -2318 6642 -5785
552 -5785 -13529 1875 13661 -1069 -17316 -4684 13706 5750 -11667 -4795 12574 6084 -13266
565 -13266 -5884 18589 16664 -9214 -13429 10608 17951 -3841 -11732 9828 20372 -1513 -15178
578 -15178 6890 26739 9092 -13532 -2289 18518 9447 -10801 -2247 19202 12496 -11097 -7748
591 -7748 15785 17847 -3272 -7857 9369 11780 -5398 -7846 10267 14361 -4244 -11246 4485
604 4485 12353 -1429 -7376 6254 10537 -5990 -11965 5427 15084 -2111 -14239 -333 11019
617 11019 -2937 -14186 871 15011 -134 -17810 -5513 15297 7248 -14257 -9022 9835
629 9835 4879 -15529 -11141 11121 11198 -10774 -14698 5796 12821 -4353 -12345 2431 8892 -6801
643f801q070J5693J1118j2247j2895R627J2154p358j1013P274J0479p899j3361
656a3299N898J4885k500j3395j1J1993n33j1543l57J3433K116j3707o184J2195
670a009R132q911r197N860R327o501j0274N557J2583j355j3347k026J2071N760
684G670r589o635P100O654p272q270P239J1259l513j1777M27J0754K108r014j680
699d539Q143J110q811k314R462N243p776n492N868M363n157l407P374M110q570
714c93n885Q812P442p489p698P383O923q765q708R958J2188q454j4212O555J5452
729A3109m971j5971L886J6037l720j9065J163K0692K955j9404n616J8444O947
742A4486j7735p914J7125R203j7913j2510J6372J4967j3148j4831J1823J4605
$$ plain form
643 -6801 -14871 822 11940 -307 -13202 -3575 8579 1221 -9792 -2518 7961 62 -13299
656 -13299 -7401 7484 4984 -8411 -8422 3571 3038 -8505 -8862 4571 6687 -7020 -13204 -1009
670 -1009 8123 -788 -9985 -4125 5202 -1299 -11573 -6016 6567 5212 -8135 -10161 1910 7670
684 7670 -1919 -8554 -1454 5200 -2072 -10342 -3103 8156 4643 -7134 -6707 4047 6155 -2859 -4539
699 -4539 3604 4714 -4097 -6411 3051 8294 518 -4974 894 5257 100 -3307 4067 8177 -393
714 -393 -6278 2534 9976 2487 -5211 2172 9095 330 -8378 1580 13768 5314 -8898 -2343 13109
729 13109 8138 -7833 -3947 12090 8370 -10695 -9532 11160 14115 -5289 -10905 7539 14486
742 14486 -3249 -11163 5962 15165 -2748 -15258 1114 16081 2933 -11898 -75 14530
754A4530j1522j5600J1039J7095r935j9447P183J9233m731j8302M289J8421l870
767H383k0296K098K1694J284k1422m004J9540N138j8456o612J8348P784j8185
780d706j0974J6877J3032j3034j3298J0334J2664r674j3261Q663J3047o551j4679
793a1560M052J3744j631j1162J844J0023k065j0740J307R983m04r653p79Q699
807A658L38o832K79Q171j104q770j128R276K388q199k413P241K846p817k586Q193
823A541M414p424o821N333P634k684o762J770P031j417p560k7P835K504p317m632
839f582N326N716k536n269K475N473j435p129L51P793J884p770l956O367N494
854F202n107m589M820N403n330p396M745R095l077r581J775Q837p36r490J448
$$ plain form
754 14530 3008 -12592 -1553 15542 5607 -13840 -6657 12576 7845 -10457 -6168 12253 8383
767 8383 -11913 -9815 11879 13163 -8259 -12263 7277 12415 -6041 -12653 5695 13479 -4706
780 -4706 -15680 1197 14229 1195 -12103 -1769 10895 1221 -12040 -3377 9670 3119 -11560
793 -11560 -7508 6236 4605 -6557 -4713 5310 3245 -7495 -6188 3795 3391 -6262 -7041 1658
807 1658 1996 -4836 -4557 3614 2510 -6260 -7388 1888 4276 -3923 -6336 905 3751 -4066 -6652 1541
823 1541 5955 -1469 -8290 -2957 4677 1993 -4769 -2999 4032 2615 -4945 -4972 2863 5367 -1950 -6582
839 -6582 -1256 4460 1924 -3345 -870 4603 3168 -3961 -3610 4183 6067 -1703 -5659 708 6202
854 6202 1095 -3494 1326 6729 1399 -5997 -1252 7843 4766 -4815 -3040 5797 5061 -4429 -2981
869b981J0254o91j1951j605J2619L560j1626m600J1297N066j2101o617J1794R000
883A1418j1987j0861J0319J2217p783j2535P385J2538p048j4477N686J4891l415
896F348j5459R96J4914q1j2760n79J3590P41j4286k610J3241L462j2444l830J1279
911B522L622j1290l669J2672M562j3212n611J1616O923j1777o559J2054O621j2216
925c742q308J1922J0665j0696j2137R368J2807q056j2760P599J4344o699j5684
938a1377M202J6211j842j5170j8J4718J070j3693j659J3969L486j3261n892J1131
952A875P079r671o826Q802O584p840o944P589Q046n909q756M138P589l352o558
967d154K996P037k804p571J676P455O30p511j190N983J373n506j531N576K582
$$ plain form
869 -2981 7273 6582 -5369 -6974 5645 9205 -2421 -7021 4276 9342 -2759 -9376 2418 11418
883 11418 -569 -11430 -1111 11106 3323 -9212 -1827 10711 3663 -10814 -5128 9763 6348
896 6348 -9111 -8115 6799 6718 -6042 -6621 6969 7710 -6576 -9186 4055 7517 -4927 -8757 2522
911 2522 6144 -5146 -8815 3857 8419 -4793 -10404 1212 8135 -3642 -10201 1853 8474 -3742
925 -3742 -12050 -128 10537 -159 -12296 -2928 9879 1823 -10937 -3338 11006 4307 -11377
938 -11377 -7175 9036 7194 -7976 -7994 6724 7794 -5899 -7558 6411 9897 -3364 -9256 1875
952 1875 8954 -717 -7543 1259 7843 3 -6941 648 8694 2785 -5971 -1833 5756 2404 -4154
967 -4154 -1158 5879 3075 -4496 -2820 4635 5265 -2246 -3436 2547 3920 -1586 -3117 2459 5041
982E041n280m270L578M610j826m547N92M357j58l723J10L885J887m704l418L127
998g39L553j428l778J299L684q10l888P89M923j91m900j633L944K333l717j245
1014a804L558J252m223j459M616K362m218k841L595K602m288k710N630K986o046
1029i88n015N754O127n094o676M553P314m780q430M398J0331l357j2193J455J1152
1044D551J93j0894j230J1736K055j2109l676J1694N987j1403p317R414P610q543
1058a932p808Q689Q726p679r656O662J0505m518j0672L665R682l195r899L254
1072d176J1113j893j1342O54J0832M93j0059p90J0049J204j0303k006J0901L731
1086H408j0026m955Q402O013q116n641P664O576p066p550O078Q380m654q451K858
$$ plain form
982 5041 -239 -4509 -931 3679 1853 -2694 -2102 2255 2097 -1626 -1516 2369 4256 -448 -3866 -739
998 -739 2814 1386 -2392 -1093 2591 1781 -2107 -1318 3605 3414 -1486 -3119 825 3158 -559 -1804
1014 -1804 1754 3006 -1217 -2676 1940 4302 84 -2757 838 3440 -848 -3558 2072 5058 -988
1029 -988 -6003 -249 5878 784 -5892 -1339 5975 1195 -7235 -2837 7494 4137 -8056 -6601 4551
1044 4551 4744 -6150 -7380 4356 6411 -5698 -9374 2320 8307 -3096 -10413 -999 6611 -1932
1058 -1932 -9740 -1051 7675 -4 -9660 -2998 7507 2989 -7683 -4018 5664 2469 -7430 -4176
1072 -4176 6937 5044 -6298 -5644 5188 5681 -4378 -5168 4881 6085 -4218 -6224 4677 8408
1086 8408 -1618 -6573 1829 7842 -274 -5915 1749 8325 1259 -6291 -213 8167 3513 -4938 -2080
1101b080P338k096p179K048P725j594p078k62O812N80n721j163M961K95n305o66
1117c385N558J721n526k308N181J910m881k002N053K262n191m076N293N132m042
1132F99n473K695N370k346n768J792P094j044p348q81P718K503o460l825N286
1147A2M134m846n055N027O320l648o885J391O987p6o685p14N871J449o227j847
1163d792O466L188n852m042M495M341l595m069L188M188l754n010L221N727j977
1178A723n997J457N241j017n143J199O271r27p036j44O732J766o286k429N799
1193A209K723n937k985O351M490n898n300M860N572l436n552K852N300k570n800
1208d121K167P010j019o203q1N616K72n258j31N419J76n557j053O216J211m552
$$ plain form
1101 -2080 5258 3162 -4017 -1969 5756 4162 -2916 -3178 3634 4214 -1507 -2670 2291 2586 -2719 -3385
1117 -3385 2173 3894 -1632 -3940 1241 3151 -1730 -3732 1321 3583 -1608 -5684 -391 4741 699
1132 699 -4774 -2079 3291 945 -4823 -3031 4063 3019 -4329 -5210 2508 5011 -1449 -5274 12
1147 12 4146 -700 -5755 -728 5592 1944 -4941 -3550 3437 3361 -3324 -4038 1833 3282 -2945 -4792
1163 -4792 1674 4862 -990 -5032 -537 3804 209 -3860 -672 3516 -238 -5248 -2027 3700 1723
1178 1723 -4274 -2817 2424 1407 -3736 -2537 3734 2807 -4229 -4373 2359 4125 -2161 -4590 1209
1193 1209 3932 -2005 -4990 1361 5851 -47 -5347 -487 5085 1649 -3903 -1051 4249 1679 -4121
1208 -4121 -1954 5056 4037 -2166 -2247 3369 3641 -1617 -1748 3671 3847 -1710 -2763 3453 4664 112
1224A12j687M635J336n232j595N635K427n812l724N145M573m562m843M401M916
1239E725m486n832L431P428k673p973N79P951J69p839n70P388J456p410l440P300
1255A204M815n808n728M374N793m197n672L642N777k471o957J445O787k4n956
1270b976n18N107P72n201j052N592J433n106k972N193L004m425k917M314K907
1285C155m538l808M562M964m072n238L154M985k765m584K274N748j979o703J156
1300c689O699P04o387j601N953J405n821j701N739K591n717l432M658M262l619
1315D4l780L443L368l693l839L613M349k813m735K431M539k178l981K133M576
1330C477k171n392J508N880m95n895J23N504M38n649q45O517J679o438k962N379
$$ plain form
1224 112 -1575 3060 4396 -836 -2431 3204 5631 -181 -3905 1240 5813 1251 -3592 809 5725
1239 5725 1239 -4593 -1162 6266 3593 -4380 -3801 4150 4319 -3520 -4090 3298 4754 -2656 -6096 1204
1255 1204 6019 211 -5517 -1143 4650 453 -5219 -1577 4200 1729 -5228 -3783 3004 2980 -2976
1270 -2976 -3494 1613 2385 -2816 -3868 1724 3157 -1949 -4921 272 3276 -1149 -4066 248 3155
1285 3155 -1383 -5191 -629 4335 263 -4975 -1821 3164 399 -4185 -1911 3837 1858 -4845 -3689
1300 -3689 3010 3714 -2673 -4274 1679 3084 -2737 -4438 1301 3892 -1825 -5257 -599 3663 44
1315 44 -3736 -293 3075 -618 -4457 -844 3505 692 -4043 -1612 2927 749 -3232 -1099 3477
1330 3477 1306 -4086 -2578 3302 2807 -3088 -2965 2539 2977 -2672 -3517 3000 4679 -1759 -4721 658
1346F58M582m681m881M322M677l421n536L045O292k374n780J04O441L16n236q41
1362b313M846J487n086k208M681K659l631l312K963K820j802k525J918K730j957
1377A270l329R84L552j70k905l03K604J48k775q7L311J54l344j185L062J922k785
1394A24k147K399K332l168k575L090K954j785m265J380L560k8l998J86L888j02
1410A845m659n80M534J652m678j900L466K582l451k037L194K527l504l556L115
1425a450M059k385m072K407L717k492m080K726M769k292n349J196N887p46n781
1440c886Q02N786n11o165l90P370J320p313k209O713K821n758l695O320M368o382
1456h09m968N432N969l787o522K915O793k631o629K645O627j418p032K03O690
$$ plain form
1346 658 5240 559 -4322 0 4677 1256 -4280 -1235 5057 2683 -3097 -2993 3448 3764 -1472 -2313
1362 -2313 2533 4020 -1066 -3274 1407 4066 435 -2877 86 2906 1104 -1421 497 3227 1270
1377 1270 -2059 -1075 2477 2307 -598 -901 1703 1851 -924 -1011 2300 2454 -890 -2075 987 2909 124
1394 124 -2023 376 2708 -460 -3035 55 3009 1224 -3041 -1661 1899 1871 -2127 -1941 1947 1845
1410 1845 -2814 -3394 1140 2792 -1886 -3786 -320 2262 -1189 -3226 -32 2495 -1009 -4565 -1450
1425 -1450 2609 224 -3848 -1441 2276 -216 -4296 -1570 3199 907 -4442 -3246 2641 1895 -3886
1440 -3886 -3084 2702 2191 -3974 -4364 3006 4326 -2987 -5196 1517 4338 -1420 -5115 1205 5573 -809
1456 -809 -5777 -345 5624 1837 -4685 -1770 5023 2392 -4237 -1592 5035 3617 -3415 -3212 3478
1471C478O79n624j221N646P44n195j158N378J751m805k629M246K755m348k159
1486b462M175K138m143k860M122L070l058l828K774L745k746l496K273M267k480
1501A491m118J179M699p38l984N4L668J51m123k02L975P17l453j574K789J739
1517B270k585j245K332J339k055j805J982J660j225k122P70J754p05j504M80K040
1533A381n65k498J16K185N82k016j153J495J207j630j261J640K163j906k784J204
1549a840L023m70l239n7L191K39l358r93L716J967l742k702K723L515k143l943
1565d113K179M097j684m451J035M808j72m908n38M745R48l938j354M554J423m310
1581a679k046M449K648l917k755L237K764l100k491L485L281l512l638L117L865
$$ plain form
1471 3478 4157 -1467 -2688 2958 3702 -1493 -2651 2727 4478 -327 -2956 1290 4045 -303 -2462
1486 -2462 1713 3851 -292 -3152 970 4040 982 -2846 -72 3673 927 -2569 -296 3971 1491
1501 1491 -2627 -1448 3251 2513 -1471 -1417 2251 2402 -1721 -1923 2052 2769 -684 -2258 531 2270
1517 2270 -315 -1560 772 2111 56 -1749 233 1893 668 -1454 -684 1070 365 -1139 -659 1381
1533 1381 816 -1682 -1566 619 1201 -815 -1968 -473 734 -896 -2157 -517 1646 -260 -3044 -1840
1549 -1840 1183 713 -2526 -2583 608 847 -2511 -3504 212 2179 -1563 -4265 -1542 1973 -170 -4113
1565 -4113 -1934 2163 479 -3972 -2937 1871 1699 -3209 -3747 998 1946 -1992 -3346 1208 2631 -1679
1581 -1679 -3725 724 3372 -545 -3300 -63 2701 -399 -2890 595 3876 364 -3274 -157 3708
1596C708k602l446K291M074k475m760K103N298j494n508J271N406j019n099M03
1611a849N408J78n945m57N606J356n245k237N172J997m746k114M762K679m315
1626B50l769M132L585l732l243L076L551l390l966L187M462k619m473J747M633
1641C431j612m761J750M759j213n495N82N402K88n164n51M492J147m634j436M597
1657A582J761m075k659K931L534k859l122J990L098j801k953J017L452k43l535
1672a882l30K775N23k132o19K020J60j769p91J476J047p15j698P36J230n16p65
1689a250M52P55o00r47O88Q42K33j209rO81K1r20J45R93Q56j253j488J360J686
1708A036j025j323M28J860j038j917Q23K675k69k871k51L027Q31k521j288K970
$$ plain form
1596 3708 1106 -2340 -49 4025 1550 -3210 -1107 4191 2697 -2811 -1540 3866 2847 -2252 -1849
1611 -1849 3559 3737 -2208 -2665 2941 4297 -948 -3185 1987 3984 -762 -2876 1886 4565 250
1626 250 -3519 613 4198 466 -2777 299 3850 460 -3506 -319 4143 1524 -2949 -1202 3431
1641 3431 1819 -2942 -1192 3567 2354 -3141 -2559 2843 3131 -2033 -2584 1908 3055 -1579 -3015 1582
1657 1582 3343 -732 -3391 -460 3074 215 -2907 -917 2181 380 -2573 -1556 1896 1653 -1882
1672 -1882 -2212 563 1086 -1046 -1665 355 515 -1254 -2045 -569 478 -237 -1935 -1199 31 -485 -1250
1689 -1250 -798 -43 -643 -1590 -902 -60 173 -1036 -1045 -364 -343 -1263 -1118 -125 731 -522 -2010 -650 1036
1708 1036 11 -1312 -884 976 -62 -1979 -1156 1519 1250 -1621 -1872 1155 1986 -535 -1823 1147
1724A147R24k496j755K695K806k608k602J845K987j956k903K206L026j669l698
1739b051J557L995j057l790P05L622p27l713M61M224j19m691m80M467J051m372
1755i18j462M845J470m700k373M734K997m013l968L429M236l356m217K940M545
1770D189k587n179K032M950r74n042K99M737K1m603k86L957Q59m161j005L539
1786G46J981l832j531K931J977l418j647L384J711l403j816L126J783k818j772
1801b598K535J877k379k766K576L003j744l563J395L453j749k722J271L135p26
1816I98l307m92L642N94k909o41K452J051k678j296K484J984k291k065J691J705
1832I22j174j399Q00J664q43k073R93J818M2j975M0J707J45j394k70J733K66j442
$$ plain form
1724 1147 2071 -425 -2180 515 3321 713 -1889 -44 2943 987 -1916 290 3316 1647 -2051
1739 -2051 -494 3501 2444 -1346 -641 2981 2254 -1459 -998 3226 3107 -1584 -2064 2403 3454 -918
1755 -918 -2380 2465 3935 -765 -3138 1596 4593 580 -3388 41 4277 921 -3296 -356 4189
1770 4189 1602 -3577 -1545 3405 2431 -2611 -2312 2425 2446 -2157 -2443 1514 2373 -1788 -2793 746
1786 746 2727 -1105 -2636 295 2272 -1146 -2793 591 2302 -1101 -2917 209 1992 -826 -2598
1801 -2598 -63 1814 -565 -3331 -755 2248 504 -3059 -1664 1789 40 -2682 -1411 1724 998
1816 998 -2309 -2801 841 1435 -1474 -2115 337 1388 -1290 -2586 -102 1882 -409 -2474 -783 922
1832 922 -252 -1651 -851 813 -30 -2103 -1110 708 750 -1225 -1185 522 667 -727 -997 736 1002 -440
1850d40j099J427J801j398j338O20J564o72j775Q37K133m28k260q42L117Q88k509
1867c74r89K326J305k280j808K227K511j808k710J156K779m90k975M56K887k51
1883A962k859l9K903Q22k910r43K456J202k524r40K300J008k344j537K142J957
1899B656k034j856J901J902k255j860K020J942j915k141J402K978j947k468J062
1914f13L041r83l640R63L576n18l518j06L176M91l390o33L461P41l244j571K982
1931B15J946k548k321K302K440k385k137J846K670k077k745J438K998j063l060
1946b481J099K757r25k913L68L425k17l093m63K910M89k530o49K780O13k635j441
1963b906K800K095k337k068J475K528j547k219J001K761q50k813N37K671K40k307
$$ plain form
1850 -440 -1539 -112 1689 291 -1047 -427 1137 465 -1310 -473 1660 1232 -1028 -1870 1247 2135 -374
1867 -374 -1363 963 2268 -12 -1820 407 2918 1110 -1600 -444 2335 1845 -1130 -674 2213 1962
1883 1962 -897 -936 1967 2789 -121 -1064 1392 2594 70 -870 1430 2438 94 -1443 699 2656
1899 2656 622 -1234 667 2569 314 -1546 474 2416 501 -1640 -238 2740 793 -1675 -613
1914 -613 2428 1445 -2195 -1232 2344 1826 -1692 -1798 1378 1869 -1521 -2154 1307 2048 -1196 -2767 215
1931 215 2161 -387 -2708 -406 2034 -351 -2488 -642 2028 -49 -2794 -1356 1642 579 -2481
1946 -2481 -1382 1375 450 -2463 -2095 1330 1113 -1980 -2443 467 956 -1574 -2223 557 1170 -1465 -2906
1963 -2906 -106 1989 -348 -2416 -941 1587 40 -2179 -1178 1583 733 -2080 -1543 1128 1368 -939
1979i39l83K202K04j861l67J372J289j580j370J313J662j374r94R49O88n45j014
1996g48M38J598m68j548J44J480k19j074M68J223j55j825J98J676M83j741n63
2013f33J573N64j649o08J612J257j423j915J167J908o18k041O96K043o65k267
2029i99Q03K138kk569m29K310P01k229p36K066J348k609j295K275J109j650j568
2046a336J219J957j567j585J061J751r86k072P82K214l27k646K06K372L7k280
2062a200k22K437K38k526j024K476R75j965j432K012J619j964j913J624K438j111
2078D62k406N18J934k52k281O41K171j11k384j4J969O68k271l63J661P19j512
2095h51o22J618O08j124j281J692J052j077j300J057J463j554r26R89J704j140
$$ plain form
1979 -939 -1322 880 1084 -777 -1144 228 1517 -63 -1433 -120 1542 168 -826 123 811 266 -748
1996 -748 -310 1288 820 -728 -584 896 677 -397 71 1294 1139 -686 -488 1188 1671 -70 -633
2013 -633 940 1504 -145 -753 859 2116 693 -1222 -55 1853 1235 -806 -110 1933 1268 -999
2029 -999 -196 1942 1940 -629 -1058 1252 1953 -276 -1012 1054 2402 -207 -1502 773 1882 232 -1336
2046 -1336 -117 1840 273 -1312 -251 1500 514 -1558 -776 1438 1111 -1535 -1329 1043 1080 -1200
2062 -1200 -1422 1015 1253 -1273 -2297 179 1154 -811 -2243 -231 1388 -576 -2489 -865 1573 462
2078 462 -1944 -1426 508 256 -2025 -1384 787 676 -1708 -1722 247 915 -1356 -1719 -58 661 -851
2095 -851 -1473 145 753 -371 -1652 40 1092 15 -1285 -228 1235 -319 -1245 -256 1448 308
2111C08j612Q45J519n54j451J90K269o18j805KK157M89k237r04J905J044j866
2128c19q72J925J267j540k188J673K079r45k177O91K282o29k155K60K299k41k310
2145i00j45K147N30j981n01J862Q88k293r41K300R46j451j813J644J396j086j883
2162a281J690J579j441j936R89K280q75k253M21K102j6k595J00K449M92k295q53
2179a443J911J044j653j118J662Q52j278j615J420J770j521j541P85J848p61j640
2195a278O93J304m75j718O24J339j19j506K76J093l20j255m2J600J32j672J3J419
2213A08K59j169p88J361O57j325o64J382J038j180j563J196Q69k5j520M03J440
2230D79k83j053n45J992J31j409r07J266J104j141r80J306J138r47j406P42J661
$$ plain form
2111 308 -1304 -459 1060 506 -945 -755 1514 896 -909 -907 1250 1739 -498 -1402 503 1547 -319
2128 -319 -1191 734 2001 461 -1727 -54 2025 1080 -1097 -406 1876 1247 -908 -648 1651 1410 -900
2145 -900 -1045 1102 1632 -349 -850 1012 1900 -393 -1334 966 1912 461 -1352 292 1688 602 -1281
2162 -1281 409 1988 547 -1389 -400 1880 1005 -1248 -827 1275 1259 -1336 -1236 1213 1705 -590 -1443
2179 -1443 468 1512 -141 -1259 403 1255 -23 -1638 -218 1552 31 -1510 -725 1123 362 -1278
2195 -1278 -585 719 244 -1474 -850 489 370 -1136 -860 233 -87 -1342 -1384 216 348 -1324 -1311 108
2213 108 367 -802 -1590 -229 428 -897 -1561 -179 859 -321 -1884 -688 181 156 -1364 -961 479
2230 479 196 -857 -1402 590 721 -688 -1595 -329 775 -366 -1346 -40 1098 151 -1255 -513 1148
2247A148l18j366m0J650k20j489M20J107M67j547p13J275R96j479l46P53R62j045
2265B15j214J253J416p63k228J122J827q25j502N74J746n84j831R7K194K44k229
$$ plain form
2247 1148 830 -536 -576 1074 854 -635 -215 892 1359 -188 -901 374 1370 -109 -455 298 1260 215
2265 215 -999 254 1670 907 -1321 -199 1628 803 -699 -125 1621 1037 -794 -697 1497 1741 -488
$$ [...]
8191a18
##END NTUPLES=NMR FID
##END=
