##TITLE=1H_Ser 1363
 DMSO, 8 sc, 
 20.12.2019
##JCAMPDX= 6.0         $$ Bruker NMR JCAMP-DX V2.0
##DATA TYPE= NMR FID
##DATA CLASS= NTUPLES
##ORIGIN= UXNMR, Bruker Analytische Messtechnik GmbH
##OWNER= root
$$ XWIN-NMR		Version 3.5
$$ Fri Dec 20 15:59:44 2019 Russian Standard Time (UT+4h)  she@DPX200
##.OBSERVE FREQUENCY= 200.1315
##.OBSERVE NUCLEUS= ^1H
##.DELAY= (6, 6)
##.ACQUISITION MODE= SIMULTANEOUS
##.ACQUISITION SCHEME= undefined
##.AVERAGES= 8
##.DIGITISER RES= 18
##SPECTROMETER/DATA SYSTEM= spect
##.PULSE SEQUENCE= zg30
##.SOLVENT NAME= DMSO
##.SHIFT REFERENCE= (INTERNAL, DMSO, 0, 15.7039)
##AUDIT TRAIL= $$ (NUMBER, WHEN, WHO, WHERE, WHAT)
$$ ##TITLE= Audit trail, XWIN-NMR		Version 3.5
$$ ##JCAMPDX= 5.01
$$ ##ORIGIN= Bruker BioSpin GmbH
$$ ##OWNER= she
$$ F:/spectra/data/she/nmr/H-F/1/audita.txt
$$ ##AUDIT TRAIL=  $$ (NUMBER, WHEN, WHO, WHERE, WHAT)
(   1,<2019-12-20 15:58:46.37 +0400>,<she>,<DPX200>,
      <created by zg, POWCHK disabled, PULCHK disabled
       configuration hash MD5:
       00 E9 B6 7A A2 85 ED C7 34 08 36 98 17 FE 4E 26
       data hash MD5: 16K
       9D 98 E3 25 E6 6A 5B C7 17 41 E3 65 63 51 7B A4>)
$$ ##END=
$$ 
$$ hash MD5
$$ 7E 66 DE 78 04 CC F1 84 1B D8 3C 85 01 1D 25 5F
##$RELAX= 
##$RELAX= 
##$RELAX= 
##$RELAX= 
##$RELAX= 
##$RELAX= 
$$ Bruker specific parameters
$$ --------------------------
##$DU= <F:/spectra>
##$EXPNO= 1
##$NAME= <H-F>
##$PROCNO= 1
##$TYPE= <nmr>
##$USER= <she>
##$AMP= (0..31)
100 100 100 100 100 100 100 100 100 100 100 100 100 100 100 100 100 100 
100 100 100 100 100 100 100 100 100 100 100 100 100 100 
##$AQSEQ= 0
##$AQ_mod= 1
##$AUNM= <au_zg>
##$AUTOPOS= <>
##$BF1= 200.13
##$BF2= 200.13
##$BF3= 200.13
##$BF4= 200.13
##$BF5= 200.13
##$BF6= 200.13
##$BF7= 200.13
##$BF8= 200.13
##$BYTORDA= 1
##$CFDGTYP= 0
##$CFRGTYP= 5
##$CHEMSTR= <none>
##$CNST= (0..31)
1 1 145 1 1 1 1 1 1 1 1 1 1 1 1 1 1 1 1 1 1 1 1 1 1 1 1 1 1 1 1 1 
##$CPDPRG= <>
##$CPDPRG1= <>
##$CPDPRG2= <>
##$CPDPRG3= <>
##$CPDPRG4= <mlev>
##$CPDPRG5= <mlev>
##$CPDPRG6= <mlev>
##$CPDPRG7= <mlev>
##$CPDPRG8= <mlev>
##$CPDPRGB= <>
##$CPDPRGT= <>
##$D= (0..31)
0 1.2 0 0 0 0 0 0 0 0.06 0 0.03 0 0 0 0 0.0002 0 0 0 0 0 0 0 0 0 0 0 0 
0 0 0 
##$DATE= 1576843125
##$DBL= (0..7)
120 120 120 120 120 120 120 120 
##$DBP= (0..7)
150 150 150 150 150 150 150 150 
##$DBP07= 0
##$DBPNAM0= <>
##$DBPNAM1= <>
##$DBPNAM2= <>
##$DBPNAM3= <>
##$DBPNAM4= <>
##$DBPNAM5= <>
##$DBPNAM6= <>
##$DBPNAM7= <>
##$DBPOAL= (0..7)
0.5 0.5 0.5 0.5 0.5 0.5 0.5 0.5 
##$DBPOFFS= (0..7)
0 0 0 0 0 0 0 0 
##$DE= 6
##$DECBNUC= <off>
##$DECIM= 24
##$DECNUC= <off>
##$DECSTAT= 4
##$DIGMOD= 1
##$DIGTYP= 9
##$DL= (0..7)
0 120 120 120 120 120 120 120 
##$DP= (0..7)
150 150 150 150 150 150 150 150 
##$DP07= 0
##$DPNAME0= <>
##$DPNAME1= <>
##$DPNAME2= <>
##$DPNAME3= <>
##$DPNAME4= <>
##$DPNAME5= <>
##$DPNAME6= <>
##$DPNAME7= <>
##$DPOAL= (0..7)
0.5 0.5 0.5 0.5 0.5 0.5 0.5 0.5 
##$DPOFFS= (0..7)
0 0 0 0 0 0 0 0 
##$DQDMODE= 0
##$DR= 18
##$DS= 0
##$DSLIST= <SSSSSSSSSSSSSSS>
$$ [...]
##$SUBNAM2= <"">
##$SUBNAM3= <"">
##$SUBNAM4= <"">
##$SUBNAM5= <"">
##$SUBNAM6= <"">
##$SUBNAM7= <"">
##$SUBNAM8= <"">
##$SUBNAM9= <"">
##$SW= 24.9337058887773
##$SWIBOX= (0..15)
0 0 2 0 0 0 0 0 0 0 0 0 0 0 0 0 
##$SW_h= 4990.01996007984
##$TD= 16384
##$TD0= 1
##$TE= 0
##$TE2= 300
##$TE3= 300
##$TEG= 300
##$TL= (0..7)
0 120 120 120 120 120 120 120 
##$TP= (0..7)
150 150 150 150 150 150 150 150 
##$TP07= 0
##$TPNAME0= <>
##$TPNAME1= <>
##$TPNAME2= <>
##$TPNAME3= <>
##$TPNAME4= <>
##$TPNAME5= <>
##$TPNAME6= <>
##$TPNAME7= <>
##$TPOAL= (0..7)
0.5 0.5 0.5 0.5 0.5 0.5 0.5 0.5 
##$TPOFFS= (0..7)
0 0 0 0 0 0 0 0 
##$TUNHIN= 0
##$TUNHOUT= 0
##$TUNXOUT= 0
##$USERA1= <user>
##$USERA2= <user>
##$USERA3= <user>
##$USERA4= <user>
##$USERA5= <user>
##$V9= 5
##$VALIST= <valist>
##$VCLIST= <CCCCCCCCCCCCCCC>
##$VD= 0
##$VDLIST= <DDDDDDDDDDDDDDD>
##$VPLIST= <PPPPPPPPPPPPPPP>
##$VTLIST= <TTTTTTTTTTTTTTT>
##$WBST= 1024
##$WBSW= 4
##$XGAIN= (0..3)
0 0 0 0 
##$XL= 0
##$YL= 0
##$YMAX_a= 200127
##$YMIN_a= -145321
##$ZGOPTNS= <>
##$ZL1= 120
##$ZL2= 120
##$ZL3= 120
##$ZL4= 120
##$ABSF1= 10
##$ABSF2= 0
##$ABSG= 5
##$ABSL= 3
##$ALPHA= 0
##$AQORDER= 0
##$ASSFAC= 0
##$ASSFACI= 0
##$ASSFACX= 0
##$ASSWID= 0
##$AUNMP= <proc_1d>
##$AZFE= 0.1
##$AZFW= 0.1
##$BCFW= 1
##$BC_mod= 2
##$BYTORDP= 1
##$COROFFS= 0
##$CY= 11.3945322036743
##$DATMOD= 1
##$DC= 2
##$DFILT= <>
##$DTYPP= 0
##$F1P= 16.9975609425685
##$F2P= -3.02152046262296
##$FCOR= 0.5
##$FTSIZE= 0
##$FT_mod= 4
##$GAMMA= 1
##$GB= 0.15
##$INTBC= 1
##$INTSCL= 1
##$ISEN= 128
##$LB= 0.24
##$LEV0= 0
##$LPBIN= 0
##$MAXI= 10000
##$MC2= 0
##$MEAN= 0
##$ME_mod= 0
##$MI= 1.114404
##$NCOEF= 0
##$NC_proc= 0
##$NLEV= 6
##$NOISF1= 3.799351
##$NOISF2= 2.8
##$NSP= 1
##$NTH_PI= 0
##$NZP= 0
##$OFFSET= 15.70392
##$PC= 1
##$PHC0= -10155.27
##$PHC1= 21.6008
##$PH_mod= 1
##$PKNL= yes
##$PPARMOD= 0
##$PSCAL= 0
##$PSIGN= 0
##$REVERSE= no
##$SF= 200.130013532006
##$SI= 16384
##$SIGF1= 3
##$SIGF2= 2
##$SINO= 400
##$SIOLD= 16384
##$SREGLST= <1H.CDCl3>
##$SSB= 0
##$STSI= 0
##$STSR= 0
##$SW_p= 3612.71676300578
##$SYMM= 0
##$S_DEV= 0
##$TDeff= 0
##$TDoff= 0
##$TI= <>
##$TILT= no
##$TM1= 0
##$TM2= 0
##$TOPLEV= 0
##$USERP1= <user>
##$USERP2= <user>
##$USERP3= <user>
##$USERP4= <user>
##$USERP5= <user>
##$WDW= 1
##$XDIM= 8192
##$YMAX_p= 0
##$YMIN_p= 0
$$ End of Bruker specific parameters
$$ ---------------------------------
##NTUPLES= NMR FID
##VAR_NAME=  TIME,          FID/REAL,        FID/IMAG
##SYMBOL=    X,             R,               I
##VAR_TYPE=  INDEPENDENT,   DEPENDENT,       DEPENDENT
##VAR_FORM=  AFFN,          ASDF,            ASDF
##VAR_DIM=   8192,          8192,            8192
##UNITS=     SECONDS,       ARBITRARY UNITS, ARBITRARY UNITS
##FACTOR=    0.0002004,     1,               1
##FIRST=     0,             0,               0
##LAST=      1.6414764,     0,               0
##MIN=       0,             -145321,         0
##MAX=       1.6414764,     200127,          0
$$ Real data points
##PAGE= N=1
##DATA TABLE= (X++(R..R)), XYDATA
$$ plain form
0 0 0 0 0 0 0 0 0 0 -8 8 -8 8 -8 16 -16 16 -24 32 -32 40 -48 56 -64 72 -87 100 -111 127 -147 166 -185 209
32 209 -235 262 -293 327 -364 407 -449 498 -554 611 -675 748 -832 920 -1019 1136 -1269 1418
50 1418 -1596 1808 -2063 2379 -2787 3332 -4097 5262 -7264 11611 -41844 115783 171294 -89486
64 -89486 -142360 34543 98280 -55958 -67087 91949 102372 -92525 -116517 86131 156897
75 156897 -28348 -114560 33968 116055 -19624 -81672 58821 118225 -43284 -124888 34562
86 34562 145075 3831 -124064 -19343 98179 10925 -84478 2888 82411 -27417 -115636
97 -115636 9806 124074 1188 -139608 -37548 115635 34652 -117925 -48036 108758
107 108758 48056 -120503 -79971 96569 90530 -72245 -91506 38678 57557 -45182 -37530
$$ packed form
0@%%%%%%%%qJ6j6J6j6K4l2L2m0N6o4P2q8J04j20J36j59J87k11K38k74L13l51L94
32B09m44M97n55O20o91P71q56R47j052J165j286J423j580J752j939K155k405K687
50A418l014L404l871M442n166O119p429R359j2526J8875n3455J57627N5511k60780
64h9486n2874J76903O3737j54238j1129J59036J0423j94897k3992K02648P0766
75A56897j85245q6212J48528Q2087j35679o2048J40493N9404j61509q1604J59450
86C4562J10513j41244j27895J04721J17522q7254r5403Q7366P9523j09828q8219
97a15636J25442J14268j22886j40796J02060J53183q0983j52577O9889J56794
107A08758o0702j68559M0532J76540o039j62775j9261J30184J8879j02739P652
$$ plain form
118 -37530 66930 38432 -93131 -68152 91722 99055 -63665 -103236 40393 96072 -19867
129 -19867 -68566 36305 74518 -31704 -66072 48057 89411 -25138 -74464 36360 86547
140 86547 -23863 -74675 41430 96171 -33327 -108365 24179 123741 -1003 -129284 -32737
151 -32737 104055 37182 -95699 -51620 63361 23794 -80198 -37461 66619 22334 -87093
162 -87093 -47434 68252 38875 -75828 -51219 67992 53278 -67794 -62718 61660 76494
173 76494 -36980 -62928 35289 63798 -18717 -35820 45596 52316 -40102 -47469 56569 74425
185 74425 -36117 -69643 36880 78061 -28283 -78633 26510 86226 -21267 -100571 -3223
196 -3223 92010 13155 -90856 -36238 60286 21769 -59779 -21879 48899 1204 -71336 -13279
$$ packed form
118c7530J04460k8498j31563K4979J59874P333j62720l9571J43629N5679j15939
129a9867m8699J04871L8213j06222l4368J14129M1354j14549m9326J10824N0187
140H6547j10410n0812J16105N4741j29498p5038J32544R9562j24744j28281R6547
151c2737J36792o6873j32881M4079J14981l9567j03992M2737J04080m4285j09427
162h7093L9659J15686k9377j14703K4609J19211j4714j21072N076J24378J4834
173G6494j13474k5948R8217K8509q2515j7103Q1416O720r2418p367J04038J7856
185G4425j10542l3526J06523M1181j06344n0350J05143N9716j07493p9304R7348
196c223R5233p8855j04011N4618R6524l8517q1548L7900P0778m7695p2540N8057
$$ plain form
208 -13279 76889 24194 -81611 -45154 67405 54339 -48082 -46560 43878 44556 -36887 -33198
220 -33198 47832 46126 -35540 -38801 38881 42238 -29795 -26862 46597 34205 -54559 -45034 61266
233 61266 69121 -47730 -83050 24182 78441 -10263 -70752 961 55463 -10515 -60292 7266
245 7266 60107 -8376 -69276 -6927 61116 8278 -58550 -12582 52047 5807 -60397 -12331
257 -12331 64251 22596 -64422 -39652 48703 44148 -30397 -34946 19754 18022 -24708 -4393 43462
270 43462 10904 -54202 -22439 59991 42816 -44322 -42099 42366 47635 -31875 -39421 42051 53766
283 53766 -32348 -56485 28278 65864 -9356 -55536 4006 45589 -7866 -42241 13072 43258
295 43258 -23021 -63709 5572 61775 -847 -70920 -26192 45972 17907 -45354 -25440 28229
$$ packed form
208a3279R0168n2695j05805L6457J12559j3066j02421J522R0438O78q1443L689
220c3198Q1030j706q1666l261P7682L357p2033K933P3459j2392q8764R525J06300
233F1266P855j16851l5320J07232N4259q8704o0489P1713N4502o5978m9777O7558
245G266N2841o8483o0900O2349O8043n2838o6828M5968O4629m6240o6204M8066
257a2331P6582m1655q7018K4770Q8355m555p4545m549N4700j732m2730K0315M7855
270D3462l2558o5106L1763Q2430j7175q7138K223Q4465N269p9510p546Q1472J1715
283E3766q6114k4137Q4763L7586p5220m6180N9542M1583n3455l4375N5313L0186
295D3258o6279m0688O9281N6203o2622p0073M4728P2164k8065o3261J9914N3669
$$ plain form
307 28229 9255 -37425 -13501 34026 10949 -35156 -10455 36368 12475 -32328 -2120 49201
319 49201 16495 -44776 -14032 59767 41296 -38542 -36231 39557 48385 -18319 -32565 24698
331 24698 34187 -22529 -31783 27008 36534 -27707 -46211 17166 42219 -19496 -51625 4699 40744
344 40744 -11065 -52724 -5992 40410 2379 -45646 -16288 28850 8730 -27288 -8043 21361
356 21361 -1595 -25653 6482 34504 -2586 -37356 1999 46304 10556 -39577 -9758 45205
368 45205 21863 -35262 -19037 38368 27644 -28195 -22358 30009 25651 -25911 -21837 29836 26270
381 26270 -30070 -30996 28346 36578 -23726 -42121 14618 39982 -10338 -40379 2072 33575 -2164
394 -2164 -33473 -3561 25579 1 -24642 -2054 16961 -7402 -22074 8593 23627 -13784
$$ packed form
307B8229j8974m6680K3924M7527k3077m6105K4701M6823k3893m4803L0208N1321
319D9201l2706o1271L0744P3799j8471p9838K311P5788Q828o6704j4246N7263
331B4698R489n6716r254N8791R526o4241j8504O3377K5053o1715l2129N6324L6045
344D0744n1809m1659M6732M6402l8031m8025K9358M5138k0120l6018J9245K9404
356B1361k2956k4058L2135K8022l7090l4770L9355M4305l5748n0133K9819N4963
368D5205k3342n7125J6225N7405j0724n5839N837N2367m358n1562M074N1673l566
381B6270n6340r26N9342Q232o0304j8395N6739K5364n0320l0041M2451L1503l5739
394b164l1309K9912K9140k5578k4643K2588J9015k4363j4672L0667J5034l7411
$$ plain form
406 -13784 -34835 6015 36806 -959 -39149 -8047 33317 10027 -28469 -8267 28880 9276
418 9276 -27586 -6603 34453 16049 -27576 -13122 33175 22841 -23458 -15707 30795 26019 -24068
431 -24068 -25535 26285 35973 -14864 -35025 5663 29963 -976 -23403 -2533 10690 -10009
443 -10009 -17170 7723 12346 -18914 -27906 5963 19625 -12298 -27459 3489 19717 -10559 -26849
456 -26849 6736 28726 -3196 -29319 578 31179 8538 -19888 719 26600 4939 -20184
468 -20184 5488 36257 9078 -30791 -9345 36727 24889 -22368 -23061 17752 23043 -11626 -19089
481 -19089 9611 14143 -13510 -19019 7247 12935 -11147 -17370 3173 6502 -13072 -11944 10865
494 10865 8207 -19934 -20075 13073 20483 -10798 -23414 3621 18243 -3431 -14951 7319 16193
$$ packed form
406a3784k1051M0850L0791l7765l8190L1102M1364k3290l8496K0202L7147j9604
418I276l6862K0983M1056j8404m3625J4454M6297j0334m6299P751M6502m776n0087
431b4068j467N1820R688n0837k0161M0688K4300l0939k2427K0870J3223k0699
443a0009p161K4893M623l1260q992L3869J3662l1923j5161L0948J6228l0276j6290
456b6849L3585K1990l1922k6123K9897L0601k2641k8426K0607K5881k1661k5123
468b0184K5672L0769k7179l9869K1446M6072j1838m7257o93M0813N291l4669p463
481a9089K8700M532k7653n509K6266N688k4082o223K0543L329j9574J128K2809
494A0865k658k8141j41L3148P410l1281j2616K7035J4622k1674j1520K2270Q874
$$ plain form
507 16193 -9049 -18400 11290 26019 -5056 -25832 2769 29242 5123 -23539 -3539 26376
519 26376 9870 -21645 -8867 23615 16361 -15874 -14843 13655 16208 -6255 -8908 7526 6617
532 6617 -8945 -3704 13112 6047 -15265 -9803 13384 10026 -13533 -13401 8531 8767 -13051 -13004
546 -13004 8923 8116 -15020 -15547 8957 10916 -14152 -17637 9166 14457 -12594 -20569 8317 21495
560 21495 -5882 -23537 2235 25369 5226 -18631 -4164 20683 11928 -9770 -3531 14870
572 14870 10212 -4908 -534 12895 6554 -6943 84 13098 4426 -10271 -3067 11242 3771
585 3771 -11889 -6492 7765 1293 -13823 -7578 7509 566 -16594 -9764 9119 3608 -17002
598 -17002 -12127 11081 8689 -16088 -15132 12103 16801 -9698 -18974 6710 21383 1137 -15091
$$ packed form
507A6193k5242r351K9690J4729l1075k0776K8601K6473k4119k8662K0000K9915
519B6376j6506l1515J2778L2482p254l2235J031K8498K553k2463k653J6434r09
532F617j5562N241J6816p065k1312N462K3187l358k3559J32K1932K36k1818M7
546a3004K1927q07k3136n27K4504J959k5068l485K6803N291k7051p975K8886J3178
560B1495k7377j7655K5772K3134k0143k3857J4467K4847q755k1698O239J8401
572A4870m658j5120M374J3429o341j3497P027J3014q672j4697P204J4309p471
585C771j5660N397J4257o472j5116O245J5087o943j7160O830J8883n511k0610
598a7002M875K3208k392k4777R56K7235M698k6499r276K5684J4673k0246j6228
$$ plain form
611 -15091 288 16789 5472 -8331 1144 12934 3021 -7713 1721 12350 2914 -8489 -320
624 -320 9417 1072 -8144 193 8414 -1530 -11053 -509 10247 -87 -11900 -2220 9011 -1002
638 -1002 -11652 -246 11726 -1543 -16951 -3298 17294 6349 -17698 -11578 12410 12427 -10104
651 -10104 -12697 7051 11131 -6998 -11673 5450 11710 -3987 -11828 962 9746 471 -6854 1201
665 1201 6248 -1567 -4500 4951 8002 -2452 -7222 3622 9394 560 -4537 2637 5730 -2986 -4091
680 -4091 7445 8467 -6615 -11790 4793 13499 -2542 -14926 -1782 12024 72 -14949 -4610
693 -4610 11726 2309 -16156 -9714 10385 8175 -10378 -11441 4226 7529 -4463 -6847 4355
706 4355 5521 -4839 -4714 6846 8308 -2541 -4690 5493 7806 -5 -1161 6422 5376 -3322
$$ packed form
611a5091J5379J6501j1317j3803R475J1790r913j0734R434J0629r436j1403Q169
624c20R737q345r216Q337Q221r944r523J0544J0756j0334j1813R680J1231j0013
638a002j0650J1406J1972j3269j5408J3653K0592j0945k4047O120K3988J7k2531
651a0104k593J9748M080j8129m675J7123O260j5697p841J2790Q784r275p325Q055
665A201N047p815k933R451L051j0454m770J0844N772q834n097P174L093q716j105
680d091J1536J022j5082n175J6583Q706j6041j2384J3144J3806j1952j5021J0339
693d610J6336r417j8465O442K0099k210j8553j063J5667L303j1992k384J1202
706D355J166j0360J25J1560J462j0849k149J0183K313p811j156P583j046q698
$$ plain form
720 -3322 -1354 9203 6340 -6277 -4871 8049 7301 -7522 -7986 6614 7633 -9620 -13455 4837
734 4837 11140 -6521 -17591 -2181 11022 -688 -14274 -5345 8039 895 -10732 -3843 8149
747 8149 2787 -8678 -4308 7527 6039 -4133 -2549 5882 4902 -1867 388 6620 3725 -2941 888
762 888 7664 3130 -4393 217 7619 2252 -6626 -769 9376 1905 -10135 -4868 10384 6353 -11049
777 -11049 -10327 7469 9783 -7035 -12332 3083 9976 -4128 -11712 1050 9750 -1770 -11349 -1682
791 -1682 9005 668 -9665 -2956 6919 1392 -7218 -2349 4765 558 -6112 -550 5329 -122 -5748
806 -5748 377 5908 -237 -5313 2416 7954 -704 -7152 3542 12430 1639 -9735 110 13684
820 13684 6278 -9257 -3349 11797 7647 -8360 -6493 9247 8643 -7576 -10017 5050 8965 -5031
$$ packed form
720c322J968J0557k863j2617J406J2920p48j4823m64J4600J019j7253l835J8292
734D837O303j7661j1070J5410J3203j1710j3586Q929J3384p144j1627O889J1992
747H149n362j1465M370J1835j488j0172J584Q431r80o769K255O232k895o666L829
762H88O776m534p523M610P402n367q878N857J0145p471j2040N267J5252m031j7402
777a1049P22J7796K314j6818n297J5415O893j4104p584J2762Q700j1520r579R667
791a682J0687q337j0333O709R875n527q610M869P114m207o670N562N879n451n626
806e748O125N531o145n076P729N538q658o448J0694Q888j0791j1374R845J3574
820A3684p406j5535N908J5146m150j6007J867J5740o04j6219k441J5067L915j3996
$$ plain form
834 -5031 -10857 227 5940 -3872 -9419 -1004 4438 -3748 -9045 -1399 3929 -2326 -6480 -1149 2785
849 2785 -2381 -3812 3070 4580 -3933 -4997 5722 9200 -2036 -6840 4580 11169 211 -6878
863 -6878 4365 12873 1188 -10132 804 14431 5353 -11068 -5063 10796 7460 -8546 -7424
876 -7424 6493 5707 -7685 -8464 5368 6200 -7101 -10009 1582 6321 -3721 -8157 72 3013
890 3013 -3686 -4495 3182 3061 -5258 -4896 4611 5308 -4102 -4754 5507 5694 -5037 -5251 7366 8985
906 8985 -5378 -9241 6043 12342 -2249 -11224 1654 12212 404 -10899 -646 11428 2170
919 2170 -10916 -3372 10805 5207 -9108 -6116 7301 6182 -5774 -5111 4892 5220 -4632 -4254
933 -4254 4569 4322 -4783 -4690 3546 2799 -5054 -3496 3952 1533 -7168 -4321 6588 3435 -8601 -7198
$$ packed form
834e031n826J1084N713r812n547Q415N442q186n297P646N328o255m154N331L934
849B785n166j431O882J510q513j064J0719L478j1236m804J1420O589j0958p089
863f878J1243Q508j1685j1320J0936J3627r078j6421O005J5859l336j6006J122
876g424J3917p86j3392p79J3832Q32j3301k908J1591M739j0042m436Q229K941
890C013o699q09P677j21q319L62R507O97r410o52J0261J87j0731k14J2617J619
906H985j4363l863J5284O299j4591q975J2878J0558j1808j1303J0253J2074r258
919B170j3086P544J4177n598j4315K992J3417j119j1956O63J0003L28r852L78
933d254Q823k47r105R3Q236p47p853J558P448k419q701K847J0909l153j2036J403
$$ plain form
949 -7198 6549 6417 -7295 -8854 5916 8828 -5375 -9543 5778 11769 -2561 -10770 3112 13651
963 13651 2159 -9770 -263 12094 4546 -7688 -1581 10058 4606 -7285 -3265 7994 4334
976 4334 -6276 -4298 4444 2678 -5538 -3769 3177 422 -7096 -3022 4595 -6 -8653 -3749 5915
991 5915 1681 -8870 -4638 7346 3670 -9204 -5597 9029 7839 -8199 -8192 8222 11207 -4500
1005 -4500 -9755 5342 12285 -1185 -9430 3107 11920 691 -9323 404 10484 2423 -8752
1018 -8752 -2217 7879 2829 -6792 -2624 5522 830 -6010 -1616 5326 89 -6951 -1533 5636 -5
1033 -5 -7418 -1522 6597 22 -8851 -1618 8935 2063 -10476 -4392 9637 5248 -9205 -6558 8368
1048 8368 7584 -7651 -8289 7153 9728 -5775 -10184 4774 11007 -2140 -9992 1449 9922 251
$$ packed form
949g198J3747j32j3712j559J4770K912j4203m168J5321N991j4330q209J3882J0539
963A3651j1492j1929R507J2357p548j2234O107J1639n452j1891M020J1259l660
976D334j0610J978Q742j766q216J769O946k755p518M074P617m601q647M904R664
991E915m234j0551M232J1984l676j2874L607J4626j190j6038PJ6414K985j5707
1005d500n255J5097O943j3470q245J2537Q813j1229j0014R727J0080q061j1175
1018h752O535J0096n050r621M168Q146m692o840M394O942n237p040N418P169n641
1033ep413N896Q119o575q873P233J0553o872j2539O084J4029m389j4453K647J4926
1048H368p84j5235o38J5442K575j5503m409J4958O233j3147p852J1441Q473r671
$$ plain form
1062 251 -8073 474 8181 559 -6748 400 7871 1538 -6014 -16 6523 738 -4699 1223 5927
1077 5927 -1478 -6525 1570 7972 -1354 -9471 -664 8468 171 -10056 -2572 8758 1225 -11239
1091 -11239 -4767 9275 4218 -11061 -8428 7933 7252 -8025 -9055 5608 8666 -4601 -8460
1104 -8460 4554 9694 -2643 -7787 3304 9782 83 -6382 1849 7704 986 -4342 2073 6131
1118 6131 -1177 -5280 2566 6486 -1897 -6638 1516 6151 -2565 -8169 1106 6905 -3113 -10798 -236
1133 -236 8993 -504 -11671 -3229 9777 2524 -10727 -4864 9070 5245 -8735 -5839 8589 7721
1147 7721 -6391 -7358 6421 9000 -3105 -7248 4085 7726 -1544 -5727 3014 6595 -2063 -5319
1161 -5319 2748 5939 -1816 -5276 2606 4942 -2846 -4990 3303 5605 -3941 -7158 3122 7602 -3549
$$ packed form
1062B51q324Q547P707p622p307P148P471o333p552N998O539n785n437N922M704
1077E927p405n047Q095O402r326q117Q807R132q297j0227P484J1330p533j2464
1091a1239O472J4042n057j5279K633J6361o81j5277j030J4663L058j3267l859
1104h460J3014N140j2337n144J1091O478r699o465Q231N855o718n328O415M058
1118F131p308m103P846L920q383m741Q154M635q716n604R275N799j0018p685J0562
1133b36R229r497j1167Q442J3006p253j3251N863J3934l825j3980K896J4428q68
1147G721j4112r67J3779K579j2105m143J1333L641r270m183Q741L581q658l256
1161e319Q067L191p755l460P882K336p788k144Q293K302r546l217J0280M480j1151
$$ plain form
1176 -3549 -8646 1946 8686 -1950 -10066 418 9465 63 -10701 -2218 10291 2611 -10440
1189 -10440 -4767 8824 5478 -8229 -6268 6582 6234 -5881 -6477 4941 6109 -4212 -6036 3731
1203 3731 6124 -2522 -4640 2994 4758 -2468 -3473 4419 4952 -3064 -4054 4734 5679 -3699 -4958 4616
1219 4616 6662 -4025 -6528 4337 7563 -3715 -9038 2547 9218 -2487 -11004 -316 9603
1232 9603 23 -11039 -3186 8063 1997 -10211 -4998 6982 3801 -8029 -5959 5775 5158 -5397
1246 -5397 -5022 4386 4854 -3133 -3043 4905 4591 -2928 -2644 5610 5023 -2728 -2298 5478 4680 -3826 -2679
1263 -2679 6051 5191 -4930 -5299 5413 6538 -5257 -7749 3662 7590 -4004 -9673 1627 8260
1277 8260 -2311 -10696 -684 8577 160 -10313 -3375 7774 2895 -7648 -4192 5826 3507
$$ packed form
1176c549n097J0592O740j0636q116J0484R047r402j0764Q483J2509p680j3051
1189a0440N673J3591l346j3707J961J2850l48j2115n96J1418J168j0321j824R767
1203C731K393q646k118P634J764p226j005P892N33q016r90Q788R45r378j259R574
1219D616K046j0687k503J0865L226j1278n323J1585O671j1705q517J0688R919
1232I603r580j1062P853J1249o066j2208N213J1980l181j1830K070J1734o17j0555
1246e397L75R408M68p987R0P948l14p519K84Q254n87p751M30P776p98q506J147
1263b679Q730q60j0121l69J0712J125j1795k492J1411L928j1594n669J1300O633
1277H260j0571q385J0012R261q417j0473O938J1149m879j0543L456J0018k319
$$ plain form
1290 3507 -5549 -3579 5413 3908 -4432 -3282 4709 3797 -3200 -2425 4162 2810 -3860 -1745 5483
1305 5483 2433 -4960 -2302 6045 3800 -5238 -3488 6395 4791 -5607 -4890 6211 6726 -5509 -7555
1320 -7555 5228 8891 -2981 -8706 2110 8693 -786 -8160 -337 7485 245 -8093 -1877 6201
1334 6201 1342 -7029 -3302 4475 1792 -5262 -3099 3725 1323 -4469 -2068 3574 1369 -4696 -1666
1349 -1666 4375 1664 -4359 -770 5493 1995 -5141 -1166 7010 3898 -5658 -3026 7392 6142 -4976
1364 -4976 -5321 5875 7433 -3738 -6791 3799 8102 -2743 -7854 1345 7448 -852 -8309 -1051
1378 -1051 6031 56 -7031 -1991 4543 168 -6168 -1934 3964 295 -5334 -2020 3422 943 -4315
1393 -4315 -476 4142 502 -4229 592 5601 458 -5154 247 7242 2161 -5909 -1363 7443 3651
$$ packed form
1290C507r056J970Q992j505q340J150P991r12o997P75O587j352o670K115P228
1305E483l050p393K658Q347k245r038J750R883j604j0398P17J1101N15j2235k046
1320g555J2783L663j1872n725J0816O583r479p374P823P822p240q338O216Q078
1334F201m859q371L727P777k683p054K163O824k402n792K401N642k205o065L030
1349a666O041k711o023L589O263l498p136L975Q176l112r556K632J0418j250j1118
1364d976l45J1196J558j1171l053J0590M303j0845n111R199O103q300p457P258
1378a051P082n975p087N040O534m375o336M234N898l669n629L314N442k479n258
1393d315L839M618l640m731M821N009n143n612N401O995n081q070M546Q806l792
$$ plain form
1408 3651 -5914 -3498 7082 4994 -5627 -5663 4963 6433 -4194 -6854 2423 6228 -2305 -6696
1422 -6696 854 5364 -1414 -6433 -263 4862 4 -5426 -1108 4055 548 -3817 -385 3120 234
1437 234 -3625 117 3453 -566 -3955 551 4420 -541 -4543 492 5517 40 -5841 -703 6776
1452 6776 1405 -6964 -2408 6909 3501 -5866 -3954 6132 5197 -4476 -4901 4489 5817 -3340 -5576
1467 -5576 3246 6244 -1920 -5602 1296 5466 -700 -4697 283 3903 -660 -4080 75 3078 -1175
1482 -1175 -3759 360 1916 -1717 -3571 1063 2679 -2521 -4478 1792 4772 -1989 -5675 1155 6171
1497 6171 158 -5450 -56 6764 1859 -5340 -1429 6476 3622 -4376 -3007 5293 4751 -3440 -4302
1512 -4302 3561 4797 -2191 -4211 1871 4486 -1696 -4922 235 3164 -1175 -3945 -156 1848 -1112
$$ packed form
1408C651r565K416J0580k088j0621l6J0626J470j0627k660R277L805q533m391
1422f696P550M510o778n019O170N125m858n430M318N163l507m365L432L505k886
1437B34l859L742L336m019l389M506L869m961m002N035N025n477n881N138P479
1452F776n371q369M556R317l408r367J912J0086r35r673m25R390J328r157k236
1467e576Q822K998q164l682O898M170o166l997M980L620m563l420M155L003m253
1482a175k584M119J556l633j854M634J616n200j957O270K980o761l686O830N016
1497F171o013n608N394O820m905p199L911P905k854p998J369Q300n42q191q62
1512d302P863J236o988k020O082K615o182l226N157K929m339k770L789K004k960
$$ plain form
1527 -1112 -3142 510 1689 -2164 -2916 1339 2340 -2332 -3556 2097 3885 -2075 -4473 2014 5224
1542 5224 -1267 -5371 1202 6520 263 -5656 -306 6655 1841 -5226 -1830 5779 3321 -4264 -3086
1557 -3086 4385 3953 -3396 -3440 2717 3850 -2190 -3567 1111 2840 -1233 -2418 1153 1843 -1435 -1983
1573 -1983 1162 1462 -2126 -1847 2003 1760 -2431 -2567 2885 2315 -3054 -3410 2483 3959 -2694 -4515
1589 -4515 1470 4700 -1309 -5197 826 5110 -460 -5429 -625 5306 1634 -4441 -2132 4744 3114
1604 3114 -3243 -2710 3013 3334 -1613 -2133 2538 3367 -1108 -1578 1740 2119 -797 -1177 1314 1062 -1734
1621 -1734 -1171 2024 484 -2898 -2074 2448 1163 -3810 -2622 2370 2005 -3706 -4020 2555 3112 -2670
1637 -2670 -4504 1971 4649 -1340 -5155 251 4955 868 -4185 -427 4850 1879 -3204 -1336 3679
$$ packed form
1527a112k030L652J179l853p52M255J001m672j224N653J788n960k398O487L210
1542E224o491m104O573N318o257n919N350O961m814p067L396P609k458p585J178
1557c086P471m32p349m4O157J133o040j377M678J729m073j185L571O90l278n48
1573a983L145L00l588K79L850k43m191j36N452n70n369l56N893J476o653j821
1589d515N985L230o009l888O023M284n570m969M804N931l672o075K309O876j630
1604C114o357N33N723L21m947n20M671Q29m475m70L318L79k916l80K491k52k796
1621a734N63L195j540l382Q24M522j285m973J188M992l65n711l14O575N57n782
1637b670j834O475K678n989l815N406M704m087n053L758N277k971n083J868N015
$$ plain form
1652 3679 2581 -2388 -1253 2903 2217 -1341 -1391 1649 1322 -1168 -846 1407 243 -1955 -705 1551
1668 1551 -62 -2414 -834 2125 132 -3189 -1536 2907 912 -3740 -2406 3246 2695 -3321 -3327 2405
1684 2405 3742 -1653 -3707 1149 4282 -379 -4142 310 4248 593 -3461 -440 3790 1571 -2288
1699 -2288 -1310 2419 1490 -1402 -1027 1715 1015 -1399 -429 1247 605 -1487 24 1365 -450 -1744
1715 -1744 516 2260 -474 -2825 -278 3171 329 -3425 -1086 3004 1194 -3391 -2333 2856 2311
1730 2311 -3240 -3310 2127 3300 -2292 -3912 721 3140 -377 -3529 -100 2784 436 -2557 -582
1745 -582 2058 923 -1824 -287 1388 950 -609 108 1495 343 -562 886 1530 -208 -922 1062
1761 1062 1941 -524 -2087 674 2383 -850 -3069 5 3160 94 -3929 -1734 2882 987 -3522
$$ packed form
1652C679j098m969J135M156o86l558n0L040l27k490L22K253j164k198J250K256
1668A551j613k352J580K959j993l321J653M443j995m652J334N652n51o016oN732
1684B405J337n395k054M856L133m661l763M452L938l655m054L021M230k219l859
1699b288R78L729r29k892L75K742p00k414R70J676o42k092J511J341j815j294
1715a744K260J744k734k351K547L449k842l754K339M090j810m585J058N189n45
1730B311n551p0N437J173n592j620M633K419l517l152L429K884k348k993J975
1745e82K640j135k747J537J675m38j559P17J387j152r05J448O44j738p14J984
1761A062Q79k465j563K761J709l233k219L074L155l066m023K195M616j895m509
$$ plain form
1776 -3522 -2714 2120 2082 -2825 -3024 1027 2561 -1483 -3182 514 2830 -311 -2127 15 2540 923
1792 923 -1171 59 1555 684 -384 651 1378 284 -414 829 1234 -655 -650 1212 1412 -1281 -1419
1809 -1419 1489 2170 -1478 -2921 588 2828 -409 -3291 -324 2863 493 -3254 -1416 2363 1226
1824 1226 -2852 -1897 1942 1886 -1683 -2536 1260 2109 -779 -2086 167 1826 -386 -1521 95 1013
1840 1013 227 -651 55 330 -224 -423 919 297 -886 -120 1510 1233 -1248 -823 1794 1590 -1360 -1568
1858 -1568 1675 2302 -845 -2486 1038 2878 -344 -3061 -65 2873 660 -2893 -1366 2394 1125
1873 1125 -2149 -1663 1049 1518 -1299 -2181 493 1218 -724 -1504 -424 750 -292 -783 314 80 -484
1890 -484 117 747 187 -895 240 1731 461 -1471 -72 2419 1177 -1735 -851 2203 1864 -1588
$$ packed form
1776c522Q08M834l8m907j99M051J534m044j699L696K316l141j816K142K525j617
1792I23k094J230J496q71j068J035P27j094o98J243M05j889NJ862K00k693j38
1809a419K908O81l648j443L509K240l237k882K967L187k370l747J838L779j137
1824A226m078R55L839n6l569q53L796Q49k888j307K253J659k212j135J616R18
1840A013p86q78P06K75n54j99J342o22j183P66J630k77k481M25K617k04k950k08
1858a568L243O27l147j641L524J840l222k717K996K938k213l553J527L760j269
1873A125l274M86K712M69k817q82K674P25j942p80J080J174j042m91J097k34n64
1890d84O01O30n60j082J135J491j270j932J399K491j242k912Q84L054l39l452
$$ plain form
1906 -1588 -1731 1774 2796 -977 -2498 574 2412 -58 -2739 -382 2353 241 -2594 -1351 1323
1921 1323 884 -1798 -1547 439 717 -814 -915 145 413 -69 -366 318 272 -61 413 882 -155 -148 787
1940 787 1596 -98 -1390 474 2121 428 -2002 -349 2114 1258 -2013 -1207 1605 1523 -1563 -2102 1278
1957 1278 2262 -831 -2356 215 2118 79 -1939 -583 1411 436 -1325 -687 979 775 -766 -579
1973 -579 481 419 -408 -164 131 3 -559 417 415 -747 -742 678 933 -952 -1567 771 1628 -751 -1909
1992 -1909 323 2131 324 -2013 -496 2500 1723 -1741 -1452 2072 1838 -1297 -1672 1126 1797 -517
2008 -517 -1817 11 1952 133 -2035 -206 1026 355 -1042 -625 415 209 -469 -42 16 -680 -277
2025 -277 81 -94 -845 -583 591 559 -1150 -1241 1160 1487 -1176 -1584 1044 2135 -66 -2120 -131 2594
$$ packed form
1906a588j43L505J022l773j521L072J838k470k681K357K735k112k835J243K674
1921A323m39k682K51J986K78j531j01J060K68m82k97O84m6l33M74M69j037PR35
1940G87Q09j694j292J864J647j693k430J653K463q56l271Q06K812q2l086n39L380
1957A278R84l093j525K571J903k039k018J356J994r75j761O38J666k04j541J87
1973e79J060o2q27K44K95j28n62R76kj162NJ420K55j885o15K338Q57k379j158
1992a909K232J808j807k337J517K996p77l464K89L524k34l135l75K798O71k314
2008e17j300J828J941j819k168J829J232o71j397M17J040k06o78M27N8o96M03
2025b77L58j75p51K62J174l2j709r1K401L27k663m08K628J091k201k054J989K725
$$ plain form
2043 2594 922 -1867 -582 2398 1434 -1494 -1173 1790 1814 -767 -1260 771 1626 -212 -1259 107
2059 107 847 -156 -1244 -198 58 -286 -390 -400 -40 -830 107 221 -231 -1243 68 1336 292 -1433
2077 -1433 -695 1543 1130 -1525 -1398 1001 1794 -912 -1742 696 2492 -158 -1718 -215 2328 809
2093 809 -1764 -770 1576 1218 -1123 -1160 781 1343 -689 -954 430 1280 -183 -813 -66 794 42 -298
2111 -298 -3 -314 -118 -69 400 -286 -1138 241 1268 16 -1540 -374 1398 444 -1863 -1309 1388 1221
2129 1221 -1602 -1770 798 1718 -743 -2216 248 1730 -2 -1820 -208 1865 533 -1551 -457
2144 -457 1557 809 -1000 -786 892 1344 -205 -686 362 269 57 -50 -82 -157 -120 373 387 -708 -788 329
2164 329 746 -551 -1931 8 1100 -172 -2082 -631 1385 563 -1627 -902 1240 1358 -1178 -1506
$$ packed form
2043B594j672k789J285K980r64k928L21K963K4k581m93K031Q55j838j047J366
2059A07P40j003j088J046K56l44j04j0L60p90R37J14m52j012J311J268j044j725
2077a433P38K238m13k655J27K399P93k706q30K438J796k650j560J503K543j519
2093H09k573R94K346l58k341l7J941N62k032k65J384Q50j463o30P47Q60p52l40
2111b98K95l11J96M9M69o86q52J379J027j252j556J166J772r54k307N54K697j67
2129A221k823j68K568R20k461j473K464J482j732j818J612K073j332k084J094
2144d57K014p48j809K14J678M52j549m81J048r3k12j07l2p5L7M93J4j095q0J117
2164C29M17j297j380J939J092j272j910J451K016q22k190P25K142J18k536l28
$$ plain form
2180 -1506 568 1646 -703 -1604 261 2006 183 -1579 2 1341 733 -1102 -668 1392 1044 -383
2196 -383 -361 492 628 23 -265 461 -360 -73 523 638 -798 -1073 437 1169 -413 -1575 -83 1468
2214 1468 -374 -1897 -339 1681 350 -1882 -776 1330 1071 -1468 -1180 1311 1292 -1365 -1417 746
2230 746 1643 -644 -1741 135 1765 371 -1602 -298 1100 323 -949 -617 349 565 -69 -67 -152 -391
2248 -391 39 468 558 -647 -546 1056 837 -749 -1406 854 1562 -344 -1271 23 1437 75 -1687
2265 -1687 -259 1270 321 -1663 -1034 1148 643 -1666 -1238 1089 1392 -1233 -1937 389 1442 -185
2281 -185 -1645 -87 892 606 -831 -577 678 387 -155 68 371 -72 301 1182 414 -693 -288 1402
2299 1402 909 -875 -998 943 1255 -485 -1119 416 1521 -465 -1776 171 1475 -157 -1915 -346
$$ packed form
2180a506K074J078k349r01J865J745j823j762J581J339o08j835M34K060l48j427
2196c83K2Q53J36o05k88P26q21K87N96J15j436k75J510P32j582j162J492J551
2214A468j842j523J558K020j331k232J106K106k59k539K88K491j9k657n2K163
2230G46Q97k287j097J876J630j394j973J304J398p77j272L32R66K16o34Kq5k39
2248c91M30M29R0j205J01J602k19j586o57K260P08j906r27J294J414j362j762
2265a687J428J529r49j984O29K182n05k309M28K327L03k625p04K326J053j627
2281a85j460J558R79k86j437K54J255k91n42K23L03m43L73Q81p68j107M05J690
2299A402m93j784j23J941L12j740o34J535J105j986j311J947J304j632j758J569
$$ plain form
2315 -346 1586 90 -1924 -1077 1462 1180 -1553 -1400 764 1314 -412 -1185 -275 988 136 -677 -251
2332 -251 432 94 -12 165 225 -466 6 1012 392 -895 -55 1094 547 -843 -862 1074 941 -786 -914
2351 -914 973 996 -739 -1209 492 1023 -537 -1838 113 1663 323 -1944 -551 1669 927 -1459
2367 -1459 -1335 1088 1464 -194 -1262 590 1252 64 -612 3 391 -32 -45 281 41 -720 -303 754
2385 754 -225 -802 -290 982 530 -616 -581 834 724 -1120 -586 1106 858 -714 -908 1297 1404 -820
2403 -820 -1253 833 1959 -349 -1865 -122 1736 851 -1431 -897 1127 997 -1003 -1216 264 705 -220
2420 -220 -826 -27 72 -303 -268 59 -211 -478 -275 514 322 -815 49 958 251 -389 -248 809 434 -766
2440 -766 13 1379 558 -1007 -546 1371 1007 -988 -1301 1180 1686 -778 -1965 106 1813 98 -1604
$$ packed form
2315c46J932j496k014Q47K539k82k733J53K164N50j726p73R10J263q52q13M26
2332b51O83l38j06J77O0o91M72J006o20j287Q40J149n47j390j9J936j33j727j28
2351i14J887K3j735m70J701N31j560j301J951J550j340k267J393K220p42k386
2367a459J24K423L76j658j068J852O62j188o76O15L88m23j3L26k40p61M17J057
2385G54r79n77N12J272m52j146L5J415j10j844N34J692k48j572j94K205J07k224
2403h20m33K086J126k308j516J743J858q85k282N34K024j30k000k13J480M41r25
2420b20o06P99R9l75L5L27k70k67K03P89j92j137Q64R09p07o40J41J057l75j200
2440g66P79J366q21j565M61J917l64j995l13K481N06k464j187K071J707j715j702
$$ plain form
2457 -1604 -831 1109 774 -878 -766 301 709 -314 -519 379 -34 -282 341 598 86 -387 2 560
2475 560 22 -826 -156 524 -25 -449 137 594 -217 -1029 -126 1157 236 -1288 -520 1735 578 -1478
2493 -1478 -1342 1607 1300 -664 -1937 560 1748 164 -1577 -538 1202 553 -874 -461 498 457 -527
2510 -527 -54 650 -160 -216 13 496 -94 -814 -314 783 328 -599 -136 261 -428 -460 232 491 -457 -782
2530 -782 189 934 -222 -1447 -128 1197 486 -1546 -1019 1668 1317 -1058 -1435 572 1532 -16 -1380
2547 -1380 -179 1327 286 -868 -361 833 138 -483 47 534 235 -982 -176 702 -402 -751 -324
2564 -324 254 -15 -428 -95 35 -447 -368 324 465 -451 -577 475 1151 -430 -1395 225 1779 306 -1343
2583 -1343 -323 1285 1196 -978 -1036 833 1423 -432 -1009 127 813 57 -1035 -333 585 -318 -653 240
$$ packed form
2457a604P73J940l35j652J12J067M08j023k05Q98m13k48O23K57n12m73L89N58
2475E60n38q48O70O80n49m24N86M57q11q12R03J283r21j524P68K255j157k056
2493a478J36K949l07j964j273K497J188j584j741J039J740o49j427M13R59m1r84
2510e27M73P04q10n6K29M83n90p20N00J097m55r27M63L97o89l2O92K59r48l25
2530g82R71P45j156j225J319J325p11k032N27K687l51k375l77K007R60j548j364
2547a380J201J506j041j154N07J194o95o21N30M87k99j217Q06Q78j104l49M27
2564c24N78k69m13L33J30m82P9O92J41r16j26J052O76j581r65J620J554j473j649
2583a343J020J608q9k174n8J869N90j855n77J136O86p56j092P02R18r03l35Q93
$$ plain form
2601 240 414 -67 -794 -346 729 87 -667 -70 191 351 -88 192 137 -127 -173 476 202 -809 -751 1077
2621 1077 966 -709 -1196 535 1691 -196 -1520 -232 1305 642 -1027 -868 1169 752 -627 -630 591
2638 591 997 -586 -790 237 588 -319 -901 343 523 -239 -576 82 678 70 -247 -154 225 352 -20
2657 -20 5 -291 -400 104 636 131 -871 -519 816 297 -1131 -1057 533 1157 -457 -1277 -22 1137 503
2676 503 -1403 -701 576 837 -475 -409 390 424 -388 -509 544 949 -289 -641 557 806 139 -722 44
2695 44 449 -163 -362 -443 199 56 -229 -59 -138 -11 421 474 -430 -924 -84 950 630 -744 -1032 414
2715 414 1013 -249 -1099 224 1017 -52 -868 -102 773 380 -581 57 981 445 -479 -373 1129 303 -570
2734 -570 -711 651 865 -427 -562 258 743 252 -321 -390 -173 16 -46 145 -499 -178 427 214 -317 -942
$$ packed form
2601B40J74m81p27M48J075o42p54N97K61J60m39K80n5k64m6O49k74j011N8J828
2621A077j11j675m87J731J156j887j324J288J537o63j669J59K037m17j379lJ221
2638E91M06j583k04J027L51r07n82J244J80p62l37O58N96o08l17R3L79J27l72
2657b0K5k96j09N04N32n05j002L52J335n19j428P4J590O24j614q20J255J159o34
2676E03j906P02J277K61j312O6P99L4q12j21J053M05j238l52J198K49o67q61P66
2695D4M05o12j99q1O42j43k85J70p9J27M32N3r04m94Q40J034l20j374k88J446
2715D14N99j262q50J323P93j069q16P66Q75l93r61O38R24n36r24J06J502q26q73
2734e70j41J362K14j292j35Q20M85m91n73o9K17J89o2J91o44L21O05k13n31o25
$$ plain form
2754 -942 -195 829 480 -1001 -762 947 813 -462 -814 71 780 -202 -905 146 647 6 -633 -165
2772 -165 572 -129 -816 -415 749 446 -992 -773 577 767 -404 -826 190 388 556 -259 -145 -27
2790 -27 71 426 -239 -613 -402 457 517 -352 -991 323 930 145 -978 -426 398 682 -372 -712 377 493
2810 493 -520 -427 96 437 -891 -922 419 508 -390 -1030 108 823 565 -500 -458 581 800 -100 -708
2829 -708 -58 334 290 -93 -350 -282 216 -98 122 -207 -248 429 635 -101 -552 149 595 363 -603 -483 481
2850 481 279 -313 -283 453 485 -644 -372 210 286 -611 -659 479 825 -319 -906 -349 701 38 -898 -760
2870 -760 679 671 -415 -717 27 544 167 38 -402 -131 176 406 321 -372 36 293 265 -258 -222 292 590
2891 590 -198 -588 -74 736 -20 -585 -113 664 -74 -592 -100 583 342 -845 -418 562 710 -297 -942
$$ packed form
2754i42P47J024l49j481K39J709j34j275l52Q85P09r82p03J051N01o41o39M68
2772a65P37p01o87M01J164l03j438K19J350J90j171m22J016J98J68q15J14J18
2790b7R8L55o65l74K11Q59O0q69o39J314O07p85j123N52Q24K84j054l40J089J16
2810D93j013R3N23L41j328l1J341Q9q98o40J138P15k58j065M2J039K19r00o08
2829g08O50L92m4l83k57O8M98l14K20l29m1O77K06p36m51P01M46k32r66J20R64
2850D81k02n92L0P36L2j129K72N82P6q97m8J138L46j144n87N57J050o63r36J38
2870g60J439qj086l02P44N17l77j29m40K71L07K30q5o93M08K57k8n23L6N14K98
2891E90p88l90N14Q10p56n65M72P77p38n18M92O83k41j187M27R80J48j007o45
$$ plain form
2910 -942 201 1037 -156 -717 -374 688 347 -420 -549 249 442 151 -362 -351 -197 3 53 -220 -380 -269
2930 -269 605 406 -273 -289 181 375 -260 -363 469 331 -176 -325 266 533 -90 -633 -81 992 156 -858
2950 -858 -603 727 680 -1032 -945 396 834 -441 -1105 -550 472 -13 -535 -581 -135 -147 25 -16 -22 -119 49
2971 49 352 84 -485 68 296 155 -317 -468 276 307 -407 -398 305 449 -344 -430 329 414 -452 -596 523 690
2993 690 56 -901 -278 626 397 -730 -695 347 267 -294 -879 83 325 113 -512 -436 194 58 35 -122 -133
3014 -133 -208 -201 -298 84 -26 -113 322 27 -58 -171 -131 -245 -222 133 144 81 -387 -222 520 555 -253 -683 747
3037 747 638 -177 -745 -91 939 32 -712 -375 273 424 -382 -764 83 422 350 -328 1 269 285 45
3057 45 18 142 -142 202 -4 -313 159 47 196 -58 -223 14 281 -288 -249 286 167 143 -304 -363 476 409
$$ packed form
2910i42J143Q36j193n61L43J062l41p67j29P98J93k91n13J1J54K00N0k73j60J11
2930b69Q74j99o79j6M70J94o35j03Q32j38n07j49N91K67o23n43N52J073q36j014
2950h58K55J330m7j712Q7J341M38j275o64N55J022m85n22m6M46j2J72m1or7J68
2971D9L03k68n69N53K28j41m72j51P44L1p14RP03J44p93q6P59Q5q66j44J119J67
2993F90o34r57O23R04k29j127L5J042q0n61n85R62K42k12o25P6O30j36k3j57j1
3014a33p5Pr7L82j10q7M35k95q5j13M0j14K3L55J1o3m68J65P42L5q08m30J430
3037G47j09q15n68O54J030r07p44L37O48J51q06l82Q47L39p2o78L29K68J6k40
3057D5k7J24k84L44k06l09M72j12J49k54j65K37K67n69L9N35j19k4m47n9Q39o7
$$ plain form
3079 409 -587 -140 317 625 -278 -612 105 911 18 -590 -468 665 416 -365 -314 269 518 -81 -280 -301
3099 -301 136 61 30 -291 67 -125 -169 -221 -419 -109 -32 -28 -14 -100 94 -74 -165 -87 388 274 -264 -420 68 387
3123 387 521 -398 -520 421 669 -414 -891 231 325 82 -397 -52 440 32 -661 -253 405 357 -194 -250
3143 -250 28 143 -335 2 26 130 11 -12 245 7 225 214 50 -75 121 296 147 -331 -177 376 253
3164 253 -99 -506 179 438 105 -488 100 673 441 -580 -510 200 312 -144 -458 210 372 278 -241 -317 451
3185 451 -98 -247 71 27 309 158 13 -35 188 30 -272 -262 180 523 101 -255 -309 95 16 -144 -223 -147
3207 -147 406 78 -487 -384 385 383 -193 -885 -194 433 384 -534 -680 540 300 -240 -436 71 571 43 -278
3228 -278 39 213 376 -12 -42 194 5 71 83 91 30 356 34 27 43 100 329 -457 -195 203 196 17 -596 -105
$$ packed form
3079D09r96M47M57L08r03l34P17Q06q93o08J22J133k49p81N1N83K49n99j99k1
3099c01M37p5l1l21L58j92m4n2j98L10P7MJ4q6J94j68r1P8M75j14n38j56M88L19
3123C87J34r19j22R41K48j083m77J122R4k43m79L45M92m08o93M08O58m8n51n6
3143b50K78J15m78L37K4J04j19k3K57k38K18j1j64j25J96J75j49m78J54N53j23
3164B53l52m07O85K59l33n93N88N73k32j021P0P10J12m56l14O68J62r4n19p6P68
3185D51n49j49L18m4K82j51j45m8K23j58l02J0M42L43m22l56n4M04p9j60p9P6
3207a47N53l28n65J03P69kn76o92O91O27m9r18j46J220k40n40j96N07N00n28l21
3228b78L17J74J63l88l0K36j89O6J2Qo1L26l22pJ6N7K29p86K62L98pj79o13M91
$$ plain form
3252 -105 398 79 -210 -91 401 334 -360 -306 -54 358 57 -166 -53 304 278 -140 38 88 239 -178 -376
3273 -376 -275 302 127 -368 -124 138 153 -178 -168 -110 235 -28 -157 -80 133 217 -60 -225 -406 243 102 31
3295 31 -245 2 279 -85 -422 -194 489 143 -141 -410 -29 503 -219 -418 202 560 8 -655 -169 248
3315 248 127 -202 -232 273 283 20 -479 195 253 188 -220 -69 74 168 -136 217 -212 -78 305 104 -404 -217
3337 -217 127 366 -66 -109 205 415 -35 -46 -104 505 239 -560 -402 166 233 -301 -141 217 345 -120 -615
3358 -615 -60 294 58 -156 -366 8 238 -140 -50 -20 -5 320 -161 -3 22 52 -269 -110 62 232 -5 -57
3380 -57 -228 -95 225 153 -308 -175 175 260 -175 -314 -87 216 -70 -529 -284 281 245 -299 -310 194 493 -123
3402 -123 -348 -79 263 113 -352 -301 58 60 -218 -139 251 308 141 -370 -150 121 187 70 -65 -212 103 351
$$ packed form
3252a05N03l19k89J19M92o7o94N4K52M12l01k23J13L57k6m18J78N0J51m17j98
3273c76J01N77j75m95K44K62J5l31J0N8L45k63j29P7K13Q4k77j65j81O49j41p1
3295C1k76K47K77l64l37K28O83l46k84k69L81N32p22j99O20L58n52o63M86M17
3315B48j21l29l0N05J0k63m99O74N8o5m08J51J43R4l04L53m29J34L83k01n08J87
3337b17L44K39m32m3L14K10m50j1n8O09k66p99J58N68O7n34J60L58J28m65m95
3358f15N55L54k36k14k10L74K30l78R0L0J5L25m81J58K5L0l21J59J72J70k37n2
3380e7j71J33L20p2m61J33L50Q5m35j39K27L03k86m59K45N65l6n44j1N04K99o16
3402a23k25K69L42j50m65N1L59Kk78P9L90N7j67n11K20K71O6j17j35j47L15K48
$$ plain form
3424 351 -350 -116 233 182 -42 -283 -106 459 38 -35 -182 206 79 16 -306 -300 562 68 -223 -77 403 572
3446 572 -407 -199 75 -196 -131 -148 387 53 -133 -354 -325 131 74 25 118 -136 186 -155 -22 -201 142 16
3468 16 205 102 -373 -140 120 -211 -290 -50 323 188 -326 -230 138 319 -42 -446 188 408 72 -243 -349
3489 -349 448 182 -216 -215 -28 -9 -76 -441 -96 121 116 -409 -47 68 156 71 -282 110 91 141 -281 -213 72 -198
3513 -198 40 -140 52 -90 12 -150 -254 112 95 -1 -207 -184 415 406 -60 -233 119 117 125 -94 -4 438 126
3536 126 -428 23 404 176 -63 -317 -109 -10 -216 -156 11 75 -162 -17 26 -246 -155 -109 157 -112 -121 374 0
3559 0 -167 -122 -3 -222 -208 -449 -269 172 -82 -260 -251 191 -74 -203 -163 231 379 -132 -429 164 506 216
3581 216 -61 -212 366 240 10 -535 -84 259 -133 -73 117 181 -199 -17 23 141 190 -152 -51 -81 9 -82
$$ packed form
3424C51p01K34L49n1k24k41J77N65m21p3j47L88j27o3l22OQ62m94k91J46M80J69
3446E72r79K08K74k71O5j7N35l34j86k21K9M56n7m9R3k54L22l41J33j79L43j26
3468A6J89j03m75K33K60l31p9K40L73j35n14R6L68J81l61m04O34K20l36l15j06
3489c49P97k66l98JJ87J9o7l65L45K17nn25L62J15Q8q5l53L92j9N0m22O8K85k70
3513a98K38j80J92j42J02j62j04L66j7r6k06K3N99rm66j73L52kQk19R0M42l12
3536A26n54M51L81k28k39k54K08R9k06O0J67O4k37J45M3k72R1M6K66k69rM95l74
3559@j67M5J19k19J4k41J80M41k54j78RM42k65j29M0L94J48n11k97N93L42k90
3581B16k77j51N78j26k30n45M51L43l92O0J90O4l80J82M0J18M9l42J01l0R0r1
$$ plain form
3603 -82 59 -348 17 64 176 -338 -5 305 137 4 -376 242 334 -39 -259 -124 131 71 -7 -388 -84 387
3625 387 -310 -379 -19 108 223 -433 -168 94 100 138 -237 103 85 -37 -273 -228 228 207 186 -54 36 -2 -95 -81
3649 -81 76 262 273 -125 -284 55 158 82 -400 -271 -21 246 87 -226 36 393 -70 -383 -447 484 371
3670 371 -259 -192 259 95 56 -93 -21 80 -33 145 -224 -106 129 -107 -94 -224 -137 -76 -286 -214 171 -50
3692 -50 29 211 -150 128 78 127 -340 -18 152 -41 -45 -103 529 380 218 -359 -52 463 27 -284 -54 111
3714 111 185 -83 -165 49 352 38 -20 -128 168 -71 -42 -120 -106 233 152 41 145 -32 -4 -324 -171 96 -49
3737 -49 237 -114 -67 -49 -94 119 -106 -195 -17 173 -497 74 300 39 -164 -142 32 193 134 -237 -56 243
3759 243 449 -405 -251 0 202 83 -132 114 157 95 -19 -67 258 63 -203 -282 396 -107 -111 -282 28 287
$$ packed form
3603h2J41m07L65M7J12n14L33L10j68j33l80O18R2l73k20J35K55o0p8l81L04M71
3625C87o97o9L60J27J15o56K65K62OL8l75L40j8j22k36M5M56k1k1k40R0l8r3J4
3649h1J57J86J1l98j59L39J03p6m82J29K50K67j59l13K62L57m63l13o4R31j13
3670C71o30O7M51j64l9j49P2J01j13J78l69J18K35k36J3j30Q7O1k10P2L85k21
3692e0P9J82l61K78n0M9m67L22J70j93mn8O32j49j62n77L07N15m36l11K30J65
3714A11P4k68q2K14L03l14n8j08K96k39K9p8J4L39q1j11J04j77K8l20J53K67j45
3737d9K86l51M7J8m5K13k25q9J78J90o70N71K26k61k03K2J74J61n9l71J81K99
3759B43K06q54J54K51K02j19k15K46M3o2j14m8L25j95k66p9O78n03mj71L10K59
$$ plain form
3781 287 255 -232 10 210 -127 1 -222 -474 72 46 -29 -451 16 346 97 -202 -204 -27 80 8 -69 -121 568
3804 568 53 -217 188 -38 3 -138 -315 147 303 -86 -159 -114 325 -199 88 -177 -20 28 6 -97 -47 102
3826 102 6 145 78 85 147 38 -488 -57 -133 -12 -64 38 22 80 65 -68 -88 9 260 -52 17 -141 22 327
3850 327 -100 -248 514 8 -325 -137 292 223 -205 83 377 88 -130 -137 12 316 220 130 -159 -149 239 -19
3872 -19 -80 -147 493 387 108 -60 -185 368 119 -290 -3 124 210 194 -416 -102 108 185 -442 -70 36 -47
3894 -47 -105 -214 -15 17 177 -237 9 -31 229 -16 -634 -140 160 21 -136 -212 93 152 -112 -216 323 23
3916 23 2 -29 -329 -41 -113 -70 41 -63 61 19 -12 -299 -295 111 -52 -152 144 -169 134 100 -16 22 186 -150
3940 -150 -63 -44 70 -227 -65 68 70 -56 125 -550 114 270 -193 -73 -112 -16 91 -30 42 127 -9 68 -106
$$ packed form
3781B87l2m87K42K00l37J28k23k52N46k6p5m22M67L30k49k99kJ77J07p2p7n2O89
3804E68n15k70M05k26M1j41j77M62J56l89p3M5M39n24K87k65J57M8k2j03N0J49
3826A02r6J39o7PO2j09n26M31p6J21n2J02j6N8j5j33k0R7K51l12O9j58J63L05
3850C27m27j48P62n06l33J88M29o9m28K88K94k89k18pJ49L04r6r0k89J0L88k58
3872a9o1o7O40j06k79j68j25N53k49m09K87J27Q6j6o10L14K10P7o27L72J06q3
3894d7n8j09J99L2J60m14K46m0K60k45o18M94L00j39j57p6L05N9k64j04N39l00
3916B3k1l1l00K88p2M3J11j04J24m2l1k87MM06j63j00K96l13L03l4j16L8J64l36
3940a50Q7J9J14k97J62J33Kj26J81o75O64J56m63J20l9R6J07j21P2Q5j36P7j74
$$ plain form
3963 -106 -368 -32 197 -139 -58 -129 -53 88 -396 -200 149 174 128 -226 67 126 322 -186 -212 195 19 -174
3985 -174 -207 123 451 182 -488 36 21 -13 -19 65 149 412 40 -229 -213 147 -18 -222 160 3 203 -75 -147
4008 -147 31 -192 324 -30 28 73 126 57 -57 -65 191 226 -54 -298 -242 238 244 -72 23 192 129 -265 64 238
4032 238 -62 -88 -78 -54 223 -250 -129 -56 141 2 25 -173 -81 154 -139 -223 -39 83 -109 -96 -25 4 103 -118
4056 -118 -83 -11 203 346 -6 15 -345 42 55 -11 -268 151 316 -111 -71 -86 236 10 -70 -261 22 127 -245
4079 -245 136 265 168 109 -225 -185 108 -272 -124 -27 82 362 -123 -64 9 54 3 144 53 -32 66 -255 -98 138
4103 138 246 50 60 47 -58 28 -232 -121 -333 46 199 -151 -186 130 -69 -164 -256 -181 63 365 -99 141
4125 141 128 195 -124 -233 236 63 67 -27 123 -329 -26 -376 -207 43 -45 76 -161 204 -141 -176 201 -57
$$ packed form
3963a06k62L36K29l36Q1p1P6J41m84J96L49K5m6l54K93N9J96n08k6M07j76j93
3985a74l3L30L28k69o70N24j5l4oQ4Q4K63l72k69J6L60j65k04L82j57K00k78p2
4008a47J78k23N16l54N8M5N3o9j14qK56L5k80k44N6M80Ol16R5J69o3l94L29J74
4032B38l00k6J0K4K77m73J21P3J97j39K3j98R2K35k93q4J84J22j92J3P1K9R9k21
4056a18L5P2K14J43l52K1l60L87J3o6k57M19J65m27M0j5L22k26q0j91K83J05l72
4079b45L81J29r7n9l34M0K93l80J48R7J09K80m85N9P3M5n1J41r1q5R8l21J57K36
4103A38J08j96J0j3j05Q6k60J11k12L79J53l50l5L16j99r5r2P5K44L02m64K40
4125A41j3O7l19j09M69j73Mr4J50m52L03l50J69K50q8J21k37L65l45l5L77k58
$$ plain form
4147 -57 -273 -131 -181 9 -215 -91 235 177 -129 -51 1 -60 112 -388 240 175 77 -103 51 261 267 -312 -285 82
4171 82 121 -132 -265 -155 -282 102 103 68 167 -50 -318 -24 -254 258 -71 -33 139 158 113 -105 257 -47 38
4194 38 58 -72 -112 -45 241 -90 -243 -139 17 132 -266 -62 -24 46 -43 -108 -11 -60 -122 -233 42 109 -218 111
4218 111 166 27 -59 95 -217 11 1 -168 294 7 -66 55 -60 -285 -162 289 -70 -53 -142 -22 151 -70
4240 -70 -91 137 19 -201 43 -8 -41 303 -102 -235 -201 343 -97 -91 69 -164 118 133 147 -130 46 -34 57 -144
4264 -144 351 189 -158 -221 69 416 -59 100 400 75 31 -67 -40 150 -121 6 -31 -277 184 40 313 99
4286 99 -188 103 21 -175 24 -116 213 -243 -126 219 54 -86 122 -686 63 342 17 -261 -193 167 230
4307 230 -83 126 208 162 -43 -49 -36 -71 -131 -132 172 -146 196 165 10 26 52 -279 131 -64 212 -115 -110 -233 -158
$$ packed form
4147e7k16J42n0J90k24J24L26n8l06P8N2o1J72n00O28o5r8j80J54K10On79K7L67
4171H2L9k53j33J10j27L84Jl5R9k17k68K94k30N12l29L8J72J9m5k18L62l04Q5
4194C8K0j30m0O7K86l31j53J04J56J15l98K04L8P0q9o5R7m9o2j11K75O7l27L29
4218A11N5j39q6J54l12K28j0j69M62k87p3J21j15k25J23M51l59J7q9J20J73k21
4240g0k1K28j18k20K44n1l3L44m05j33L4N44m40OJ60k33K82J5J4k77J76q0R1k01
4264a44M95j62l47o3K90L47m75J59L00l25m4r8K7J90k71J27l7k46M61j44K73k14
4286I9k87K91q2j96J99j40L29m56J17L45j65j40K08q08P49K79l25k78O8L60O3
4307B30l13K09Q2m6k05oJ3l5o0jL04l18L42l1j55J6K6l31M10j95K76l27Nj23P5
$$ plain form
4332 -158 99 89 -99 40 41 -91 195 -280 -224 241 -203 -188 -143 187 55 -245 -330 97 350 -311 -148 18
4354 18 -64 -197 70 -110 -27 -4 59 260 -115 180 100 -184 5 287 42 -57 41 39 142 165 -81 84 -229 275
4378 275 42 99 -199 251 -118 -67 -148 235 313 -34 -94 154 217 1 3 -177 260 125 -78 -273 159 55 41
4401 41 -175 -164 284 -218 -163 78 4 121 -109 137 -93 229 17 -23 -182 -356 317 116 -189 52 -93 6
4423 6 43 -231 -62 -120 -88 -299 8 208 102 0 82 -56 -82 -128 -4 -179 111 317 -68 -317 -6 50 60
4446 60 98 -37 4 274 -118 -123 61 72 89 -219 32 97 243 -235 25 -100 -114 -11 -51 -76 -25 3 -112 -128 -169
4471 -169 -48 -79 -67 -124 -43 -37 -235 234 3 -190 84 114 -64 170 298 -23 -142 -309 102 -148 -312 151
4493 151 -41 85 -109 181 44 -81 -189 -347 53 32 -185 128 -132 -86 -8 73 -202 84 -177 -160 -256 53
$$ packed form
4332a58K57j0j88J39Jj32K86m75N6M65m44J5M5L30j32l00q5M27K53o61J63J66
4354A8q2j33K67j80Q3K3O3K01l75K95q0k84J89K82k45r9R8kJ03K3k46J65l13N04
4378B75k33N7k98M50l69N1q1L83P8l47o0K48O3k16Kj80M37j35k03j95M32j04j4
4401D1k16J1M48n02N5K41p4J17k30K46k30L22k12m0j59j74O73k01l05K41j45R9
4423FL7k74J69n8L2k11L07K00j06j02Q2j38k6m6J24j75K90K06l85k49L11N6J0
4446F0L8j35M1K70l92nJ84J1J7l08K51O5J46m78K60j25j4J03m0k5N1K8j15j6m1
4471a69J21l1J2n7Q1Oj98M69k31j93K74L0j78K34J28l21j19j67M11k50j64M63
4493A51j92J26j94K90j37j25j08j58M00k1k17L13k60M6P8Q1k75K86k61J7r6L09
$$ plain form
4515 53 -254 97 143 398 -248 -43 195 -93 -143 420 363 -249 352 -62 -39 -118 -234 216 2 -176 65 194
4537 194 144 333 -149 144 87 -102 23 -127 96 49 10 190 -151 -101 146 -161 -125 -107 -86 -41 -22 115 -149
4560 -149 284 -228 -151 156 79 -57 -315 -237 205 126 -27 129 -174 75 141 7 -221 -116 147 72 -225 -172
4582 -172 39 141 -281 -77 -353 210 -53 -194 -86 37 141 -119 -255 -97 201 -43 39 88 170 8 0 -178
4604 -178 216 266 -50 123 -144 -104 -188 71 -5 86 -78 -17 261 91 192 -70 184 -123 25 68 8 -286 -16
4627 -16 -123 202 -120 -49 211 37 199 -497 102 -158 -6 38 -100 81 337 -73 -47 67 1 150 -95 -177
4649 -177 -146 46 23 -160 -155 -116 -15 170 -132 -6 -5 -87 79 5 169 158 -75 -242 274 89 -99 -198 -56 -182
4673 -182 330 127 274 -36 165 136 -508 252 -211 -71 38 73 269 86 -34 68 15 220 -5 206 35
$$ packed form
4515E3l07L51M6K55o46K05K38k88n0N63n7o12O01m14K3p9j16M50k14j78K41J29
4537A94n0J89m82K93n7j89J25j50K23m7l9J80l41N0K47l07L6J8K1M5J9J37k64
4560a49M33n12P7L07p7j36k58P8M42p9j53J56l03K49O6j34k28J05K63p5k97N3
4582a72K11J02m22K04k76N63k63j41J08J23J04k60j36J58K98k44Q2M9Q2j62qj78
4604a78L94N0l16J73k67M0q4K59p6R1j64O1K78j70J01k62K54l07J48M3o0k94K70
4627a6j07L25l22P1K60j74J62o96N99k60J52M4j38J81K56m10K6J14o6J49k45q2
4649a77L1J92k3j83NL9J01J85l02J26Jq2J66p4J64j1k33j67N16j85j88r9J42j26
4673a82N12k03J47l10K01k9o44P60m63J40J09L5J96j83j20J02n3K05k25K11j71
$$ plain form
4694 35 100 11 66 156 -140 31 180 229 129 188 65 -211 122 218 55 61 -133 -76 204 292 258 -346 195 -59
4718 -59 -18 -157 214 -23 234 -91 -68 -48 -247 -18 -252 -16 107 -132 -324 -240 109 -71 -233 214 -281 -124
4740 -124 44 -320 23 66 -123 37 -308 101 169 -15 -67 137 -1 -28 -192 -28 253 230 281 -101 -147 -36
4762 -36 208 -114 -262 68 -10 -83 20 -377 -37 251 52 186 -50 212 -263 82 406 -84 63 -11 -128
4783 -128 45 173 -24 -212 -33 61 -56 45 1 -7 170 43 0 55 -68 182 -162 -23 93 -8 -149 -74
4805 -74 -68 -47 -13 -8 151 -156 109 -105 80 -198 45 55 3 -13 -135 -124 -301 -7 -127 -122 -5 -13 117 -49 217
4830 217 -10 -213 -96 166 113 119 -301 -80 51 100 -185 131 158 -83 301 -282 207 145 42 121 -166 92
4852 92 -171 92 -112 327 2 52 -130 -214 110 245 27 -136 -246 43 -318 -384 -161 -204 -266 45 15 77 -120
$$ packed form
4694C5O5q9N5R0k96J71J49M9j00N9j23k76L33R6j63Oj94N7K80Q8l4o04N41k54
4718e9M1j39L71k37K57l25K3K0j99K29k34K36J23k39j92Q4L49j80j62M47m95J57
4740a24J68l64L43M3j89J60l45M09O8j84n2K04j38k7j64J64K81k3N1l82m6J11
4762c6K44l22j48L30p8p3J03l97L40K88j99J34k36K62m75L45L24m90J47p4j17
4783a28J73J28j97j88J79R4j17J01m4qJ77j27m3N5j23K50l44J39J16j01j41P5
4805g4OK1L4NJ59l07K65k14J85k78K43J0n2j6j22J1j77K94j20NJ17qJ30j66K66
4830B17k27k03J17K62n3Om20K21J31M9k85L16K7k41L84n83M89o2j03P9k87K58
4852I2k63K63k04M39l25N0j82q4L24J35k18j63j10K89l61o6K23m3o2L11l0O2j97
$$ plain form
4875 -120 -16 321 -252 187 -269 59 -127 40 -141 240 91 112 174 -41 -137 -102 -197 -144 -10 -112 -92 7 322
4898 322 163 -113 261 58 97 -104 -65 95 228 -162 314 184 104 99 -101 19 -124 273 -118 -209 -12 -215
4920 -215 244 -59 -48 -33 25 -106 -61 199 161 65 -331 105 -31 -1 -9 44 186 51 110 -186 -187 -25 83 41 -35
4945 -35 241 214 -266 138 201 -75 -108 -181 -63 -34 -67 4 -11 -61 192 79 -236 -185 -169 406 232 36 -69 17
4969 17 -38 -89 -290 -2 -197 96 22 73 -2 -111 -133 -95 43 1 114 -21 126 27 81 -107 -208 -169 94 10
4993 10 108 -55 41 -114 171 -186 -52 76 -202 117 80 -194 16 -85 111 180 33 -152 126 -78 237 -209
5015 -209 371 100 236 47 129 -161 -75 53 -177 36 -181 -16 239 -122 -238 -70 10 94 -276 67 122 272
5037 272 -138 257 -129 -154 -54 -74 326 115 30 240 -194 108 44 -125 -104 258 -40 -233 0 225 63 99
$$ packed form
4875a20J04L37n73M39m56L28j86J67j81L81j49K1O2k15r6L5r5N3J34j02K0R9L15
4898C22j59k76L74k03L9k01L9J60J33l90M76j30q0nk00J20j43L97l91r1J97k03
4920b15M59l03J1J5N8j31M5K60l8r6l96M36j36L0qN3J42j35N9k96jJ62J08m2p6
4945c5K76k7m80M04O3k76l3p3J18K9l3P1j5n0K53j13l15N1J6N75j74j96j05Q6
4969A7n5n1k01K88j95K93p4N1p5j09k2L8J38m2J13j35J47r9N4j88j01L9K63q4
4993A0R8j63R6j55K85l57J34J28k78L19l7k74K10j01J96O9j47j85K78k04L15m46
5015b09N80k71J36j89Q2k90Q6J28k30K13k17J65K55l61j16J68Q0Q4l70L43N5J50
5037B72m10L95l86k5J00k0M00k11q5K10m34L02o4j69K1L62k98j93K33K25j62L6
$$ plain form
5059 99 -229 -73 67 -8 -90 -195 -3 65 -40 -60 -159 124 51 322 -95 181 144 21 -180 -89 -108 93 -7
5082 -7 -70 -59 -39 138 -90 164 -121 31 273 -45 -415 -31 -234 -141 29 20 -128 187 -44 93 130 4 -168
5105 -168 -138 190 177 -294 -198 285 63 -83 -142 -58 -197 -212 -87 251 390 88 29 121 -46 -46 -107 53 -135 -166
5129 -166 -18 143 16 -176 -40 205 -155 -229 87 -38 14 -192 67 99 156 33 124 36 205 -144 -91 95
5151 95 165 112 -3 219 -181 -49 -42 -164 -11 272 206 -261 0 -7 79 -185 -73 34 60 2 -111 -27 518 166
5175 166 -104 14 -29 110 54 118 132 115 -102 32 193 -21 -111 440 226 88 178 -83 55 -15 -143 149 198
5198 198 21 -18 199 -83 -122 28 32 59 -246 51 109 148 56 49 -44 276 116 167 -77 -172 27 261 -48 -316
5222 -316 9 168 90 118 158 -97 4 -6 -134 211 -69 -91 -103 -177 65 23 -37 128 -102 -101 -57 123 -201 373
$$ packed form
5059I9l28J56J40p5q2j05J92O8j05k0r9K83p3K71m17K76l7j23k01R1j9K01j00
5082go3J1K0J77k28K54k85J52K42l18l70L84k03R3J70rj48L15k31J37L7j26j72
5105a68L0L28j3m71R6M83k22j46n9Q4j39j5J25L38J39l02n9R2j67%o1J60j88l1
5129a66J48J61j27j92J36K45l60p4L16j25N2k06K59L2N7j23R1q8J69l49N3J86
5151I5P0n3j15K22m00J32Pj22J53K83o6m67K61pQ6k64J12J07K6n8j13Q4N45l52
5175A66k70J18m3J39n6O4J4j7k17J34J61k14r0N51k14j38R0k61J38p0j28K92M9
5198A98j77l9K17k82l9J50MK7l05K97N8L9r2pr3L20j60N1k44r5J99K34l09k68
5222c16L25J59p8K8M0k55J01j0j28L45k80k2j2p4K42m2o0J65k30JM4J80l24N74
$$ plain form
5246 373 230 -118 135 303 -69 -176 -156 250 -222 -24 -175 227 130 207 124 61 6 -25 -378 40 -47 62 296
5269 296 -131 39 -87 112 39 -67 322 -62 103 -67 -140 -18 77 434 259 -99 -1 122 210 -122 -160 -310
5291 -310 -43 -159 -55 124 197 52 -5 131 66 369 -67 -244 107 182 -10 -14 6 -83 195 -142 -25 -48 17
5314 17 4 51 -79 -3 -115 197 -90 249 -41 -93 151 -182 347 360 49 35 223 121 -44 -161 -111 269 209
5337 209 -136 -153 58 111 -97 74 -240 -41 204 -215 3 -39 2 -97 -467 82 49 -69 20 -346 153 51
5359 51 -94 3 103 -81 2 -74 -154 6 -81 -267 -126 -89 -39 222 64 270 -92 141 35 220 -127 282 126
5382 126 -36 130 -242 20 -131 74 141 58 30 29 -20 225 78 166 113 -16 280 4 -16 76 2 159 280 -145
5406 -145 14 83 291 473 -265 -143 3 58 -360 158 31 71 183 -121 -21 179 -30 142 -18 43 118 28
$$ packed form
5246C73j43l48K53J68l72j07K0M06m72J98j51M02r7P7q3o3n5l1l53M18q7J09K34
5269B96m27J70j26J99p3j06L89l84J65j70p3J22R5L57j75l58R8J23Q8l32l8j50
5291c10K67j16J04J79P3j45n7J36o5L03m36j77L51P5j92mK0q9K78l37J17k3O5
5314A7j3M7j30P6j12L12k87L39k90n2K44l33N29J3l11j4J88j02j65j17N0L80o0
5337B09l45j7K11N3k08J71l14J99K45m19K18m2M1r9l70N49l3j18Q9l66M99j02
5359E1j45R7J00j84Q3p6q0J60q7j86J41L7N0K61j58K06l62K33j06J85l47M09j56
5382A26j62J66l72K62j51K05O7q3k8jm9K45j47Q8n3j29K96k76k0R2p4J57J21m25
5406a45J59O9K08J82p38J22J46N5m18N18j27M0J12l04J00K00k09J72j60O1P5r0
$$ plain form
5428 28 -187 -187 386 110 -66 38 274 -85 32 17 414 -101 -313 20 -79 -125 175 -326 156 -251 32 -81
5450 -81 -28 54 375 -15 -275 99 -27 -130 176 -11 6 82 5 110 -150 -60 182 -5 429 -103 -234 114
5472 114 241 -104 242 -39 -349 -230 -40 9 -43 194 -183 -77 161 44 44 -65 440 217 -159 17 103 413
5494 413 118 -21 292 -94 138 185 155 -26 104 -151 46 14 43 -211 177 -35 118 104 -232 -84 111 -86
5516 -86 -464 -192 -285 257 50 -271 -158 -323 200 -15 53 107 254 75 69 -66 39 47 -206 -214 -12 -151 -269
5539 -269 -321 29 -91 155 -307 -57 162 41 88 -75 -297 -92 -59 -33 178 -181 -112 -72 180 -26 451 -34
5561 -34 -138 164 3 -94 -107 -364 68 -138 -45 80 -12 256 145 12 92 -145 -178 -104 -115 115 50 -13 -18 18 169
5586 169 -31 -157 166 -239 -37 75 117 9 -110 -58 58 44 -60 11 240 -61 121 -205 57 -3 -262 210
$$ packed form
5428B8k15%N73k76j76J04K36l59J17j5L97n15k12L33r9m6L00n01M82m07K83j13
5450h1N3Q2L21l90k60L74j26j03L06j87J7P6p7J05k60R0K42j87M34n32j31L48
5472A14J27l45L46k81l10J19J90M9n2K37l77J06K38j17%j09N05k23l76J76Q6L10
5494D13k95j39L13l86K32M7l0j81J30k55J97l2K9k54L88k12J53j4l36J48J95j97
5516h6l78K72r3N42k07l21J13j65N23k15O8N4J47j79oj35J05Qk53qK02j39j18
5539b69n2L50j20K46m62K50K19j21M7j63k22K05L3K6K11l59O9M0K52k06M77m85
5561c4j04L02j61r7j3k57M32k06R3J25r2K68j11j33Q0k37l3P4j1K30o5o3nL6J51
5586A69k00j26L23m05K02J12M2j08j19N2J16j4j04P1K29l01J82l26K62o0k59M72
$$ plain form
5608 210 213 -44 155 112 -273 135 83 -46 110 -50 -22 -445 -75 -376 -110 161 -79 -192 -99 52 -4 -222
5630 -222 -120 26 -93 -147 177 -34 -152 -20 46 246 -45 21 33 -141 202 -202 -19 -75 72 88 -440 93
5652 93 247 420 -214 -116 135 2 94 -44 91 51 262 -115 62 -232 311 85 -176 -1 55 173 -76 -53
5674 -53 169 62 -88 30 -146 -104 -134 114 -22 -73 198 174 110 -318 -7 14 352 -88 -149 315 160 61 145
5697 145 -298 -103 40 -53 -1 216 -107 68 14 268 -120 112 -53 3 102 -343 -277 152 44 157 181 -323
5719 -323 75 70 148 95 169 23 106 -43 385 169 103 -164 166 -7 155 168 96 -17 185 202 -128 -63 183 -11
5743 -11 -254 -59 -133 75 111 183 -139 -22 52 -101 288 19 42 -3 72 -30 187 5 -314 -92 55 86 -23
5766 -23 -39 -227 -12 222 83 105 -40 100 93 143 39 -211 -4 318 114 -66 -31 85 24 -91 -216 -50 -43
$$ packed form
5608B10Lk57J99m3l85M08n2j29J56j60K8m23L70l01K66K71k40j13R3J51n6k18
5630b22J02J46j19n4L24k11j18J32O6K00k91O6J2j74L43m04J83n6J47J6n28N33
5652I3J54J73o34R8K51j33R2j38J35m0K11l77J77k94N43k26k61J75N6J18k49K3
5674e3K22j07j50J18j76M2l0K48j36n1K71k4o4m28L11K1L38m40o1M64j55r9Q4
5697A45m43J95J43r3N2K17l23J75n4K54l88K32j65N6R9m45O6M29j08J13K4n04
5719c23L98nP8n3P4j46Q3j49M28k16o6k67L30j73J62J3p2j13K02J7l30O5K46j94
5743a1k43J95p4K08L6P2l22J17P4j53L89k69K3m5P5j02K17j82l19K22J47L1j09
5766b3j6j88K15K34j39K2j45J40pN0j04k50K07L22k04j80L5J16o1j15j25J66P
$$ plain form
5789 -43 -44 -63 135 194 285 -467 -218 -26 -18 -151 -119 104 -78 49 -125 122 -299 -38 301 -235 48 201 151
5812 151 -121 -348 358 311 -134 -171 124 -28 19 15 66 -113 5 -107 -101 -117 134 149 167 8 207 -30 157 -98
5836 -98 170 -17 23 -150 -99 156 -102 94 116 88 -137 -128 -191 314 -11 151 161 -281 -198 36 -62 -376 -62 -152
5860 -152 85 -49 334 -56 -63 -40 -52 -109 47 249 -144 -40 189 228 -379 229 -174 62 168 79 -37 28 -81
5883 -81 -15 -114 -12 -207 -57 -40 -133 105 63 54 144 24 22 158 -47 -75 30 181 -20 -94 -196 91 158 126 269
5908 269 157 161 206 -182 46 109 34 -57 -120 -239 -135 224 -121 61 315 -277 -149 -51 224 -8 30 -101 96
5931 96 -56 -9 -48 -302 -219 -136 -80 -203 75 -278 95 -60 -196 -242 77 66 -90 409 164 94 -61 -69 -185 -241
5955 -241 199 52 -65 26 -46 -4 -93 207 122 -125 -171 212 194 136 -174 -211 277 -17 27 37 26 213 240 -27
$$ packed form
5789d3jj9J98N9R1p52K49J92Qj33L2K23j82J27j74K47m21K61L39n36K83J53n0
5812A51k72k27P06m7m45l7K95j52M7mN1j79J18j12Oj6K51J5J8j59J99k37J87k55
5836i8K68j87M0j73N1K55k58J96K2k8k25Ro3N05l25J62J0m42Q3K34r8l14L14r0
5860a52K37j34L83l90pK3j2n7J56K02l93J04K29L9o07O08m03K36J06q9j16O5j09
5883h1O6r9J02j95J50J7r3K38m2rR0j20kJ36k05k8J05J51k01p4j02K87O7l2J43
5908B69j12MM5l88K28O3p5r1o3j19J04L59l45J82K54n92J28R8K75k32L8j31J97
5931I6j52M7l9k54Q3Q3N6j23K78l53L73j55j36m6L19j1j56M99k45p0j55qj16n6
5955b41M40j47j17R1p2M2q9L00q5k47m6L83j8n8l10l7M88k94M4J0j1J87K7k67
$$ plain form
5979 -27 247 -65 -241 -91 -32 152 143 130 -202 192 -113 49 258 -212 132 25 -66 -249 -84 107 -178 82
6001 82 289 -81 -243 35 146 17 236 -112 -105 143 -89 94 -182 -27 109 -24 196 257 101 -125 -44 -147
6023 -147 -59 -21 -153 57 99 -37 191 -135 -60 179 -34 139 158 260 -269 -31 22 172 -271 -209 117 74 -110
6046 -110 3 121 -94 -265 -94 -73 -171 111 33 -9 150 -141 -339 152 -6 -210 -104 163 233 -44 166 101
6068 101 1 -128 -291 270 32 42 58 -36 0 59 21 21 52 -98 59 137 -55 296 -56 -88 -86 -22 223 145 -99
6093 -99 -26 -169 -144 -310 14 245 12 -3 25 85 -39 -119 -247 330 -57 -426 -97 91 -8 0 187 102 -99 21
6117 21 -181 -96 68 231 14 -57 -103 77 -3 -158 217 147 174 143 50 -72 -243 117 -123 -4 -188 144 -7
6140 -7 224 -65 17 35 -199 -207 -146 106 4 11 30 16 69 -93 81 -129 -388 -216 220 -145 -114 -94 14 183 -279
$$ packed form
5979b7K74l12j76J50N9J84rj3l32L94l05J62K09m70L44j07r1j83J65J91k85K60
6001H2K07l70j62K78J11j29K19l48PK48k32J83k76J55J36j33K20O1j56k26Q1j03
6023a47Q8L8j32K10M2j36K28l26P5K39k13J73J9J02n29K38N3J50m43O2L26m3j84
6046a10J13J18k15j71J71K1r8K82p8m2J59k91j98M91j58k04J06K67P0k77K10o5
6068A01j00j29j63N61k38J0J6r4L6N9l8%L1j50J57P8j92L51l52l2KO4K45p8k44
6093i9P3j43K5j66L24K31k33j5K8O0j24q0j28N77l87l69L29J88r9QJ87q5k01J20
6117B1k02Q5J64J63k17p1m6J80q0j55L75p0K7l1r3j22j71L60k40J19j84L32j51
6140gK31k89Q2J8k34qO1K52j02PJ9j4N3j62J74k10k59J72M36l65L1K0J08J69m62
$$ plain form
6165 -279 -194 -332 41 -14 89 58 -46 -57 99 33 -132 -33 97 109 -137 124 -76 -60 271 86 79 104 -228 51
6189 51 43 -100 80 -28 -44 18 -160 -112 -96 214 -89 -19 -14 355 199 166 -29 141 -142 236 78 -112 -62 110
6213 110 47 14 -79 -60 10 151 -204 4 -42 118 200 -14 -281 47 334 -206 -71 -95 -70 343 -27 -88 61
6236 61 -14 125 -26 65 -130 30 -168 -157 163 231 -98 -47 -179 -62 117 134 122 -260 113 182 71 54 -175
6259 -175 222 58 -329 129 204 181 111 136 -56 -113 6 215 -105 -12 -262 181 -128 -77 23 191 -66 75
6281 75 37 -179 -146 -343 -46 -225 -235 54 21 51 36 -75 31 158 -23 94 -150 113 -314 -160 123 275
6303 275 122 -174 55 51 159 184 21 39 261 23 -80 26 169 261 121 92 84 0 -147 -26 -161 8 -207
6326 -207 32 -239 -35 202 -51 100 58 232 -88 -204 110 -96 -61 56 67 -86 184 103 -19 -49 -241 -301
$$ packed form
6165b79Q5j38L73n5J03l1j04j1J56o6j65R9J30J2k46K61k00J6L31j85pK5l32K79
6189E1qj43J80j08j6O2j78M8J6L10l03P0NL69j56l3j95J70k83L78j58j90N0J72
6213A10o3l3r3J9P0J41l55K08m6J60Q2k14k67L28K87n40J35k4K5M13l70o1J49
6236F1p5J39j51R1j95J60j98J1L20O8l29N1j32J17J79J7j2l82L73O9j11j7k29
6259a75L97j64l87M58P5k3p0K5j92n7J19K09l20R3k50M43l09N1J00J68k57J41
6281G5l8k16L3j97K97j79j0K89l3L0j5j11J06J27j81J17k44K63m27J54K83J52
6303B75j53k96K29mJ08K5j63J8K22k38j03J06J43R2j40k9qq4j47J21j35J69k15
6326b07K39k71K04K37k53J51m2J74l20j16L14k06L5J17J1j53K70q1j22l0j92o0
$$ plain form
6348 -301 -95 -78 -71 -93 -97 -77 124 -9 -89 -127 50 37 257 -13 -170 327 -97 -19 -338 -79 67 -85 -17 66
6372 66 -197 64 -46 78 -182 -149 153 -5 237 8 7 81 74 -40 14 -85 -45 -110 -195 113 -62 -54 -54 -218 -119 -79
6398 -79 -267 -72 151 -160 -230 97 4 172 -168 -81 -195 97 111 17 103 -265 73 92 74 204 64 -205 113
6421 113 16 86 78 265 32 -40 -25 -194 -108 294 81 221 -155 -211 126 -357 113 -28 -273 118 38 -281 -155
6444 -155 -225 158 45 -59 -141 -15 -22 -109 -25 77 200 -28 -44 -18 -167 -71 -61 57 12 76 -117 110 1 -177
6468 -177 61 -67 70 260 -5 -69 -7 7 132 -112 -137 -168 -64 177 182 162 78 -287 101 142 93 148 218 -93
6492 -93 -243 44 -35 417 -22 18 10 44 -28 115 -83 172 165 -217 191 164 163 13 93 292 -47 -60 89 3 29
6517 29 -162 32 -6 203 44 2 -158 39 50 68 -1 20 17 14 -102 35 -99 134 -138 123 -15 -36 -256 -88
$$ packed form
6348c01K06J7Pk2mK0K01j33q0l8J77j3K20k70j57M97m24P8l19K59J46j52O8Q3
6372F6k63K61j10J24k60L3L02j58K42k29jP4pj14N4r9M0o5q5L08j75Q%j64R9M0
6398g9j88J95K23l11p0L27r3J68l40Q7j14K92J4r4Q6l68L38J9j8J30j40k69L18
6421A13r7P0qJ87k33p2J5j69Q6M02k13J40l76n6L37m83M70j41k45L91q0l19J26
6444a55p0L83j13j04q2J26pq7Q4J02J23k28j6K6j49R6J0J18m5O4j93K27j09j78
6468a77K38j28J37J90k65o4O2J4J25k44k5l1J04K41Nk0q4l65L88M1m9N5P0l11
6492i3j50K87p9M52m39M0qL4p2J43j98K55pl82M08k7jj50Q0J99l39j3J49q6K6
6517B9j91J94l8K09j59m2j60J97J1J8o9K1llj16J37j34K33k72K61j38k1k20J68
$$ plain form
6541 -88 -107 109 50 -66 185 -387 -100 -141 -4 57 160 -398 -30 97 -6 214 -126 226 -136 -4 340 106
6563 106 -67 -179 26 93 -36 31 68 129 7 62 16 -180 -254 -172 -45 -9 -143 -196 156 82 -136 -150 -64 -177
6587 -177 -41 99 71 69 -89 -52 -37 -65 -32 70 -80 143 235 -67 -141 -231 0 100 104 -195 -60 40 -246 74
6611 74 141 15 120 -88 -106 184 -176 -213 93 83 -199 9 -19 298 29 200 140 -74 40 -96 89 54 -29
6634 -29 -141 126 114 39 43 -72 -202 176 185 -110 -141 -71 -86 158 66 -23 2 111 11 -46 -226 -184 204 253 113
6659 113 -47 55 155 -146 -75 197 41 63 18 91 -108 -201 14 -108 -214 -2 -74 2 128 126 -286 -34 135
6682 135 176 -93 247 171 123 193 211 176 -40 -181 -168 30 194 -161 -308 -2 -1 87 87 110 38 8 55 269 110
6707 110 429 -64 -74 52 -133 -265 -443 411 -76 101 260 -119 26 -142 127 -144 -63 133 -136 -68 51
$$ packed form
6541h8j9K16n9j16K51n72K87m1J37O1J03n58L68J27j03K20l40L52l62J32L44k34
6563A06j73j12K05O7j29O7L7O1j22N5m6j96p4Q2J27L6j34n3L52p4k18j4Q6j13
6587a77J36J40k8kj58L7J5k8L3J02j50K23R2l02p4r0K31J00Mk99J35J00k86L20
6611G4O7j26J05k08j8K90l60l7L06j0k82K08k8L17k69J71o0k14J14j36J85l5q3
6634b9j12K67j2p5Mj15j30L78Rk95l1P0j5K44r2q9K5J09j00n7j80M2L88M9j40
6659A13j60J02J00l01P1K72j56K2m5P3j99r3K15j22j06K12p2P6J26km12K52J69
6682A35M1k69L40p6m8P0J8l5k16j41J3J98J64l55j47L06JQ8%K3p2l0M7K14j59
6707A10L19m93j0J26j85j32j78Q54m87J77J59l79J45j68K69k71Q1J96k69O8J19
$$ plain form
6728 51 206 96 49 140 -187 -11 126 -93 -54 143 -25 32 330 11 146 -88 12 -69 -72 60 -14 24 -145
6751 -145 -3 -211 99 186 229 -159 143 -189 122 327 68 -127 -337 -283 62 -176 14 -113 -111 46 23 -33
6773 -33 222 4 66 19 -108 131 -178 -66 58 -2 -177 101 21 -116 83 86 104 -16 230 -91 166 -37 223
6796 223 -115 118 153 470 -222 63 190 222 -147 -73 95 8 301 -110 63 -184 29 -46 -120 -72 -196 -57
6818 -57 46 -33 37 50 123 18 -61 143 -107 75 -42 -1 313 -8 10 187 -150 258 -105 107 -55 136 -61
6841 -61 -58 -133 -168 2 20 94 -122 62 50 25 103 23 -241 365 267 51 190 -289 -59 -81 203 -258 -175 -27 -142
6866 -142 45 212 164 16 -135 -186 25 132 -7 33 -11 109 -349 203 -163 11 78 -50 -80 135 48 -77
6888 -77 159 148 138 172 -65 46 -63 -288 135 -83 222 171 173 -134 180 94 134 -152 -118 34 28 -77 50 -106
$$ packed form
6728E1J55j10m7R1l27J76J37k19L9J97j68N7K98l19J35k34J00q1lJ32p4L8j69
6751a45J42k08L10Q7M3l88L02l32L11K05k59j95k10N4L45k38J90j27KJ57k3n6
6773c3K55k18O2m7j27K39l09J12J24o0j75K78q0j37J99LJ8j20K46l21K57k03K60
6796B23l38K33L5L17o92K85J27L2l69P4J68q7K93m11J73k47K13p5p4M8j24J39
6818e7J03p9P0J3P3j05p9K04k50J82j17M1L14l21J8J77l37M08l63K12j62J91j97
6841f1Lp5l5J70J8P4k16J84j2k5P8q0k64O06r8k16J39m79K30k2K84m61Q3J48j15
6866a42J87J67m8j48j51n1K11J07j39M0m4J20m58N52l66J74O7j28l0K15q7j25
6888g7K36j1j0L4k37J11j09k25M23k18L05n1Kl07L14q6M0k86L4J52oj05J27j56
$$ plain form
6912 -106 282 12 -45 116 15 310 -57 184 -188 397 -168 58 -86 -124 -248 -154 -36 -82 258 262 -95 -65
6934 -65 -35 -121 14 175 -12 -250 85 157 168 245 92 35 85 76 226 2 61 67 34 93 -102 84 194 -94 17
6959 17 -79 -134 30 -203 -42 160 460 28 41 -127 11 -36 -102 -54 144 -29 -58 -124 151 105 3 -138 -15
6982 -15 -221 372 -58 -9 -24 109 45 -123 -112 -49 -17 -124 -58 191 -160 22 153 40 -74 75 73 -158 130
7005 130 -103 170 67 -69 -41 184 -240 -180 80 -10 -61 75 -80 -122 186 244 30 -52 212 -85 0 -68 45
7028 45 182 18 -152 18 141 -191 253 23 199 176 -68 -5 -119 145 237 76 -157 203 50 121 -139 129
7050 129 37 -13 -270 166 -69 75 94 95 -20 58 -32 340 34 -86 -226 173 36 14 192 141 -172 -253 190
7073 190 162 -30 56 126 -60 -41 227 -14 -223 237 61 -181 -145 203 -25 -64 -79 196 22 72 9 109 -199
$$ packed form
6912a06L88k70n7J61j01K95l67K41l72N85n65K26j44l8j24R4J18m6L40Ml57L0
6934f5L0q6J35J61j87k38L35P2J1P7j53n7N0rJ50k24N9Ol3N9j95J86J10k88J11
6959A7r6n5J64k33J61K02L00m32J3j68J38m7o6M8J98j73k9o6K75m6j02j41J23
6982a5k06N93m30M9j5J33o4j68J1O3L2j07O6K49l51J82J31j13j14J49kk31K88
7005A30k33K73j03j36K8K25m24O0K60r0n1J36j55m2L08N8k14q2K64k97Q5o8J13
7028D5J37j64j70J70J23l32M44k30J76k3k44O3j14K64R2j61k33L60j53P1k60K68
7050A29r2n0k57M36k35J44J9Jj15P8r0L72l06j20j40L99j37k2J78n1l13q1M43
7073A90k8j92Q6P0j86J9K68k41k09M60j76k42L6L48k28l9j5K75j74N0o3J00l08
$$ plain form
7096 -199 -17 -54 184 167 -170 -191 -112 89 -181 -184 142 197 27 -67 42 440 -156 140 64 207 -155 -137 -208 -170
7120 -170 -123 -88 -179 -103 -263 -69 121 -231 144 -247 -217 86 -81 287 -3 -145 -211 132 -75 274 15 -22
7142 -22 -88 242 35 -64 68 168 426 125 -1 191 269 -96 66 368 -128 177 214 -219 46 36 93 19 -145
7165 -145 138 136 138 -116 -3 -116 -242 -93 284 130 101 52 -213 -84 406 80 -254 -35 3 292 -473 -35
7187 -35 106 167 -249 -146 5 108 228 -109 -2 -126 -198 219 169 370 80 -195 185 -34 -223 -95 -203
7208 -203 4 -110 42 32 -160 -154 44 35 -153 -209 -117 -82 106 -24 44 -50 -136 9 -21 242 194 -40 113 130 160
7233 160 118 -130 -75 -264 197 26 0 71 -12 58 259 -73 -234 181 -131 162 -221 3 -38 -39 19 61 -185 38
7257 38 -36 -42 -12 36 -35 -137 72 -27 -202 -3 125 -346 270 -157 344 179 464 143 204 54 86 -342 147
$$ packed form
7096a99J82l7K38j7l37k1P9K01k70lL26N5j70r4J09L98n96K96p6J43l62J8p1L8
7120a70M7L5r1P6j60J94J90l52L75l91L0L03j67L68k90j42o6L43k07L49k59l7
7142b2o6L30k07r9J32J00K58l01j26J92P8l65J62L02m96L05L7m33K65j0N7p4j64
7165a45K83kKk54J13j13j26J49L77j54k9m9k65J29M90l26l34K19L8K89p65M38
7187c5J41O1m16J03J51J03J20l37J07j24p2M17n0K01k90k75L80k19j89J28j08
7208b03K07j14J52j0j92OJ98rj88n6R2L5J88j30O8r4q6J45l0K63m8k34J53J7L0
7233A60m2k48N5j89M61j71k6P1q3P0K01l32j61M15l12K93l83K24m1jN8M2k46K23
7257C8p4oL0M8p1j02K09r9j75J99J28m71O16m27N01j65K85l21O1j50L2m28M89
$$ plain form
7280 147 -5 -40 122 129 98 -13 -104 -168 380 -20 -124 -38 117 -180 -210 133 -212 119 -108 162 -57 66 244
7303 244 130 206 -134 -124 62 -80 -38 216 103 -216 -244 61 121 -33 -26 65 57 20 55 273 129 -195 -103 85
7327 85 -70 112 147 154 161 -58 -109 -144 112 156 71 -125 -18 133 7 193 -3 298 101 -134 -159 221 81 -208
7351 -208 -28 -44 92 -117 128 -219 80 -30 232 -96 -183 66 -100 -6 -142 90 173 -55 42 135 88 -50
7373 -50 64 -89 -146 250 166 -235 -153 -9 -92 -111 126 -57 69 240 14 -201 -36 -9 348 -219 -26 -114 -270
7396 -270 170 94 -7 56 199 160 -49 70 41 6 66 -287 -366 -44 -107 -11 138 -118 -1 -137 12 47 -142
7419 -142 52 23 157 34 -228 47 128 159 145 -209 -265 -79 -44 135 -10 -83 -93 -168 262 -131 -328 110 103 -42
7443 -42 -23 -123 -23 -409 -18 23 -77 -140 -23 -127 -76 -87 -211 -122 368 -219 -53 -39 -18 174 -72 170 75
$$ packed form
7280A47j52l5J62Pl1j11r1o4N48m00j04Q6J55k97l0L43l45L31k27K70k19J23J78
7303B44j14P6l40J0J86j42M2K54j13l19k8L05O0j54PR1ql7L5K18j44l24R2J88
7327H5j55J82L5PPk19n1l5K56M4q5j96J07J51j26J86j96L01j97k35k5L80j40k89
7351b08J80j6J36k09K45l47K99j10K62l28q7K49j66R4j36K32Q3k28R7R3m7j38
7373e0J14j53n7L96q4m01Q2J44q3j9K37j83J26J71k26k15J65K7L57n67J93q8j56
7396b70M40p6j01O3J43l9k09J19k9l5O0l53p9L22o3R6J49k56J17j36J49L5j89
7419a42J94k9J34j23k62K75Q1L1j4l54n6J86L5J79j45p3j0p5M30l93j97M38pj45
7443d2J9j00J00l86L91M1j00o3J17j04N1j1j24Q9M90n87J66J4K1J92k46K42r5
$$ plain form
7466 75 202 -111 -113 320 111 233 141 -26 -5 14 -101 -419 -160 139 148 20 -184 208 191 57 -6 276 13
7489 13 -19 -9 132 -85 -107 79 -179 -219 -59 176 184 271 158 59 121 127 58 47 7 28 -211 -234 36 -144 154 323
7515 323 -217 359 -53 74 49 54 4 -40 1 197 39 27 -250 -259 -17 -71 137 125 -33 105 -227 -149 146 -201
7539 -201 -45 130 -133 -141 -372 -144 -27 -205 80 -80 -157 -2 6 -97 39 -44 78 -68 349 15 192 15
7561 15 -192 83 -120 78 19 -54 67 177 -95 130 -14 -1 -104 -123 -97 145 72 457 53 -182 -5 27 247
7584 247 164 -109 335 265 95 231 -189 -177 -121 297 81 -200 13 20 4 348 -98 21 -191 149 -31 -118 -148
7607 -148 -215 254 54 -153 109 105 82 -99 20 5 221 -91 -94 -162 -409 480 103 -41 -31 120 93 21 -86 176
7631 176 21 -99 -41 142 -34 275 -185 120 272 346 110 31 331 7 -39 65 43 134 -50 -130 224 -88
$$ packed form
7466G5J27l13kM33k09J22r2j67K1J9j15l18K59K99Rj28k04L92j7j34o3K82k63
7489A3l2J0J41k17k2J86k58m0J60K35QQ7j13r9O2Oo9j1m0K1k39k3K70j80K98J69
7515C23n40N76m12J27k5Nn0m4M1J96j58j2k77rK42n4K08j2j58J38l32P8K95l47
7539b01J56J75k63qk31K28J17j78K85j60p7J55Qj03J36q3J22j46M17l34J77j77
7561A5k07K75k03J98n9p3J21J10k72K25j44J3j03j9K6K42p3L85m04k35J77L2K20
7584B47q3k73M44p0j70J36m20J2N6M18k16k81K13Pj6L44m46J19k12L40j80q7l0
7607a48o7M69k00k07K62mk3j81J19j5K16l12lo8k47Q89l77j44J0J51k7p2j07K62
7631A76j55j20N8J83j76L09m60L05J52P4k36p9L00l24m6J04k2R1j84q0L54l12
$$ plain form
7653 -88 36 -195 11 -81 55 146 -130 189 5 163 152 159 -93 80 -35 -6 36 100 -48 -196 79 -269 119
7676 119 603 -93 0 77 -19 -157 51 173 176 -7 -29 -118 -116 210 30 -84 -87 -31 23 -189 -117 124 17 16 61 20
7702 20 49 -87 -52 139 324 543 105 267 -61 -3 -164 -229 271 274 -36 -183 -17 -128 -48 202 7 94 90 -52
7726 -52 94 124 -71 -64 169 -191 70 257 77 347 32 137 -17 99 156 79 50 -118 -93 -84 47 -20 129 -90
7750 -90 149 45 121 -62 -63 -156 77 110 63 67 -285 143 16 80 198 2 50 15 15 169 88 -135 -23 -180 258
7775 258 -120 -163 -177 -164 306 -2 23 161 161 203 153 -1 -447 210 -2 101 92 126 72 -69 -157 -226 -102 84 133
7800 133 -231 -223 128 68 8 -20 41 51 30 108 33 -80 -152 -122 -29 -7 -352 110 66 62 129 97 241 -5 -64 -137 107
7827 107 151 7 241 -18 -44 127 8 -34 -201 -58 -207 194 83 -325 -205 -63 -107 -45 -23 438 259 -58
$$ packed form
7653h8J24k31K06r2J36R1k76L19j84J58j1Pk52J73j15K9M2O4j48j48K75l48L88
7676A19M84o96R3P7r6j38K08J22Lj83k2q9KL26j80j14lN6N4k12P2K41j07jM5m1
7702B0K9j36L5J91J85K19m38J62l28N8j61o5N00Ll10j47J66j11Q0K50j95Q7mj42
7726e2J46L0j95PK33l60K61J87j80K70l15J05j54J16N7p7k9j68K5RJ31o7J49k19
7750i0K39j04P6j83jr3K33L3m7Ml52M28j27O4J18j96M8l5%J54q1k23J12j57M38
7775B58l78m3j4J3M70l08K5J38%M2n0j54m46O57k12J03rL4n4j41q8o9J24J86M9
7800A33l64QL51o0o0k8O1J0k1P8p5j13p2L0R3K2l45M62m4mO7l2J44k46n9p3K44
7827A07M4j44K34k59k6J71j19m2j67J43j49M01j11m08J20J42m4O2K2M61j79l17
$$ plain form
7849 -58 -123 4 113 -59 25 233 -37 -69 -333 53 -42 80 164 63 -16 1 50 9 213 52 68 98 47 -134
7873 -134 44 141 -109 195 269 -165 -7 98 185 107 -294 78 -26 75 -2 -72 46 115 0 64 54 -7 -105 67
7897 67 -95 -132 46 -140 -152 237 -178 -62 40 -227 2 -148 24 -60 -130 334 92 82 -310 36 -12 116
7919 116 160 -80 40 42 9 -89 -167 0 -50 -280 163 -110 267 157 -62 -115 54 -100 1 -233 -129 -31 -32 -174
7943 -174 -80 -42 94 183 -43 -38 114 119 64 -162 3 -30 -199 -123 -60 53 75 70 65 -162 151 -136 -226 -67 -89 24
7969 24 -128 -20 -31 -12 -80 25 -268 216 43 -44 102 -84 181 95 -30 -149 192 -53 -182 229 18 134
7991 134 198 -335 166 179 44 31 -165 17 274 -321 -115 191 105 207 -6 -363 -82 206 221 177 134 -129
8013 -129 429 -35 153 241 70 -115 -19 137 12 -70 -68 -121 -12 192 -88 20 98 88 229 91 -219 208 27
$$ packed form
7849e8o5J27J09j72Q4K08k70l2k64L86r5J22Q4j01p9J7M9m1K04j61J6L0n1j81
7873a34J78R7k50L04P4m34J58J05Q7p8m01L72j04J01p7p0J18O9j15O4j0o1r8J72
7897F7j62l7J78j86j2L89m15J16J02k67K29j50J72q4p0M64k42j0l92L46m8J28
7919A16M4k40J20Kl3r8p8J67n0k30M43k73L77j10k19n3J69j54J01k34J04R8jj42
7943a74R4L8J36Q9k26NJ52Nn5k26J65l3j69P6O3J13K2nnk27L13k87r0J59k2J13
7969B4j52J08j1J9o8J05k93M84j73q7J46j86K65q6j25j19L41k45j29M11k11J16
7991A34O4n33N01J3j35j3j96J82K57n95K06L06q6J02k13l57K81K88J5m4m3k63
8013a29N58m64J88Q8j71j85R6J56j25q2Kn3J09K04k80J08P8j0J41j38l10M27j81
$$ plain form
8036 27 -158 41 -192 215 14 -354 47 9 68 41 -59 -112 81 -129 51 -164 173 131 285 44 -23 187
8058 187 78 -103 -44 207 -240 -168 189 51 -74 91 286 -14 -73 -110 73 -79 195 -72 -289 136 -203
8079 -203 49 38 122 188 -157 73 59 -111 308 71 -76 -41 -224 -63 51 -66 -355 -138 203 -128 73 242
8101 242 80 241 144 89 -164 162 204 -18 111 148 -150 -40 -97 -41 4 -49 201 -140 81 64 260 -142 -90
8124 -90 235 448 34 46 -49 101 -18 -93 -28 -208 -11 -92 75 1 -54 -357 -45 -234 230 -23 -361 -124 64
8147 64 281 173 -165 246 335 0 -251 -42 217 -50 167 45 -76 3 18 -214 166 -47 125 191 -87 -9
8169 -9 50 30 168 -30 65 50 34 -361 177 -144 -172 19 174 13 147 94 33 -34 49 -99 239 55
$$ packed form
8036B7j85J99k33M07k01l68M01l8N9k7j00n3J93k10J80k15L37m2J54k41o7K10
8058A87j09j81N9K51m47P2L57j38j25J65J95l00n9l7J83j52K74k67k17M25l39
8079b03K52j1Q4O6l45K30j4j70M19k37j47L5j83J61J14j17k89K17L41l31K01J69
8101B42j62J61r7n5k53L26M2k22J29L7k98J10n7N6M5n3K50l41K21j7J96m02N2
8124i0L25K13m14J2r5J50j19p5O5j80J97q1J67p4n5l03L12j89M64k53l38K37J88
8147F4K17j08l38M11Q9l35k51K09K59k67K17j22j21P9J5k32L80k13J72O6k78P8
8169iN9k0J38j98R5j5j6l95N38l21k8J91J55j61J34n3o1o7Q3j48L38j84
8191E5
$$ Imaginary data points
##PAGE= N=2
##DATA TABLE= (X++(I..I)), XYDATA
$$ plain form
0 0 0 0 0 0 0 0 0 -8 8 -8 8 -16 16 -24 24 -32 40 -48 56 -64 73 -88 102 -119 135 -152 175 -199 224 -254
30 -254 286 -320 360 -400 448 -500 556 -616 684 -758 838 -929 1028 -1141 1263 -1400 1559
47 1559 -1736 1941 -2180 2462 -2803 3222 -3753 4453 -5418 6839 -9151 13551 -24894 114712
61 114712 200127 -117741 -144571 73403 157238 -26000 -72391 69971 95943 -77208 -94199
72 -94199 86169 130295 -61788 -128980 31877 105321 -46340 -110457 35455 97583 -66960
83 -66960 -145321 18778 128875 -17686 -145012 -33650 90915 7931 -87497 -4907 71107
94 71107 -31273 -104369 26859 129703 -5745 -140532 -22601 136961 51413 -107541 -41603
105 -41603 112327 54615 -101217 -51034 114848 87150 -80047 -81725 64704 79846 -39575
$$ packed form
0@%%%%%%%qJ6j6J6k4L2m0M8n6P2q8J04j20J37j61J90k21K54k87L27l74M23m78
30b54N40o06O80p60Q48r48J056j172J300j442J596j767J957k169K404k663K959
47A559l295L677m121M642n265O025o975Q206r871J2257j5990K2702l8445J39606
61A14712Q5415l17868k6830K17974Q3835j83238m6391J42362K5972j73151j6991
72i4199J80368M4126j92083o7192J60857P3444j51661o4117J45912O2128j64543
83f6960p8361J64099J10097j46561j27326J11362J24565q2984r5428Q2590P6014
94G1107j02380p3096J31228J02844j35448j34787J17931J59562q5548j58954O5938
105d1603J53930n7712j55832N0183J65882k7698j67197j678J46429J5142j19421
$$ plain form
116 -39575 -44001 62366 43389 -78976 -54509 93052 88144 -73458 -101906 46301 95296
127 95296 -28883 -78477 28170 64806 -42474 -74459 41497 79026 -40940 -91511 22868
138 22868 78378 -29045 -83043 25210 76954 -42045 -101692 29223 111928 -20215 -131589
149 -131589 -15223 120079 35341 -103835 -47489 81177 42786 -67862 -29477 74103 33911
160 33911 -70176 -28941 81305 46342 -66208 -36793 78470 55670 -65831 -53891 71851
171 71851 76219 -47458 -71783 34737 65713 -23210 -49765 26754 37133 -46910 -51703 45435
183 45435 54099 -55079 -79695 31698 69364 -38907 -85633 21698 78644 -27384 -97362
194 -97362 5376 95224 8677 -90686 -24555 76662 32323 -54895 -16303 58785 15012 -55152
$$ packed form
116c9575m426J06367j8977j22365K4467J47561m908j61602k8448J48207M8995
127I5296j24179m9594J06647L6636j07280l1985J15956L7529j19966n0571J14379
138B2868N5510j07423n3998J08253N1744j18999n9647J30915Q2705j32143j11374
149a31589J16366J35302q4738j39176N6346J28666l8391j10648L8385J03580m0192
160C3911j04087M1235J10246l4963j12550K9415J15263k2800j21501J1940J25742
171G1851M368j23677k4325J06520L0976q8923k6555P6519J0379q4043m793R7138
183D5435Q664j09178k4616J11393L7666j08271m6726J07331N6946j06028o9978
194i7362J02738Q9848q6547r9363O6131J01217m4339q7218L8592P5088m3773p0164
$$ plain form
206 -55152 66 81922 24672 -75756 -31234 79774 56380 -52821 -48642 45530 45657 -38569
218 -38569 -37375 42117 36951 -46170 -46101 34402 37670 -37860 -39879 32023 25113 -54444 -42783 54699
232 54699 52897 -59041 -79846 34416 80182 -17888 -75977 4245 62689 -4790 -56239 10666
244 10666 62383 -5999 -63379 2329 68371 11283 -56369 -8489 56290 10619 -53062 -5154
256 -5154 65185 18063 -65027 -29876 60136 45682 -38395 -40967 23992 27685 -19077 -9153 33278
269 33278 5487 -49879 -15433 58600 32877 -54425 -44802 42288 44219 -37838 -45101 34947 43923
282 43923 -40499 -58138 28177 59720 -21160 -64233 2451 47535 -7832 -45164 8338 39624
294 39624 -21587 -55304 14763 63788 -3589 -67863 -13365 60568 25177 -42544 -19443 38458
$$ packed form
206e5152N5218Q1856n7250j00428M4522J11008k3394j09201M179R4172J27q4226
218c8569J194P9492n166q3121O9Q0503L268p5530k019P1902o910p9557J1661R7482
232E4699j802j11938k0805J14262M5766r8070n8089Q0222N8444o7479n1449O6905
244A0666N1717o8382n7380O5708O6042n7088o7652M7880O4779m5671o3681M7908
256e154P0339m7122q3090L5151R0012j4454q4077k572O4959L693m6762R924M2431
269C3278k7791n5366L4446P4033k5723q7302R623Q7090J931q2057p263Q0048Q976
282D3923q4422j7639Q6315L1543q0880m3073O6684M5084n5367l7332N3502L1286
294C9624o1211l3717P0067M9025o7377o4274N4498P3933l5391o7721K3101N7901
$$ plain form
306 38458 20416 -28150 -5887 40571 16572 -30661 -6178 40732 16421 -29870 -3474 43533
318 43533 11334 -45037 -13055 53949 27347 -50634 -40974 37004 40718 -31651 -44674 16486
330 16486 28356 -28525 -37609 20073 28907 -32933 -46755 18057 40295 -21539 -49849 9204
342 9204 44715 -8749 -46596 3459 48235 5973 -41212 -6640 40995 17533 -23850 -4919
354 -4919 27621 7370 -18649 8693 33000 -1992 -33053 5289 43775 5695 -42455 -9706
366 -9706 42885 15619 -40923 -21663 35414 21777 -34782 -26840 26689 22328 -29388 -25215 25978
379 25978 21933 -31749 -29966 28592 32923 -27984 -41103 18832 40591 -13190 -41318 4976 36155
392 36155 -2744 -34517 -1233 28678 1267 -25447 -1846 20417 -2617 -18817 8342 22688
$$ packed form
306C8458j8042m8566K2263M6458k3999m7233K4483M6910k4311m6291K6396M7007
318D3533l2199n6371L1982O7004k6602p7981R660P7978L714p2369j3023O1160
330A6486J1870n6881r084N7682Q834o1840j3822O4812K2238o1834k8310N9053
342I204L5511n3464l7847N0055M4776m2262m7185L4572M7635k3462m1383J8931
354d919L2540k0251k6019K7342K4307l4992l1061L8342L8486l8080m8150L2749
366i706N2591k7266n6542J9260N7077j3637n6559P942N3529m361n1716M173N1193
379B5978m045n3682J783N8558M331o0907j3119N9935K1759n3781k8128M6294L1179
392C6155l8899l1773L3284K9911k7411k6714K3601K2263k3034j6200K7159J4346
$$ plain form
404 22688 -10620 -28032 11867 38179 -2174 -36553 -1995 38914 12340 -27518 -6723 31076
416 31076 10885 -25717 -5337 33036 12889 -30233 -13771 30769 17811 -28318 -20173 25531
428 25531 18835 -29949 -27703 22877 27711 -24482 -39983 6380 29810 -5734 -30242 -4822 13692
441 13692 -5937 -15202 7553 13573 -14515 -19906 13267 24960 -7698 -21465 9870 26256 -3736
454 -3736 -19312 12961 31781 -1440 -25563 5685 34362 8084 -22294 -1642 24995 4384
466 4384 -21420 1682 28441 879 -34926 -10620 32380 15541 -32553 -27685 16695 19963 -17529
479 -17529 -24583 6210 12511 -14921 -19530 7577 13329 -11454 -17099 5477 11116 -8223 -8623 12445
493 12445 10294 -14302 -12440 19368 22821 -9674 -19574 9790 24028 -625 -13894 7687 17143
$$ packed form
404B2688l3308j7412L9899K6312m0353l4379L4558M0909k6574l9858K0795L7799
416C1076k0191l6602K0380L8373k0147m3122J6462M4540j2958m6129Q145M5704
428B5531o696m8784K246N0580M834n2193j5501M6363K3430l5544k4508K5420J8514
441A3692j9629r265K2755O020k8088n391L3173J1693l2658j3767L1335J6386k9992
454c736j5576L2273J8820l3221k4123L1248K8677k6278l0378K0652K6637k0611
466D384k5804K3102K6759k7562l5805K4306M3000j6839m8094M868M4380L268l7492
479a7529p054L0793O301k7432m609K7107N752k4783n645K2576N639j9339m00K1068
493A2445k151k4596J862L1808L453l2495r900K9364J4238k4653j3269K1581R456
$$ plain form
506 17143 -6048 -14819 12321 23900 -7060 -25379 4353 28358 1806 -26181 -4710 24682
518 24682 6318 -24502 -9479 22343 12205 -20810 -16754 13999 15208 -10414 -13910 5032 6504
531 6504 -9639 -6641 9215 2917 -16528 -9934 12736 8251 -15480 -13917 8751 8894 -12302 -12107
545 -12107 9651 9286 -12076 -11983 12589 14046 -10389 -12828 13078 17965 -8353 -14571 13405 24146
559 24146 -4181 -19548 7427 28025 4928 -19433 -2321 22314 10402 -13593 -6962 12809
571 12809 7016 -10298 -6135 7210 1214 -11977 -5552 7097 -1276 -14970 -7313 7469 272
584 272 -14925 -8373 6859 1355 -12895 -6599 8948 2957 -12770 -5032 13247 6992 -12442 -6285
598 -6285 15960 11948 -11312 -9145 16644 18731 -8360 -15628 10837 22916 -467 -16503 1093
$$ packed form
506A7143k3191q771K7140J1579l0960j8319K9732K4005k6552k7987K1471K9392
518B4682j8364l0820J5023L1822j0138l3015M056L0753J209k5622l496J8942J472
531F504j6143K998J5856o298j9445O594K2670m485k3731J563K2668J43k1196J95
545a2107K1758l65k1362R3K4572J457k4435k439K5906M887k6318o218K7976J0741
559B4146k8327j5367K6975K0598k3097k4361J7112K4635j1912k3995O631J9771
571A2809n793j7314M163J3345n996j3191O425J2649q373j3694P657J4782p197
584B72j5197O552J5232n504j4250O296J5547n991j5727P738J8279o255j9434O157
598f285K2245m012k3260K167K5789K087k7091p268K6465J2079k3383j6036J7596
$$ plain form
611 1093 17598 4138 -11323 -1213 10839 994 -10284 -886 9654 -315 -11394 -2938 7747
624 7747 -777 -10164 -1843 6669 -2716 -11327 -554 9478 -755 -11860 -2087 9485 297 -10447
638 -10447 160 11053 -1388 -14321 -348 17283 4965 -17703 -9169 15451 13241 -10970
650 -10970 -12615 8750 12417 -6628 -10853 6647 12592 -4203 -11325 2847 11847 576 -7606
663 -7606 805 6795 -603 -4431 4334 7327 -3365 -7182 3884 8803 -799 -6849 987 5034 -3298
678 -3298 -5160 4403 5041 -8359 -11534 4412 11280 -5281 -16131 -1506 11764 -551 -14462
691 -14462 -3059 12243 2296 -14605 -6315 12924 9491 -9674 -9339 7996 11190 -2426 -5060
704 -5060 6279 7948 -2515 -2994 7840 8491 -2775 -4926 5314 7334 -1852 -4113 3236 2816 -5343
$$ packed form
611A093J6505j3460j5461J0110J2052r845j1278R398J0540r969j1079Q456J0685
624G747q524r387Q321Q512r385q611J0773J0032j0233j1105R773J1572r188j0744
638a0447J0607J0893j2441j2933J3973J7631j2318k2668Q534K4620k210k4211
650a0970j645K1365L667j9045m225J7500N945j6795p122J4172R000j1271q182
663g606Q411N990p398l828Q765K993j0692l817J1066M919r602o050P836M047q332
678c298j862R563O38j3400l175J5946O868j6561j0850J4625J3270j2315j3911
691a4462J1403J5302r947j6901Q290J9239l433j9165L35J7335L194j3616k634
704e060J1339J669j0463m79J0834O51j1266k151J0240K020r186k261P349m20q159
$$ plain form
719 -5343 -3434 5124 2231 -9587 -7919 5112 4045 -9870 -9534 4833 5565 -10206 -11906 6041
733 6041 10963 -7099 -15457 1811 14509 880 -12226 -2031 11746 4475 -7562 -1070 10891
746 10891 5039 -6554 -2157 9770 6892 -4242 -2776 6147 5276 -2505 -1194 4967 2189 -4119
760 -4119 -1026 5507 1077 -6391 -1724 5382 399 -7723 -1905 6951 317 -10745 -4365 9385 4452
775 4452 -12075 -9661 8444 9324 -8031 -11729 4264 10230 -4125 -11575 1821 10321 -1781 -11051
789 -11051 12 10224 996 -9231 -1835 8401 2581 -6141 -1348 6787 2407 -4383 719 6613
803 6613 1144 -4282 1485 7245 1389 -4208 2644 8125 -664 -6611 3427 10752 -115 -10657
817 -10657 -353 12072 3070 -11751 -4984 9546 4891 -11141 -8450 7233 5809 -10587 -11416
$$ packed form
719e343J909Q558k893j1818J668J3031j067j3915L36J4367P32j5771j700J7947
733F041M922j8062q358J7268J2698j3629j3106J0195J3777p271j2037O492J1961
746A0891n852j1593M397J1927k878j1134J466Q923q71p781J311O161k778o308
760d119L093O533m430p468M667P106m983q122N818Q856o634j1062O380J3750m933
775D452j6527K414J8105Q80j7355l698J5993N966j4355p450J3396Q500j2102r270
789a1051J1063J0212r228j0227P396J0236n820q722M793Q135m380o790N102N894
803F613n469n426N767N760n856n597O852N481q789n947J0038P325j0867j0542
817a0657J0304J2425r002j4821O767J4530m655j6032K691J5683j424j6396q29
$$ plain form
830 -11416 4378 7492 -7249 -12334 485 6646 -3953 -9264 119 5882 -2215 -6976 1178 6921
844 6921 717 -4544 1970 6233 1082 -1075 5026 6390 -1187 -2259 7732 9636 -1725 -5852 4995
859 4995 10748 -855 -8419 2431 10180 -1537 -11747 -825 11354 1143 -14502 -6866 9506
872 9506 4728 -11464 -9491 5437 4945 -8629 -8379 5192 5907 -7408 -9165 3918 7972 -2977
886 -2977 -6992 1664 5732 -1568 -3011 3800 4351 -3282 -3151 5899 6051 -3526 -4337 5503 6542 -4134
902 -4134 -5120 6973 7763 -5986 -8469 6069 11440 -3472 -11565 2360 12042 -124 -11081 -441
916 -441 11225 1444 -11615 -2869 10516 4030 -10495 -6415 7756 5915 -7431 -7031 4234 4259
930 4259 -5782 -5459 3667 3165 -5453 -5228 3330 2958 -4904 -3497 3783 1906 -5802 -2482 6999 4193
$$ packed form
830a1416J5794L114j4741n085J2819O161j0599n311R383N763q097m761Q154N743
844F921o204n261O514M263n151k157O101J364p577j072R991J904j1361m127J0847
859D995N753j1603p564J0850P749j1717j0210J0922J2179j0211j5645P636J6372
872I506m778j6192J973J4928m92j3574K50J3571P15j3315j757J3083M054j0949
886b977m015Q656M068p300j443O811N51p633J31R050J52r577q11R840J039j0676
902d134r86J2093P90j3749k483J4538N371j4912q093J3925R682j2166j0957J0640
916d41J1666r781j3059Q746J3385o486j4525M080J4171j841j3346M00J1265K5
930D259j0041L23R126n02q618K25Q558l72p862J407P280j877p708L320R481k806
$$ plain form
946 4193 -7032 -4409 8389 7731 -5717 -6107 7955 10256 -4411 -7623 6944 12183 -2776 -10366
960 -10366 3543 13568 333 -11262 -736 11368 2524 -9985 -3562 7987 2445 -9754 -5285
973 -5285 6130 2455 -8678 -6206 3914 1794 -6906 -4708 3060 350 -6265 -2345 5264 827
987 827 -6820 -1831 8063 3033 -6836 -2163 9463 5741 -6750 -2905 10451 8095 -6971 -6072 9841
1002 9841 11589 -5040 -9339 5978 11891 -2900 -10208 2184 10489 -1372 -10966 -826 9007
1015 9007 195 -10808 -3534 7005 1504 -8411 -4048 4516 734 -6593 -2228 4834 162 -7039
1029 -7039 -1539 6328 1068 -6669 -809 7062 976 -7475 -546 9231 2073 -9113 -2776 10206
1043 10206 5650 -9075 -5411 9443 7705 -7436 -7219 8120 9492 -5987 -9334 5585 11528
$$ packed form
946D193j1225K623J2798o58j3448l90J4062K301j4667l212J4567N239j4959p590
960a0366J3909J0025j3235j1595J0526J2104q844j2509O423J1549n542j2199M469
973e285J1415l675j1133K472J0120k120q700K198P768k710o615L920P609m437
987H27p647M989R894n030r869M673J1626l722j2491L845J3356k356j5066Q99J5913
1002I841J748j6629m299J5317N913j4791p308J2392Q305j1861r594J0140R833
1015I007q812j1003P274J0539n501r915M363Q564l782p327M365P062m672p201
1029g039N500P867n260p737N860P871o086q451O929R777p158j1186O337J2982
1043A0206m556j4725L664J4854j738j5141K17J5339J372j5479l347J4919N943
$$ plain form
1056 11528 -2851 -10227 2502 10387 -160 -8635 418 8240 550 -7636 -168 7025 532 -7172
1070 -7172 -1295 5666 -500 -6461 -724 4100 -2288 -7311 601 5992 -2445 -9500 -946 8177 -93
1085 -93 -10048 -1857 9218 1627 -10154 -2982 11091 5121 -9608 -5578 10544 9051 -6978 -7354
1099 -7354 8135 10204 -3819 -6847 6113 10146 -2183 -7461 3530 9384 -1202 -7862 754
1112 754 6913 -850 -6379 191 4444 -2438 -6934 999 4653 -3052 -7952 234 5112 -3330 -8279
1127 -8279 690 6660 -2770 -9201 497 9548 -409 -10477 -1218 10988 3334 -9312 -2767 10977
1141 10977 6134 -7999 -4409 9976 7919 -6772 -6851 7344 9300 -4266 -7977 3761 7594 -2536
1155 -2536 -6661 2071 5644 -2633 -6267 1408 5118 -2701 -6150 1522 4482 -3198 -5541 2755 4603
$$ packed form
1056A1528j4379p376J2729P885j0547q475R053P822p690q186P468P193o493p704
1070g172N877O961o166n961N737M824o388n023P912N391q437p055Q554R123q270
1085i3r955Q191J1075p591j1781P172J4073n970j4729M030J6122j493j6029l76
1099g354J5489K069j4023l028J2960M033j2329n278J0991N854j0586o660Q616
1112G54O159p763n529O570M253o882m496P933L654p705m900Q186M878q442m949
1127h279Q969N970r430o431R698R051r957j0068R259J2206p654j2646O545J3744
1141A0977m843j4133L590J4385k057j4691p9J4195J956j3566l711J1738L833j0130
1155b536m125Q732L573q277l634P675L710p819l449P672K960p680k343Q296J848
$$ plain form
1170 4603 -4155 -6802 3441 7139 -3605 -8550 2310 8697 -1843 -9176 1252 9886 -287
1183 -287 -10065 -871 10826 2822 -10158 -3664 9790 5330 -8549 -6002 7470 6763 -5876 -5840
1197 -5840 5848 6770 -4054 -5664 4653 6847 -2675 -5024 3345 5402 -2398 -3976 3732 4355 -3505
1212 -3505 -4113 4259 4694 -4564 -5909 3484 5076 -4995 -7339 3241 6129 -5323 -9080 2298
1226 2298 7841 -3429 -10807 290 9653 -363 -10626 -1575 9399 2771 -8453 -2790 9359
1239 9359 4884 -7022 -4010 7885 6687 -3992 -4010 5953 6185 -2580 -3021 4788 4423 -3413 -3202 4251
1255 4251 3865 -4290 -3738 3724 3244 -4853 -4411 4234 3069 -6252 -6029 4226 5003 -6583 -8236 3790
1271 3790 6903 -4702 -9522 2041 8385 -2638 -9609 471 9785 442 -9277 -1316 9498 3588
$$ packed form
1170D603q758k647J0243L698j0744m945J0860O387j0540p333J0428Q634j0173
1183b87r778R194J1697q004j2980O494J3454m460j3879K547J3472p07j2639L6
1197e840J1688R22j0824j610J0317K194r522k349Q369K057p800j578P708O23p860
1212c505o08Q372M35r258j345R393J592j0071k344J0580K888j1452l757J1378
1226B298N543j1270p378J1097R363j0016j0263R051J0974o628j1224N663J2149
1239I359m475j1906L012J1895j198j0679j8R963K32q765m41P809l65p836K11P453
1255D251l86q155N52P462m80q097M42Q645j165r321K23J0255P77j1586j653J2026
1271C790L113j1605m820J1563O344j1023o971J0080R314r343r719P961J0814n910
$$ plain form
1285 3588 -7051 -2848 7443 4661 -5081 -2636 6369 4449 -4059 -2883 5311 4308 -3381 -2526 4250
1300 4250 2804 -3659 -1964 4564 2250 -5239 -2631 5163 2949 -6348 -3977 5487 3969 -6229 -5211
1315 -5211 5588 5575 -6017 -7041 4720 7838 -4363 -8983 2227 8537 -1676 -8935 54 7870
1329 7870 -46 -8161 -1692 7020 1456 -7203 -2333 5677 2486 -5233 -2176 4530 2412 -3643 -1136
1344 -1136 5012 2333 -3528 -828 5451 2478 -3588 -466 5756 2215 -4434 -1095 6691 2739 -5979
1359 -5979 -3009 6676 4241 -6743 -6019 5068 5802 -5721 -7728 2944 6255 -4171 -8975 1185
1373 1185 6997 -1747 -8631 -951 6667 74 -6555 -1121 5642 1109 -5084 -863 5528 1779 -3922
1388 -3922 -303 5270 2110 -3200 165 4656 1089 -3340 738 5731 490 -5080 -47 6320 936
$$ packed form
1285C588j0639M203J0291k782r742K445R005j920q508J176Q194j003p689Q55O776
1300D250j446o463J695O528k314p489K608P794k214r297K371R464j518j0198J018
1315e211J0799j3j1592j024J1761L118j2201m620J1210O310j0213p259Q989P816
1329G870p916q115O469Q712n564q659M870Q010l191p719L057O706k118o055K507
1344a136O148k679n861K700O279k973o066L122O222l541o649L339P786l952q718
1359e979K970R685k435j0984P24J1087P34j1523k007J0672L311j0426m804J0160
1373A185N812q744o884P680P618o593o629N434O763m533o193M221O391l749n701
1388c922L619N573l160n310L365M491l567m429M078M993n241n570N033O367n384
$$ plain form
1403 936 -6367 -2079 6471 2068 -6975 -3647 6121 3957 -6843 -5858 4925 5722 -4770 -7442 2552
1418 2552 6016 -2607 -6879 1437 5939 -1124 -5772 441 5756 -68 -5134 -690 4675 834 -3756
1433 -3756 -147 3763 467 -3157 569 3562 -172 -3432 939 4320 -318 -4084 786 5271 -486
1448 -486 -5541 134 6385 1084 -6669 -1875 6814 3193 -6443 -3876 5771 4330 -5286 -4885 4578
1463 4578 5253 -3805 -6038 3114 5511 -2625 -5753 1067 5247 -1119 -5249 -48 3720 -963 -4368
1478 -4368 173 3331 -842 -3431 371 2997 -934 -3033 1521 3383 -1298 -3370 2404 4959 -1300
1493 -1300 -4549 2037 6457 351 -5525 515 6671 1723 -5712 -1441 6390 2572 -5367 -3513 4938
1508 4938 3811 -5026 -5066 2994 4068 -3682 -5373 1512 3673 -2486 -5353 690 3441 -1393 -4218
$$ packed form
1403I36p303M288Q550m403r043L328R768k164j0800R85J0783P97j0492k672R994
1418B552L464q623m272Q316M502p063m648O213N315n824n066M444N365l841m590
1433c756L609L910l296l624L726K993l734l260M371L381m638l766M870M485n757
1448d86n055N675O251n301p753M794Q689l621r636K567R647j441r616M01R463
1463D578O75r058k233R152K397q136l128O820M180o366m130N201L768m683l405
1478d368M541L158m173k589L802K626l931k099M554J862m681k072N774K555o259
1493a300l249O586M420o106n876O040O156m948p435M271P831l818p939J854Q451
1508D938j127q837m0Q060J074p750j691O885K161o159k867O043K751m834k825
$$ plain form
1523 -4218 187 2587 -696 -2504 1104 2056 -1157 -2126 2363 3167 -1321 -2679 2829 4381 -1355 -3401
1539 -3401 2574 5574 -1119 -4517 1590 5952 -233 -5665 -152 6090 1235 -6220 -2095 4985 2380
1554 2380 -5327 -3457 4277 3039 -4159 -4024 3028 3447 -2666 -4031 1637 3051 -1408 -2925 1088
1569 1088 2139 -1308 -2131 1324 1674 -1974 -1390 1908 1933 -2135 -1873 2667 2093 -2907 -2458 2712 3691
1586 3691 -2657 -3917 2427 4889 -1161 -4813 1354 5048 196 -4928 48 5471 1321 -4810 -1618
1601 -1618 4673 2957 -4051 -2872 3407 3078 -2650 -2946 2156 2506 -1836 -2533 1045 1452 -1615 -2110
1617 -2110 670 823 -2102 -1517 1584 411 -2908 -1230 2627 1139 -2921 -2110 3132 2358 -3180 -2861
1633 -2861 3180 3816 -2315 -3571 2987 4808 -1332 -4333 1553 5400 701 -4036 -25 4677 1225
$$ packed form
1523d218M405K400l283j808L608R52l213r69M489Q04m488j358N508J552n736k046
1539c401N975L000o693l398O107M362o185n432N513O242m855p455M125P080k605
1554B380p707J870P734j238p198J35P052M19o113j365N668J414m459j517M013
1569A088J051l447q23L455L50l648N84L298K5m068K62M540n74n000M49N170R79
1586C691o348j260O344K462o050l652O167L694m852n124M976N423m150o131L192
1601a618O291j716p008J179O279l29n728k96N102L50m342o97L578M07l067m95
1617b110K780J53k925N85L101j173l319J678L857j488m060Q11N242p74n538L19
1633b861O041O36o131j256O558J821o140l001N886L847m699m737M011M702l452
$$ plain form
1648 1225 -3809 -1607 3443 1824 -3381 -1684 2387 1822 -2143 -2342 777 760 -1998 -1531 616 75
1664 75 -2217 -1056 1304 -222 -2518 -508 2310 395 -2666 -639 3306 1049 -3100 -1352 3368
1679 3368 2881 -2990 -2514 2920 3748 -2002 -3642 2067 4176 -646 -3852 637 4229 437 -3916 -995
1695 -995 3594 1028 -3235 -1386 2141 1580 -2079 -1158 1453 945 -1752 -807 1137 422 -1519 -172
1711 -172 1316 -275 -1741 360 1885 -560 -3046 107 3148 130 -3536 -1046 3343 1114 -3697
1726 -3697 -1998 3054 2119 -3065 -3025 2488 3227 -1909 -3394 1565 4087 -293 -3149 390 3315 921
1742 921 -2159 -360 2687 1206 -1464 -545 1888 1029 -1036 -196 991 -408 -780 446 788 -858
1758 -858 -1398 600 1133 -1240 -2144 398 1915 -1198 -3072 -139 2651 -360 -3552 -1254 2930 1151
$$ packed form
1648A225n034K202N050j619n205J697M071n65l965j99L119j7k758M67K147n41
1664G5k292J161K360j526k296K010K818j915l061K027L945k257m149J748M720
1679C368m87n871M76N434Q28n750j640N709K109m822l206M489L592l792m353K921
1695i95M589k566m263J849L527n61l659R21K611n08k697R45J944p15j941J347
1711a72J488j591j466K101J525k445k486L153L041l018l666K490M389k229m811
1726c697J699N052r35n184M0N513P39n136j485M959K522m380k856L539K925k394
1742I21l080J799L047j481k670R19K433q59k065Q40J187j399l72J226L42j646
1758h58n40J998N33k373r04K542J517l113j874K933K790l011l192K298M184j779
$$ plain form
1774 1151 -3347 -1782 2839 2504 -2299 -2454 1917 2850 -897 -2399 1445 3258 40 -2226 230 2832
1790 2832 855 -1430 -50 1343 633 -796 109 865 140 -712 393 310 -817 -928 862 879 -1678
1807 -1678 -1628 974 1665 -1318 -2822 1041 2611 -852 -3131 120 3008 295 -3067 -846 2741 1470
1823 1470 -2534 -1643 2631 2092 -1711 -1856 1443 2565 -889 -2005 448 1784 -185 -1290 -15 1360
1839 1360 264 -825 9 709 -231 -471 480 105 -660 -105 1600 405 -1495 -757 1852 1585 -1668
1856 -1668 -1794 1516 2108 -1458 -2532 926 2687 -611 -3295 -212 2643 441 -3130 -1207 2199
1871 2199 994 -2185 -1863 1220 1615 -1407 -1826 983 1572 -579 -1195 677 1178 240 -241 230 516
1888 516 -127 102 985 576 -437 399 1553 301 -1343 -443 2061 503 -1992 -945 1815 1327 -2169
$$ packed form
1774A151m498J565M621l35m803j55M371R33l747j502L844J813l218k266K456K602
1790B832j977k285J380J393p10j429R05P56p25q52J105q3j127j11J790J7k557
1807a678N0K602O91k983j504L863J570l463k279L251K888k713l362K221L587j271
1823A470m004Q91M274n39l803j45L299J122l454j116K453J336j969j105J275J375
1839A360j096j089Q34P00r40k40R51l75p65N55J705j195j900P38K609k67l253
1856a668j26L310N92l566j074L458J761l298k684L083K855k202l571J923L406
1871B199j205l179L22L083L95l022m19K809N89k151o16J872N01r38m81M71K86
1888E16o43K29Q83m09j013Q36J154j252j644R00K504j558k495J047K760m88l496
$$ plain form
1905 -2169 -1963 1501 1933 -1536 -2937 204 2247 -695 -3174 -141 2050 213 -2326 -916 1686
1920 1686 1301 -1021 -1256 1245 1511 -449 -929 661 1180 -262 -253 584 382 -187 518 729 -70 -510 428
1939 428 1084 -286 -1353 284 1776 -65 -2121 -497 2021 503 -2214 -1489 1861 1553 -1848 -2017
1955 -2017 1167 2046 -1366 -2489 439 2399 -321 -2260 -428 1910 577 -1617 -774 1066 740 -867
1971 -867 -527 402 267 -158 -228 325 -184 -43 462 221 -363 -598 939 846 -716 -997 780 1405 -388
1990 -388 -1798 532 2376 382 -2168 -287 2020 1025 -1644 -1162 1799 1675 -1369 -1972 858 2161
2006 2161 -1008 -2030 -11 1546 -449 -1581 -685 977 286 -1241 -517 370 69 -327 -279 3 29 -285
2024 -285 419 168 -595 3 1006 898 -907 -427 1425 1405 -640 -1362 1208 2024 -241 -1946 387 2169
$$ packed form
1905b169K06L464M32l469j401L141K043k942k479L033K191j837k539J410K602
1920A686l85k322k35K501K66j960m80J590N19j442RQ37k02n69P05K11p99m40R38
1939D28O56j370j067J637J492j841k056J624K518j518k717P25L350l08l401j69
1955b017L184Q79l412j123K928J960k720j939J832K338j333k194Q43J840l26j607
1971h67L40R29j35m25p0N53n09J41N05k41n84k35J537r3j562k81J777O25j793
1990c88j410K330J844j994k550J881K307r95k669M82K961j24l044o03K830J303
2006B161l169j022K019J557j995j132Q96J662o91j527P24Q87l01l96M8K82K6l14
2024b85P04k51p63N98J003j08j805M80J852k0k045p22K570Q16k265j705K333J782
$$ plain form
2042 2169 196 -2040 -470 2046 1314 -2066 -1647 1399 1296 -1410 -2013 483 1098 -690 -1664 363
2058 363 1006 -268 -1093 -351 414 -218 -895 -48 226 -121 85 631 -15 -842 213 1217 339 -1013 -53
2077 -53 1743 994 -1140 -1139 1612 1720 -842 -1767 1062 2192 -249 -2083 -163 2108 793 -1969 -887
2094 -887 1507 892 -1028 -1241 999 1210 -859 -1051 413 818 -344 -1004 -36 664 -17 -615 -247 224
2112 224 -297 142 296 -603 -714 79 785 41 -1475 -294 1199 481 -1786 -873 1660 1083 -1376 -1696
2130 -1696 1202 1838 -799 -1847 740 2130 442 -1703 229 1825 290 -1414 -166 1488 697
2145 697 -973 -417 1041 447 -340 -1130 212 376 -328 -489 -220 -14 -448 -171 45 -727 -845 200 981
2164 981 -754 -1685 4 1296 -84 -1808 -457 1595 904 -1484 -897 1782 1644 -1065 -1489 1370
$$ packed form
2042B169j973k236J570K516p32l380M19L046j03k706o03K496O15j788r74K027
2058C63O43j274q25P42P65o32o77Q47K74l47K06N46o46q27J055J004q78j352R60
2077e3J796p49k134JK751J08k562r25K829J130k441j834J920K271j315k762J082
2094h87K394o15j920k13K240K11k069j92J464M05j162o60R68P00o81n98L68M71
2112B24n21M39J54q99j11P93P06p44j516J181J493p18k267R13K533n77k459l20
2130a696K898O36k637j048K587J390j688k145J932J596j535j704J248J654p91
2145F97j670N56J458n94p87p90J342J64p04j61K69K06m34K77K16p72j18J045P81
2164I81j735r31J689J292j380j724J351K052o91k388N87K679j38k709m24K859
$$ plain form
2180 1370 1926 -360 -1785 755 2107 128 -1519 -186 1888 442 -1507 -374 1213 836 -1007
2195 -1007 -799 512 470 -204 -239 -161 -280 -341 -90 83 -389 -1124 680 779 -691 -1398 218 1664 151
2214 151 -1729 -270 2002 285 -1763 -617 1540 933 -1714 -962 1417 1520 -941 -1252 1142 1540
2230 1540 -635 -1566 317 1618 -334 -1472 -71 1525 740 -1094 -645 689 540 -156 -423 -158 87
$$ packed form
2180A370N56k286j425K540J352j979j647J333K074j446j949J133J587l77j843
2195a007K08J311m2o74l5P8j19o1K51J73m72p35J804R9j470p07J616J446j513
2214A51j880J459K272j717k048J146K157o07k647P52K379J03k461l11K394L98
2230A540k175r31J883J301j952j138J401J596p85j834M49J334j49o96k67K65K45
$$ [...]
8191H
##END NTUPLES=NMR FID
##END=
