##TITLE=1H_Ser 1363
 DMSO, 8 sc, 
 20.12.2019
##JCAMPDX= 6.0         $$ Bruker NMR JCAMP-DX V2.0
##DATA TYPE= NMR FID
##DATA CLASS= NTUPLES
##ORIGIN= UXNMR, Bruker Analytische Messtechnik GmbH
##OWNER= root
$$ XWIN-NMR		Version 3.5
$$ Fri Dec 20 16:12:06 2019 Russian Standard Time (UT+4h)  she@DPX200
##.OBSERVE FREQUENCY= 200.1315
##.OBSERVE NUCLEUS= ^1H
##.DELAY= (6, 6)
##.ACQUISITION MODE= SIMULTANEOUS
##.ACQUISITION SCHEME= undefined
##.AVERAGES= 8
##.DIGITISER RES= 18
##SPECTROMETER/DATA SYSTEM= spect
##.PULSE SEQUENCE= zg30
##.SOLVENT NAME= DMSO
##.SHIFT REFERENCE= (INTERNAL, DMSO, 0, 15.7039)
##AUDIT TRAIL= $$ (NUMBER, WHEN, WHO, WHERE, WHAT)
$$ ##TITLE= Audit trail, XWIN-NMR		Version 3.5
$$ ##JCAMPDX= 5.01
$$ ##ORIGIN= Bruker BioSpin GmbH
$$ ##OWNER= she
$$ F:/spectra/data/she/nmr/H-F/1/audita.txt
$$ ##AUDIT TRAIL=  $$ (NUMBER, WHEN, WHO, WHERE, WHAT)
(   1,<2019-12-20 16:11:03.79 +0400>,<she>,<DPX200>,
      <created by zg, POWCHK disabled, PULCHK disabled
       configuration hash MD5:
       00 E9 B6 7A A2 85 ED C7 34 08 36 98 17 FE 4E 26
       data hash MD5: 16K
       41 91 32 4C E3 3C 5F 1E D7 20 D6 1B C9 07 E1 F4>)
$$ ##END=
$$ 
$$ hash MD5
$$ 39 E6 2D 8F 88 A8 E6 0C CC 24 0F 18 10 5D F3 1F
##$RELAX= 
##$RELAX= 
##$RELAX= 
##$RELAX= 
##$RELAX= 
##$RELAX= 
$$ Bruker specific parameters
$$ --------------------------
##$DU= <F:/spectra>
##$EXPNO= 1
##$NAME= <H-F>
##$PROCNO= 1
##$TYPE= <nmr>
##$USER= <she>
##$AMP= (0..31)
100 100 100 100 100 100 100 100 100 100 100 100 100 100 100 100 100 100 
100 100 100 100 100 100 100 100 100 100 100 100 100 100 
##$AQSEQ= 0
##$AQ_mod= 1
##$AUNM= <au_zg>
##$AUTOPOS= <>
##$BF1= 200.13
##$BF2= 200.13
##$BF3= 200.13
##$BF4= 200.13
##$BF5= 200.13
##$BF6= 200.13
##$BF7= 200.13
##$BF8= 200.13
##$BYTORDA= 1
##$CFDGTYP= 0
##$CFRGTYP= 5
##$CHEMSTR= <none>
##$CNST= (0..31)
1 1 145 1 1 1 1 1 1 1 1 1 1 1 1 1 1 1 1 1 1 1 1 1 1 1 1 1 1 1 1 1 
##$CPDPRG= <>
##$CPDPRG1= <>
##$CPDPRG2= <>
##$CPDPRG3= <>
##$CPDPRG4= <mlev>
##$CPDPRG5= <mlev>
##$CPDPRG6= <mlev>
##$CPDPRG7= <mlev>
##$CPDPRG8= <mlev>
##$CPDPRGB= <>
##$CPDPRGT= <>
##$D= (0..31)
0 1.2 0 0 0 0 0 0 0 0.06 0 0.03 0 0 0 0 0.0002 0 0 0 0 0 0 0 0 0 0 0 0 
0 0 0 
##$DATE= 1576843863
##$DBL= (0..7)
120 120 120 120 120 120 120 120 
##$DBP= (0..7)
150 150 150 150 150 150 150 150 
##$DBP07= 0
##$DBPNAM0= <>
##$DBPNAM1= <>
##$DBPNAM2= <>
##$DBPNAM3= <>
##$DBPNAM4= <>
##$DBPNAM5= <>
##$DBPNAM6= <>
##$DBPNAM7= <>
##$DBPOAL= (0..7)
0.5 0.5 0.5 0.5 0.5 0.5 0.5 0.5 
##$DBPOFFS= (0..7)
0 0 0 0 0 0 0 0 
##$DE= 6
##$DECBNUC= <off>
##$DECIM= 24
##$DECNUC= <off>
##$DECSTAT= 4
##$DIGMOD= 1
##$DIGTYP= 9
##$DL= (0..7)
0 120 120 120 120 120 120 120 
##$DP= (0..7)
150 150 150 150 150 150 150 150 
##$DP07= 0
##$DPNAME0= <>
##$DPNAME1= <>
##$DPNAME2= <>
##$DPNAME3= <>
##$DPNAME4= <>
##$DPNAME5= <>
##$DPNAME6= <>
##$DPNAME7= <>
##$DPOAL= (0..7)
0.5 0.5 0.5 0.5 0.5 0.5 0.5 0.5 
##$DPOFFS= (0..7)
0 0 0 0 0 0 0 0 
##$DQDMODE= 0
##$DR= 18
##$DS= 0
##$DSLIST= <SSSSSSSSSSSSSSS>
$$ [...]
##$SUBNAM2= <"">
##$SUBNAM3= <"">
##$SUBNAM4= <"">
##$SUBNAM5= <"">
##$SUBNAM6= <"">
##$SUBNAM7= <"">
##$SUBNAM8= <"">
##$SUBNAM9= <"">
##$SW= 24.9337058887773
##$SWIBOX= (0..15)
0 0 2 0 0 0 0 0 0 0 0 0 0 0 0 0 
##$SW_h= 4990.01996007984
##$TD= 16384
##$TD0= 1
##$TE= 0
##$TE2= 300
##$TE3= 300
##$TEG= 300
##$TL= (0..7)
0 120 120 120 120 120 120 120 
##$TP= (0..7)
150 150 150 150 150 150 150 150 
##$TP07= 0
##$TPNAME0= <>
##$TPNAME1= <>
##$TPNAME2= <>
##$TPNAME3= <>
##$TPNAME4= <>
##$TPNAME5= <>
##$TPNAME6= <>
##$TPNAME7= <>
##$TPOAL= (0..7)
0.5 0.5 0.5 0.5 0.5 0.5 0.5 0.5 
##$TPOFFS= (0..7)
0 0 0 0 0 0 0 0 
##$TUNHIN= 0
##$TUNHOUT= 0
##$TUNXOUT= 0
##$USERA1= <user>
##$USERA2= <user>
##$USERA3= <user>
##$USERA4= <user>
##$USERA5= <user>
##$V9= 5
##$VALIST= <valist>
##$VCLIST= <CCCCCCCCCCCCCCC>
##$VD= 0
##$VDLIST= <DDDDDDDDDDDDDDD>
##$VPLIST= <PPPPPPPPPPPPPPP>
##$VTLIST= <TTTTTTTTTTTTTTT>
##$WBST= 1024
##$WBSW= 4
##$XGAIN= (0..3)
0 0 0 0 
##$XL= 0
##$YL= 0
##$YMAX_a= 168182
##$YMIN_a= -107773
##$ZGOPTNS= <>
##$ZL1= 120
##$ZL2= 120
##$ZL3= 120
##$ZL4= 120
##$ABSF1= 10
##$ABSF2= 0
##$ABSG= 5
##$ABSL= 3
##$ALPHA= 0
##$AQORDER= 0
##$ASSFAC= 0
##$ASSFACI= 0
##$ASSFACX= 0
##$ASSWID= 0
##$AUNMP= <proc_1d>
##$AZFE= 0.1
##$AZFW= 0.1
##$BCFW= 1
##$BC_mod= 2
##$BYTORDP= 1
##$COROFFS= 0
##$CY= 11.3945322036743
##$DATMOD= 1
##$DC= 2
##$DFILT= <>
##$DTYPP= 0
##$F1P= 16.9975609425685
##$F2P= -3.02152046262296
##$FCOR= 0.5
##$FTSIZE= 0
##$FT_mod= 4
##$GAMMA= 1
##$GB= 0.15
##$INTBC= 1
##$INTSCL= 1
##$ISEN= 128
##$LB= 0.24
##$LEV0= 0
##$LPBIN= 0
##$MAXI= 10000
##$MC2= 0
##$MEAN= 0
##$ME_mod= 0
##$MI= 1.114404
##$NCOEF= 0
##$NC_proc= 0
##$NLEV= 6
##$NOISF1= 3.799351
##$NOISF2= 2.8
##$NSP= 1
##$NTH_PI= 0
##$NZP= 0
##$OFFSET= 15.70392
##$PC= 1
##$PHC0= -10157.08
##$PHC1= 24.4008
##$PH_mod= 1
##$PKNL= yes
##$PPARMOD= 0
##$PSCAL= 0
##$PSIGN= 0
##$REVERSE= no
##$SF= 200.130013532006
##$SI= 16384
##$SIGF1= 3
##$SIGF2= 2
##$SINO= 400
##$SIOLD= 16384
##$SREGLST= <1H.CDCl3>
##$SSB= 0
##$STSI= 0
##$STSR= 0
##$SW_p= 3612.71676300578
##$SYMM= 0
##$S_DEV= 0
##$TDeff= 0
##$TDoff= 0
##$TI= <>
##$TILT= no
##$TM1= 0
##$TM2= 0
##$TOPLEV= 0
##$USERP1= <user>
##$USERP2= <user>
##$USERP3= <user>
##$USERP4= <user>
##$USERP5= <user>
##$WDW= 1
##$XDIM= 8192
##$YMAX_p= 0
##$YMIN_p= 0
$$ End of Bruker specific parameters
$$ ---------------------------------
##NTUPLES= NMR FID
##VAR_NAME=  TIME,          FID/REAL,        FID/IMAG
##SYMBOL=    X,             R,               I
##VAR_TYPE=  INDEPENDENT,   DEPENDENT,       DEPENDENT
##VAR_FORM=  AFFN,          ASDF,            ASDF
##VAR_DIM=   8192,          8192,            8192
##UNITS=     SECONDS,       ARBITRARY UNITS, ARBITRARY UNITS
##FACTOR=    0.0002004,     1,               1
##FIRST=     0,             0,               0
##LAST=      1.6414764,     0,               0
##MIN=       0,             -107773,         0
##MAX=       1.6414764,     168182,          0
$$ Real data points
##PAGE= N=1
##DATA TABLE= (X++(R..R)), XYDATA
$$ [...]
2237e78P21r08j9J879L10k062j174J970R49q17o04J006k89j160L02J453N66k060
$$ -578 143 -765 -784 1095 1405 -657 -1831 139 1088 271 -333 673 384 -776 -474 979 1545 -515
2255e15q55P33J119J08Q1o18j339k03J519J373j177p75n8L80O32J46M86j113r29
$$ -515 -1370 -637 482 590 671 53 -1286 -1489 30 1403 226 -549 -607 -227 405 551 1037 -76 -1005
2274a005P61P13l37m60R5N56j013l94J627J167j965j362J111J478n46m66R02m27
$$ -1005 -244 469 132 -328 -233 323 -690 -1084 543 1710 -255 -1617 -506 972 426 -40 862 435
2292D35j890O30K161M08k286j392K395P46j451p04J506L28j951K38K176K25k175
$$ 435 -1455 -825 1336 1744 -542 -1934 461 1207 -244 -948 558 886 -1065 -827 1349 1574 -601
2309f01q24J751K05j188M96J316r59j915P75K077M01k043q39J164Q44n43j71M28
$$ -601 -1425 326 531 -657 -161 1155 196 -1719 -944 1133 1534 -509 -1348 -184 660 117 -54 374
2327C74o19n91J004J355o53j668J91Q98M90p79L7O33p52p42L30P84K40J41j188
$$ 374 -245 -836 168 1523 870 -798 -607 291 781 2 39 672 -80 -822 -492 292 532 673 -515
2346e15p3O9J136K37o41j135K35R06J52j69l19p2p92J198P11n13r87O0N57j51
$$ -515 -588 -519 617 854 213 -922 -687 219 371 202 -117 -189 -981 217 928 415 -572 -512 45 -106
2366a06k85O32O43p87j460N55J756K14j625k68P46l98l13J545O69k020j292J537
$$ -106 -391 241 884 97 -1363 -808 948 1162 -463 -731 15 -383 -696 849 1518 -502 -1794 -257
2384b57K217q94j878J03J260k57r36P72J089j058j302Q93J074k43j041J85P45
$$ -257 1960 1066 -812 -709 551 294 -642 130 1219 161 -1141 -248 826 583 -458 -273 472
2401D72j144j02J621N42j510j715P66K007K67j348n05J68m8M13Q57j02j357l49
$$ 472 -672 -774 847 1389 -121 -1836 -1070 937 1204 -144 -649 -481 -529 -116 741 639 -718 -1067
2419a067O82P68k20m34J22J12K37m98J36O72o7j096k13P05J018K70j188o68r3
$$ -1067 -385 383 163 -271 -149 -37 200 -298 -162 510 443 -653 -866 -161 857 1127 -61 -729 -822
2438h22J248N40pr24p32J37J098P38o98j175p66J519M20o60j95L71O1q98j50J658
$$ -822 426 966 959 35 -697 -560 538 1276 578 -597 -1363 156 576 -84 -279 92 153 -745 -895 763
2458G63J65q38q26M13N0K72L23L05m78j543O91J881L0j990n34J049P95k56k79
$$ 763 928 90 -736 -323 -273 -1 322 627 149 -1394 -703 1178 1208 -782 -1316 -267 528 272 -7
2477gj36K50m36K10Q90J0o52q13P00J52n39N38N14j94j347m31J584J036n72j517
$$ -7 -143 107 -329 -119 771 781 129 -684 16 168 -371 167 681 487 -860 -1291 293 1329 757 -760
2497g60n75J396Q41o41j11m11o36P16N47M92p78r04K10R56k04l01Q3P41p69p34
$$ -760 -1335 61 902 261 150 -261 -897 -181 366 858 80 -824 -614 342 138 -163 -80 661 -108 -842
2517h42N50J250O2j233p26N36P03M93j83n66o77j64Q90R26l39j696l13J394Q72
$$ -842 -292 958 1020 -213 -939 -403 300 793 610 44 -633 -797 93 1019 680 -1016 -1329 65 937
2536I37o49r21N50L54j96k19O63M6k36n09l1L46p8M25k19n08o45L50J095L59j204
$$ 937 288 -633 -83 271 75 -144 519 565 329 -180 -211 135 57 482 263 -245 -890 -540 555 914 -290
2557b90j133L52J759K09j141n65K42M61J80k5M92l14q11K92M24J90l11J9K04m73
$$ -290 -1423 -1071 688 897 -244 -809 -567 -106 74 49 541 227 -584 -292 132 322 11 30 234 -239
2577b39o24R87R59j65j432q11J440J124k30q61q24M97L26M74J79q86m93k61J132
$$ -239 -863 124 1083 918 -514 -1325 115 1239 1009 148 -676 -179 147 621 800 -86 -579 -840 292
2596B92J80m98l84j14R22m54n88J079N25q35j096J99R56O20p62o37J10L94L04
$$ 292 472 -26 -410 -524 398 -56 -644 435 960 125 -971 -772 184 804 42 -595 -485 -91 213
2615B13L24l0r12n20O49J363j71j163p18J119N26o71m50J130O1j218j48O78N27
$$ 213 537 507 -405 -925 -276 1087 916 -247 -965 154 680 9 -441 689 750 -468 -616 62 589
2634E89k92n97L51j74k78M45R02n26j648J6J738J015j157j297J44J156L90n15
$$ 589 297 -300 51 -123 -401 44 946 420 -1228 -1212 526 1541 384 -913 -769 387 777 262
2652B62nm42l43M8R54M6q00K22J59K36j083N43P18%r79n43R00R96J16j078r65
$$ 262 257 -185 -528 -480 474 520 -280 -58 101 337 -746 -203 515 515 -464 -1007 -107 889 1005 -73 -1038
2673a038R5J183P62m48p67m50K79R51J32m95m24qO5N64j46k35L85J71o09m96O57
$$ -1038 -943 240 1002 554 -213 -663 -384 567 699 204 -220 -228 -163 401 255 20 405 576 -33 -529 128
2694A28R05l38j451j07Q38O44l10l75n61j5J97J077M70j176j021K70J740m5j238
$$ 128 1033 695 -756 -863 -25 619 309 -66 -627 -642 -445 632 1102 -74 -1095 -825 915 870 -368
2713c68k45R11n5j115R00M95k58q08J54R13j67m21O48n3j058o31J441J634j164
$$ -368 -613 298 243 -872 28 523 265 -543 -389 524 357 -64 584 531 -527 -1158 283 1917 753
2732G53k119L35J514N22r04p2q2O1k43M43L67p75m12N43L90n78m6N61l55k77m08
$$ 753 -1366 -1031 483 1005 101 29 -53 8 -235 208 575 -200 -612 -69 321 -257 -303 258 -97 -374 -782
2753g82N80R03m63m00o52K74O69O13N6j142p57O23J236J24p82m36j66N47J85M26
$$ -782 -202 701 238 -162 -814 -540 129 742 798 -344 -1101 -478 758 882 100 -336 -502 45 230 656
2773F56o89k55M28J74l29l18M62M49o94j146Q56J259k61o88p16O36K4K08N63Q2
$$ 656 -33 -288 140 314 -15 -333 129 578 -116 -1262 -406 853 592 -96 -812 -176 -152 56 619 701
2793G01j578j99J802J072j514j463J079O11o18n07P12P67j215q10J097P59r62
$$ 701 -877 -1076 726 1798 284 -1179 -100 511 -107 -614 98 865 -350 -1160 -63 696 -266
2810b66j01L85K0o84o6J934k12j912p09J788R32o19q29n1L29l7J49Q95p90n68
$$ -266 -367 18 38 -646 -712 1222 1010 -902 -1611 177 1109 490 -339 -390 -61 -98 51 946 156 -412
2830d12j58J167l18n32M66N56l61r44K45J180j54q69j50jn5O70J81q77q27K73
$$ -412 -570 597 279 -253 213 769 408 -536 -291 889 735 -134 -284 -285 -340 330 511 -366 -1193 -920
2850i20J608j48j017k6M90l08j55R54No27m29Q80J51p37m1Q68K22j445j34J777
$$ -920 688 540 -477 -503 -13 -321 -476 478 483 -144 -573 307 458 -279 -320 548 770 -675 -809 968
2870I68j45j023p51J068L76l66J74M95p91j100J078J124k84j708R0J625n0j312
$$ 968 823 -200 -951 117 493 127 301 796 5 -1095 -17 1107 823 -885 -795 830 780 -532
2888e32j51J444m32j082M79Q97m08q64Q14N29o06r17J043N89q09j279J008J382
$$ -532 -683 761 329 -753 -274 623 215 -649 165 694 88 -829 214 803 -6 -1285 -277 1105
2906A105n53j039p4R86o88J86L9J52p87N35Q40j33r34k68N99M7l16M01K55l28
$$ 1105 552 -487 -561 425 -263 -77 -38 114 -673 -138 702 569 -365 -633 -34 13 -303 98 353 25
2926B5n74L09M29j03k86O38j77j063L70R80J33j223m0O29M65k65r6j63n95j05
$$ 25 -549 -240 189 86 -200 438 261 -802 -432 548 681 -542 -582 47 512 247 151 -12 -607 -712
2946g12Q25P96o85j434R89J032n75q31L59J170r86q33J164M86m08j104M57N83
$$ -712 113 909 224 -1210 -221 811 236 -595 -236 934 -52 -885 279 765 357 -747 -290 293
2964B93m88j60J159k8j341q70J572J658j684j220O30P54o5m19P59J02j133O2J086
$$ 293 -195 -355 804 776 -565 -1435 137 1795 111 -1109 -479 275 210 -209 550 652 -481 -419 667
2983F67K64j027n44Q90R2q12J80R69J78j535n11J144O84l88m47Nl94m8R51P15
$$ 667 931 -96 -640 250 342 -470 -290 679 857 -678 -1189 -45 639 251 -196 -191 -585 -633 318 1033
3003A033j148q89O27O66q6l51J52j72L8l11J000K29p10o7j95j33k86J066O55j119
$$ 1033 -115 -1004 -377 289 203 -148 4 -168 -130 -441 559 788 78 11 -184 -317 -603 463 1118 -1
3023aj013L13J272m7n53j95j7l51K28J253l28j085m53J231M38p12m15N43J8o93
$$ -1 -1014 -701 571 524 -29 -224 -241 -592 -364 889 561 -524 -977 254 692 -20 -435 108 126 -567
3043e67m6J088L56r11l36K28N75l84M46j9l80j252P80J551l45j270m29P12O97
$$ -567 -613 475 831 -80 -416 -188 387 3 449 430 50 -1202 -422 1129 784 -486 -915 -203 494
3062D94m13j47L79p92k27L31J209n06k59l70K63Q7n16Q53L73o25p80J81P22N08
$$ 494 81 -66 313 -479 -706 -375 834 328 69 -301 -38 49 -467 386 759 134 -646 -465 257 765
3082G65p66l67J1M89R2L47m55q57O68J00N96k12m84j43r4k12N17L20l03j2k40
$$ 765 -1 -368 -357 132 224 571 116 -741 -73 27 623 411 -73 -216 -310 -522 -5 315 12 0 -240
3103b40K33m5J52M43m81o89MJ358l35k76m98L4M19K06J13J7k09o84M22M74m6o16
$$ -240 -7 -52 100 543 62 -627 -623 735 400 124 -374 -340 79 285 398 415 206 -478 -56 418 372 -244
3125b44L24L74n00l46K74O92m35n87K41M24N0k57J09j3o98K34L08P02n22o94R4
$$ -244 80 454 -46 -392 -118 574 139 -448 -207 217 267 10 119 106 -592 -358 -50 652 130 -564 -470
3146d70O46n6n48L60J81r0o2j36L65l85Q7M7L20j88j63j04N53o73K51M92j99L10
$$ -470 176 120 -428 -68 113 23 -39 -175 190 -195 -108 -61 259 71 -92 -196 357 -316 -65 427 228 538
3168E38q60j15K62M89r5k78j30R3K05J26j96j69k57K69L43J24k67j48O7n9J03
$$ 538 -322 -437 -175 314 219 -59 -189 -96 109 235 39 -130 -387 -118 225 349 82 -66 1 -58 45
3189D5R3%J72m73j90K42M45J91l75j81J56O5j3J91n0j011J45P18L14K46r78l77
$$ 45 138 138 310 -163 -353 -111 334 525 150 -31 125 190 177 368 318 -693 -548 170 484 730 -248 -625
3211f25P37J51m56M73n2j74o02M16K37L30n27l02M00j04J04N2N94n47m00l4P08
$$ -625 112 263 -193 280 228 54 -548 -132 105 435 -92 -394 6 -98 6 58 652 105 -295 -329 379
3232C79m1r2q48J18N28j52k9K75j96j04J5J70K87p4j57k48N4n5J06J16J33m30
$$ 379 338 246 -602 -484 44 -108 -137 138 -58 -162 -147 23 310 236 79 -169 -115 -170 -64 52 185 -245
3254b45j26Q09r2k3o78k54M57M06J00j20r4j27l63L51M06o6n96L1K19j06J92j33
$$ -245 -371 438 346 323 -355 -609 -152 254 354 234 140 13 -350 1 407 341 -255 -224 -5 -111 81 -52
3276e2M64m42j77J28O57o3l59p36P9O45l9M8p1l38r6J94L40pk39n13J55N56O5
$$ -52 412 -30 -207 -79 578 515 156 -580 -501 144 105 153 82 -256 -352 -158 182 175 -64 -577 -422 134 199
3299A99R1o16M40m36K35J39K83k37l94J91q4M43j89K45l76j76K2M16K29k77l91
$$ 199 290 -326 114 -322 -87 52 335 98 -296 -105 -189 254 65 310 -66 -242 -220 196 425 148 -243
3320b43j93P56J5j0l75j8J26l46P56l10j33m05J96J62k7L06J61p14J84p2K40J43
$$ -243 -436 320 335 325 -50 -68 58 -288 468 158 25 -380 -184 -22 -49 257 418 -296 -112 -184 56 199
3342A99Ql41m67L41J22P07n53j92K83j30j84L73J37n54j40J33M14j43O8m16L80
$$ 199 207 -134 -601 -260 -138 569 16 -176 107 -23 -207 166 303 -251 -391 -258 156 13 81 -335 45
3363D5n5K7Q7K07l89m17K6Q23k36N0k80k00R5M5N77j83j98l37j24P42j44N8o81
$$ 45 -10 17 104 311 -78 -495 -469 354 118 168 -112 -312 -217 -172 405 222 24 -313 -437 305 161 219 -462
3386d62M65J36k15J09J09l9p10K26O80R9n41j82J50Q9j50oO90p8o52J38M15N7
$$ -462 3 139 -76 33 142 103 -607 -381 299 398 -143 -325 -175 -86 -236 -242 448 370 -282 -144 271 328
3408C28J09l31r0r0j8N70k37m58j2j74M81r2K06j98J49n11L39M83k85j49j42k7
$$ 328 437 106 16 -74 -92 478 241 -217 -229 -403 78 -14 192 -6 143 -368 -29 454 169 20 -122 -149
3430a49K2R3K37K00q42J20N87k0r0j68k33K35k05J04L24j88l44JO31r3l17J64
$$ -149 -127 -34 203 403 -439 -319 268 248 158 -10 -243 -8 -213 -109 215 27 -317 -316 315 222 -95 69
3452F9K05n85Q2N17K05k92p45J96N12l02K34J57k37k38k23M03O57n02l09K92K85
$$ 69 274 -311 -229 288 493 201 -544 -348 164 -138 96 253 16 -222 -445 -42 615 113 -196 96 381
3473C81k34k43M18j39n38k17O53P73m71r72L90M99l94j18K55K16p28Q3P68J25
$$ 381 147 -96 322 183 -355 -572 81 854 383 -589 -199 300 -94 -212 43 259 -469 -386 382 507
3493E07o09k61K58k29J08K26M03j06j011M25O00pj03j37o1j75L0L44K10q17O7
$$ 507 -102 -363 -105 -334 -226 0 403 297 -714 -289 311 304 201 64 3 -172 -142 202 412 -405 -338
3514c38P5L78Q4l97L02k01k37N16L49l06n96L86M97m77l24K72K01m35l05O07M26
$$ -338 -263 115 199 -198 104 -97 -334 182 531 225 -371 15 512 35 -289 -17 184 -251 -556 51 477
3535D77n05l65K43L87n39R8N92j90q12Q4P52K72n99k65O04j60k44j25Q73l85p88
$$ 477 -28 -393 -150 237 -302 -204 388 198 -614 -530 222 494 -105 -370 234 74 -170 -295 578 193 -595
3556e95J7P91M25p97mK59J14m91K28P80n40p28l25J114m7l05m7L93l12o57J021
$$ -595 -578 213 638 -159 -163 96 210 -281 -53 727 187 -541 -866 248 201 -104 -151 242 -70 -727 294
3577B94J07m84k75L41L51l95k45Q29j63p17J93N28Ro48J83J29j46J1K74p9k62
$$ 294 401 -83 -358 -17 334 -61 -306 523 360 -357 -164 364 373 -275 -92 37 -109 -98 176 97 -165
3598a65n15N81O97m33n60L66k10l0j31O65M31p71n88Q57L10n69j21L98m7o26K41
$$ -165 -680 -99 598 165 -395 -29 -239 -269 -400 265 696 -75 -663 194 504 -65 -186 212 165 -461 -220
3619b20O55j10q14J3P92K18p57O1O47m70j051P84O33M5j119L71P14k60n17O56
$$ -220 435 325 -489 -476 316 534 -223 -162 485 15 -1036 -252 381 426 -693 -322 392 132 -385 271
3639B71J79p16n44J197O81j033m76K64N00l12m57Q59q4n75l50Q44L61o27l50M23
$$ 271 450 -266 -810 387 1068 35 -441 -177 323 11 -446 413 329 -246 -596 248 609 -18 -368 55
3659E5J40q56Q94L40r8p87J99K36J60n09J59J08j48l34L28M40k90n61K82N12j33
$$ 55 195 -661 233 573 475 -312 -113 123 283 -226 -67 41 -107 -441 -113 327 37 -524 -242 270 137
3680A37j83K28n5k88o8K00L27k83l95N38J6k14P8M24l35r51M09R46l75k60n8M32
$$ 137 -46 182 127 -161 -229 -29 298 15 -380 158 174 -40 38 462 127 -824 -415 531 156 -104 -162 270
3702B70j49m19N88M34q95l17M46J25j18k78N31k27m24o9O69J31n59l37N79M31
$$ 270 121 -298 290 724 -171 -488 -42 83 -35 -313 218 -9 -433 -502 167 298 -261 -598 -19 412
3722D12l83K0K49j03n62K60P38m3j069J55K68P5k22K29O59p47m02N26O21o17l61
$$ 412 29 49 298 195 -367 -107 631 588 -481 -326 -58 17 -205 24 683 -64 -466 60 681 64 -297
3743b97J38M77m01m4L3L18m01K8J86O73m21p49M74P9k44K0L28j24j81L03N56o23
$$ -297 -159 318 -83 -127 -94 224 -177 -149 37 710 289 -460 14 93 -151 -131 197 73 -108 195 751 128
3765A28l29J77L01m28N5M13l8j62l69N72k12J41r7j10L7m39Q0N05j55m22n0M70
$$ 128 -201 -24 277 -151 -96 317 279 117 -252 320 108 249 152 42 79 -360 -280 225 70 -352 -402 68
3787F8K15n53K57J47j22l76L60N8J47m26M4J85J2k07%L84q6l70K19O13o67k03
$$ 68 283 -270 -13 134 12 -364 -4 54 201 -225 -181 4 16 -191 -191 193 107 -263 -44 569 -98 -301
3809c01NM86q5r7L28Kk58m73O93R5n18M1p6jK56l43N14j85l12k41N68m2M8k09
$$ -301 -296 190 105 8 336 338 80 -393 300 395 -123 -82 -158 -159 97 -246 268 83 -229 -470 98 56 104 -105
3833a05j07R4j26M17L9j47j58o2Q1P0K14j47k44m8L00KK44j37k45l57L37L8J4
$$ -105 -212 -118 -244 173 212 65 -93 -155 -74 -4 210 63 -181 -229 71 73 317 180 -65 -422 -85 -47 -33
3856c3N5K09m30M7K41k76L8K32j39p4k07L34KJ3p8p5K60r1l6n8q7OL37K23j40
$$ -33 22 231 -199 -152 89 -187 -149 83 -56 -130 -337 -3 -1 12 -66 -141 119 28 -8 -66 -153 -147 190 413 273
3881B73j91l53L81Q9k10k9o5J40j05P7J41j86j97k27N20J00l0q6M5l34M0M0O13
$$ 273 82 -271 110 199 -11 -40 -105 35 -70 7 148 -38 -235 -462 58 158 128 42 87 -247 -207 -167 446
3904D46l27K3n78M31L48k26k2q7j45K37J13P7J13n57O4J27K56j32n6j92K03k49
$$ 446 119 142 -436 -5 343 117 95 8 -137 100 213 290 403 -154 -90 37 293 161 105 -87 116 -133
3926a33J02J54K09l1m59k42L52j34K36k29j31J85k3K76r8J83m02K22j14K48J44
$$ -133 -31 123 332 301 -158 -400 -48 -182 54 -175 -306 -121 -144 132 34 217 -185 37 -77 171 315
3947C15n54K89j61j26K61L53k90k07j19J54M8J36j24K4q8R9mK33p6m44r9M20N9
$$ 315 -239 50 -111 -237 24 377 87 -120 -239 -85 -37 99 -25 -1 -89 10 6 239 163 -281 -380 40 99
3970I9K95j64m63j62M53J52R4o5k31j70L58P4L3k37r0Q8k33J98p3J73n1k79J16
$$ 99 394 230 -233 -395 58 210 304 239 8 -162 196 270 303 66 -24 64 -169 29 -44 129 78 -201 -85
3993h5M25m49M8j61K86M5j25O7j77J10l00M01N0j23K49n06K50K32j91R1L1Q7k49
$$ -85 340 -109 -61 -222 64 109 -16 51 -126 -16 -316 85 135 12 261 -245 5 237 46 137 168 255 6
4016Fj03J25M30k32k39l83K37J81k1k2j21K01m20K87L48j35l64L14M3l07J11o4
$$ 6 -97 28 458 226 -13 -396 -159 22 1 -21 -142 59 -361 -74 274 139 -225 89 132 -175 -64 -128
4038a28O2q8l67J32N23m2j19m43N71K10p0j42l27J67J41l64K86L37m02P0j37K44
$$ -128 -66 -154 -521 -389 134 92 -27 -470 101 311 241 99 -228 -61 80 -284 2 339 -63 7 -130 114
4060A14J5J71j5j17l51r7M77o9k09l70K26J72J80j78P0J0l45o1L68Q3J50k80j
$$ 114 129 300 285 168 -183 -280 197 128 -81 -451 -225 -53 127 -51 19 29 -316 -377 -9 74 224 -56 -57
4083e7K60k29l2J3N3j18m6K86K27n25k87J99K46K82j66J50l51P2P9Pn5m0J80k20
$$ -57 203 -26 -58 -45 8 -110 -156 130 357 -168 -455 -256 -10 272 106 256 -95 -23 56 63 8 -32 148 -72
4107g2j31j44N53n68J47K65K17l18j51L92j88p4j47L03M40o39P6L6j04j44J62
$$ -72 -203 -347 206 -362 -215 50 267 -51 -202 190 2 -72 -219 84 524 -115 -39 -3 -107 -251 -89
4128h9N12l14m90R3N22p9k67m9N7K5r5K33J76k99J64l13M08q4k77K35O1l66K98
$$ -89 423 109 -381 -288 234 155 -112 -161 -104 -79 -174 59 235 -64 100 -213 195 111 -166 69 130 -236 62
4151F2J26J1k64l40M03L53n41R0J53L8l14j04N99J23n40k92K61J24j87K73K7j19
$$ 62 188 199 -65 -405 -2 351 -190 -100 53 91 -223 -327 272 395 -145 -437 -176 -52 -239 34 61 -58
4173e8k75K31L95K26o01J72j32p7J27L26l60l13LK94J13j23k1K62k21j41L34K48
$$ -58 -333 -102 293 519 -82 90 -42 -119 8 334 -26 -339 -336 -42 71 -52 -73 189 -32 -173 161 409
4195D09k33o30L17M64K8m80J27J72k13m44M65J35j43m71M20K44k27L26j64j48
$$ 409 176 -454 -137 327 355 -125 2 174 -39 -483 -18 117 -26 -497 -77 167 -60 266 102 -46
4215d6j41l1N92k76m52K88J08k80J60j82N36k96l54N5N51L1o47K97K17J88n07
$$ -46 -187 -218 374 98 -354 -66 42 -238 -78 -260 276 -20 -374 -319 232 263 -384 -87 130 318 -189
4236a89J97K22r0m79L36J13K56n18l5L02j35l39N70K18k72n49M52J54m12J7K30
$$ -189 8 230 140 -339 -3 110 366 -152 -187 115 -20 -359 211 429 157 -392 60 214 -198 -181 49
4257D9K50n62J75P76m71m89P5L80k88O2K36J70m40k34N0L71j00k96M94r0J7l58
$$ 49 299 -263 -88 688 217 -272 -197 183 -105 -43 193 363 -77 -311 -261 110 10 -286 208 118 135 -223
4279b23N52l44j70L2N68nn56j4K50n4m64L24J95ln12j56N38O21o57N6M2P7k35
$$ -223 329 -15 -185 -153 415 410 -146 -160 90 36 -428 -104 91 88 -424 -580 -42 579 -78 -22 20 97 -138
4302a38K45J54m86l50L13M74j88J41P1Q0l37m37O26J8k91l65L80K89j80l60P20
$$ -138 107 261 -225 -575 -262 212 24 165 236 316 -21 -458 168 186 -105 -470 -90 199 19 -341 379
4323C79j89m59QO98j58l82m5QQ0k00K05L29o6m76K73R6j30j98J69K83k32j38L26
$$ 379 190 -269 -261 437 279 -103 -148 -140 -60 -260 -55 274 208 -268 5 101 -29 -227 -58 225 -7 -145 181
4346A81j67k7m82N95N5k3m33L99k77m3L14J20Rm47P5J14J02p7O3N45n68l75J11
$$ 181 14 -13 -495 100 155 132 -301 98 -179 -222 92 212 221 -226 -151 -37 65 -12 51 596 28 -347 -236
4369b36P01l23o51L93L84l91jK03R9j68l40L59M74o65k6L09k2n43K80K93k90o
$$ -236 465 142 -509 -116 268 -123 -124 79 178 10 -330 29 503 -162 -188 121 99 -444 -164 129 -161 -167
4391a67k65P35l5l59n3J36j87j67K94K55K61o54P5L34k30o0j89M07K1l6J75j05
$$ -167 -432 303 268 -91 -144 -8 -195 -362 -68 187 448 -206 -131 203 -27 -87 -276 131 152 116 291 186
4413A86j44j03k82M10j1k80M78j84j35p2M24l26j07o6L28K50m69J29nQ3l83L71
$$ 186 42 -61 -343 67 56 -224 254 70 -65 -137 287 -39 -146 -212 116 366 -103 26 21 104 -279 92
4435I2j9J2m84N25j52R9j06K1M79p93J6M43K62n28k75L94J20m01k44P85J98n84
$$ 92 73 85 -399 126 -26 73 -33 -12 467 -326 -310 133 395 -133 -408 -14 106 -295 -539 246 444 -140
4457a40p9R6L07j15j49K39j85j18K34j91J42l92J43L31k83K2J6nJ58l14K52L08
$$ -140 -219 -123 184 69 -80 159 -26 -144 90 -101 41 -351 -208 123 -160 -138 -122 -127 31 -283 -31 277
4479B77j2m18L61j50k60j75O18k11k45K77L4M74o49n6K08j01j8j38N04k04o38
$$ 277 265 -153 208 58 -202 -377 241 30 -215 62 96 570 -79 -135 73 -28 -46 -184 320 116 -522
4500e22L32N91j44n01R4K97k76JN0L62l36n5k66O07o30N38j42k45K85l58N65n11
$$ -522 -190 401 257 -244 -150 147 -129 -128 -78 284 -52 -107 -373 234 -396 142 0 -245 40 -318 247 -264
4522b64L97m09K23K83k07M1j04k94M09k9K19m37M8j19L93l83j48M61Q3k96k16
$$ -264 133 -276 -53 230 23 64 -40 -334 75 46 265 -172 -124 -243 150 -233 -381 80 163 -133 -349
4543c49M77o5J01j33M4j16Q6j46P3L50l40m27K52L90k86j13J81K66j91j10L50
$$ -349 128 63 164 31 75 -41 45 -101 -28 322 -18 -445 -193 197 -89 -202 -21 245 54 -56 294
4564B94k98j71J1o3M00J28m30j14O7m0R0J81j08K7l7J43r4J1j20K75j33J9j24
$$ 294 -4 -175 -164 -227 173 301 -129 -243 -176 -216 -126 55 -53 -26 -63 80 -14 -3 -123 152 19 38 -86
4587h6K21k26L3R2j3J01k5k14K59j70o9M91m08J29q0nP2l21L31K67n18k42N66
$$ -86 135 -91 -58 34 21 122 97 -117 142 -28 -97 394 -14 115 35 30 102 -219 112 379 -139 -381 185
4610A85J41k51o5Q5l12K79j21j4J01j37k3L2J93j92K00r7j19M5j95M26j11j24
$$ 185 326 75 10 95 -217 62 -59 -73 28 -109 -132 -100 93 -99 101 4 -115 -70 -265 161 50 -74
4632g4l9L7L09k35L44k11m7l19J84R1J15j34m80M20L9M61n90r4J33NJ77q0K72
$$ -74 -113 -76 233 -2 342 131 84 -235 -51 40 155 21 -459 -39 0 461 -129 -223 -90 -85 92 12 284
4655B84k58j40N8J88J90j35J8l30n9Q1J00q3n5J33q7J77k96K8K19j43J31q5n6
$$ 284 26 -114 -56 132 322 187 205 -125 -184 -103 -3 -86 -141 -8 -95 82 -214 -186 33 -110 21 -64 -120
4678a20K39j40J35k33K85m5jk22j42J04K85M2K97l21j0k32m4K96M9l27jM2j60
$$ -120 119 -21 114 -119 166 121 120 -102 -244 -140 145 187 484 163 153 -79 -123 173 222 -105 -106 -64 -224
4701b24M38k68j40K17j50j08L63jRJ0l18n2L58q9K1j14l78O11j33J94l48q7L46
$$ -224 214 -54 -194 23 -127 -235 128 127 136 146 -172 -224 134 45 66 -48 -426 185 52 246 -102 -189 157
4724A57j25j72K04M2l90JK20Q1rK46k25N1k86M79j08j19L9j69K43m4k54K50j63
$$ 157 32 -140 64 106 -284 -283 -63 18 9 255 30 81 -205 274 166 47 86 -83 160 116 -138 112 -51
4747e1K30k11K97l93J34r3nJ7L92j32n03J35m1J90J20J32k71m2K44k91M13j92
$$ -51 179 -32 265 -128 6 -87 -92 -75 317 185 -318 -183 -224 -34 86 218 -53 -95 149 -142 271 79
4769G9m71M50k24r5M68l34J85j04o6K21n62K98J66j49K33j64L52k52j4P6n7l09
$$ 79 -392 58 -166 -261 207 -127 58 -46 -112 109 -453 -155 11 -138 95 -69 283 31 17 93 36 -273
4791b73L96R6l04J57k9q6M71m36j69K99m28J33K64K03k40m44M45N1k82L87n1K26
$$ -273 123 219 -85 72 43 -43 428 -8 -177 122 -306 -173 91 294 54 -390 55 106 -176 211 160 386
4813C86m12j76J21N08k48k98p9N5k81L41O7o7M4K38r5J95j53k16p0K57L7Lk50
$$ 386 -26 -202 -81 427 179 -119 -198 -143 -424 -83 -16 -83 -39 199 104 299 146 -70 -140 117 154 157 -93
4836i3J60r1j09Q4J26J29q5q4k17K42j21J46M70r56O26k38j16K02q6j07p6O8L32
$$ -93 67 -24 -133 -49 77 206 121 37 -180 62 -59 87 557 -399 227 -11 -127 75 -11 -118 -194 -126 206
4859B06j57K5P2q6J8j40P6K15l13K3p0j58M12j06O0P7l55j5J76L84j32l24R2L31
$$ 206 49 74 146 60 78 -62 14 229 -84 -61 -131 -289 123 17 77 154 -201 -216 -40 344 212 -112 -20 311
4883C11k54j22J53o8k14L96k98J12k38L67n0j23n1J64k06j9j94J84J81J66j2l18
$$ 311 57 -65 88 20 -194 202 -96 16 -222 145 95 -28 -79 85 -121 -140 -334 -150 31 197 185 -133
4905a33J92M19l42k29J06k41j36K94L11l16J16QJ71j31j3j46RJ00l70L76K20n76
$$ -133 59 478 136 -93 13 -228 -364 -70 241 -75 41 49 220 89 76 -70 -61 39 -331 45 265 -311
4927c11K17L74k73l71L36J22j38j56R7L77l34M8J7j0M2r4j59N46l76J01j09K31
$$ -311 -94 280 7 -364 -28 94 -44 -200 -103 274 -60 -12 5 -5 37 -57 -216 330 -46 55 -54 177
4949A77m47%J35K74p4l79M92jo8k54K33Nj83J86J11j07k24N6P0J99j72l21M58
$$ 177 -270 -270 -135 139 65 -314 178 177 109 -145 88 93 -90 96 207 100 -124 -68 2 201 29 -292 166
4972A66j80j03M3J36q5j4J43j33j16LR6N63p96J3L42J88k30n32M47j44M1q3L17
$$ 166 -14 -117 -74 62 -23 -37 106 -27 -143 -140 -44 519 -277 -264 78 266 36 -496 -49 -193 -152 -235 82
4995H2j35j26K08P8P5k76K70j70l18K90m8M33l34j03J11o7K04l98J78M37k66j43
$$ 82 -53 -179 29 107 182 -94 176 6 -312 -22 -70 363 29 -74 37 -30 174 -224 -46 391 125 -18
5017a8J96k96k16r6O15J42k82L7J35J15m24L35k20K94n35K37K54k10o3k08M30
$$ -18 178 -118 -334 -430 185 327 45 82 217 332 -92 243 23 317 -218 19 273 63 0 -208 222
5038B22k23J35k04J07k93J77J84j06K50m22K95L5j06j32N2N4l9m27M94M38k25
$$ 222 -1 134 -70 37 -256 -79 105 -1 249 -173 122 157 51 -81 -29 25 -14 -441 53 491 266
5059B66k58N0M32p14J36J98j01l34j7M85J4k84J55J78k67k60R2N20j75k5p4m1
$$ 266 8 58 490 -224 -88 110 9 -325 -342 143 157 -127 28 206 -61 -321 -229 291 116 91 17 -24
5081b4j68O9M77l24j85l92O62J57k77j22k31M09q2n9J4J77l29J95l6O4K58k63
$$ -24 -192 -123 354 30 -155 -547 115 272 -5 -127 -358 51 -31 -90 -76 101 -228 -33 -69 -5 253 -10
5103a0J4R0j11k79N74j26o24L13K00q5l6K13o25M41l56Q03j45l77l65N19k8l2
$$ -10 4 94 -17 -296 278 152 -472 -159 41 -44 -80 133 -492 -51 -407 396 251 -126 -491 28 0 -32
5125c2j37R1L40m17J16R7K65p12N20m96L93nj49L32j91m69J29L83L77m60k15K71
$$ -32 -169 -78 262 -155 -39 58 323 -389 131 -365 28 23 -126 206 15 -454 -325 58 435 -25 -240 31
5147C1RJ04j39R7r9j71M91r3j89k26K79j52n9N7rJ44m9j28m7J22p6J58r7J42m49
$$ 31 40 144 5 102 3 -168 323 230 41 -185 94 -58 -117 -60 -69 75 26 -102 -149 -27 -103 55 -42 100 -349
5172c49M33j73L36n81M03J9j18k0K80n8m39Q4J81j8l5k19K27J56l11P8K91J04
$$ -349 84 -89 247 -334 69 88 -30 -50 230 172 -267 -183 -2 -20 -55 -274 -47 109 -202 -124 167 271
5194B71m01p3L7L10l17J34l7j08l9K30K34k68jj13K43N1n7k13J83j74J32J44k4
$$ 271 -130 -203 -166 144 -173 -39 -76 -184 -223 7 241 -27 -28 -141 102 153 96 -117 66 -108 24 168 144
5217A44R8l88mL55m24M21j37J04k31KK25j0%k40K45l72J24j7oJ95k83j28K03K45
$$ 144 242 -146 -150 205 -219 202 65 169 -62 -60 165 155 155 -85 160 -212 -88 -105 -111 84 -199 -327 -124 121
5241A21K3m20j3N14k78R6J65J51l02j37J9L41l01Q4J6j24k18j75K75J65l29K99
$$ 121 144 -276 -289 225 -53 43 208 359 57 -80 -61 280 -21 63 79 -45 -263 -438 -163 2 -327 -28
5263b8K43k99M0P2o3P0p2J25j09K9k97M90l86K52m12O33n31J33R0M2mK78j24j47
$$ -28 215 -84 -44 28 -35 35 -37 88 -21 8 -289 201 -185 67 -345 288 -243 -110 -20 22 18 296 172 25
5287B5oPJ82m05j12J18J14N9K32k62p7K99J69m04K47l13J37L2j92L70k71k77N76
$$ 25 19 26 208 -197 -309 -191 -77 -18 214 -48 -125 174 343 -61 186 -127 10 42 -150 220 -51 -328 248
5310B48m22J49J09oj93j68K03j49Q9L67n77N87j75L8l5K71r6o20L02K35k83j17
$$ 248 -174 -25 84 78 -115 -283 -80 -229 -140 227 -350 237 62 100 65 336 240 -380 -78 157 -126 -243
5332b43J51R8q7%J76n5o2k18K90n2J58m07K22R6k09K08L4l84R0M24j94l82M42
$$ -243 -92 6 -81 -81 95 40 -22 -240 50 -2 156 -251 -29 67 -142 66 100 -284 -194 230 36 -346 96
5355I6N4l44K94Jk2n71O68o9j58J24m23M61K13j19n35J95R6jK70j4k81j7K3J23
$$ 96 150 -194 100 101 79 -492 176 107 -51 73 -350 111 324 205 -330 -135 -39 -40 230 216 -65 -82 -59 64
5379F4J15q0k02k31M77j35K76l65J73k1k6l23J67o6o7L43o9l38J50L34l22J76
$$ 64 179 99 -103 -334 143 8 284 -81 92 71 45 -278 -111 -177 -244 99 30 -308 -158 176 -146 30
5401C0l16M00j5J17m71M97j48J2P5J28m48J71j32L8K53j72r6J01j87K57j18j76
$$ 30 -286 114 99 216 -255 242 94 106 181 309 -139 32 -100 -62 191 19 -77 24 -163 94 -24 -200
5423b00L66p7k12J16L13l91J54l27K0J21N06l67K63m89J84l4P3Q9k12O7N5N3J23
$$ -200 166 89 -123 -7 306 -85 69 -258 -238 -117 389 22 285 -204 -20 -54 19 108 -104 -37 18 71 194
5446A94Q9q1p8P3k37j37K54m2k1J50k90J86o7J65k25P0p4QK75l79P4j39L20n9
$$ 194 283 202 124 197 -40 -177 77 35 14 164 -126 60 -7 158 -67 3 -71 -63 212 -167 -93 -232 88 29
5470B9r4O7j54N9J05l0K77k54k15K6K93J0k08P3J58l07p6L98Pn7j14L7L5J17j98
$$ 29 -65 2 -152 -93 12 -18 259 5 -210 -184 109 119 -89 -16 142 -165 -241 157 164 107 -7 30 65 182 -16
5495a6J19o3k27J32J48J52km14J40R3l30M19o7j66J35L3j61J71O9J20l94M5j21
$$ -16 103 40 -187 -55 93 245 243 -171 -31 62 -268 151 84 -82 53 86 -75 96 165 285 -109 -64 -185
5518a85J49j33R5L8o9J96m1n9p5L6j9L8L8J13k86j34J82J76j05o9k4K34l23L91
$$ -185 -36 -169 -74 -36 -105 91 50 -9 -84 -48 -67 -29 9 122 -164 -298 -116 60 -45 -114 -138 96 -227 164
5542A64lm2l25qM17k0k94J71K63m76l09L03K95k14k99M78J4L5k27o1J09j65J34
$$ 164 161 119 -206 -214 203 183 -111 60 323 -153 -462 -159 136 -78 -377 101 115 150 -77 -138 -29 -194 -60
5565f0J21k76J02L06l55K21N4l39J50J96p7J60p7m5J23l28k29P2K38Q2J96l48
$$ -60 61 -215 -113 193 -162 59 113 -226 -76 120 43 203 126 81 204 -124 -353 -281 -43 39 235 -113
5587a13J83j40J08pK47j69j01k3j36J30r7J65J4r2J19k67K86O1l72j80K03K95
$$ -113 70 -70 38 31 278 109 8 -15 -151 -21 -118 47 61 -31 88 -179 107 168 -204 -384 -181 114
5609A14j36J7j00J29J16j68J71rJ0k85N6J78k66p9L31pj86n2NL57k34j28L54j51
$$ 114 -22 -5 -105 24 140 -28 143 134 144 -141 -85 93 -173 -252 79 72 -114 -166 -161 196 -38 -166 188 37
5633C7m5k4J1JOm3J48J29l38n2J9N03m38R5n5L8J05L5R8Mm10J68q8k58K50L62
$$ 37 -8 -32 -21 -20 -14 -57 91 220 -118 -170 -151 352 -86 9 -46 -8 97 132 230 234 -176 -8 -96 -354 -104 258
5659B58k52j06j69P8k8J6J97j74J92k25M6L49j75l93K67J69L14m78J02M76m51
$$ 258 6 -100 -269 -191 -219 -203 -6 -180 12 -213 -167 182 7 -386 -119 50 364 -114 -12 464 13
5680A3R4p1J17J19o10L45J34l99J18K72l18MJ56mM07n45j9L0M64n26J14N0J30
$$ 13 107 36 153 272 -338 7 141 -258 -140 132 -186 -182 -26 -30 377 -168 -187 -157 307 -219 -105 -55 75
5703G5r1J2K25n2l41k89O98q3k35r8k7K36k73J58M4M3J98l4J56l76N1n4O2q4k23
$$ 75 -16 -4 221 169 -172 -461 237 154 -81 -179 -206 30 -243 -85 -41 2 200 166 322 -54 -3 -57 5 -79 -302
5728c02J55J65j17J60j20L15j49j9q1J33k81j30J69M77k14j32L85o12J3L3M51
$$ -302 -147 18 -99 61 -59 256 107 88 7 140 -141 -271 -102 375 161 29 414 -198 -185 -152 299
5749B99j94l57M32M2k31l0L04k08j02o2n6M30k29j21L75j37p5k66J53P5j55p2
$$ 299 105 -252 180 222 -9 -39 265 57 -45 -107 -163 267 38 -83 292 155 80 -186 -33 42 -113 -185
5771a85J53R5m4k62K24K08k38o9K24L26n92J27J60o1K5r8r2N3P7N9M01n04k07
$$ -185 -32 63 19 -243 -19 189 -49 -118 106 432 -160 -33 127 66 91 -7 -99 -46 31 90 491 -13 -220
5794b20L87l6l59R1K23m4Ol42L47K06k92q9K24j78K61l32L08J28n46L7L01o0k01
$$ -220 167 131 -228 -137 86 42 48 -294 53 259 -33 -122 102 -76 185 -147 161 289 -257 -220 81 21 -180
5817a80L9J54j0J71j01J89m76L10J2J19j11q6K30q0j73m1L15l24J42l09L2N55
$$ -180 -141 13 3 174 73 262 -214 96 108 227 116 30 260 180 7 -34 281 -43 99 -210 -178 377
5839C77m5l17J85r9j80j07K85K02l67r8M71r9O7k77M42o76RM28l3m21J4L59Q8
$$ 377 332 15 200 101 -79 -186 99 301 -66 -164 307 208 275 -2 440 -236 -227 201 168 -253 -239 120 208
5862B08n31K41L32q9n75M00J87J20j23l91L13k83j03N81J02j4k63k79J58O0o02
$$ 208 -323 -82 250 161 -414 -14 173 293 170 -221 92 -191 -294 287 389 375 112 -167 -9 51 -551
5883e51N45L35l59P7r4J77p4j50J45j23L01n34L13p6j09K26J13m45K58j08L16
$$ -551 -6 329 -30 47 -47 130 56 -94 51 -72 229 -305 8 -68 -177 49 162 -283 -25 -133 183
5904A83OJ54j71m24K47j86K25K18k94NJ96k25L89l32J6L31l85j1q6J88K46o8k10
$$ 183 189 343 172 -252 -5 -191 34 252 -42 -37 159 -66 323 -9 7 338 -47 -58 -144 44 290 222 12
5927A2l8J89k09P1ok4K8J17l5k4L3Mj31J34k74L28q1m2j24K58j08k27RR4r7K32
$$ 12 -26 163 -46 25 19 -5 23 140 105 81 114 118 -13 121 -153 175 94 52 -72 186 78 -149 -140 -46 -143 89
5953H9j12N2k33J20%P6J34j28k00K3r0j6M11J58j03m31L19J55l05n7J96M2O3j64
$$ 89 -23 29 -204 -84 -84 -8 126 -2 -202 -179 -269 -285 126 284 181 -250 69 224 -81 -138 58 100 163 -1
5977aJ89k1J71k66n1j41K04j96L39L8l61q8N3R1r8j03J00k9J16Q6L78l55j20L05
$$ -1 188 167 338 72 21 -120 84 -112 227 265 -96 -184 -131 -40 -138 -241 -141 -170 -54 32 410 55 -65 240
6001B40K73n44L7K78l30J13k86M92m58L3J53l70M51n6O1k98K12k6M1Ok6N7j59
$$ 240 513 -31 6 284 -46 67 -219 273 -185 -152 1 -369 82 26 87 -211 1 -25 16 22 -4 53 -106
6024a06O9J72j19K59j65j73j81L27J81j69J17m25L31l26J90L5L18m52k2K36M2
$$ -106 -37 135 16 275 110 -63 -244 83 264 95 212 -213 118 -208 -18 17 335 -117 -139 97 139
6045A39p9p3L96k62o4N4j8J91l71J43M7j48j4j4J30j63J91j37P6O7l33L03k34
$$ 139 60 -13 383 121 57 111 93 284 -87 56 103 -45 -59 -73 57 -106 85 -52 24 91 -242 61 -173
6068a73L76l87K65j65j32M01K6j34j69L85m32J68k26M21r5k21J50j97L24k53K0
$$ -173 203 -184 81 -84 -216 185 211 77 -92 293 -139 29 -197 224 129 -92 58 -139 185 -68 -48
6089d8l9q5L44O0n28M65j53j32J33j15J80J73l63K79k01K25j03j06J21k49J60
$$ -48 -87 -172 172 232 -296 169 16 -116 17 -98 82 255 -108 171 -30 195 92 -14 107 -142 18
6110A8P7j04q8j28K33l7n3Q3J76j27j72J43J86o6l4Nl33Q0J75OQ9l59K47j62J00
$$ 18 95 -9 -97 -225 8 -29 -82 1 177 50 -122 21 207 141 107 112 -221 -141 34 40 129 -230 17 -145 -45
6135d5k49Q6L67k81M69k45J43l50L18k39J21p5J09J59k44j30j16L93J79m32J97
$$ -45 -294 -208 159 -122 347 102 245 -105 213 -26 95 20 129 288 44 -86 -202 191 370 -62 135
6156A35M6l54J80L93m54J76O9J2L6n9k49lK30k95J64n7K7K13m01Q9J25P5K7K29
$$ 135 181 -173 7 400 -54 122 191 203 239 180 -69 -72 158 -137 27 -30 -3 210 -191 -102 23 98 125 354
6180C54o00L20j3j12j19L9K66L58l54J15l40q5M42m48L5L24j08j30j5J5j3q5K51
$$ 354 -246 74 61 -51 -170 -131 135 493 139 254 -86 -171 271 -177 -142 182 74 -56 -71 -56 -69 -154 97
6203I7J10j17J97l37L14n3l37J3J48J01k26K08lj69K00n6J37k02m2J65K73m20
$$ 97 207 90 287 -50 264 211 -126 -113 35 136 -90 118 115 -54 146 90 227 25 -17 148 421 1
6225AN2JK4q7L3J23j07q1O2l3j41Q8j86N39l95j81K27j57K11J20k05M17l65j8
$$ 1 53 54 78 -9 24 147 40 -41 21 -12 -153 -65 -251 288 -107 -288 -61 -218 -7 113 -92 325 -40 -58
6249e8J5K73l47K70nj44J79j04J28l36K90j42K79l92J39Q8m8j93R0J42r0Ok30
$$ -58 -43 230 -117 153 148 4 183 79 207 -129 161 19 298 -94 45 133 85 -108 -18 124 34 40 -190
6272a90J35rQ9J31j04J9l4j12Q9K87j59m26K20m9J36M4m6p9O1J52j64oj70J19
$$ -190 -55 -64 25 156 52 71 37 -75 14 301 142 -284 -64 -113 23 67 21 -58 3 155 -9 -15 -185 -66
6296f6n9rK33R4k24j65J21L8J21NJ72j30j48J51K0%q3k43J67N8j1k75L0L49l65
$$ -66 -125 -134 99 193 -31 -196 -75 -37 84 89 261 131 -17 134 154 154 71 -172 -5 53 42 -233 -203 146 -219
6321b19J05J98MJ63n02N5L34M6k84q3L49k38L4m6K6M6J7J19L5k18M2K10k14k9
$$ -219 -114 84 88 251 -251 -196 138 184 -100 -183 166 -72 -38 -84 -58 -12 5 124 159 -59 -17 193 -21 -50
6345e0J03J3J58j96OK4j44J54j49k1L03l34j22K60Mj70M05j91q3n6K45p1j79j69
$$ -50 53 66 224 28 34 58 -86 68 -81 -102 201 -133 -255 5 9 -161 244 53 -30 -86 159 88 -91 -260
6369b60J8N15l06N6J64n2m60R5K62M2j74j07O3K09j03j2J35n1k52J80J60o6l90
$$ -260 -242 273 -33 23 187 135 -325 -230 32 74 -100 -207 -144 65 -38 -50 85 34 -218 -38 122 56 -334
6392c34K69L15l35K92k84j25L42k14N1L97m18k12p0K59K57j94K09q8k78L74l52
$$ -334 -65 250 -85 207 -77 -202 140 -74 -23 374 -44 -256 -326 -67 190 -4 205 117 -161 213 -139
6413a39J75j08J93p3O6O8k31K57q2k75j25J97j71M25q7r8m1j23M58r5j57L1j83
$$ -139 36 -72 121 48 114 182 -49 208 126 -149 -274 -77 -248 177 90 -8 -49 -172 286 191 34 65 -118
6436a18p8O5J98J25l24R9P7j1m7k63J64l8K96j87l6L02k66l1J40n9l1N0j90K34
$$ -118 -196 -131 67 192 -132 -33 44 33 -14 -277 -113 -151 145 -42 -78 224 -42 -73 67 8 -23 27 -163 71
6460G1k42J37J62Qj64m4K32j08n1k93N91k99j24k02L39j87K66m4J89k81N5j24
$$ 71 -171 -34 128 136 -28 -72 160 52 1 -292 299 0 -124 -326 13 -174 92 48 237 -44 11 -113
6482a13L34j22l37pL65n9l98L34M7r2J47q4L0j65k9L41j49n2K20l96J98n0j37
$$ -113 221 99 -238 -245 120 61 -337 -3 44 -48 99 15 45 -120 -149 192 43 -9 211 -185 13 -37 -174
6505a74N84j35m11J53j49J26k16Q7L52k86r4N56q1k76J06j05J16l87J60P3J64
$$ -174 410 275 -136 17 -132 -6 -222 -135 217 -69 -163 393 312 36 142 37 153 -234 -74 -1 163
6526A63q4j64K31k62J23k45L51m4j01p1L44k24j9J62j36J70m97M8N43m46K72k39
$$ 163 79 -85 146 -116 7 -238 113 69 -32 -103 241 17 -2 160 24 194 -303 -255 288 -158 114 -125
6548a25J23P4k23j17K21J22n9n1k03J07q4K44K13o27L40J83k22O6J36J29j22k63
$$ -125 -2 72 -151 -268 -47 75 16 -35 -238 -131 -215 29 242 -385 -45 138 -84 -18 118 247 125 -138
6570a38j82L13l87M94l17K65j17J5J9M05m25R6M1r1Pj75J09K39k5M0R4j19j42
$$ -138 -320 -7 -394 100 -217 48 -69 -54 -35 370 -55 41 82 -9 -2 -177 -68 171 146 186 280 161 19
6593A9J7J83k75O6l05K61NK21j41O5l40K42k52J97j10j08J48K68q9l94M64j71
$$ 19 36 219 -56 10 -295 -34 -29 192 51 116 -224 18 -234 -37 -147 -255 -107 161 72 -322 142 -29
6615b9r5k26N10p0J14r4l55J65L85j31k72L18N3k35o0j15k16K99J94q8k22o2J45
$$ -29 -124 -350 160 90 204 110 -245 -80 305 174 -98 220 273 38 -22 -137 -353 -54 140 52 -170 -232 -87
6638h7K99j31o10N23P4pk58K8L22m01L52Jl7m7J18j73j43K84k12j47J68J28J1
$$ -87 212 81 -529 -6 68 61 -197 -169 153 -248 104 105 68 21 139 -34 -177 107 -105 -252 -84 44 55
6661E5J01J7j66m0M2j29M04k53L11k61j65M5R2j33k17M67k94L57k43J10j21l6
$$ 55 156 173 7 -33 9 -120 284 31 342 81 -84 -39 53 -80 -297 170 -124 233 -10 100 -21 -57
6683e7J4Qk38L79J02j97K36k02J15m0k49L21k18L68k90R1j72L3K52j66r7n9j53
$$ -57 -43 -35 -273 106 208 11 247 45 160 120 -129 192 -26 342 52 143 -29 4 256 90 -7 -66 -219
6706b19K89M33k89k40J71j39J34j04k56R8L26k90Nj10J45Q8L10k25o0J0K29n5
$$ -219 70 503 214 -26 145 6 140 36 -220 -122 204 -86 -81 -191 -46 42 352 127 67 77 306 251
6728B51j17l38Q5K14j14j0J32N4j54j63J70j40p5L88k11R1J4k74k0K04j35J65
$$ 251 134 -204 -119 95 -19 -29 103 157 3 -160 10 -130 -205 183 -28 63 77 -197 -217 -13 -148 17
6750A7P6k52K59k1n10L54K47l31J22N7k4k2K48k35rj13K77k46j94N24l14K20p3
$$ 17 93 -159 100 79 -431 -77 170 -161 -39 18 -6 -28 220 -15 -24 -137 140 -106 -300 224 -90 130 57
6773E7J11j32m19M29j73J34L1J65j19J98k23J69n36K66q0J33k36J45l2k4J65j18
$$ 57 168 36 -383 46 -127 7 38 203 84 282 59 228 -308 -42 -122 11 -225 -80 -112 -136 29 -89
6795h9L33l84R9R0J31j22J73l23O1L25k57J2k98M09r7p4k59J6N61k14J45l98L15
$$ -89 244 -140 -41 49 180 58 231 -92 -31 294 37 49 -249 160 63 -11 -270 -254 307 93 238 -160 155
6818A55o2K3l31J51J57M9%k23J66r6j60K44j60k63L31kr9j77J51J16J15K46n42
$$ 155 93 116 -215 -64 93 142 142 -81 85 -11 -171 73 -87 -350 -19 -21 -120 -297 -146 -30 85 331 -211
6841b11K48K4K07k44l5K67m54N16m80L49j84k82M81k20k6j35K26j31j04j7K96
$$ -211 37 61 268 24 -11 256 -198 318 -162 187 3 -279 202 -18 -44 -179 47 -84 -188 -205 91
6862I1j09l5j17M17k89L01k14j43m3oK49l16K09K9j22J37M9k03K11p6j01L37m35
$$ 91 -18 -53 -170 247 -42 259 45 -98 -141 -147 102 -214 -5 24 -98 39 88 -115 96 20 -81 256 -179
6885a79O5MJ86k32K0L07k64j82L04M11m78L23k54n2j28M0K03o2O5K47k97J82n80
$$ -179 -114 -110 76 -156 -136 171 -93 -275 29 440 -38 285 31 -21 -149 -109 94 32 97 344 47 229 -351
6908c51K24M89j17N9k21Kj48q9nM18k89K04k36K70j38j27P2j96PL23o1r5r8r5
$$ -351 -127 362 245 304 83 85 -63 -152 -157 261 -28 176 -60 210 72 -55 17 -179 -172 151 90 -5 -103 -198
6932a98O5q6K85j09J53m75K26l22M48K00o58N00Q6l60Q4L25n7n07M63O9l0Q5j44
$$ -198 -133 -219 66 -43 110 -365 -139 -461 -13 187 -471 29 115 -245 -161 164 107 -400 63 132 102 187 43
6955D3m2K8J63r3m5j22K24n26N19l36K00O0l8R2j90J81l12J59k00J51J57N7N5
$$ 43 1 29 192 99 54 -68 156 -370 149 -187 13 73 35 127 -63 118 -194 -35 -235 -84 73 130 185
6978A85p9k9J6l21K36K22j75q5j14R8M9k46L02j66PJ22J72j22J0j30j05N4K4j41
$$ 185 106 77 93 -228 8 230 55 -30 -144 -46 3 -243 59 -107 -100 22 194 72 82 -48 -153 -99 -75 -216
7002b16R4L98l38j26N90l82P8k36K68j47O8J58%r1m4L9j42K31k76j41N93l66J92
$$ -216 -122 276 -62 -188 402 20 98 -138 130 -17 51 209 209 118 74 113 -29 202 -74 -215 378 12 204
7025B04k68J1J05K7l66M08l0J04k51Q5K1m4nJ32l21R1j58L64m2L1l70L52K25m25
$$ 204 -64 -53 52 79 -287 121 91 195 -56 29 50 6 1 133 -188 -97 -255 109 67 98 -272 80 305 -120
7049a20N27l94j38J26k19K59k54N12j30k55Jk86N81k63J23j76J19J10r9o0O6j76
$$ -120 407 13 -125 1 -218 41 -213 299 169 -86 -85 -371 210 -53 70 -106 13 123 24 -36 30 -146
7071a46K3L77j75k34J84r5Q0m44K69r5j66J74L54J11j04l2j01j9K67l86J42J7
$$ -146 -123 254 79 -155 29 -66 14 -430 -161 -256 -422 -248 106 217 113 81 -20 -39 228 -158 -16 1
7093Aj64K16j18N5J63k73M24l21p4p0J4L36j72k42J02L51k23l21M11N4l06L4L45
$$ 1 -163 53 -65 -10 153 -120 304 -17 -91 -161 -147 189 17 -225 -123 228 5 -316 95 149 -157 -123 222
7116B22l63L7Rk7J64K03k20P2j79k20L66J58l16J18J91m33j9J54M5M0P8j64M8
$$ 222 -141 -104 -95 -122 42 245 25 97 -82 -302 64 222 -94 24 215 -218 -237 -83 -38 2 80 -84 -36
7139c6M9K0L0J8j27m2lQ6K01l12K46k94L49k81L5J77K54n25J53K09n1k20J32J34
$$ -36 13 33 63 81 -46 -88 -91 -5 196 -116 130 -164 185 -96 -61 116 370 -155 -2 207 156 -64 68 202
7163B02j42j66K09k31J93q1L17n69K88j53NN25m91l1L79%j74k76J04n6K32O8j
$$ 202 60 -106 103 -128 65 -16 301 -268 20 -133 -128 397 -94 -125 254 254 80 -196 -92 -148 84 152 151
7186A51j08k61J53R4P0Q7l46J75p3p3J72j20N9J6O9j0j13j28K11k14K61j78L09
$$ 151 43 -218 -65 29 99 186 -160 15 -58 -131 41 -79 -20 -4 65 55 -58 -186 25 -189 72 -106 203
7209B03j14K3j68L22j81k06P3L70m67J24j13J58L8l32K53j70M41m22Q8K01l82
$$ 203 89 112 -56 266 85 -121 -48 322 -145 -21 -134 24 62 -270 -17 -187 254 -168 -80 121 -261
7230b61L32j41j13J70k00J67k0J13m2k81p8O21n08J68Q9l59K37j1R0J79j24j37
$$ -261 71 -70 -183 -13 -213 -46 -66 47 5 -276 -354 267 -241 -73 16 -343 -106 -117 -27 152 28 -109
7252a09M46k87k43M80r1k15J17j43K65j72O9l3j03k30l5J05L55k07l91P57k17
$$ -109 337 50 -193 287 196 -19 98 -45 220 48 117 84 -19 -249 -284 -179 176 -31 -422 335 118
7273A18jq0N9k76R6l27M09k87J21K57j8J96m60K56k67m7Q8L56J05m59K79k32J48
$$ 118 117 37 96 -180 -84 -411 -2 -289 -168 89 71 267 -193 63 -204 -251 -163 193 298 -161 118 -114 34
7296C4Kj66K98k65p8K95n2R2k17J4Q3L1k22J48j32K23k81R7K68k31J58l00L57
$$ 34 36 -130 168 -97 -175 120 68 160 -57 -43 40 71 -151 -3 -135 88 -193 -96 172 -59 99 -201 156
7319A56j12k89K58j41p3J16L67l23j0L6N7r3K50k49j24K76k25J35M34k14k57L20
$$ 156 44 -245 13 -128 -201 -85 282 -41 -51 -15 42 -51 199 -50 -174 102 -123 12 446 232 -25 295
7341B95l68j02jL64l42J67j08K17k8J56k75L5o4l40L69J06L20l45k86K53p3Q7
$$ 295 -73 -175 -176 188 -154 13 -95 122 94 250 -25 10 -54 -394 -25 81 401 56 -230 23 -50 37
7363C7N2P8j37Q6j90J45o6j6oqk32J74J85k79Q0mL61l87r6K80j42P2K3J39l04
$$ 37 89 167 30 116 -74 71 5 -11 -17 -25 -257 -83 102 -177 -97 -101 260 -127 -223 57 -85 -13 10 149 -155
7388a55J9J26l9O7p4k06J52J52K73m63J25L26n33K99k28j93M06L11k84k70R7L
$$ -155 -136 -10 -49 18 -56 -262 -110 42 315 -148 -23 303 -230 69 -159 -352 54 365 81 -189 -92 -89
7410h9n4j45K78p6j55J62J69j87J13L19m96J21n4K90J0l44J97l03L75j80L3P2
$$ -89 -143 -288 -10 -86 -241 -79 90 -97 16 335 -161 -40 -94 196 206 -138 59 -244 131 -49 -16 56
7432E6k52J69k2k1pL69r9j17J06m43M11k33k56L43J32M4m38J77J64j9j37Q7k17
$$ 56 -196 -27 -49 -70 -77 292 193 76 182 -261 150 -83 -339 4 136 180 -258 -81 83 64 -73 14 -203
7455b03L57k01K56J5j83j60LM3R1k02J72N1q3O8j04N8K33j83J54l37K11R2j31
$$ -203 154 -47 209 224 41 -119 -116 -73 18 -184 -12 39 -44 24 -80 -22 211 28 182 -155 56 148 17
7478A7K11k59J21K5p0l04J35K08k28L58j32K5l8l41L69N2l03K64Rk33m1J08J66
$$ 17 228 -31 90 115 45 -259 -124 84 -144 214 82 107 69 -272 97 149 -154 110 119 -114 -155 -47 119
7501A19j05J08r6k3j41K35j94P8l2J36j88K5J00J41J31j65n8l62K62j90N6JJ40
$$ 119 14 122 26 3 -138 97 -97 -19 -51 85 -103 -78 22 163 294 129 71 -291 -29 -219 -163 -162 -22
7524b2q0j55L82j43J75j34M2J71k56k2M3J79k42N4J00r5J87k98J2L35j38n2%j63
$$ -22 -102 -257 125 -18 157 23 65 236 -20 -42 1 180 -62 -8 92 -3 184 -114 -102 233 95 43 43 -120
7548a20J06L2j62L46l35o3J93Q7j97J59J95l69p3K24j52L75m67L05L5L5M3l93
$$ -120 -14 18 -144 202 -133 -196 -3 84 -113 46 241 -128 -201 23 -129 246 -221 84 119 154 197 -196
7570a96K08M1m57M29j96J98l15J42J16j55K41j48Q4k64J88O6Q6j86K77k49L07
$$ -196 12 53 -404 25 -171 27 -288 -146 -30 -185 56 -92 -8 -272 -84 -18 68 -118 159 -90 217
7591B17j38j41J97k09R1l5K68l69L11k52M11m66K01l6l46J43J84R3j42k1n5J37
$$ 217 79 -62 135 -74 17 -18 250 -119 192 -60 351 -115 86 50 -296 -153 31 124 -18 -39 -94 43
7613D3j9lK3Q0l6r8J29k36N8J71p6J69P1q4q9k08L9mK0l09K62K38j76K23l23q3
$$ 43 24 21 44 124 88 -10 119 -117 -59 112 36 205 276 192 103 -105 -66 -70 -50 -359 -97 141 -35 188 -135 -218
7639b18J80o8j36M78k01k41K3K0L82j20k68J29p9L8j19K97m7k40L40k69N3p2K85
$$ -218 -38 -106 -242 236 35 -206 -183 -163 219 99 -169 -40 -119 -81 -200 97 50 -190 150 -119 -66 -138 147
7662A47k09M0L80J4j79l62L77k38k1L9r4p4K02l2qq8j28K27j87o6K45P8k20K28
$$ 147 -62 -22 358 372 193 -169 208 -30 -51 -12 -106 -180 22 -10 -18 -106 -234 -7 -194 -260 -15 63 -157 71
7686G1r4L4R4m14M21k77j0J6L83j24j53J12j82L47l64J68j05j06K15M5q6q5m87
$$ 71 -23 11 105 -309 112 -165 -175 -159 224 100 -53 59 -123 224 -140 28 -77 -183 32 77 -9 -94 -581
7709e81P17j08j25k18K05L17k13J04L8k41L73P9j04p8j27j5J40j19q5q2n8K55
$$ -581 136 28 -97 -315 -110 207 -6 98 136 -105 268 347 243 165 38 23 163 44 -41 -123 -181 74
7731G4J07l80l2N12k90Q6k30J90P3l2k68K18k28J89l1n3L03j57j52K56k70K63
$$ 74 181 -199 -231 281 -9 77 -153 37 110 78 -190 28 -200 -11 -42 -95 208 51 -101 155 -115 148
7753A48l3k10J84m76L26K42k11J40m3O8j67J24L1j53q4K96l15J98P2o5J08l12
$$ 148 115 -95 89 -387 -61 181 -30 110 67 135 -32 92 123 -30 -114 182 -133 65 137 72 180 -132
7775a32J31M4P8k71L49l8k79n1J65l3K05k52K5Q6j49k6K62j03j28J19J43j82k61
$$ -132 -1 43 121 -150 199 161 -118 -169 -4 -37 168 -84 -59 27 -122 -148 114 11 -117 2 145 -37 -298
7798b98L11K26j52%j6m5j42K99r3q1J33k10q8J70k13J11K45k11R9N6l6j96N44
$$ -298 13 239 87 87 71 26 -116 183 90 9 142 -68 -156 14 -199 -88 157 -54 45 101 65 -131 413
7821D13l95L7L05k38l88M93n01L22L4k62N3P8k21L22K8j23l4K33l07J1j47K87
$$ 413 18 55 360 122 -266 227 -274 48 82 -180 -127 -49 -270 52 80 -43 -77 156 -151 -140 -287 0
7843@K19k57P9L76o98M38k06K80k62k13K32Q0j49L20n8l19K50k54L29J21l70J79
$$ 0 219 -38 41 417 -281 157 -49 231 -31 -244 -12 68 -81 239 181 -138 112 -142 187 308 -62 117
7865A17Q0j60K11o34M10j10J13l47N02K0l66K79J4k32n9K61j31O4j35R1j42K75
$$ 117 197 37 248 -386 24 -86 27 -320 182 202 -164 115 129 -103 -162 99 -32 32 -103 -12 -154 121
7887A21n52L39L8r3J7K84N9l14l4o0J13j88K73p4R2l21J67K82k19J88j3k53L10
$$ 121 -431 -92 -54 -147 -130 154 213 -101 -135 -195 -82 -270 3 -71 21 -300 -133 149 -70 118 105 -148 162
7910A62j26O1o5n1q0j89N53j76m9N9J26O8k88j44J14o5Q4K33n0l60q9M37N9j95
$$ 162 36 97 32 -19 -99 -288 265 89 40 99 225 293 5 -139 -25 -90 -6 227 177 -183 -272 165 224 29
7934B9J40k25o0n4L27o8j01L9L0O8J74l52R9J38K5P7n77M57k96K23J00J6m14N5
$$ 29 169 -56 -116 -170 157 89 -12 27 57 125 299 -53 46 184 209 286 -291 166 -130 93 193 209 -205 -150
7958a50LL29k39J12j60J64j55J86n0J3ql4m0P8J53j06J7Q2l54K43n5L4l56Q8N4
$$ -150 -147 182 -57 55 -105 59 -96 90 40 53 45 11 -29 49 202 96 113 195 -159 84 29 63 -293 -205 -151
7983a51L01k86J86M8j12K3q9m3J40j07K19oj59J82k33J27j87K68p5N0J6o5J09
$$ -151 150 -136 50 98 -14 9 -80 -123 17 -90 129 123 -36 146 -87 40 -147 121 46 96 112 47 156
8006A56j76j67N8j7J71j08L49m73K99J08k03l2M42l65j26L63l21J2j34J4K05k89
$$ 156 -20 -187 -129 -146 25 -83 266 -207 92 200 -3 -35 407 42 -84 279 -42 -30 -164 -150 55 -234
8028b34K13N75m79J8m9L9k53J28j26L75k32O5j42K34k22j29O59l18k47J69K8j14
$$ -234 -21 554 75 93 44 83 -170 -42 -168 207 -25 40 -102 132 -90 -219 440 122 -125 44 72 -42
8050d2J00k38jL21n8L22n26P1J1J85j27O9k59N0J63l56M57j74J3J16k62N5J91
$$ -42 58 -180 -181 140 82 404 -122 -51 -40 145 18 87 -172 -122 41 -315 142 -32 -19 97 -165 -110 81
8073H1j05r2n7K70k57k40M91j60k16N89m70J69j74Q8L48j28P2l60L08k18Q9Q2
$$ 81 -24 -116 -173 97 -160 -400 91 -69 -285 304 -166 3 -171 -83 265 137 209 -151 157 -61 28 110
8095A10j4n6j41J1k3N2m4L66j84j05K1K56j12j36j50J69R4Q2k26j4k10j8L46J71
$$ 110 96 40 -101 -90 -113 -61 -105 261 77 -28 -7 249 137 1 -149 20 114 196 -30 -44 -254 -272 74 245
8119B45m52l3K80p5J85k38k20M96l19J33J18J20l34J61k57O25m46%K58l58J80
$$ 245 -207 -240 40 -35 150 -88 -308 188 -131 2 120 240 -94 67 -190 435 -11 -11 247 -111 69
8140F9p2J90j06k71J76J98k50J38J22l49J76j02M1J78l57J29L68l32M6j60j4J48
$$ 69 -3 187 81 -190 -14 184 -66 72 194 -155 21 -81 -40 138 -219 -90 278 -54 -8 -168 -182 -34
8162c4K04k54j02L19p9O0k02R6m1J2r8J61l11P5L22j76M5m26M83k4K68m67K71
$$ -34 170 -84 -186 133 54 114 -88 8 -33 -21 -119 42 -269 -194 128 -48 -3 -429 54 30 298 -169 102
8185A02k17Q2m9K73l4q8
$$ 102 -115 -33 -82 191 157 69
8191F9
$$ Imaginary data points
##PAGE= N=2
##DATA TABLE= (X++(I..I)), XYDATA
0@%%%%%%%qJ6j6J6j6K4l2L6m4N6o6P5r1J08j24J42j66J94k21K51k86L26l68M14
$$ 0 0 0 0 0 0 0 0 -8 8 -8 8 -8 16 -16 20 -24 32 -34 41 -50 58 -66 76 -90 104 -117 134 -152 174 -194 220
31B20m67N23n85O53p27Q10r01R99j108J228j359J505j665J844k045K271k529K824
$$ 220 -247 276 -309 344 -383 427 -474 525 -583 645 -714 791 -874 970 -1075 1196 -1333 1491
49A491l166L567m045M629n359O304p583R420j2293J7457k9618J08058P9320k26497
$$ 1491 -1675 1892 -2153 2476 -2883 3421 -4162 5258 -7035 10422 -19196 88862 168182 -58315
63e8315l8082J24423O2285r3683j3768O4796j9919j04492K8114J16872p368j28912
$$ -58315 -96397 28026 90311 -3372 -17140 47656 27737 -76755 -48641 68231 60863 -68049
75f8049r533J09193J8079r7133k962R7261j355j20396j5434J28641N7743j04476
$$ -68049 -77582 31611 49690 -47443 -50405 46856 45501 -74895 -90329 38312 96055 -8421
87h421q1426N5598P0063k2096l1531K5427P939m7540m721P0948K7269p6107n2377
$$ -8421 -89847 -34249 35814 13718 -17813 7614 15553 -31987 -36708 34240 61509 -14598 -66975
100f6975O1962O7980m1531o7954K7199O2009k8533p0793K1220Q5491O258p8831
$$ -66975 -5013 62967 21436 -46518 -19319 42690 14157 -56636 -35416 50075 56333 -22498
112b2498l1356N0903L1810k1947l89K6132k4745n3825K6096Q2513p696r9429k2867
$$ -22498 -53854 -2951 28859 6912 6523 32655 7910 -45915 -19819 62694 54998 -44431 -67298
125f7298R2464M3273p7173n1542N8145M3962n4893l7693O0619M4665n5411m9192
$$ -67298 25166 68439 -8734 -60276 -2131 41831 -13062 -50755 9864 54529 -882 -50074
137e0074M3583M0357l7679k2056N2461J6333p4687l1995Q4041N5020p8334p5014
$$ -50074 -6491 33866 -3813 -25869 26592 42925 -31762 -63757 20284 75304 -3030 -78044
149g8044N8778Q3124l4413p3388J7955N4387j6227l7308K8384L6301l4903m2107
$$ -78044 -19266 63858 29445 -43943 -25988 28399 12172 -25136 3248 39549 4646 -37461
161c7461L3383M2263l3335m2121L7697M9555l9406o4183K7990P3532o759p1279
$$ -37461 -4078 38185 4850 -37271 426 49981 10575 -53608 -25618 47914 41155 -30124
173c0124j2507N8272K5006l7932k4018J8452O954j8163P578L0948j0386n0416
$$ -30124 -42631 15641 40647 2715 -21303 -2851 4103 -14060 -6482 24466 14080 -36336
185c6336o716N0839K0178m5514k5680M2944L0292m2017l8006M2053N2021k8711
$$ -36336 -43052 7787 27965 -17549 -43229 -285 30007 -12010 -50016 -7963 44058 15347
197A5347n3361J8894N4600m602m2038J295K9100j0068j9731L0437K9232m5783
$$ 15347 -38014 -19120 35480 30878 -11160 -9865 19235 9167 -10564 19873 49105 3322
209C322n5127L8163P2478j9520p6895k95O5241M865n7117n905N1349K670n0360
$$ 3322 -51805 -13642 58836 39316 -37579 -37874 27367 32232 -24885 -30790 20559 23229 -27131
222b7131k674N0888O566m6108n963L9842n57l9290J2205N4182j2089p3498q762
$$ -27131 -29805 21083 27649 -18459 -24422 15420 14863 -24427 -12222 41960 29871 -43627 -52389
235e2389P5295L1697n9640m3679L5949L5291k3236k1129K4233J2570l0669r776
$$ -52389 22906 54603 -5037 -48716 -12767 22524 -712 -21841 2392 14962 -15707 -25483
247b5483M0095J9895l8640k6095L3299K7129k7856k2908L2308K5243m0854m2917
$$ -25483 14612 34507 -4133 -30228 3071 30200 2344 -20564 11744 36987 -3867 -46784
259d6784L2704N6229j1798n5324j0171L7692J4372j6454j12J1309j6325k0323
$$ -46784 -14080 42149 30351 -24973 -35144 2548 16920 466 354 11663 -4662 -24985
271b4985K6472M0779j9312n5036K81N2023J2244m1731j4740L3817P458m0582j0038
$$ -24985 1487 42266 22954 -32082 -31801 20222 32466 -9265 -24005 9812 17270 -23312 -33350
284c3350M5648K2423l9552l0551K6135K7359j4965j1701J9123K67l4605j777N0872
$$ -33350 12298 34721 -4831 -35382 -9247 18112 3147 -8554 10569 10836 -23769 -25546 25326
297B5326J6960n5298l9252M2423M8851k1677m1018J1919K8707j3718k1902K4241
$$ 25326 42286 -13012 -52264 -9841 39010 17333 -23685 -11766 16941 3223 -18679 5562
309E562K8575k2087l2488J5431L0030j1771k4000J4028J8841k5327k9035K8510
$$ 5562 34137 12050 -20438 -5007 25023 13252 -10748 3280 22121 -3206 -32241 -3731
321c731M0142k2294n3451L359N0711J4515l3610j6384J7093N833j2472P599K2860
$$ -3731 36411 14117 -39334 -35975 14736 29251 -4359 -20743 -3650 2183 -10289 -2690 20170
334B0170r410l3151J351L3999N326l0637q312K6762O791k9087o913L4520J6269
$$ 20170 10760 -22391 -21040 12959 18285 -12352 -20664 6098 12889 -16198 -23111 11409 27678
347B7678l4019k5588K7421L3769j0290k5978J847J1599p002l256K0761O196l1073
$$ 27678 -6341 -31929 -4508 29261 18971 -7007 -5160 6439 -563 -3819 16942 23138 -7935
360g935k1272K8015L0242j8781l3607J0514K9437o731k6187Q599K7874p631l0853
$$ -7935 -29207 -1192 29050 10269 -23338 -12824 16613 9882 -16305 -7706 20168 12537 -18316
373a8316J604L0082N213k3358o446J2760l911j3015J2944K3572j4072l6550L833
$$ -18316 -16712 13370 18583 -4775 -11221 1539 -2372 -15387 -2443 21129 7057 -29493 -25660
386b5660M1786J1561l3935j7503K4218J7562j6367j0533J6939O963k1609j0141
$$ -25660 16126 27687 -6248 -23751 467 18029 1662 -8871 8068 15031 -6578 -16719
398a6719K1257J4032j8195j4669J2494Q557j6458m056K5297J0925l0446k2933
$$ -16719 4538 18570 375 -14294 -1800 6757 -9701 -13757 11540 22465 -7981 -30914
410c0914K7096L3852j2245l2240O35K2818K085j1922L924R173j3950j5751J5790
$$ -30914 -3818 30034 17789 -14451 -13816 9002 11087 -835 3089 12262 -1688 -17439 -1649
423a649K2845j1658k5601L795K1200l892j8770P998K2293r183l0842J709L3530
$$ -1649 21196 9538 -16063 -12268 8932 5040 -13730 -5732 16561 7378 -23464 -21755 11775
436A1775R946k6948j6456J4292J2677o154l24R633p101k0090N505L1155N742k9328
$$ 11775 21721 -5227 -21683 -7391 5286 -868 -1192 8441 1340 -18750 -13245 17910 23652 -5676
450e676j5534K2146J7521j3969j2116J3855Q984j9146j2751K0051J9618j4743
$$ -5676 -21210 936 18457 4488 -7628 6227 15211 -3935 -16686 3365 22983 8240
462H240k2007N099J5810k750o058Q482K473k0449j0020K5018K3037j9453l1386
$$ 8240 -13767 -8668 7142 4392 -1666 6816 9289 -11160 -21180 3838 26875 7422 -23964
475b3964N382K7885L409j7813k995J0317m378j2186R866J8375o113k1267l73J8461
$$ -23964 -18582 9303 12712 -5101 -8096 2221 -2157 -14343 -4477 13898 7785 -13482 -13855 4606
489D606L155j1117J981J0246q119j7147R248K7188N97k9163j2358K0533J8373
$$ 4606 7761 -3356 -1375 8871 752 -16395 -7147 20041 20638 -8525 -20883 -350 18023
502A8023q580j2488K296J112o510L470J5091q8k0967r098J7225J3209j0123j1360
$$ 18023 9443 -3045 -749 363 -6147 -2677 12414 12326 -8641 -17739 -514 12695 2572 -8788
516h788P441O852j0151o306J5732J3727j3973k0768N295K1515L234j3715n363
$$ -8788 -1347 5505 -4646 -10952 4780 18507 4534 -16234 -10939 10576 13810 95 -5268
529e268L393k929k625J0909R630j4381j9906P904K4483J803j9544n328J4392K960
$$ -5268 -1875 -4804 -7429 3480 13110 -1271 -21177 -13273 11210 13013 -6531 -11859 2533 5493
543E493j0693K058J5020j375j9594l723J8037Q136j2369p684O843J71q784N148
$$ 5493 -5200 -3142 11878 10503 -9091 -12814 5223 13359 990 -6694 149 320 -8464 -3316
557c316J7165l580k2791m430K3876J3437j5125j3733P379Q410n049k955R036P15
$$ -3316 13849 10269 -12522 -16952 6924 20361 5236 -8497 -1118 7292 2243 -712 8324 9039
571I039j4863o490J2690Q790r307q706M634L171o704n06J2391N382j4214j1167
$$ 9039 -5824 -12314 376 9166 -141 -8847 -4213 -1042 -7746 -8252 4139 9521 -4693 -15860
585a5860R788J6548q44j2453n119N032L978K98J957Q67o564o831N279J1687J660
$$ -15860 -6072 10476 9632 -2821 -7940 -2908 1070 1368 3325 4192 -2372 -9203 -3924 7763 9423
600I423j0061n131O872N337l866r87O901Q40j2101o301J2653J1483q828j6063
$$ 9423 -638 -5769 1103 6440 2574 1587 8488 9328 -2773 -9074 3579 15062 6234 -9829
614i829O16J0005M67m403M186J598j2178o089J5524J4776j1006j7333N552J5860
$$ -9829 -9213 792 1259 -3144 1042 2640 -9538 -15627 -103 14673 3667 -13666 -8114 7746
628G746k804r855N989R314j0886j3306J0539J7863o709j7563J549J1845j910o018
$$ 7746 4942 -4913 1076 10390 -496 -13802 -3263 14600 7891 -9672 -8123 3722 1812 -4206
642d206P765O585j4887j2567J5138J9530p600k0701K90J3660J458o275L983M954
$$ -4206 3559 10144 -4743 -17310 -2172 17358 9758 -10943 -10653 3007 4465 -1810 2173 7127
656G127r958q990R906J5006m631j3707L25P492n2k549N783L077j0353r693O754
$$ 7127 -2831 -11821 -1915 13091 8460 -5247 -4922 2570 2518 -31 5752 8829 -1524 -11217 -4463
671d463J3488j50j1763p120K922N627L135P13k516n564k042M356P678L125o091
$$ -4463 9025 8875 -2888 -10008 -7086 -1459 1676 2389 -127 -5691 -7733 -3377 4301 7426 1335
686A335p506L96Q389M378l227l703m56j591m142M876J0130p16j4699o879J1560
$$ 1335 -6171 -5775 2614 6992 3765 62 -394 -1985 -6127 -1251 8879 8163 -6536 -13415 -1855
701a855J0681m456o503K843j65n970L793J3837k90j7350n764J5567Q749j0999
$$ -1855 8826 4370 -2133 710 545 -5425 -1632 12205 11915 -5435 -11199 4368 13117 2118
715B118p268P443J394j0827L76J5093J544j8171p271J4638Q442q940m504P394
$$ 2118 -5150 2293 3687 -7140 -6764 8329 9873 -8298 -15569 -931 7511 -1429 -5933 1461
729A461r57j1033L461J6759M50j8275n342J4949Q327q976m513N811l41q014L845
$$ 1461 504 -10529 -7068 9691 10141 -8134 -13476 1473 9800 824 -3689 2122 1781 -6233 -2388
744b388J2383n9j3848l695R690M595n094j199L898k470o557K070Q409K78q574
$$ -2388 9995 9936 -3912 -7607 2083 6678 1584 385 4283 1813 -4744 -2674 5735 6013 -2561
759b561m372M924M699m67k539k714j289Q62L403L103o20l234l476J03N697M753
$$ -2561 -6933 -2009 2690 2223 -316 -3030 -4319 -3457 -54 3049 2429 -805 -4281 -4178 1519 6272
775F272k536o260J58M497j53k571K449K464o384n774O180Q763m248j1106J474
$$ 6272 3736 -2524 -2366 2131 1978 -593 1856 4320 -2064 -7838 -1658 7105 2857 -8249 -6775
790f775Q591n15m682M428M717p813p421R848J1909o638j1893L425J0332l496p630
$$ -6775 1816 1301 -3381 1047 5764 -2049 -9470 378 12287 5649 -6244 -2819 7513 4017 -3613
805c613N089O321q966q259R273J1344p926j2656L935R011k876m523P003L910j0433
$$ -3613 1476 7797 -1169 -9428 -155 11189 3263 -9393 -5458 3553 677 -3846 3157 7067 -3366
820c366q271J0142J1554n239j0860J678N940k253l130N368K595p385n798P646
$$ -3366 -11637 -1495 10059 4820 -6040 -4362 1578 -675 -3805 1563 4158 -3227 -9025 -1379
834a379Q586m022p350QL698R16O55L013J20o672m070M259P338J580m993n532o8
$$ -1379 7207 3185 -4165 -4157 -459 457 1112 4125 4245 -2427 -6497 -2238 5100 6680 1687 -3845 -3913
851c913M243L343L11j919j977k171N36N178N030l486r967j931P803N528l845l831
$$ -3913 330 3673 3984 2065 88 -2083 -1547 3631 8661 5175 -4792 -6723 1080 6608 2763 -1068
867a068J19k844m641M339J0831q98j3139m131J0299O322n491k280M957j525p037
$$ -1068 -949 -3793 -8434 -4095 6736 5838 -7301 -11432 -1133 5189 -302 -2582 2375 850 -6187
882f187L582J2631r98j5191m160J1977O459o963k693M706l484r313M574J5093
$$ -6187 -2605 10026 9028 -6163 -10323 1654 8113 1150 -1543 3163 -321 -9634 -5060 10033
896A0033J284j5335n791J0223N507n178j120N393l491r596L333J3542j06j3510
$$ 10033 11317 -4018 -9809 414 5921 743 -377 5016 1525 -8071 -4738 8804 8698 -4812
910d812n762Q494O012k522j046K772m101p413L714J1792K913r882o574L436N401
$$ -4812 -10574 -2080 3932 1410 364 3136 -965 -8378 -4664 7128 10041 159 -6415 -2979 2422
925B422J07j118M15k678m480J633O258L110o343p324J876O986M458k209l169k065
$$ 2422 2529 1411 1826 -852 -5332 -3699 2559 5669 -674 -7998 -6122 864 5322 3113 -56 -2121
941b121q46N07M106O255j910r128l872O183O619k627m728M83J391k140J08O054
$$ -2121 -2967 -2460 1646 7901 5991 -3137 -7009 -826 5793 3166 -1562 -1079 312 -1828 -1720 4334
957D334J339q775n439Q298Q669l540p198M42K635k759j222P528L401r524q433
$$ 4334 5673 -3102 -8541 -243 8426 4886 -2312 -1870 765 -1994 -3216 4312 7713 -1811 -10244
972a0244N884R335k369p268J649L913l252k426O415M695q059p660O112J0904k141
$$ -10244 -4360 4975 2606 -4662 -3013 900 -2352 -4778 1637 6332 -1727 -9387 -3275 7629 5488
987E488p938m41L807j695k068N683N623o690q759K886R285L88o287p23L458m89
$$ 5488 -2450 -2891 916 -779 -2847 2836 8459 1769 -6990 -4104 5181 5569 -718 -1441 2017 1528
1003A528l402K940M598l989p529J315Q261K466o395m274J636J911j305J632M322
$$ 1528 -1874 1066 5664 1675 -5854 -4539 3722 6188 -207 -4481 -2845 -934 -2239 -607 3715
1018C715j396p028k406O930N722l568n197J369L423j550j144L102J456n295m091
$$ 3715 2319 -4709 -7115 -185 5537 1969 -3228 -1859 1564 14 -1130 1972 3428 -1867 -5958
1033e958N599P272k396q314j176N065P00j538K546L107n276o618L430R008L47
$$ -5958 -359 6913 4517 -3797 -4973 92 792 -746 1800 4907 -369 -6987 -3557 5451 5798
1048E798p905j907N120J971m069N73M027k345o782J858R431J171q983m885N027
$$ 5798 -2107 -4014 1106 3077 -992 -419 3608 1263 -5519 -3661 5770 6941 -2042 -6927 -1900
1063a900L814j777p0L759j936p853K7R049M120o940o045M350M355k132k610K993
$$ -1900 1914 137 67 3826 1890 -5963 -5936 3113 7233 293 -5752 -1402 2953 821 -1789 1204
1079A204M30n731j522P465N239o434p626J903P179J27k703K178J260n281l526
$$ 1204 1634 -4097 -5619 1846 7085 651 -6975 -5072 2107 2234 -469 1709 2969 -2312 -5838
1094e838O435P412l497q413j5O997P25m135o0K562k469l934L888P188k024r110
$$ -5838 597 8009 4512 -3901 -3916 3081 3806 -329 -389 2173 -296 -4230 -342 6846 4822 -4288
1110d288k080P223M054l507j536J611j528n515J966P745R59q635m424O171M647
$$ -4288 -6368 855 4909 1402 -134 1477 -51 -5566 -3600 4145 5104 -3531 -7955 -1784 2863
1125B863k677l683K485J035l353L24P023K355p613n642M972P733j226m121j02
$$ 2863 186 -3497 -1012 23 -3330 -3006 4017 6372 -1241 -6883 -1911 5822 4596 475 373
1140C73J370l665j793O131M329n502p500K819P392l92n562m16L543j703j770L878
$$ 373 1743 -1922 -3715 2416 6745 1243 -6257 -3438 3954 3562 -2000 -2416 1127 -576 -2346 1532
1156A532M464m377q253J416Q699K159n851k620K590r68k840L105N577j199p794
$$ 1532 5996 1619 -6634 -5218 3481 5640 -211 -2831 -241 -1209 -4049 -944 4633 3434 -4360
1171d360j402P353L770m801l212J860K201k422P80M118k03p625l130O557O125
$$ -4360 -5762 1591 5361 560 -2652 -792 1409 -1013 -233 3885 3682 -3943 -7073 -516 5609
1186E609l468n295N40K933j478r78M785K426n429m803M383O867k089o010k97M121
$$ 5609 2141 -3154 -2614 319 -1159 -2137 2648 5074 -355 -5158 -775 6092 4003 -2007 -2304 1817
1202A817n16k038J579L019m459o229L392Q162N84p196k706M258J758k915Q97M764
$$ 1817 1301 -737 842 3861 -598 -6827 -3435 4727 5311 -1885 -4591 -333 1425 -1490 -593 4171
1218D171j950o770L20P518J783p099l299M312L052l355o99M135p52o355o97Q340
$$ 4171 2221 -4549 -4229 3289 5072 -2027 -5326 -1014 2038 -1317 -2016 2119 1367 -4988 -5685 2655
1234B655M146o104n401L294L668j913q98L763N68o257k417O181M701m298o033
$$ 2655 6801 697 -4704 -1410 2258 345 -553 3210 3778 -2479 -4896 1285 5986 1688 -4345
1249d345K539M123j031k158K705J009m613k853M975N720k566o534p52L924J062
$$ -4345 -1806 2317 1286 -872 1833 2842 -1771 -4624 351 6071 3505 -3029 -3781 143 1205
1264A205j978N45J141k894l026K254N469L54n912k043L918M177k118j860J472
$$ 1205 -773 -228 913 -1981 -5007 -2753 2716 3070 -2842 -4885 -967 3210 1092 -768 704
1279G04m8k923M5N917K436n379n779K755N542n90l465R10J782l933k101N406M965
$$ 704 656 -2267 -2222 3695 6131 752 -5027 -2272 3270 2680 -785 125 1907 -2026 -4127 1279 6244
1296F244m993p776L070P377k14n359K66L389l370l191N263O351m687q666J932
$$ 6244 1251 -6525 -3455 3922 3708 -1651 -1385 2004 -1366 -4557 706 7057 2370 -6296 -4364
1311d364P905K2m986O57L287l308m139M718O825m037q793J205P592J103m757l22
$$ -4364 3541 3563 -1423 -766 2521 -787 -4926 -208 6617 2580 -6213 -5008 2584 3687 -1070 -1392
1327a392J878k021k955M311N710k840p426j82N938K429k405j055J202j701k127
$$ -1392 486 -1535 -4490 -179 5531 2691 -4735 -4917 1021 3450 1045 -10 1192 -509 -2636
1342b636K403M623m96n243k471L377M097n67l284p87p4n11J050K355J136l393
$$ -2636 -233 4390 3894 -1349 -3820 -443 3654 3087 -197 -984 -1058 -1569 -519 1836 2972 -421
1358d21m800J753N636J965m409k873K094J329j832J615L265j155o031j256P128
$$ -421 -5221 -3468 2168 4133 -276 -3149 -1055 274 -1558 57 3322 2167 -3864 -5120 2008
1373B008L359n138m389K865J868k426K77N081k32p887j664Q064M739n540m492
$$ 2008 5367 229 -4160 -1295 573 -1853 -1576 3505 3273 -4614 -6278 1786 6525 985 -3507
1388c507L630K514l463r23N914R35p600k818P539L820n629m169L547K127l873
$$ -3507 123 2637 -826 -1749 4165 5100 -2500 -5318 2221 6041 412 -3757 -210 1917 -1956
1403a956l20N486N46p142k316O481M320l914m066J784J728k345K71L525K46n247
$$ -1956 -2276 3210 3756 -3386 -5702 779 5099 1185 -2881 -1097 631 -1714 -1443 2082 2328 -2919
1419b919j969M436L453k000k165j23J012o2Q86J693k35j676k113P80K968J281
$$ -2919 -4888 -452 3001 1001 -1164 -1287 -275 -337 549 2242 2007 331 -1782 -1002 1966 3247
1435C247k128l187J36K565M18j583j34J254j816j685K910L864j969n386P23N597
$$ 3247 1119 -2068 -1932 633 1051 -532 -666 588 -1228 -2913 -3 3861 1892 -3494 -2771 2826
1451B826O08l766n6L226k230m735L341N906k150p577J95O858j22n247J467M641
$$ 2826 3434 -332 -388 2838 608 -4127 -786 5120 2970 -4607 -4412 2446 2324 -2923 -1456 3185
1467C185l104n530L924P162k446q436J587O883o87n064R88M297k678n050L432
$$ 3185 81 -5449 -1525 5637 3191 -5245 -3658 3225 2538 -2526 -1538 2759 81 -4969 -1537
1482a537O975l091p117J461N948l80l595J476L448l304m228L825N411k402n575
$$ -1537 5438 2347 -4770 -3309 2639 2259 -1336 140 3588 284 -3944 -119 5292 2890 -2685
1497b685P9L823J61j596P18N06k550j699K709L261m31l819p01J503J577P46j032
$$ -2685 -2606 1217 1378 -218 500 1006 -1544 -3243 -534 2727 2296 -1523 -2224 -721 856 1602 570
1514E70j153r24N0J010P53O46n60k991j145L617L253k049l129P28J803k23p04
$$ 570 -583 -1507 -1457 -447 306 952 392 -2599 -3744 -127 3126 1077 -2052 -1324 479 256 -448
1531d48K640R29m718k759N255M734l864m522J784K996k498j469M201J794o211
$$ -448 2192 3121 -1597 -4356 899 5633 1769 -2753 -969 2027 -471 -1940 2261 4055 -2156
1546b156l736O296N042m463m297K743K925l746r93M508K420o856l563N997M915
$$ -2156 -5892 404 5446 983 -3314 -571 2354 -1392 -2385 2123 4543 -2313 -5876 121 5036
1561E036m260m651L199K079k781q49M814J131n876l012N525M070l351k995J608
$$ 5036 776 -3875 -676 1403 -1378 -2227 2587 3718 -2158 -5170 355 4425 1074 -1921 -313
1576c13J433k642J85L755O50m376k822L653L408j461k047m82N61m35R43J865j8
$$ -313 1120 -1522 -1337 2418 3068 -1308 -4130 -477 2931 1470 -577 -1059 -498 -933 10 1875 1857
1593A857k592j849J600K596P16j665j801k82J285J357m16m18N0j494j130K052
$$ 1857 -735 -2584 -984 1612 2328 663 -1138 -1420 -135 1222 806 388 438 -1056 -2186 -134
1609a34K698j051l721m41K869J500k106j61J377j326k849K020M996j102n081q33
$$ -134 2564 1513 -2208 -2649 220 1720 -386 -547 830 -496 -3345 -1325 3671 2569 -2512 -3345
1625c345M325J054k644l57K831j486l753J676N081j12n762m65M362J091l135L26
$$ -3345 980 2034 -610 -967 1864 378 -3375 -1699 3382 3270 -2492 -2957 1405 2496 -639 -313
1641c13K928j597m172K002N421r18n301p32L499N39j611l70J683j420k949J529
$$ -313 2615 1018 -3154 -1152 4269 3351 -1950 -2682 817 1356 -255 -625 1058 -362 -3311 -1782
1657a782M189J34m160j523K703J356p72k56J223j098k164Q36L142Q09k782k498
$$ -1782 2407 2541 -1619 -3142 -439 917 145 -111 1112 14 -2150 -1314 1828 2637 -145 -2643
1673b643R79K463M12q61l08p8j136o9K116J737j067l003k89K407J864j970j270
$$ -2643 -1664 799 1211 350 42 -36 -1172 -1241 875 2612 1545 -1458 -1747 660 2524 554 -716
1690g16L75N1j029J042K057q1l724j268L287K338j509j798Q77M35j222L36K746
$$ -716 -341 -290 -1319 -277 1780 1699 -2025 -3293 -6 2332 823 -975 -98 337 -885 -549 2197
1707B197O55l675k948L323K923j747k174N98R28j688l5L120J023l701k312K786
$$ 2197 2852 -823 -3771 -448 2475 728 -1446 -848 80 -1608 -1643 1477 2500 -1201 -3513 -727
1723g27L529j130k749P54R87j397n07K855J437l471k739J434L359j18k276j28
$$ -727 2802 1672 -1077 -323 664 -733 -1240 1615 3052 -419 -3158 -1724 1635 1517 -759 -887
1739h87O78k53l67K333J258k317k967J364L272M47k113j274N38q0m71J018J354
$$ -887 -209 -462 -829 1504 2762 445 -2522 -1158 2114 2561 448 -826 -288 -368 -839 179 1533
1756A533j164k831J42K559J871j876j878O55R75l47O70Q32l12k761m33K359K692
$$ 1533 369 -2462 -2320 239 2110 234 -1644 -989 -14 -361 309 1141 829 -1932 -2365 -6 2686
1773B686j607k511j93J132n0K95J444K85k096j722K302K965r75k876j53J472P41
$$ 2686 1079 -1432 -1625 -493 -543 -248 1196 1481 -615 -2337 -35 2930 1955 -921 -1074 398 1139
1790A139o89M47M23j849k102J570L141K26l286j100J395J021l10R6J284j433k271
$$ 1139 450 897 1320 -529 -2631 -1061 2080 2306 -980 -2080 -685 336 26 122 1406 -27 -2298
1807b298N86L391O06k617j985J569J245k56L7L09m43k172N48L189R07k020k378
$$ -2298 -1712 1679 2285 -332 -2317 -748 497 241 278 587 144 -2028 -1480 1709 2616 596 -1782
1824a782Q72J601L8l61P09k13k285k93K293J514j414k698N48J840N60q73L11l28
$$ -1782 -910 691 729 368 1077 864 -1421 -1714 579 2093 679 -2019 -1471 369 929 56 367 39
1842C9j153o29K018K033q66k861j62J737R12n53oK70j346j222J147K144lk359
$$ 39 -1114 -1743 275 2308 1442 -1419 -1581 156 1068 515 509 779 -567 -1789 -642 1502 1499 -860
1860h60j052K040R09o60p33K60n07q98P26K560o6k785j377J516K093o59n07J97
$$ -860 -1912 128 1037 377 -356 -96 -603 -1501 -775 1785 1719 -1066 -2443 -927 1166 507 0 197
1878A97J5j362L99J728J179k142j882J409K344o45j464q5j2j62j70J734J228j825
$$ 197 212 -1150 -751 977 2156 14 -1868 -459 1885 1240 -224 -309 -321 -483 -653 1081 2309 484
1896D84k499M02K593J63p59n34J5p24p24J885J353j130k742O31K464N78j476n02
$$ 484 -2015 -1613 980 1143 384 -150 -135 -859 -1583 302 1655 525 -2217 -1586 878 1456 -20 -522
1914e22R4k25K7Q25J869j016k746j46J926J252n86j263K03j10l38N93J435k04
$$ -522 -428 -653 -626 199 2068 1052 -1694 -1840 86 1338 752 -511 -308 -418 -756 -163 1272 1068
1932A068j813r73J783J826l52j649m79N50J3M04R74L54k027j820P78K516K99k163
$$ 1068 -745 -1718 65 1891 1539 -110 -589 -39 -26 378 1352 1706 -321 -2141 -1363 1153 1452 -711
1950g11o01M57L79r0R58N75p24k280J026K556L99j880j144R99M14n95R32J118
$$ -711 -1312 -855 -476 -566 392 967 243 -2037 -1011 1545 1944 64 -1080 -81 333 -262 670 1788
1968A788j433k481J05L204P37k006j160J018J21o61R45J548q49k178k52K359Q83
$$ 1788 355 -2126 -2021 1183 1920 -86 -1246 -228 -107 -768 177 1725 876 -1302 -1554 805 1688
1985A688j587j197N78L97n29J239Q11p55k248k39K413J347j033j140L40n11J90
$$ 1688 101 -1096 -518 -121 -650 589 1400 645 -1603 -1842 571 1918 885 -255 85 -426 -236
2002b36O62M01p30j174j52J054J077n43j496k32M01R02J48L73k77m73r01N91J653
$$ -236 426 827 97 -1077 -1229 -175 902 359 -1137 -1369 -968 -66 82 455 178 -295 -1196 -605 1048
2021A048R63j305j608J3J349L5o45K60O2n86l83J247J375j942j797J486J890j89
$$ 1048 2011 706 -902 -889 460 495 -150 110 172 -414 -797 450 1825 -117 -1914 -428 1462 1273
2039A273j423J36Q58j717p70K013J939j935k434R03K030o34j179J082R10j626
$$ 1273 -150 -14 844 -873 -1643 370 2309 374 -2060 -1157 873 239 -940 142 1052 -574
2055e74j279K416J764k152k238J485J962p26j380Q22L40j646j76K061J279j866
$$ -574 -1853 563 2327 175 -2063 -578 1384 658 -722 100 440 -1206 -1382 679 1958 92
2071I2j951J714J063p45p09J469K8j593lJ632R82j919j330P47J057K1Q5l66j038
$$ 92 -1859 -145 918 173 -536 933 961 -632 -635 997 1979 60 -1270 -523 534 555 640 274 -764
2090g64p80O65J547m6q20k28l69M09Q10P60o13j127pP60M75n75K88r8j340k51
$$ -764 -1544 -879 668 622 -198 -426 -795 -386 424 1184 571 -556 -563 197 672 97 385 287 -1053 -1304
2110a304J850J552j968j893O91J418n15Q9J019l34k175o86L427Q72k547j416J931
$$ -1304 546 2098 130 -1763 -1072 346 -169 -80 939 605 -1570 -2256 1171 2043 -504 -1920 11
2127A1J086j318m18J953j02l176j3L447J158l126q26J519J11j196Q76K511j109
$$ 11 1097 -221 -639 1314 1212 -1964 -1977 1470 2628 -498 -1324 195 306 -890 -14 2497 1388
2144A388l518k54L797Q81l000m21J437K0j322J244J363j486k848Q03L348Ok001
$$ 1388 -2130 -2384 1413 2294 -706 -1127 310 330 -992 252 1615 129 -2719 -1916 1432 1438 -563
2161e63J85M84j119k61J900J631j618k469M81J558O33K4J53j278j276P04J968
$$ -563 -378 106 -1013 -1274 626 2257 639 -1830 -1349 209 842 866 1019 -259 -1535 -831 1137
2178A137P18j931j379O24J057P41L63j43k143o83J574J160j78r32n5l01j050J169
$$ 1137 1855 -76 -1455 -831 226 967 1330 1187 -956 -1639 -65 1095 917 -15 -70 -371 -1421 -252
2196b52J938l01k693j023J756J613j086k43L32j049r10K005K555j422l451O11
$$ -252 1686 1385 -1308 -2331 -575 1038 -48 -291 41 -1008 -1918 87 2642 1220 -2231 -1620
2212a620K582Q6j288P95J268k232j874K219K496j148k902Q17J385p51l42J471
$$ -1620 962 1048 -240 555 1823 -409 -2283 -64 2432 1284 -1618 -801 584 -167 -509 962
2228I62P06k838j196K492K498j464k772P21J430o34l61J959m49k245p27J917J411
$$ 962 1668 -1170 -2366 126 2624 1160 -1612 -891 539 -95 -456 1503 1054 -1191 -1918 -1 1410
2245A410j293n19L73M10j045RJ840l43j696n03J369J203q64j19j017m44o4J967
$$ 1410 117 -402 -29 381 -664 -655 1185 842 -854 -1357 12 1215 351 232 -785 -1229 -1293 674
2263F74O07j001j440N81M52M60M01k06p62n85Q80R06m93q46L38O41o45n07J423
$$ 674 1281 280 -1160 -579 -127 333 734 528 -234 -819 61 967 474 -372 -34 607 -38 -545 878
2282H78O26k033j202J559J544r57p56M83R7j238M10K106m1k482q04K621P54j809
$$ 878 1504 -529 -1731 -172 1372 415 -341 142 239 -999 -589 1517 1476 -1006 -1810 811 1565 -244
2300b44q14J438L03j657k59K149L4k093l26J647N36j005q1J425r55j603Q31K250
$$ -244 -1058 380 683 -974 -1233 916 950 -1143 -1469 178 714 -291 -372 1053 98 -1505 -674 1576
2318A576j26k534m03J787Q51j262j88N43l91p00R53J296q07j766N76J185k9p60
$$ 1576 1450 -1084 -1487 300 1151 -111 -299 244 -147 -847 106 1402 595 -1171 -595 590 561 -199
2336a99L6Q17j115n97P16J146n23o15n00K00O03Q05k59o97p50M27J372j34j88
$$ -199 -163 654 -461 -1058 -342 804 281 -334 -834 -634 -31 774 515 -182 -932 -505 867 733 545
2355E45l66p77J13O72Q51j070p93L65R59k7p85K75P21l90j562Q37J620k29j751
$$ 545 179 -598 -485 187 1038 -32 -825 -460 499 472 -313 -38 683 293 -1269 -432 1188 959 -792
2374g92R2Q83Pl60J139j17j599j210K174J783j427j921K47J714k29q76Q57N7o27
$$ -792 -700 183 190 -170 969 852 -747 -1957 217 2000 573 -1348 -1101 613 384 -492 365 422 -205
2393b05q47O77J378n95r89K45P53q77k16J303M95j453j533J469J544k18j186j007
$$ -205 -1052 -375 1003 408 -581 -336 417 -460 -676 627 1122 -331 -1864 -395 1149 931 -255 -1262
2411a262O75O02K42K37k92r58l01J380O86l34r03m63R49r1m22N64M73p78l27n55
$$ -1262 -587 15 257 494 202 -756 -1057 323 1009 675 -228 -691 258 167 -255 309 782 4 -323 -878
2431h78J197P37l22j198o64P65R68L8j51j090j19M44O42R34j103j280K16J400
$$ -878 319 1056 734 -464 -1128 -363 605 643 492 -598 -717 -273 369 1303 200 -1080 -864 536
2449E36K4q36L9L08m74l83L93Q96K62j088o29O14O37J36J53m00n36o87R78J517
$$ 536 560 -276 -237 71 -403 -786 -393 503 765 -323 -952 -338 299 435 588 188 -348 -1035 -57 1460
2469A460L9k369n45J340J243n72j091L1N81m86J45O64J59q61l74M85P32o31O9
$$ 1460 1499 -870 -1415 -75 1168 596 -495 -464 117 -369 -224 440 599 -262 -636 -151 581 -50 19
2488A9N76m47j125l4J870N26j190j399M36J227N15n93n01l30p4P12O59J35j378
$$ 19 595 148 -977 -1011 859 1385 195 -1204 -768 459 974 381 -120 -450 -524 188 847 982 -396
2507c96n09P73Q59k19p73J66N37l56r95Q06Q02R1j459m51P99Q17L68n86q16R8
$$ -396 -905 -132 727 508 -265 -99 438 82 -913 -107 695 786 -673 -1124 -325 492 860 274 -542 -444
2527d44K65P43P31o29j472k21J511Q43j150o08q1N85o8o04Q80L22p58p19K72O90
$$ -444 -179 564 1295 666 -806 -1027 484 1327 177 -431 -512 73 5 -599 281 603 -155 -874 -602 88
2547H8M39l21l83r3o06P26Q11K58j613q51J166J321j60j025o56P07O68j01J9l
$$ 88 527 206 -177 -270 -876 -150 661 919 -694 -1545 -379 942 782 -243 -899 -192 476 375 394 391
2567C91k41n45L40P23k09n21J07n9p7l55P52N15k58j337l91J529R84r74j019r8
$$ 391 150 -395 -55 668 459 -62 45 -14 -91 -446 306 821 563 -774 -1165 364 1348 374 -645 -743
2587g43N16P58P4k83p11o66M01J229N5r18o57Q57L04l58q6M28L70j167m77N09
$$ -743 -227 531 605 322 -389 -1055 -654 575 630 -288 -945 -88 216 -142 -228 200 570 -597 -1074 -565
2607e65J091O54j199o81K46N04M28L00m33j025m24J085J083m20j495k69J524M87
$$ -565 526 1180 -19 -700 -454 50 478 778 345 -680 -1104 -19 1064 644 -851 -1120 404 891
2625H91q93k39J80M30p91l10Q51Q10o94p51J5J64J99J65O94r07j263N49J742N06
$$ 891 -2 -241 -61 369 -422 -732 119 929 235 -516 -501 -337 -138 27 721 -186 -1449 -900 842 1348
2645A348j493q89M73J416j0o67m74K20j19J10K92M40j163j02M64qQ1j96N06L34
$$ 1348 -145 -1034 -561 855 845 178 -296 -76 -195 -85 207 647 -516 -618 -154 -162 -81 -277 229 563
2665E63j150m09R44R60k31j425j37O63Q93L18p79o94j83N10P80K0n28p43L91J53
$$ 563 -587 -996 -52 908 677 -748 -885 -222 671 989 210 -484 -667 -157 623 643 115 -628 -237 -84
2685h4L39l1j98Nl2k58m26N76O44l73j068j77J337N54n84m42k58K77Q4R27L18
$$ -84 255 224 26 31 -1 -259 -685 -109 535 162 -906 -1083 254 808 224 -218 -476 -199 -115 812 1130
2706A130j774l35M92J716n53j117n01J478j39p09K89P01n01o60k15J290n8o58
$$ 1130 -644 -979 -487 1229 676 -441 -942 536 397 -312 -23 678 177 -483 -698 592 534 -124
2724a24L74j88m70p33J188J323j000j783N10J773K5j004n12K94P9J43O24k16o56
$$ -124 250 62 -408 -1141 47 1370 370 -1413 -903 870 895 -109 -621 -327 -248 -105 519 303 -353
2743c53m37O16N52l13n94M90J62k83n17P09J001n72j006Q9J28N50O07o37r53j99
$$ -353 -790 -174 378 65 -529 -39 123 -160 -677 32 1033 461 -545 -456 -328 222 829 192 -761 -960
2763i60J186P70m28j050k28L79K90P32M6j020o27M48R29R1r12Q25J57r52o49P36
$$ -960 226 996 568 -482 -710 -331 -41 691 737 -283 -910 -462 467 558 -354 471 628 -324 -973 -237
2783b37J399l37j466k50J095n2r8L91J7j352k48J823R17j702j203J066J013k60
$$ -237 1162 825 -641 -891 204 152 54 445 462 -890 -1138 685 1602 -100 -1303 -237 776 516
2801E16j221J125o0p77n99Q45J060q20p20Q17k32m71K62J306l24j935P2J653Q60
$$ 516 -705 420 360 -417 -1016 -171 889 69 -651 166 -66 -537 -275 1031 707 -1228 -1156 497 1357
2820A357j246p19J13N64PK13L90o62p76L04Q57r7p46K39N07m65m65K63R69j66
$$ 1357 111 -608 -495 69 76 289 679 17 -759 -455 402 305 -441 -202 305 -160 -625 -362 607 441
2840D41o64l05N65K07L00l6r58k33L78J349n54r85P4J18N36k89M57l2o53j41O50
$$ 441 -223 -528 37 244 544 508 -450 -683 -305 1044 490 -495 -421 -303 233 -56 401 369 -284 -425 225
2861B25N13j087k88J070K76j200j13J204L34j273o20J216N01o00m91N78k36o79
$$ 225 738 -349 -637 433 709 -491 -604 600 934 -339 -959 257 758 158 -333 245 9 -670
2879f70L81J182n45j290L26J495k67j367r5J341J91j267N23Q71o14q12p0J105
$$ -670 -289 893 348 -942 -616 879 612 -755 -850 491 682 -585 -62 809 195 -617 -687 418
2897D18k01q89P38R16j393o83J258J153r64q84n4J128k24p62M14L18n62J6P77
$$ 418 217 -672 66 982 -411 -1094 164 1317 353 -531 -585 543 319 -443 -29 289 -273 -257 520
2916E20J1j364r0J368Q0p28pP31l96l54M06L46m43j1r5J05q14J77R60K81j249
$$ 520 531 -833 -923 445 525 -203 -210 521 125 -229 177 523 80 69 -26 79 -735 -558 402 683 -566
2937e66k89J278M62o27j031P49j39m92P34O93p56q56N23J113o08o51K78Q29q29
$$ -566 -855 423 885 258 -773 -24 -163 -655 79 772 16 -840 -317 796 188 -463 -185 644 -185
2956a85q07R00J003q27j093O76Q53k17n86Q36O1j308k07J548J036j192j840J267
$$ -185 -992 -92 911 84 -1009 -333 520 303 -283 553 614 -694 -901 647 1683 491 -1349 -82
2974h2P02m04o04M71Q0o95l64J765l4r24m93L90O15r65L18J025l94j543K47J034
$$ -82 620 216 -388 83 163 -532 -896 869 835 -89 -582 -192 423 -542 -224 801 407 -1136 -889 145
2994A45Q69r91l78Nj88L32O99M16r87q48N25P79n3m79K93J11l14J14M06l8p56
$$ 145 1014 23 -355 -350 -538 -206 493 909 -78 -926 -401 378 325 -154 139 250 -64 50 456 418 -338
3015c38j76O28l40J97M55K98p99o57L21J272l11j274N80J31k83R2N92L15j543
$$ -338 -514 114 -226 -29 426 724 -75 -732 -411 861 550 -724 -144 -13 -296 -204 388 703 -840
3034h40J49J159O94j426k86P00j24o75J96J082k1r38n72R22L85k63n0J11o50k64
$$ -840 -691 468 1162 -264 -550 150 26 -649 -453 629 608 -330 -902 20 405 142 92 203 -447 -711
3054g11O46J100o98j083k74J468K95p05j54J76M8o28O16J002m86r53P7K37P7j51
$$ -711 -65 1035 337 -746 -1020 448 743 38 -116 60 108 -520 96 1098 612 -341 -264 -27 50 -101
3074a01O96K31j170n86P96Q69k62o84j41N8L55n1L71o37l58K28K95N41j83l09
$$ -101 595 826 -344 -930 -134 735 473 -211 -352 -294 61 10 381 -256 -614 -386 -91 450 267 -42
3094d2o09N73K14K1m2M1m80k07K72m8L83L20k74m72p4Q73J65r05j90M97K99j36
$$ -42 -651 -78 136 157 115 156 -324 -531 -259 -307 76 396 122 -350 -424 449 614 -291 -481 16 315 179
3116A79L40n17j95l87K93Q35j65j014M17N86m49p4J27K57m37l59L94L35l9k43
$$ 179 519 2 -193 -580 -287 548 383 -631 -214 372 -77 -151 -24 233 -204 -563 -169 166 127 -116
3136a16l4j01rp1P90j04q60j78P52Q06l56p95L6J68l2o4M26O7l51k05L59J57m14
$$ -116 -150 -251 -260 -331 459 355 -505 -683 69 875 519 -276 -240 -72 -104 -168 258 325 -26 -231 128 285 -129
3159a29K82Ok46q5L49J55k6l58p67O71L94J25k18q43M12K63J77J6j30l31k28J87
$$ -129 153 159 -87 -172 177 332 306 -52 -819 -148 246 371 153 -690 -278 -15 162 178 48 -283 -511 -324
3181c24O79M3k92m54J40K04O7j71J14j20k05j94n1J072j68m90k93R2O04j43J54
$$ -324 355 398 106 -348 -208 -4 63 -108 6 -114 -319 -513 -564 508 340 -150 -443 -351 253 110 264
3202B64l05k97J36K17N45l22o27n3O66k0j35N6j22R4m82J21O25K00m74j88LL96
$$ 264 -41 -338 -202 15 560 238 -389 -442 224 204 69 125 3 97 -385 -264 361 561 87 -101 -98 298
3224B98l02J69j18j04l45J0Q84j02n55K8Q8M71j57j39k08j14K3J51K39J99n06
$$ 298 -4 165 47 -57 -402 -392 492 390 -165 -137 -49 422 265 126 -82 -196 -173 -22 217 416 -90
3245i0k04p9K84L22j53J17m73J89M1K52J04k9p90J12M27N47m92l9j43j82j5O67
$$ -90 -294 -373 -89 233 80 197 -276 -87 -46 206 310 281 -509 -397 30 577 85 46 -97 -279 -294 373
3267C73p7j45l54j98N03M00l54k46P3j1k94K22K67K80o60k50N19L05J73m92j91
$$ 373 296 151 -203 -401 102 502 148 -98 -25 -36 -330 -108 159 439 -221 -471 48 353 526 34 -157
3288a57P4k45L03O22l70l69k88J03P80j55m94J35n5J91L01j50j26p4k09o9N61
$$ -157 -83 -328 -25 597 227 -142 -430 -327 453 298 -196 -61 -116 75 376 226 100 26 -183 -252 309
3309C09R8j32j22k60j57L42K72Q5m87l53J25P52k60l57J45j89L19k27J11M42o83
$$ 309 407 275 153 -107 -264 78 350 435 -52 -405 -280 472 212 -145 0 -189 130 -97 14 456 -227
3330b27J14L32k96K56K1l03J12k84J29K89nj28l52J64R5K53J1M5k73J18O6J41
$$ -227 -113 219 -77 179 200 -103 9 -275 -146 143 138 10 -342 -178 -83 170 181 226 -47 71 137 278
3352B78j45k05O0L3j21L75Q1l61q1J19J68k15J81l56M56o99L89K54J19k65m95
$$ 278 133 -72 -12 21 -100 275 356 -5 -86 33 201 -14 167 -189 267 -432 -43 211 330 65 -430
3373d30J04P58k00k80K90m65l44L08O10Q7p81m7K71L48p0K4R6l35n31M12P54j96
$$ -430 -326 432 232 -48 242 -223 -567 -259 351 438 -343 -390 -119 229 159 183 279 -56 -587 -175 579 383
3395C83k03l43k53N94j35q3J32k56j3J4N07r2l1k48PO0L9J76j90o6n27M13M67
$$ 383 180 -163 -416 178 43 -40 92 -164 -177 -163 344 252 221 -27 -20 40 79 255 65 -1 -528 -115 352
3418C52j78l34l47M71j38K24J18k22j78j00K12M60k16j0J8k80j56O15J14l23k47
$$ 352 174 -160 -507 -36 -174 50 168 -54 -232 -332 -120 340 124 114 132 -148 -304 311 425 102 -145
3439a45j42J13j82O79K0n29k47m5Q84k50j47j32J26K6m36M61J76k87m34K13M91
$$ -145 -287 -174 -356 323 343 -186 -433 -478 406 156 9 -123 3 29 -407 54 230 -57 -491 -278 213
3460B13Ml89J20J30j48q6J87P24p63m28K39N44k52m15L67K24m74J49O8N05l24
$$ 213 217 -172 -52 78 -70 -156 31 755 -8 -436 -197 347 95 -320 47 271 -203 -54 14 519 195
3481A95q88L19P71m27l99N77j33l46K22L66K46p68P8L17m35L47K14n1m66n4M78
$$ 195 -693 -374 397 -30 -429 148 15 -331 -109 257 503 -265 -187 130 -305 42 256 205 -261 -315 163
3502A63K37p9j47k52j56q7K68R6M1jn00P27j10r9m45N67m54J08L40K45k9j031
$$ 163 400 321 174 -78 -234 -321 -53 43 84 83 -417 310 200 101 -344 223 -231 -123 217 462 433 -598
3524e98K75L14j60m2J98K68n90j80L87P52q54m11N33K55l0m42P53p6j089L53O93
$$ -598 -323 -9 -169 -211 -13 255 -335 -515 -128 624 -230 -641 -108 147 117 -325 428 352 -737 -384 309
3545C09J81n14k25N15R4p51K55N50l56j24k62Q45k05p53j33Q61k50j89J19M21
$$ 309 490 -24 -249 266 360 -391 -136 414 58 -66 -328 517 312 -441 -574 287 37 -152 -33 388
3565C88o39k42J19R53j54q71N50l9k74k48Q59O0m94o60N94O13m27k60L57on60
$$ 388 -251 -493 -374 579 425 -446 104 65 -209 -457 402 462 -32 -692 -98 515 88 -172 185 179 -381
3586c81K4R05J22j010k38P30J48n79L94L13m20n72O89L22k34n29j24O11p1j72
$$ -381 -357 548 670 -340 -578 152 300 -279 115 428 8 -564 125 447 213 -316 -440 171 100 -72
3606g2O40l8j093l0R72K75j035K86L66j41n73M4R70j10j361N88O28q8k33P9K74
$$ -72 568 530 -563 -593 379 654 -381 -95 271 130 -443 -399 571 461 -900 -312 316 228 -5 74 348
3627C48m19l83L90Q57q77p68P35M20k67j41J06L02n22j57N53M95m82p78N74N44
$$ 348 -71 -454 -64 793 -84 -852 -117 303 36 -105 1 303 -219 -376 177 672 190 -588 -14 530
3647E30m04k68M55J12o70q7N88J62l35n69L23L51p28N04L54J30n64R4K94j17N7
$$ 530 126 -142 313 425 -245 -332 256 418 83 -486 -163 188 -540 -36 318 448 -116 -22 272 155 212
3668B12j79r3l54J62L63J32n36P7O2M60r4n16K88M0k51q7P54r8m68q0M32l19j04
$$ 212 33 -60 -414 -252 111 243 -293 -216 -154 306 212 -304 -16 24 -227 -314 440 342 -126 -206 226 -93 -197
3691a97J61K15k17l67K72Q33m35n96k9K52J61o67R66J24l88p59N99O65n59n94
$$ -197 -36 179 -38 -405 -133 700 265 -331 -360 -108 53 -614 352 476 88 -671 -72 593 34 -560
3711e60M66K83o88K47M41k2n13j09O15L14o19j66J17L78m89N5M58J59p25j2L10
$$ -560 -94 189 -499 -252 189 167 -346 -455 160 474 -145 -311 -194 184 -305 -250 208 367 -358 -370 -60
3732f0K30j79J2L18m32m16O58K24k13o32L97J34q4k14J58K34m30Q5M14K42n83
$$ -60 170 -9 3 321 -111 -527 131 355 142 -490 -93 41 -43 -257 -99 135 -295 -210 204 446 -137
3753a37k20O08K9n57K35M61m12J5J45J22M6m68R8J87l85J63L60k6o80N8J88N71
$$ -137 -357 251 280 -277 -42 419 7 22 167 289 335 -133 -35 152 -233 -70 290 264 -416 -358 -170 401
3775D01l26k46J80M22n66k2L76j85j68J36L36l39j97K44j41J47j61L10j7N8m03
$$ 401 75 -171 9 431 -135 -157 219 34 -134 2 338 -1 -198 46 -95 52 -109 201 184 242 -161
3796a61j73N36p2j89K05k35j52K7K11P58o38k29m5J34L7j64J78k04P4l89Q35j01
$$ -161 -334 202 130 -59 146 -89 -241 -214 -3 755 117 -112 -157 -23 14 -150 28 -176 -102 -491 344 243
3818B43j65m79K28L33k35k16J49J75n82K70N48j31K2j33k05k1J68n7L74m89J6
$$ 243 78 -401 -173 160 -75 -291 -142 33 -549 -279 269 138 160 27 -178 -199 -31 -88 286 -203 -187
3839a87O7J76J24j80K32l56J2P4L57k35j64l97L86O9J94K57k15m97j06N46R2k56
$$ -187 -120 56 180 0 232 -124 -112 -38 319 84 -80 -477 -91 -22 172 429 214 -283 -389 157 249 -7
3861gj35L52k28Np1J66n5k95l00N10K85k47k45J49J93Q0j98J35L09p28j31M10
$$ -7 -142 210 -18 -13 -84 82 27 -268 -568 -58 227 -20 -265 -116 77 157 -41 94 403 -325 -456 -46
3883d6J40L9K61k78m9m68M24J52M8k75j20J93J78q2q7K7M2l6J21M9j77j22mK04
$$ -46 94 133 394 116 67 -401 23 175 223 -52 -172 21 199 117 30 57 99 63 184 233 56 -66 -70 134
3907A34k45L95l27L2j53l84N91L25j87l07j28L29J93j20j20L8l5k78L29J6K29
$$ 134 -111 284 -43 -11 -164 -548 43 368 181 -126 -254 75 268 148 28 66 31 -247 82 98 327
3928C27l92K0j29j24O67k86K00l12j86M36j30Oj48l43L34J01K89%k92k18o4L25
$$ 327 -65 -45 -174 -298 369 83 283 -29 -215 221 91 97 -51 -394 -60 41 330 330 38 -180 -244 81
3950H1L67j63l49k14k0J29K59J99j04m83J38K18J74p9j43j70J38L6M06k45l80
$$ 81 448 285 -64 -278 -298 -169 90 289 185 -298 -160 58 232 153 10 -160 -22 14 420 175 -205
3971b05J08K18N6J30k34K43o1m50K61L00j79k07o1OK39j44j78J85j3k79L41j34
$$ -205 -97 121 177 307 73 316 255 -195 66 366 187 -20 -81 -75 164 20 -158 27 14 -265 76 -58
3993e8N2P8j33r1J50J94RL3q1j24k56K92M34k18m54J70n3j76N06m17J42j78J23
$$ -58 -6 72 -61 -152 -2 192 201 234 153 29 -227 65 499 281 -173 -3 -56 -232 274 -143 -1 -179 -56
4016e6L85k58k0j82o0j00K23K56l3j31l1l58J44J59J95k08q1J48K01j34n8k9j87
$$ -56 329 71 51 -131 -191 -291 -68 188 155 24 -7 -365 -221 -62 133 -75 -156 -8 193 59 1 -28 -215
4039b15J87J64J54J16p58J24K30L34l85J20r9j45N0l3L94q7J1j45j53K81M0k02
$$ -215 -28 136 290 406 -352 -228 2 336 -49 71 -28 -173 -123 -156 238 151 162 17 -136 145 185 -17
4061a7K32j78m10K14N61k86m08L23k57M38k6M3l11m1o7L60o6Ll05L57j54R2k4
$$ -17 215 37 -373 -159 402 116 -292 31 -226 212 186 229 -82 -123 -190 170 104 107 -198 159 5 97 73
4084G3pM4k77j05N02l19o6K1L75m37K05P5J01N1p0j36J08l55Q8J16J15l61L07
$$ 73 66 110 -167 -272 230 -89 -155 -134 241 -196 9 84 185 236 166 30 138 -217 -129 -13 102 -259 48
4107D8K90j29J5k78M60p5l41J0K62m58k3L72L78n36L0j15J30j75q5M05K17m14
$$ 48 338 209 224 -54 406 331 -10 0 262 -196 -219 153 531 -5 25 -90 40 -135 -220 185 402 -12
4129a2l79N21L20j71m14P4L37p80M05M35o7n15n5M84l6Q3r3k2l6m8j39M94o9m86
$$ -12 -391 130 450 279 -135 -61 276 -504 -99 336 269 -246 -301 183 147 230 137 115 79 31 -108 386 317 -169
4153a69k1Q6O78m73p1J83j61k57K28Q4Pj85Q2J66q1J10m98N26n75o2O67j35j12
$$ -169 -190 -104 574 101 30 213 52 -205 23 107 114 -71 11 177 96 206 -292 234 -341 -403 264 129 17
4176A7n6m7L9j07j57M44rm07K74M06j91k78rK6J26k01R5K36J25n98J62K23j91
$$ 17 -39 -86 -47 -154 -311 133 124 -283 -9 397 206 -72 -81 -55 71 -130 -35 201 326 -272 -110 113 -78
4199g8r4J9N07k81m37O43m1j48m93L27O11q53K35l5M92o69J14N31J12o93P6M04
$$ -78 -172 -153 354 73 -364 279 238 90 -403 -76 535 -318 -83 -118 374 -295 -181 350 462 -231 -155 249
4221B49J28r9o16L98M6l37K73L50k25j39o7M06l6l34j82K49M1k83M68q4Q6m62
$$ 249 377 278 -338 60 106 -231 42 392 167 28 -39 367 331 -3 -185 64 105 -178 290 206 292 -170
4243a70k23O04m71J54K92Rj39m52N91K75m22j46K51k24j50K91J91j52m30r1N42
$$ -170 -393 211 -260 -106 186 195 56 -396 195 470 48 -98 153 -71 -221 70 261 109 -321 -412 130
4264A30j9o7p5J42j89m66P07M9j71o18N27L9J40l20M20J92o62j50M96N62q61k92
$$ 130 111 44 -31 111 -78 -544 163 212 41 -577 -50 -11 129 -191 229 421 -241 -391 105 667 -194 -486
4286d86L57J94n3k4L18p2l44Q0M16O7n21q8L37m8n14L48K50k32l58N47M17k12
$$ -486 -129 65 12 -12 306 234 -110 -30 386 453 -68 -156 181 133 -381 -33 217 -15 -373 174 591 379
4308C79l73j53P3j85K51L59k03l04j80k4Q40j75l14K31j76l46J84M10R3o40n5
$$ 379 6 -147 -74 -259 -8 351 148 -156 -336 -360 480 305 -9 222 46 -300 -116 294 387 -253 -308
4329c08O7M61k15k54M99P9o12K22K52j01n98K31M79K73m78P4K25p16o6O03L15
$$ -308 -241 220 5 -249 250 329 -283 -61 191 90 -508 -277 202 475 -3 71 296 -420 -486 117 432
4350D32k39m59L49j36l4p1K25L51p21Q0K52J25k27j01L34J03o65K42M52p8o10
$$ 432 193 -266 83 -53 -87 -158 67 418 -303 -223 29 154 -73 -174 160 263 -402 -160 292 214 -396
4371c96J92M91l58j93L67M79r41J17M00M72p23j98L50M5j60K8P11m79m56Q3L44
$$ -396 -204 287 -71 -264 103 582 -359 -242 158 630 -93 -291 59 104 -56 -28 683 204 -252 -169 175
4392A75K37k55k42O3K54m35k7M30J7m16q2N33k42j28J58P1j73r0K65K07j29m60
$$ 175 412 157 -85 -22 232 -203 -230 200 217 -199 -281 252 10 -118 40 111 -62 -152 113 320 191 -269
4414b69J46L09l64jP6%k49K22O22l33l26j76M65j03K19Mj15m64K51K16L47l52
$$ -269 -123 186 -178 -179 -103 -103 -352 -130 492 159 -167 -343 122 19 238 242 127 -337 -86 130 477 125
4436A25l46L07K22l58k32M14j74n0m65N80K22j72m40O38l04r1Q0K33J07o60O5
$$ 125 -221 86 308 -50 -282 132 -42 -92 -557 23 245 73 -367 271 -33 -124 -44 189 296 -364 -299
4457b99N27n9l65o7K73k6l09K71L46m84j49J64M25j31k22L83N7k54k03J96l2K14
$$ -299 228 169 -196 -263 10 -16 -325 -54 292 -192 -341 -177 248 117 -105 278 335 81 -122 74 42 256
4479B56o60L88M05k95j50L8J08l03K2L99R4m27K7n1M77n79K12M45n48L71l19K11
$$ 256 -404 -16 389 94 -56 -18 90 -213 -191 208 302 -125 -98 -149 328 -251 -39 406 -142 229 -90 121
4501A21n8k47L55j36n8j05K17N9j07k61J63J22L01l12j83J2J29r7J96j04K19m66
$$ 121 63 -184 171 35 -23 -128 89 148 41 -220 -57 65 366 54 -129 -117 12 -85 111 7 226 -240
4523b40K29m7j1Q4K37n8l67M11k4j64m42L63R1j56j53L69M8k49n9J18O4K58q8
$$ -240 -11 -58 -69 15 252 194 -173 238 214 50 -392 -29 62 -94 -247 122 170 -79 -138 -20 44 302 214
4546B14j03k9m7r1J6L1l1k84M54K72j74l62k30L80k9J85R4k18m8J2J46j09J32
$$ 214 111 82 35 -56 -40 -9 -40 -324 130 402 228 -134 -364 16 -13 172 266 48 0 12 158 49 181
4569A81o93N49P5j76Q0K39k53j46l18P18kk35j42L8J02J01Nmm4J15j31K7p5k4
$$ 181 -512 37 112 -64 16 255 2 -144 -462 256 254 19 -123 -85 17 118 123 119 75 190 59 86 11 -13
4593a3K71l60j99K94J50o9j65l03L47K19k56N32m33j99K00K93o1o46L62rr4J20
$$ -13 258 -102 -301 -7 143 74 -91 -394 -47 172 -84 448 15 -184 16 309 248 -398 -36 -45 -139 -19
4615a9r3K38Q4j30k17R7J41j0M7j47j91K34K06l56M03k97k8N1j45K45j59m4n8
$$ -19 -112 126 210 80 -137 -40 101 91 138 -9 -200 34 240 -116 287 -10 -38 13 -132 113 -46 -90 -148
4638a48K93k01J02Q8k53j7K99j39J40N1j67q9j00J04R6l25M12j92n3J96nm30N8
$$ -148 145 -56 46 134 -119 -136 163 24 164 215 48 -41 -141 -37 59 -266 146 -46 -99 97 92 -338 -280
4661b80L83k54j20M02l18K91J29j08j68O9j00p4O5J0l50M11j06J31O5k24K34m56
$$ -280 103 -151 -271 131 -187 104 233 125 -43 26 -74 -148 -83 -73 -423 -12 -118 13 78 -146 88 -368
4683c68L28J04k82J29J67j86K58k75K46o3N5J4j82J28Q5J5L1j24K26r4k94l1J
$$ -368 -40 64 -218 -89 78 -108 150 -125 121 58 113 127 -55 73 158 173 204 80 306 212 -82 -113 -112
4706a12L95k18j57o2K2K20p1K00m74J39j09J85L35L6l29J50k79R5Q0j97K79l20
$$ -112 283 65 -92 -154 -132 88 17 217 -257 -118 -227 -42 293 329 0 150 -129 -34 46 -151 128 -192
4728a92J78J28L2N5m36o1K54K65O1k99Q5j34L35l84J25j95J80P2L7j79J08O4l8
$$ -192 -14 114 146 201 -235 -296 -42 223 284 -15 70 -64 271 -113 12 -183 -3 69 106 -73 35 99 61
4751F1N8m39K83O1l5l3J4k30J11P7p9J17Kj9j23M0J33k05J30n6P5r7M57m59q0
$$ 61 119 -320 -37 24 -11 -44 -30 -260 -149 -72 -151 -34 -32 -51 -174 -134 -1 -206 -76 -132 -57 -154 303 -156 -236
4776b36L26m8j14L49k20q6kj03O08m75Lj16Q6l4Q7N3J38n06p5N02Q5k47O0J55
$$ -236 90 42 -72 277 57 -29 -31 -134 474 -1 2 -114 -28 -62 25 78 216 -290 -365 137 222 -25 35 190
4800A90k51pj44L33lr8j26j25K50lJ32j16j61j76K23J92k36J61KL3R0r8q7Pj74
$$ 190 -61 -68 -212 121 118 20 -106 -231 19 16 148 32 -129 -305 -82 110 -126 35 37 70 160 62 -25 -18 -192
4825a92L44k84K94j21m4j48K91Nr0l8J65j77j80L79R0m47J13K25l11K32J03Mk88
$$ -192 152 -132 162 41 -3 -151 140 145 55 17 182 5 -175 204 294 -153 -40 185 -126 106 209 213 -75
4848g5O0q7O8J00M25j78p5l79j87K98L39k80J04j40K02k03J8K05NM5m40L02k90
$$ -75 -15 -102 -34 66 491 313 238 -141 -328 -30 309 29 133 -7 195 -8 10 215 220 265 -175 127 -163
4871a63J29q4j63L48l33K31L20j99l21jK70k5j72K22J08o23K40M15j53r4J0j85
$$ -163 -34 -118 -281 67 -266 -35 285 86 -235 -236 34 9 -163 59 167 -456 -216 199 46 -48 -38 -223
4893b23L79q7k50Q3K97j84R3J16N7n82K51l3J02Q5l18M36l10K38J94j1j33l28
$$ -223 156 69 -181 -98 199 15 108 224 281 -301 -50 -83 19 104 -214 222 -88 150 344 333 200 -128
4915a28k7J88o1j56K56q6k07j33L84L05n43K71n6j24k38O18k84n5k78K10M84m20
$$ -128 -155 33 -28 -184 72 -14 -221 -354 30 335 -208 63 7 -117 -355 263 -21 -76 -354 -144 340 -80
4937h0k71L88o0J94l40L1O0K63r2O1Ok46M4m4K29k02l02M41M27k83l21J92N5j09
$$ -80 -351 37 -23 171 -169 -138 -78 185 93 154 160 -86 -42 -86 143 -59 -361 80 507 224 -97 95 150 41
4961D1j22K64m22k59M28J92J20m47J57L80k43j60J11L07l45m15L76M83m04m19
$$ 41 -81 183 -239 -498 -70 122 242 -205 -48 332 89 -71 40 347 2 -413 -37 446 42 -377
4981c77L45J3K24l82K16J75l74J46J05k7Q3n08J89J02j30L52j70k7k3j36J43P2
$$ -377 -32 -19 205 -177 39 214 -160 -14 91 64 147 -361 -172 -70 -200 152 -18 -45 -68 -204 -61 11
5003A1J0k71M95k91j62j08L87Q5n48K54L05k68K59k09p4o3L0L18Q4l92k0N30l08
$$ 11 21 -250 245 -46 -208 -316 71 156 -392 -138 167 -101 158 -51 -125 -188 -158 160 244 -148 -168 362 54
5026E4L2j79P4L3k66J62L93k25l21J59J84LJ71l04K52k34J64l37M44M2p10K11
$$ 54 86 -93 -19 14 -252 -90 303 78 -243 -84 100 103 274 -30 222 -12 152 -185 259 301 -409 -198
5048a98K82j00j69L78O0k33j95o0L85j22k17Q1J24m0j76L22pm56K72J19K17k60
$$ -198 84 -16 -185 193 253 20 -175 -235 150 28 -189 -108 16 -24 -200 122 115 -341 -69 50 267 7
5070Gn6K61k47mK11k79K48k91M7J73j2j61L7K17r5n20N77L76n93j65M81k56j58
$$ 7 -49 212 -35 -39 172 -107 141 -150 -103 70 58 -103 -66 151 56 -464 113 489 -104 -269 212 -44 -202
5093b02j7N29J5l74r1K28nkn12K33R6K77l47K20K57l42j25J77K57k93r4J65j28
$$ -202 -219 310 325 -49 -140 88 83 81 -431 -198 -102 175 -172 48 305 -37 -162 15 272 -21 -115 50 -78
5116g8j10J62M85n06j93K77J50m8k60K13%j66m8M52k08Jj00j26J85l46N26k29
$$ -78 -188 -26 459 -47 -240 37 187 139 -121 92 92 -74 -122 330 122 123 23 -103 82 -264 262 33
5138C3j09k44K07N44l77k38l2L53o0j61Q1j2K9l02N66j76K4k29r5M3k5j0L99k16
$$ 33 -76 -320 -113 431 54 -184 -216 137 77 -84 -3 -15 14 -288 278 102 126 -103 -198 -155 -180 -190 209 -7
5162gl6k05J29nq4K18J41N9k21o2L19k57l07L26Q9j12L21m56L30j42k04j01M63
$$ -7 -43 -248 -119 -124 -208 10 151 210 -11 -73 246 -11 -318 8 97 -15 306 -150 180 38 -166 -267 196
5185A96m73J47N4K92j83k70O16j71l92q3M73M4l26o6K6J99J96k08L9k02p3j14
$$ 196 -277 -130 -76 216 33 -237 379 208 -184 -267 206 250 -76 -142 -116 83 279 71 110 -92 -165 -279
5207b79M41k35J40n0m0K07j34j11L83m69K63l99L06j77n5K84l9k03J55J61o1K5
$$ -279 162 -73 67 17 -23 184 50 -61 322 -147 116 -283 23 -154 -209 75 36 -167 -12 149 88 113
5229A13j79j51J61k0j5L41j01j78j5Q0J26M4l33L13m0l11M9L41l5o38L55L67k02
$$ 113 -66 -217 -56 -76 -91 250 149 -29 -44 36 162 206 -127 186 146 -165 -116 225 190 -448 -93 274 72
5252G2j83Q9J23k30L6M29m84j35K1K93J32k23J13l51L26k08J53K23R7k71j34J89
$$ 72 -111 -22 101 -129 -93 336 -148 -283 -262 31 163 -60 53 -298 28 -180 -27 196 293 22 -112 77
5274G7j02L0K5j82M27q24M38J38o7P4l13O52l43L18m72R4j37k5K80K81k05k43
$$ 77 -25 5 30 -152 275 -549 -111 27 -40 34 -279 373 30 348 -124 -30 -167 -192 88 369 164 -79
5296g9QL76k72j74K14%j60j8j43J80N0j6r0K68k27L16J13l25r1j88N62j56J2J11
$$ -79 -71 305 33 -141 73 73 -87 -105 -248 -68 -18 -34 -124 144 -83 233 346 21 -70 -258 304 148 160 271
5320B71r8o8k67J89r3J38o2j36J29O2k66J11N4K91k04J24k32J46K3k42K01j02
$$ 271 173 105 -162 27 -66 72 10 -126 3 65 -201 -90 -36 255 51 175 -57 89 112 -130 71 -31
5342c1k30l7M41l58L33m5j13j76J0K19j30J76o2k00L30L9l99M34J2k99K44m78
$$ -31 -261 -298 143 -215 118 73 -40 -216 -206 13 -117 59 -3 -203 127 166 -233 201 213 -86 158 -320
5364c20M0M91p5L9j34r7L03l5j34J82l09J83l56K64q2m1k01N3L71q7k42m3L37
$$ -320 -280 211 136 175 41 -56 247 212 78 260 -49 134 -222 42 -40 -81 -282 -229 142 55 -187 -230 107
5387A07j73q4K74J35J8k18qm46M62k92K63k15K27n3j59J53j12j24K04o6J59q4
$$ 107 -66 -150 124 259 277 59 51 -395 67 -225 38 -177 50 -3 -162 -9 -121 -245 -41 -107 52 -32
5409c2J85j10l29K24L66m33O4K11pk47k00J92J81Q6n94Q8N20k92J28K24q1k69
$$ -32 153 43 -286 -62 304 -129 -65 146 139 -108 -308 -116 65 151 -443 -355 165 -127 1 225 144 -125
$$ [...]
8191c73
##END NTUPLES=NMR FID
##END=
