##TITLE=1H_T-4922
 CDCl3+DMSO, 8 sc, 
 19.11.2019
##JCAMPDX= 6.0         $$ Bruker NMR JCAMP-DX V2.0
##DATA TYPE= NMR FID
##DATA CLASS= NTUPLES
##ORIGIN= UXNMR, Bruker Analytische Messtechnik GmbH
##OWNER= root
$$ XWIN-NMR		Version 3.5
$$ Tue Nov 19 14:15:31 2019 Russian Standard Time (UT+4h)  she@DPX200
##.OBSERVE FREQUENCY= 200.1315
##.OBSERVE NUCLEUS= ^1H
##.DELAY= (6, 6)
##.ACQUISITION MODE= SIMULTANEOUS
##.ACQUISITION SCHEME= undefined
##.AVERAGES= 8
##.DIGITISER RES= 18
##SPECTROMETER/DATA SYSTEM= spect
##.PULSE SEQUENCE= zg30
##.SOLVENT NAME= D2O
##.SHIFT REFERENCE= (INTERNAL, D2O, 0, 15.7039)
##AUDIT TRAIL= $$ (NUMBER, WHEN, WHO, WHERE, WHAT)
$$ ##TITLE= Audit trail, XWIN-NMR		Version 3.5
$$ ##JCAMPDX= 5.01
$$ ##ORIGIN= Bruker BioSpin GmbH
$$ ##OWNER= she
$$ F:/spectra/data/she/nmr/H-F/1/audita.txt
$$ ##AUDIT TRAIL=  $$ (NUMBER, WHEN, WHO, WHERE, WHAT)
(   1,<2019-11-19 14:14:15.12 +0400>,<she>,<DPX200>,
      <created by zg, POWCHK disabled, PULCHK disabled
       configuration hash MD5:
       00 E9 B6 7A A2 85 ED C7 34 08 36 98 17 FE 4E 26
       data hash MD5: 16K
       C5 1B 87 F7 9A 3D 01 BA 84 ED 2A 05 C9 49 73 00>)
$$ ##END=
$$ 
$$ hash MD5
$$ 9B 86 05 C4 4C A8 28 73 F5 2F EB CF 3E 15 96 12
##$RELAX= 
##$RELAX= 
##$RELAX= 
##$RELAX= 
##$RELAX= 
##$RELAX= 
$$ Bruker specific parameters
$$ --------------------------
##$DU= <F:/spectra>
##$EXPNO= 1
##$NAME= <H-F>
##$PROCNO= 1
##$TYPE= <nmr>
##$USER= <she>
##$AMP= (0..31)
100 100 100 100 100 100 100 100 100 100 100 100 100 100 100 100 100 100 
100 100 100 100 100 100 100 100 100 100 100 100 100 100 
##$AQSEQ= 0
##$AQ_mod= 1
##$AUNM= <au_zg>
##$AUTOPOS= <>
##$BF1= 200.13
##$BF2= 200.13
##$BF3= 200.13
##$BF4= 200.13
##$BF5= 200.13
##$BF6= 200.13
##$BF7= 200.13
##$BF8= 200.13
##$BYTORDA= 1
##$CFDGTYP= 0
##$CFRGTYP= 5
##$CHEMSTR= <none>
##$CNST= (0..31)
1 1 145 1 1 1 1 1 1 1 1 1 1 1 1 1 1 1 1 1 1 1 1 1 1 1 1 1 1 1 1 1 
##$CPDPRG= <>
##$CPDPRG1= <>
##$CPDPRG2= <>
##$CPDPRG3= <>
##$CPDPRG4= <mlev>
##$CPDPRG5= <mlev>
##$CPDPRG6= <mlev>
##$CPDPRG7= <mlev>
##$CPDPRG8= <mlev>
##$CPDPRGB= <>
##$CPDPRGT= <>
##$D= (0..31)
0 1.2 0 0 0 0 0 0 0 0.06 0 0.03 0 0 0 0 0.0002 0 0 0 0 0 0 0 0 0 0 0 0 
0 0 0 
##$DATE= 1574158454
##$DBL= (0..7)
120 120 120 120 120 120 120 120 
##$DBP= (0..7)
150 150 150 150 150 150 150 150 
##$DBP07= 0
##$DBPNAM0= <>
##$DBPNAM1= <>
##$DBPNAM2= <>
##$DBPNAM3= <>
##$DBPNAM4= <>
##$DBPNAM5= <>
##$DBPNAM6= <>
##$DBPNAM7= <>
##$DBPOAL= (0..7)
0.5 0.5 0.5 0.5 0.5 0.5 0.5 0.5 
##$DBPOFFS= (0..7)
0 0 0 0 0 0 0 0 
##$DE= 6
##$DECBNUC= <off>
##$DECIM= 24
##$DECNUC= <off>
##$DECSTAT= 4
##$DIGMOD= 1
##$DIGTYP= 9
##$DL= (0..7)
0 120 120 120 120 120 120 120 
##$DP= (0..7)
150 150 150 150 150 150 150 150 
##$DP07= 0
##$DPNAME0= <>
##$DPNAME1= <>
##$DPNAME2= <>
##$DPNAME3= <>
##$DPNAME4= <>
##$DPNAME5= <>
##$DPNAME6= <>
##$DPNAME7= <>
##$DPOAL= (0..7)
0.5 0.5 0.5 0.5 0.5 0.5 0.5 0.5 
##$DPOFFS= (0..7)
0 0 0 0 0 0 0 0 
##$DQDMODE= 0
##$DR= 18
##$DS= 0
##$DSLIST= <SSSSSSSSSSSSSSS>
$$ [...]
##$SUBNAM2= <"">
##$SUBNAM3= <"">
##$SUBNAM4= <"">
##$SUBNAM5= <"">
##$SUBNAM6= <"">
##$SUBNAM7= <"">
##$SUBNAM8= <"">
##$SUBNAM9= <"">
##$SW= 24.9337058887773
##$SWIBOX= (0..15)
0 0 2 0 0 0 0 0 0 0 0 0 0 0 0 0 
##$SW_h= 4990.01996007984
##$TD= 16384
##$TD0= 1
##$TE= 0
##$TE2= 300
##$TE3= 300
##$TEG= 300
##$TL= (0..7)
0 120 120 120 120 120 120 120 
##$TP= (0..7)
150 150 150 150 150 150 150 150 
##$TP07= 0
##$TPNAME0= <>
##$TPNAME1= <>
##$TPNAME2= <>
##$TPNAME3= <>
##$TPNAME4= <>
##$TPNAME5= <>
##$TPNAME6= <>
##$TPNAME7= <>
##$TPOAL= (0..7)
0.5 0.5 0.5 0.5 0.5 0.5 0.5 0.5 
##$TPOFFS= (0..7)
0 0 0 0 0 0 0 0 
##$TUNHIN= 0
##$TUNHOUT= 0
##$TUNXOUT= 0
##$USERA1= <user>
##$USERA2= <user>
##$USERA3= <user>
##$USERA4= <user>
##$USERA5= <user>
##$V9= 5
##$VALIST= <valist>
##$VCLIST= <CCCCCCCCCCCCCCC>
##$VD= 0
##$VDLIST= <DDDDDDDDDDDDDDD>
##$VPLIST= <PPPPPPPPPPPPPPP>
##$VTLIST= <TTTTTTTTTTTTTTT>
##$WBST= 1024
##$WBSW= 4
##$XGAIN= (0..3)
0 0 0 0 
##$XL= 0
##$YL= 0
##$YMAX_a= 244001
##$YMIN_a= -105042
##$ZGOPTNS= <>
##$ZL1= 120
##$ZL2= 120
##$ZL3= 120
##$ZL4= 120
##$ABSF1= 10
##$ABSF2= 0
##$ABSG= 5
##$ABSL= 3
##$ALPHA= 0
##$AQORDER= 0
##$ASSFAC= 0
##$ASSFACI= 0
##$ASSFACX= 0
##$ASSWID= 0
##$AUNMP= <proc_1d>
##$AZFE= 0.1
##$AZFW= 0.1
##$BCFW= 1
##$BC_mod= 2
##$BYTORDP= 1
##$COROFFS= 0
##$CY= 11.3945322036743
##$DATMOD= 1
##$DC= 2
##$DFILT= <>
##$DTYPP= 0
##$F1P= 16.9975609425685
##$F2P= -3.02152046262296
##$FCOR= 0.5
##$FTSIZE= 0
##$FT_mod= 4
##$GAMMA= 1
##$GB= 0.15
##$INTBC= 1
##$INTSCL= 1
##$ISEN= 128
##$LB= 0.24
##$LEV0= 0
##$LPBIN= 0
##$MAXI= 10000
##$MC2= 0
##$MEAN= 0
##$ME_mod= 0
##$MI= 1.114404
##$NCOEF= 0
##$NC_proc= 0
##$NLEV= 6
##$NOISF1= 3.799351
##$NOISF2= 2.8
##$NSP= 1
##$NTH_PI= 0
##$NZP= 0
##$OFFSET= 15.70392
##$PC= 1
##$PHC0= -9783.848
##$PHC1= 7.60086
##$PH_mod= 1
##$PKNL= yes
##$PPARMOD= 0
##$PSCAL= 0
##$PSIGN= 0
##$REVERSE= no
##$SF= 200.130013532006
##$SI= 16384
##$SIGF1= 3
##$SIGF2= 2
##$SINO= 400
##$SIOLD= 16384
##$SREGLST= <1H.CDCl3>
##$SSB= 0
##$STSI= 0
##$STSR= 0
##$SW_p= 3612.71676300578
##$SYMM= 0
##$S_DEV= 0
##$TDeff= 0
##$TDoff= 0
##$TI= <>
##$TILT= no
##$TM1= 0
##$TM2= 0
##$TOPLEV= 0
##$USERP1= <user>
##$USERP2= <user>
##$USERP3= <user>
##$USERP4= <user>
##$USERP5= <user>
##$WDW= 1
##$XDIM= 8192
##$YMAX_p= 0
##$YMIN_p= 0
$$ End of Bruker specific parameters
$$ ---------------------------------
##NTUPLES= NMR FID
##VAR_NAME=  TIME,          FID/REAL,        FID/IMAG
##SYMBOL=    X,             R,               I
##VAR_TYPE=  INDEPENDENT,   DEPENDENT,       DEPENDENT
##VAR_FORM=  AFFN,          ASDF,            ASDF
##VAR_DIM=   8192,          8192,            8192
##UNITS=     SECONDS,       ARBITRARY UNITS, ARBITRARY UNITS
##FACTOR=    0.0002004,     1,               1
##FIRST=     0,             0,               0
##LAST=      1.6414764,     0,               0
##MIN=       0,             -105042,         0
##MAX=       1.6414764,     244001,          0
$$ Real data points
##PAGE= N=1
##DATA TABLE= (X++(R..R)), XYDATA
0 0 0 0 0 0 0 0 0 0 -8 8 -8 8 -8 16 -16 16 -24 25 -32 40 -46 52 -60 72 -81 92 -106 121 -137 156 -174 196
32 196 -220 245 -274 306 -339 378 -419 465 -516 570 -632 699 -774 858 -954 1062 -1187 1329
50 1329 -1496 1699 -1944 2253 -2651 3192 -3966 5187 -7391 12681 -55514 13462 135121 48350
64 48350 -61040 -100213 -36706 11041 14882 -17617 -35743 -49401 -45044 -26269 2369 3392 -10890
77 -10890 -11668 13163 16245 -18887 -44754 3231 88975 105986 14001 -83333 -77358 11610 68758
90 68758 45691 -5821 -15149 16698 48209 56806 47411 19691 -16580 -25750 10315 52128 45477
103 45477 849 -19011 11175 44063 25828 -22073 -34533 889 30635 21337 567 2331
115 2331 12906 3274 -21442 -27729 -11587 -1947 -8402 -6981 7892 4484 -26831 -47787 -24930
128 -24930 17647 26147 -8418 -40187 -28302 11731 37833 28253 -4344 -36675 -47310 -24882
140 -24882 16744 42109 26220 -9445 -18076 14611 45654 34052 718 -3727 26426 46959
152 46959 27100 -8257 -13947 15283 45298 44171 19060 -2526 1642 32195 64863 65442 27524
165 27524 -12164 -12853 20664 43871 25719 -8656 -12049 20087 43948 26716 -9874 -20973 8528
178 8528 44601 45211 8326 -30658 -35980 -5763 29104 29340 -9657 -47256 -40140 3610 33738
191 33738 20196 -13482 -24413 -7795 4918 -5847 -20107 -14058 6326 13938 -2431 -27570
203 -27570 -36098 -19540 7711 24223 15689 -11351 -30019 -15320 21396 39869 17258 -23548
215 -23548 -37486 -14330 15510 21150 6636 -3464 -2477 645 2108 5447 9435 8976 6377 7310
229 7310 11476 9471 -1234 -8082 -1306 7158 1383 -11809 -10863 8444 24783 19941 96 -9446
243 -9446 -1760 7125 5786 -1381 -5582 -6910 -5742 1483 12464 13273 -4152 -23596 -19564 7935
257 7935 27698 18650 -5379 -15229 -5285 7324 6932 -4130 -10541 -9365 -5514 -2066 2546 6701
271 6701 7435 5283 2162 -3505 -11425 -14675 -4480 13682 19977 2372 -22421 -24708 -3729 15772
285 15772 11419 -9408 -21994 -13266 5947 15997 11487 -39 -9909 -13317 -10262 -5880 -4490 -5260
299 -5260 -3709 1573 5787 1967 -7991 -12377 -3462 7605 6495 -6051 -14026 -5747 11005 14997
313 14997 688 -15584 -17688 -6425 5138 7526 1569 -877 4451 10083 8594 374 -8260 -11452
327 -11452 -6076 3589 9440 6825 -135 -2762 2442 8093 4274 -6175 -10272 -1099 9994 12387
341 12387 6043 -248 -12 2438 -250 -7082 -8916 -3592 4416 10817 12786 8153 -774 -6967 -5151
356 -5151 3663 7740 214 -8336 -2900 11706 16599 4614 -9632 -11345 -1922 4560 2277 19
370 19 5244 11656 10177 3512 -2280 -5310 -7375 -6077 310 8157 8661 796 -3463 3254 10111 3756
386 3756 -9603 -12385 -556 11858 10653 -56 -5028 -599 1821 -2657 -6530 -5607 -1852 2237
400 2237 6085 8731 6843 -1496 -9667 -7250 1920 4619 -3089 -8094 -401 10091 10379 -1239 -9470
415 -9470 -5245 3257 4073 -470 -951 3135 4360 2132 666 -63 -2427 -6170 -4699 4244 11132 6001
431 6001 -4374 -6423 2015 7240 1756 -7596 -8181 1447 8152 3899 -4320 -6156 -2401 -136 -612
446 -612 -1992 -2690 -2350 -844 1650 2777 -710 -7653 -9432 -2102 5076 4016 -3244 -6789 -2789 3535
462 3535 3109 -3693 -6826 -1776 4939 6062 2643 -915 -1690 -32 636 286 691 1053 1727 3997 6932
479 6932 5866 1017 -3846 -2687 2210 5711 4226 586 617 4987 5516 267 -5651 -6206 -1405 2807
495 2807 1810 -8 1009 2081 -1518 -6750 -8077 -5732 -3977 -4510 -5150 -1893 1662 -654 -7332 -10922
511 -10922 -9353 -6438 -6227 -6602 -4835 -921 -178 -3769 -6912 -7660 -8066 -10050 -7986 -953 3311 486
527 486 -4519 -3783 1340 1322 -6484 -12331 -5698 5699 8986 2940 -2258 -623 3245 1599 -4132 -5332
543 -5332 -664 3955 4988 5934 6041 2518 -3006 -4355 -165 2987 -680 -5188 -803 9424 10305 -709
559 -709 -10261 -7860 1178 3005 -3675 -7552 -1871 5539 4441 -2876 -7723 -6749 -4251 -2632 -2177 -1689
575 -1689 -1425 -628 595 2637 -164 -6710 -9165 -2725 5640 5720 -1262 -3811 2833 9404 6401 -2872
591 -2872 -5269 2297 9723 9493 4112 1527 4450 9337 9798 5563 1952 2755 7546 12242 12517 7248
607 7248 2903 5008 10929 12960 7286 561 2036 10233 14990 10181 2022 383 5920 10936 10616
622 10616 4097 -853 1007 8238 10810 5647 -1713 -1728 6175 11814 6654 -2372 -4614 2028 8221
637 8221 5843 -1281 -3566 1366 6578 6254 1826 -804 -1620 -210 2518 4222 1784 -2358 -2721 1989
653 1989 5779 400 -7648 -6758 2838 7133 144 -7173 -4709 2963 3044 -6598 -12521 -7160 -78 -1714
669 -1714 -7217 -6313 -985 -795 -6399 -10801 -8708 -6344 -8426 -10337 -6265 -2491 -6767 -13031 -9974 -2574
685 -2574 -3836 -14013 -17218 -6060 5632 -119 -14652 -16474 -3323 3748 -6175 -17632 -13987 -101
699 -101 6266 -102 -7386 -5328 -1550 -2663 -4464 -2022 -1351 -4679 -4905 3491 10869 4530 -10323 -12148
715 -12148 4048 15018 3936 -12906 -10325 9012 17482 5140 -10923 -9632 2506 8102 1204
728 1204 -4093 -1120 2184 1062 768 2115 -1229 -7793 -8728 1447 10029 3414 -10985 -11689 4134
743 4134 12990 1154 -15595 -13920 2152 10872 1976 -7896 -5167 3787 4817 -1233 -2906 449
757 449 1348 -124 885 5587 6048 -144 -3030 4141 11207 7196 -1595 -1014 8820 14437 7851 -282
773 -282 1866 10125 10710 3752 1185 7001 11170 7598 3083 5364 10243 9777 4023 1735 5999 9125
789 9125 6004 2172 2474 4614 4586 3434 3713 3954 1525 -1857 -490 4947 6327 258 -5723 -2924
805 -2924 3403 4595 -2333 -8159 -5705 787 2485 -2533 -5899 -4925 -722 1903 275 -4777 -8722
820 -8722 -6692 -656 3160 -360 -7488 -9476 -2930 3663 2033 -5883 -9090 -4807 2466 3911 -796
835 -796 -6158 -5870 -1444 2180 757 -3883 -7490 -4672 2653 5716 673 -6897 -7340 -408 4643 1243
851 1243 -5334 -5191 876 4371 1446 -3239 -4228 -2232 -531 -182 -639 -2189 -3488 -2729 1639 5161
867 5161 1745 -4875 -6082 -274 4916 2385 -4221 -6093 -1421 1922 -568 -3123 -578 2719 1811
882 1811 -697 -548 2469 2828 -1071 -3455 -1335 475 -1688 -3706 -1184 3972 5076 588 -2409 1011
898 1011 4422 3053 -1315 -2443 -698 -961 -2988 -2273 2048 3891 -51 -3488 -73 6517 5694 -1561
914 -1561 -5746 -2412 2334 1590 -2641 -3666 -730 1728 366 -929 1464 2815 472 -1370 -541 1526
930 1526 -196 -3681 -3913 141 2489 -1365 -4302 -137 6362 6257 -631 -5846 -4128 389 1335 -1262
946 -1262 -3028 -1435 -122 488 1842 2614 1736 -1614 -3650 -2238 829 1188 -1764 -3167 -870 1071
962 1071 -293 -2492 -1174 2880 4373 1724 -1705 -2008 86 475 -1696 -3241 -2615 -821 1583 3132
978 3132 4548 4728 2540 -419 -1292 466 1300 -309 -1926 -1581 1239 3549 2739 1004 908 2406 3423
995 3423 2423 2013 2076 2172 1009 -1092 -1682 -546 781 621 1144 3111 4770 4177 2088 1272 1864 1155
1013 1155 -2079 -3544 -1300 3076 3565 1198 -97 1420 3158 2833 895 469 2286 1710 182 52
1029 52 2071 2285 53 -2163 -919 2865 4223 1606 262 2347 4023 1397 -2126 -1547 1710 2755
1045 2755 527 -1215 1258 3824 2541 -1262 -1374 1173 802 -1256 -1770 1569 3062 903 -2996 -2245
1061 -2245 1335 1532 -2435 -4526 -1972 1501 730 -2884 -3397 -919 34 -2664 -4262 -1270 1547 -771
1077 -771 -4554 -4177 -882 -780 -3705 -5436 -2335 213 -1238 -3899 -2487 1045 1071 -3222 -5993 -3751
1093 -3751 451 240 -3001 -3609 -984 242 -1704 -3080 -1072 827 -455 -2866 -2502 553 879 -1319
1109 -1319 -3259 -1221 339 -412 -1837 -1266 1128 1561 -1302 -3988 -1751 980 550 -1950 -1947 402 1852
1126 1852 707 -1531 -1374 469 156 -1691 -1913 71 1612 779 -538 202 832 1298 1034 843 1892
1143 1892 1950 641 -12 822 2065 1532 -221 -209 2101 4746 4694 1892 1679 3222 3882 2363 46 -95
1161 -95 1767 3988 3057 1313 1621 3719 4225 3044 1777 1389 1961 2347 2415 1231 1294 -78 -946 482
1179 482 2439 2475 -102 -874 1063 3696 2386 -1970 -3571 -931 2075 563 -2803 -2928 -85 2487
1195 2487 954 -2014 -2278 -168 597 -590 -1338 -1143 -1115 -1183 -1074 371 575 -1719 -3375 -1155 2326
1212 2326 2118 -2307 -3563 -450 2955 1134 -3092 -3713 459 2756 498 -2674 -1634 861 1183 -1153
1228 -1153 -2590 -1452 326 -617 -1509 -358 869 -355 -2262 -1467 570 -154 -2604 -3299 -517 1495
1244 1495 -551 -3504 -3028 981 1679 -1544 -3988 -1889 1667 1299 -2045 -3889 -1561 1398 399 -1988
1260 -1988 -2267 -753 576 573 204 -6 -490 -1021 -442 1485 1036 -1166 -2563 107 3324 2887 -1213 -3295
1278 -3295 -332 3926 3810 -883 -3459 -721 3256 3616 349 -2805 -1852 1505 2942 1336 -1406 -1601
1294 -1601 167 2206 2613 204 -1758 -1533 703 2733 1888 -1123 -2716 -933 2653 3312 49 -2990
1310 -2990 -2157 1929 4116 1325 -2398 -2201 1513 4089 1787 -1697 -1753 1055 3243 1988 -391 -356
1326 -356 1121 1489 1618 1133 794 303 77 1127 2858 1884 -627 -1809 1407 3549 1433 -1924 -1568
1343 -1568 1908 3835 369 -2761 -818 2641 2377 -1764 -2714 476 2655 546 -2690 -2069 1075 1714
1359 1714 -1121 -2682 -624 764 -879 -1633 -531 817 -759 -3326 -1971 1927 1534 -2507 -4598
1374 -4598 -256 4026 1778 -4381 -4678 975 4900 982 -4499 -3540 1724 3584 311 -2324 -1496 798
1390 798 1207 353 897 1554 -597 -2265 115 4223 2796 -2588 -4012 1115 5906 3401 -3655 -4423
1406 -4423 1911 5777 1845 -3468 -3037 1928 3302 720 -1717 -1272 418 179 -445 622 1288 -869
1422 -869 -2537 -483 3030 1709 -2551 -4496 -395 4035 1589 -3536 -3965 201 2847 313 -3157
1437 -3157 -2510 308 1056 -962 -1923 -411 120 -867 -1331 -408 471 -771 -2168 -1497 620 1101 -1396
1454 -1396 -2466 -302 1258 407 -1614 -1249 590 743 -565 -1212 -360 964 93 -1816 -1679 610 1468
1471 1468 -80 -1266 -1101 383 939 474 -1282 -1232 -352 694 633 -337 -881 -916 183 632 530 -298 -1336
1490 -1336 -671 1150 1540 277 -1118 -1138 336 1622 1250 -351 -1461 -514 1861 2464 659 -1963 -1306
1507 -1306 1203 2989 635 -1637 -864 938 2079 1067 -162 -535 458 1324 1272 1118 605 -201 -476
1524 -476 687 2290 1568 -1193 -1539 1115 3520 1951 -1268 -1380 1468 3005 842 -1363 -638 1399
1540 1399 1589 248 -274 1049 1170 -51 -359 882 2080 534 -1510 -777 1354 2047 -470 -2184
1556 -2184 1 2429 1559 -1303 -1526 1149 1589 133 -1656 -429 1539 346 -2042 -1262 1135 1740
1572 1740 -744 -1784 -485 1910 635 -1962 -2594 159 1545 -872 -2459 -1045 927 784 -1351
1587 -1351 -1383 499 1280 -1065 -2361 -533 894 -429 -2708 -1965 381 1511 -697 -2649 -1072 1448
1603 1448 576 -1592 -2162 -402 800 -578 -1811 -1261 643 488 -1424 -1410 380 605 -1045 -1941 -503
1620 -503 826 216 -1818 -1960 410 1397 -280 -1435 -1067 721 744 -653 -1112 -268 525 -83 -935 -460
1638 -460 527 351 -573 -750 284 749 161 -933 -712 750 991 4 -585 -75 860 665 7 -237 307
1657 307 1171 449 -208 79 743 807 417 130 584 1203 865 2 -54 789 1316 337 -486 377 1377 1453 253
1678 253 -208 418 1371 1024 -464 -399 852 966 -10 -655 242 1273 719 -796 -608 832 1371 -366
1696 -366 -1117 14 1044 434 -923 -918 626 1175 -348 -1649 -522 1246 660 -973 -1422 145 861
1713 861 -523 -1961 -1000 1143 594 -1681 -1613 647 1151 -368 -1877 -978 1186 651 -1503 -1534 214
1730 214 1199 -464 -1894 -747 1115 874 -1227 -2131 255 1595 -527 -1670 -804 1320 809 -1092
1746 -1092 -1373 222 1850 79 -2060 -952 1414 1025 -805 -1566 482 1584 65 -1231 -596 1264
1762 1264 1143 -634 -1344 344 1706 516 -889 133 1282 1238 -626 -729 801 2029 214 -1380
1778 -1380 -391 1800 1340 -209 -580 452 1849 1307 -832 -417 972 1315 115 -444 361 1047 817
1795 817 74 207 1169 619 -201 -323 743 1088 188 -834 -305 1309 1282 -70 -1064 -132 1454 957 -361
1814 -361 -848 150 676 198 -658 -834 -167 221 83 -163 -34 257 392 164 -51 -164 -121 -718 -950 48
1834 48 230 -487 -922 -651 855 1123 -29 -1535 -898 62 381 -1189 -1688 -971 267 530 -880 -975 -119
1853 -119 727 344 -793 -805 -384 -159 -964 -983 -569 48 -647 -670 -47 1020 105 -1501 -867 376 578 -643
1873 -643 -2093 -1556 1100 1074 -893 -2064 70 1469 658 -1311 -1447 380 890 -310 -1520 -374 795
1890 795 184 -554 -71 873 832 -547 -470 1098 1250 -186 -1788 -392 1796 1365 -848 -1343 712 2333
1908 2333 1502 -1164 -789 1332 2162 337 -1328 -274 1342 1507 120 -93 724 1251 51 4 822
1925 822 1603 163 -786 87 1467 1538 -613 -1076 884 2599 810 -1605 -700 1314 2130 193 -1731
1942 -1731 -782 1452 1489 -136 -1109 -128 666 593 -141 -31 53 -580 -405 -309 858 29 -1307 -1195 484
1961 484 1387 -3 -1931 -1533 357 1735 72 -1584 -976 434 1460 -208 -1448 -1052 104 771
1977 771 -699 -1260 -1165 -495 -447 -310 84 -370 -496 -600 -36 713 221 -790 -1557 -97 545 -109 -1576
1996 -1576 -963 394 1202 644 -909 -660 323 990 -405 -1563 -1030 307 51 -752 -1000 69 828 702
2014 702 -569 -298 688 -79 -904 -1038 -49 114 -581 -917 90 1262 665 -478 -496 1264 1749 -514
2032 -514 -1363 -649 1342 1273 -466 -1403 275 2433 1538 -294 -279 1124 1468 251 -1066 -295 885 209
2050 209 -256 90 1345 1034 -53 211 1686 1937 118 -1553 -687 2063 1942 -928 -1841 370 2310
2067 2310 1777 -653 -1150 827 2189 747 -1089 -506 87 -18 -591 -237 816 791 -256 -30 1168
2084 1168 2060 -30 -1808 -1131 1150 714 -1251 -2133 -598 1601 1183 -916 -1202 127 1322 79
2100 79 -934 -806 168 -49 -1168 -1051 -61 280 -948 -1027 265 833 -95 -1397 -720 95 289 -985 -1904
2119 -1904 -857 470 206 -1015 -753 89 699 -120 -1430 -848 119 6 -813 -747 20 460 -461 -954 -598
2138 -598 60 588 -99 -670 -24 403 21 -435 -289 -106 -275 -447 -366 416 353 551 -620 -181 455 559
2158 559 -340 -1054 -607 737 936 488 -418 -58 412 1013 230 -541 -254 466 666 460 296 133 347 249
2178 249 205 642 655 -73 -84 435 954 769 -54 -563 795 1335 969 -354 -284 844 1556 611 -891 -458
2198 -458 878 747 -550 -445 394 811 -44 -516 96 785 178 -627 -779 537 1264 -294 -1322 -468
2216 -468 810 807 -385 -1249 -168 1144 -178 -1311 -566 624 237 -751 -1267 92 775 -642 -1450 -682
2234 -682 703 317 -898 -1195 -149 707 51 -1497 -508 662 707 -795 -1180 120 840 -353 -1510
2251 -1510 -475 850 501 -948 -1179 348 1512 -8 -1460 -738 1046 816 -909 -1263 -149 905
2267 905 240 -837 -730 1202 747 -342 -1026 149 616 108 -679 -348 828 803 -797 -862 54 1134
2285 1134 99 -888 -133 1147 970 131 -698 112 845 268 -525 -300 727 879 419 -264 430 994 40
2304 40 -652 -168 1021 931 448 -176 49 1152 499 -134 -286 868 908 414 153 461 1090 755 440 -347
2324 -347 143 511 342 -336 -142 884 784 457 -82 -178 607 239 -351 -358 413 508 597 -107 -375 168 47
2345 47 -644 -484 121 403 357 -349 -655 197 15 -564 -969 -790 -105 12 -393 -424 -338 2 -881 -1239 -845
2366 -845 -397 -35 -1014 -913 38 485 -764 -1517 -1402 -270 96 -885 -899 -187 1043 -185 -1404 -1153 -101
2385 -101 -385 -1351 -1434 -335 1325 178 -1122 -990 362 332 -1168 -1629 -545 540 471 -654 -534 783
2403 783 647 -654 -1687 -178 1052 290 -111 -270 1072 920 -455 -909 90 1136 746 -287 328
2420 328 1764 1690 145 -653 367 979 511 -412 328 1851 1793 588 -461 530 1437 427 -589 -537
2438 -537 1536 1950 507 -314 513 1191 1032 -551 -391 1021 1545 780 -22 307 1080 624 -644 -456
2456 -456 316 826 59 -181 577 1201 648 -624 -1142 -107 510 -344 -635 -54 930 592 -6 -554 -145
2475 -145 245 48 -545 76 307 115 -84 -169 29 26 -218 -514 136 824 525 -526 -234 -178 391 -587 -1319
2496 -1319 -647 173 638 -82 -813 -694 172 107 -784 -1107 -311 34 10 -793 -760 -406 -306 -736 -921 -393 -318
2517 -318 -88 -505 -677 -706 -135 -750 -890 -729 302 259 -675 -877 -398 74 -356 -1235 -1097 -133 472 -177
2537 -177 -604 -351 639 321 -751 -1351 25 474 -71 6 -54 639 4 -463 -450 71 587 -146 -402 538
2557 538 1379 413 -943 -682 929 750 133 -962 530 1959 1461 -626 -868 338 1040 194 -891
2574 -891 -158 1150 1715 517 37 637 825 -261 -727 456 1033 1112 153 100 955 1041 -368 -1542 -80
2593 -80 1402 1349 -76 -292 715 1396 70 -1151 -865 460 932 119 -15 825 969 257 -577 -191 192
2612 192 -216 -931 -603 1168 1156 312 -947 -140 736 78 -1092 -1155 -43 1414 248 -1375 -919 112
2630 112 2 -1105 -1099 -762 538 779 -137 -298 -1 -415 -1024 -1410 -712 -214 -545 -800 -157 806 419 -769
2650 -769 -1259 -699 -167 -329 -905 -955 325 506 -162 -832 -752 370 0 -550 -233 -115 505 84 -400 -547
2670 -547 -304 -263 -501 -313 128 585 233 114 55 499 205 -564 -826 43 674 534 -348 -70 1050 1047 411
2691 411 -429 -403 572 550 14 -241 243 1130 732 -49 -538 -64 282 118 -173 134 1152 607 -84 -154 187
2712 187 265 -63 -440 269 1136 1064 -319 -38 996 480 -419 -1153 -381 685 967 -90 -360 644 807
2731 807 291 -830 -544 349 108 -193 -260 556 829 -61 -944 -358 543 -181 -919 -867 571 1164 330 -1120
2751 -1120 -705 381 440 -687 -1168 -333 665 191 -549 -968 200 68 -569 -1195 35 770 36 -908 -521
2770 -521 327 -9 -853 -1121 -394 533 -166 -614 -441 255 345 -713 -872 -320 375 -194 -699 -470 119 542
2790 542 -493 -800 19 512 288 -658 -515 441 805 -99 -658 294 505 296 -85 -202 776 722 -39 -103
2810 -103 78 907 397 -89 -84 469 1044 401 -375 -343 533 979 211 17 351 929 520 -18 -181 398 489
2831 489 430 133 379 891 566 110 -117 -79 -65 -55 -433 382 1130 937 96 -108 311 325 -148 -571 -250 521
2853 521 1169 551 -55 -151 -13 -61 -378 -469 210 796 290 17 -106 268 16 -1026 -601 5 982 512 168
2874 168 369 948 415 -1065 -1322 -428 231 -27 -256 150 804 203 -320 -1258 -522 102 -501 -1072 -401 491
2894 491 478 -606 -1155 -972 -287 -141 -1034 -583 508 640 -215 -1002 -778 -541 -1312 -1559 -1030 241 727
2913 727 -302 -887 -39 368 -921 -1661 -1813 -455 476 -592 -1098 -233 500 -379 -1351 -1050 -14 345
2931 345 -502 -819 -35 873 4 -1066 -921 325 749 -233 -453 513 1639 1028 -380 -691 177 380 -458
2950 -458 -715 24 1511 1002 241 465 974 997 40 -384 105 982 508 -22 79 797 934 435 -223 163
2970 163 1031 1027 -85 113 714 700 -112 -381 -115 869 714 138 -44 845 1144 414 -87 72 501 639 -188
2991 -188 -557 -14 572 395 -141 107 418 862 207 -428 -329 -13 11 -480 -453 235 354 181 -311 -65 45
3012 45 -122 -249 -542 -246 549 270 -286 -437 -19 -5 -249 -752 -436 516 489 -48 -101 479 129 -460 -1032
3033 -1032 -455 -66 181 366 146 336 445 68 -1047 -648 177 146 -352 -150 72 835 336 -555 -912 -68
3053 -68 13 -517 -406 293 1104 461 -419 -882 14 303 -806 -941 -120 1040 632 -214 -699 -224 196 -758
3073 -758 -1443 -816 457 486 -121 -375 288 483 -641 -1461 -886 481 348 -445 -397 860 759 -332 -725
3092 -725 -518 -21 532 -230 -205 678 1121 197 -961 -547 594 244 -427 -149 796 1323 270 -679 -233
3111 -233 892 334 -521 -382 667 740 423 -591 233 956 363 -393 -742 113 972 139 -748 -223 591
3130 591 580 -434 -606 177 701 30 -497 -58 151 529 -484 -494 -340 172 -168 -623 -213 115 -146 -483
3150 -483 -432 132 569 173 -665 -276 -173 75 -346 -344 -470 -76 71 -577 -225 -210 -18 -21 -229 -151 -42 42 46
3173 46 -142 303 346 -144 -562 -249 342 286 234 -14 -156 655 193 -372 -594 25 474 252 -1 208 501
3194 501 609 482 -408 54 196 427 82 2 602 1047 283 -129 -52 213 249 -177 -173 783 1033 356 -47 -24
3216 -24 89 341 -324 -589 137 1260 668 129 49 470 199 -585 -897 132 885 711 -92 -131 747 574
3236 574 -498 -1202 -259 186 112 -563 119 1005 568 -615 -985 -235 439 -74 -817 -252 826 855 -283
3255 -283 -800 -422 501 19 -794 -629 714 521 -12 -466 -500 222 -408 -844 -464 442 537 -529 -369 136
3275 136 275 -251 -1224 -889 148 585 -438 -1082 201 713 -128 -963 -980 -134 340 -453 -745 -177 655
3294 655 253 -668 -600 142 -78 -669 -769 -137 627 175 -454 -220 269 408 -650 -1074 -67 311 169 -344
3314 -344 -159 675 664 -226 -734 -560 202 300 -72 -262 408 696 151 -260 43 302 65 -456 -115 300 1094
3335 1094 494 -221 -79 568 -99 -438 -116 199 623 848 212 81 190 18 -132 -647 -191 654 659 498
3355 498 460 476 413 -123 -369 -366 153 383 271 330 619 609 339 -326 -386 -352 388 187 -7 420 541 500 -413
3378 -413 -566 -466 243 117 -563 49 778 689 -264 -702 -158 -93 98 -437 -430 719 791 -62 -336 -83 312
3399 312 -296 -623 -593 562 632 28 -410 -191 488 -360 -1208 -556 346 577 48 -451 -227 396 -11 -757
3419 -757 -750 9 466 -261 -322 23 440 49 -832 -1050 63 416 -231 -686 -240 854 89 -772 -628 140
3439 140 590 256 -474 229 607 428 -460 -664 -138 178 -178 -517 249 817 879 -429 -722 -232 104 -396
3459 -396 -555 206 772 879 -71 -420 -99 615 -338 -372 561 950 827 109 -154 150 271 -275 -536 -34
3479 -34 1184 1089 456 248 615 572 -117 -666 -258 537 1027 518 522 832 646 -127 -471 -431 -73 760 172 274
3501 274 702 847 264 -498 -350 -143 226 290 30 455 788 458 -382 -662 -736 -144 -128 -51 259 476 623
3522 623 -204 -775 -635 -555 -620 -687 -122 366 586 -13 -339 -471 -535 -675 -662 -416 99 336 191 -270 -809 -258
3544 -258 -647 -1139 -1350 -452 291 416 -102 -12 80 -93 -941 -1472 -721 -28 241 -160 110 548 411 -492 -1436
3565 -1436 -567 265 286 -489 -130 511 762 -327 -779 -238 207 227 -390 -56 926 1241 12 -594 -554 358
3585 358 -2 -508 37 768 1486 671 -105 -94 649 115 -532 -365 354 972 345 -76 -76 877 618 -548 -438
3606 -438 405 829 291 50 196 870 392 -579 -565 205 1038 245 -251 339 781 625 -173 -846 240 558
3626 558 356 -176 160 915 523 -8 -348 238 377 323 -602 -62 692 803 67 -344 71 561 150 -275
3646 -275 -54 718 621 195 -172 34 579 75 -204 -353 400 430 -111 -138 55 255 -12 -553 8 196 252
3667 252 -119 -438 -154 251 197 -115 -516 225 135 -24 -333 -432 84 -275 -223 -624 -315 19 -64 -519 -741 -258
3689 -258 -72 -303 -170 -592 -35 -18 -383 -476 -220 -46 -235 -545 -708 19 -197 -186 -546 -427 234 -264 -637
3710 -637 -417 -7 -87 -439 -311 -265 267 233 -412 -463 47 437 19 -334 -215 557 536 -181 -279 190 360 95
3732 95 -398 184 623 738 64 -260 370 719 328 -513 -391 700 614 170 -509 307 582 523 -588 -556 477
3753 477 705 -537 -396 188 462 414 -622 -289 510 463 -343 -525 258 572 87 -434 108 493 553 -226
3773 -226 -838 -84 621 140 -300 -370 552 253 -379 -541 -250 122 -229 -416 -131 471 417 -405 -757 -148 322
3794 322 53 -256 -389 429 334 -112 -694 -247 424 -76 -310 -340 526 758 63 -543 -168 299 -126 -489 -439
3815 -439 227 790 285 -209 -330 273 84 -479 -618 2 295 169 -74 278 628 465 -189 -502 -83 -8
3835 -8 -194 -319 378 455 444 -303 -525 -113 -92 286 217 82 359 642 199 -385 -308 253 65 112 -59 629 636
3858 636 487 -465 -24 -62 -22 -85 -192 120 751 569 221 0 335 111 -10 -111 -33 590 715 313 -35
3879 -35 463 403 43 -519 -53 504 579 267 -40 111 192 -10 -533 -688 141 536 106 66 233 591 -58 -659
3901 -659 -542 32 359 -430 -280 180 667 150 -484 -634 303 719 -240 -332 0 535 391 -513 -500 -39 173
3922 173 -170 -301 -98 641 547 -695 -332 -157 -140 -282 -526 -197 459 321 -668 -616 200 563 -757 -528
3942 -528 -188 727 287 -174 -532 -48 294 -547 -715 -417 338 299 -289 -206 -24 271 -21 -793 -202 324 305
3963 305 -125 -163 607 576 -296 -636 -416 58 425 -139 -184 224 553 -279 -420 -531 256 264 -23 -318 379 689
3985 689 5 -450 -243 277 407 -136 -302 462 819 493 -304 188 402 518 -175 136 377 430 468 118 -491
4006 -491 185 301 -88 -104 8 692 516 502 78 420 206 45 -278 -210 358 29 190 65 155 362 114
4027 114 -372 -109 106 460 -310 -51 215 218 265 -574 -459 -399 180 153 -2 -112 438 213 -466 -484 -224 -23
4049 -23 0 -407 -115 408 272 -372 -537 -63 148 -3 -594 -162 148 634 -324 -585 -547 28 -63 -696 -581
4070 -581 -15 413 -211 -539 -284 104 43 -477 -455 -47 440 -344 -571 -48 214 275 -502 -693 491 553 -145
4091 -145 -468 -223 195 482 -339 -648 72 644 120 -653 -126 405 219 -76 -452 306 678 -51 -676 -102
4111 -102 471 683 -188 -391 285 675 -198 -375 -207 301 672 -87 -513 167 670 392 -145 -178 564 407
4131 407 -76 -325 257 383 331 -348 -48 266 530 207 -217 297 546 207 52 -129 429 431 -177 -302 -58
4152 -58 329 138 6 -145 397 401 -291 -280 -29 256 -40 -99 -258 172 -17 35 -228 9 372 25 -325 -23
4174 -23 231 183 -17 -391 -207 150 -25 -313 -111 111 271 108 -396 -355 124 150 -125 -490 -278 89 443
4195 443 -200 -327 -73 -88 -220 -345 -228 196 10 -298 -214 -289 362 -134 -171 -253 259 97 -6 -235 54 92
4217 92 248 -439 -453 77 163 -110 -615 -240 72 392 139 108 26 565 171 -434 -296 105 419 -455 -733 36
4239 36 244 -57 -478 163 241 348 -179 -423 161 522 230 -390 -115 256 546 15 -454 89 224 388 -387
4260 -387 -89 440 452 -260 -556 -110 325 269 -392 -184 670 910 -135 -234 -122 367 340 -473 49 374 476
4281 476 -20 -332 -208 618 466 -415 -125 192 305 -146 -251 0 545 199 -467 -5 400 682 21 -604
4301 -604 246 380 -99 -471 -343 227 413 -114 -468 7 380 -18 -421 -343 -190 -91 -153 -499 -39 42 33 -324
4323 -324 -698 120 -24 -63 -334 -137 213 -179 -291 -518 -55 -67 -271 -491 -440 466 320 14 -93 -209 224
4344 224 192 -152 -46 407 239 96 -231 299 313 240 -180 -197 -66 495 184 21 -158 349 338 34 -166 177
4366 177 147 311 -119 -19 374 254 110 -183 144 105 136 -93 65 153 478 223 -417 215 68 487 -167
4387 -167 -114 5 251 219 -35 -205 185 311 -147 -158 -59 511 327 -401 -309 169 -8 -38 -264 33 332 93
4409 93 -102 -385 108 387 -404 -584 149 556 51 -317 -396 297 355 95 -131 -101 602 287 -140 -457 -197
4430 -197 87 -502 -528 -222 689 349 -68 -766 -156 171 -486 -596 -408 364 -12 -688 -179 97 229 -3
4450 -3 -434 -360 185 169 -605 -499 163 276 -167 -777 -190 237 257 -284 -272 -128 449 -193 -331 -385 100 -122
4472 -122 -551 -205 -54 317 72 -176 22 226 491 -207 -395 206 274 76 -336 -273 388 607 25 -73 64
4493 64 503 84 -203 -171 193 96 -203 -220 215 717 267 138 -35 389 546 122 -189 18 307 13 97 37
4515 37 352 254 184 -34 239 538 329 -166 -333 115 404 129 266 -251 364 335 -64 17 45 24 257 -60
4537 -60 -250 180 51 -217 -165 -41 231 536 58 63 88 16 -130 -31 -217 194 374 -179 -305 -184 582 -173
4559 -173 -107 -396 267 312 -22 -273 -240 347 -44 -157 -271 35 231 -267 -570 -197 7 104 -258 -587 -51
4580 -51 180 118 -427 -122 430 197 51 -824 49 100 -86 -508 -292 160 278 -455 -691 -68 303 268 -603
4601 -603 -281 -42 278 -426 -772 126 338 297 -276 -23 130 175 35 -407 152 209 32 -567 -229 404 374
4622 374 -108 -240 136 304 292 -408 -86 355 66 -85 -231 143 786 -4 -355 -211 463 302 -3 -80 262
4643 262 451 116 -324 -41 247 145 -370 -91 31 332 211 -278 87 451 462 147 -359 72 320 341 -269
4664 -269 -8 298 74 -193 -428 161 360 141 197 -416 148 232 136 -269 45 124 346 -116 -141 -192 147 238
4686 238 -224 -79 -202 398 -167 -192 70 458 116 -313 -215 -120 -58 -170 -375 -62 92 46 -224 -227 -65 -98 -101
4709 -101 -457 76 186 232 -114 -588 -443 26 65 -2 -450 -119 315 -206 -192 -138 -140 37 -172 -331 23 260
4731 260 -176 -383 -47 11 479 -139 -502 174 153 185 -237 144 255 226 -262 -194 158 320 62 -55 -259 288
4753 288 408 139 -139 -59 334 101 -196 -166 363 361 -24 -76 370 242 190 -22 103 341 428 -104 -113 -62 480
4776 480 304 -599 -314 428 467 135 133 130 574 466 -293 -314 376 498 -160 -319 223 509 412 -120 -368 336
4798 336 224 75 -222 149 608 187 -292 -147 412 170 -121 -313 -151 243 380 -64 -165 89 200 -124
4818 -124 -222 101 188 -13 -470 -340 36 68 -66 -43 -274 295 70 -308 -565 247 422 214 -249 -71 -131 57
4840 57 -228 -336 -148 245 -119 -387 -483 -168 -32 -177 -247 -24 -122 162 -240 -434 28 130 -507 -501 -76 -44
4862 -44 159 -3 -175 -256 40 -286 -249 76 147 24 -29 -67 -7 114 395 -49 44 -77 346 319 -132 -152 7
4885 7 242 -66 -196 305 299 165 -162 -60 182 -19 130 -176 -159 668 315 -12 -55 532 367 -43 -297 42
4907 42 349 127 -203 -22 409 492 7 -357 -153 314 563 -107 -106 280 494 91 -267 154 368 340 -162 -80
4929 -80 333 683 -1 -259 -17 486 319 -328 -291 167 313 -162 -776 -244 549 285 -56 -346 282 445 -237
4950 -237 -283 -10 78 338 -560 -206 383 366 171 -465 -202 427 322 -227 -180 151 243 56 -501 -240 274 94
4972 94 -222 -633 -266 75 115 -556 16 645 67 -401 -369 181 103 257 -393 -106 260 -76 -350 -460 -43
4993 -43 564 26 -541 -571 92 25 -60 -373 -40 157 -64 -60 70 283 141 -428 -187 152 141 -122 -282 -59
5015 -59 197 237 68 -288 -20 134 -193 -143 -119 62 366 344 73 207 -7 232 85 -69 -56 79 95 13 -79
5038 -79 192 18 27 -155 13 125 168 323 241 87 383 123 -222 43 185 250 -150 -256 127 3 91 34 -206
5061 -206 256 221 37 -437 -49 115 313 -4 -239 32 359 21 -198 24 54 154 -106 -175 -40 34 223
5082 223 -190 -79 410 45 -212 -207 -61 136 -133 -74 163 125 105 -223 -512 -242 511 -60 -317 -341 247 72
5104 72 -328 -114 -65 429 90 -505 -350 72 271 -292 -371 50 473 36 -181 -155 -14 21 -394 -493 203 320
5126 320 -101 -622 -330 255 612 -339 -216 258 272 -71 -326 -27 148 375 163 -347 60 395 287 -194
5146 -194 -240 388 406 69 -362 207 465 228 16 -131 300 268 26 -332 179 86 194 13 123 -120 243
5167 243 -115 -84 241 315 479 -100 -3 91 428 150 -198 -56 200 136 -34 -177 97 39 198 147 -19 -45 -58
5190 -58 75 -35 24 183 -46 20 18 25 97 -112 36 -13 401 -42 -592 -91 83 117 -31 -337 -251 323 75 -187
5214 -187 -54 -261 176 165 66 -47 32 42 296 -326 -267 171 -171 -57 -342 -56 371 136 -246 -155 -434 56
5236 56 -493 -140 53 396 327 -437 -85 -114 141 -91 -284 -41 99 -143 -380 -186 42 412 -222 -296 12
5257 12 301 47 -361 -110 405 80 -296 44 -78 241 -217 -471 -368 231 369 -259 -626 121 416 149
5277 149 -226 -140 124 530 -6 -120 120 321 334 -89 -192 432 463 26 -378 -36 631 150 -160 -142 -123 628
5299 628 -91 -115 45 468 251 -341 -152 -129 550 27 84 113 204 395 -62 124 -26 475 41 -194 255 663
5321 663 184 -438 -54 8 281 231 -307 -328 109 153 -156 -187 8 303 74 -275 -136 450 284 -380 -407 49
5343 49 82 379 27 -409 41 -155 9 -372 134 205 -204 -79 -296 23 -214 25 -304 -17 232 -138 -95
5364 -95 -190 -59 226 -114 -64 -75 274 -243 -241 53 -265 73 144 -136 -143 -218 -156 -76 -329 -402 177 112 192 -152 145
5389 145 202 -54 -378 124 221 220 -125 -164 -271 97 126 -393 -197 99 294 -284 -277 -123 129 157 -240 -305 311
5412 311 478 -205 -248 -227 141 368 -207 -413 305 -7 -442 -366 109 283 171 310 -485 134 471 138 -295
5433 -295 34 450 632 143 118 456 128 43 103 -152 241 -111 -127 -201 112 474 47 -317 -1 349 324 -277
5455 -277 -417 196 65 280 -608 97 167 7 -246 -239 355 247 20 -348 -100 403 254 200 -441 -158 151
5476 151 -8 -477 -268 379 163 -302 -343 -83 340 175 52 -335 140 259 -417 -510 59 43 -390 -263 10
5497 10 145 270 -205 -322 92 -21 -14 -460 -412 -267 7 -216 -404 -35 56 -318 -98 -348 286 86 -161 -46
5519 -46 102 10 148 -81 -232 58 84 -18 132 44 131 243 -75 -165 -64 328 180 -28 -64 375 276 40 -123
5542 -123 26 191 -138 96 8 212 303 -5 13 -77 236 20 253 -97 24 269 121 53 -148 88 130 192
5564 192 -58 31 339 -57 -92 -113 94 492 156 -304 -173 41 112 -169 33 59 241 91 -34 -190 -26 161
5586 161 -381 -183 94 98 198 -272 -276 5 224 -73 -291 80 99 130 -310 -316 250 57 -151 62 -173 288 24
5609 24 -187 -205 76 -101 -315 -246 -178 -25 256 -311 -251 144 102 -94 -378 -18 141 235 -137 -321 218 116
5631 116 -306 -525 -100 -200 -14 -310 -383 206 30 -55 -625 -53 59 -23 -7 -194 88 289 56 -157 -143 212
5653 212 -84 -253 229 23 396 89 -98 53 78 100 -241 -473 314 4 -126 -202 -21 188 25 -94 -334
5674 -334 267 357 -83 -267 -296 503 1 17 -183 77 226 128 162 -117 198 111 -115 129 -43 9 322 -139
5696 -139 63 14 349 231 -4 102 432 34 -194 -148 123 40 -94 30 366 67 114 -9 -20 37 165 14
5718 14 -315 -294 311 76 -170 -33 -321 132 312 -120 -250 222 21 190 -278 -154 152 25 -276 -198 -139
5739 -139 169 164 -90 -166 -12 196 -244 -181 -29 117 -15 -124 -107 410 263 191 -628 -248 76 79 -137 -1 127
5762 127 99 -163 -213 -224 46 217 -364 50 114 -4 -147 -192 -187 457 75 -214 -213 36 -51 -227 -150 -8 -3 205
5786 205 -90 -338 164 575 -269 -180 113 378 367 -275 68 134 -38 -175 -416 -152 459 138 -135 -293 7
5807 7 379 122 -378 72 489 111 -207 63 403 254 -12 43 24 167 -150 -150 -21 259 341 155 -25 -83 266
5830 266 156 -60 -147 -185 436 230 -173 214 96 272 -65 1 165 213 -9 -421 88 302 98 -224 73
5851 73 113 186 155 -335 171 -22 186 48 -181 -192 -19 64 -124 -175 93 326 -156 -68 33 102 60 -170 -191 101
5875 101 150 -244 64 93 -142 -154 -258 -277 -73 -49 142 -454 218 -86 190 -140 -60 -90 -106 -365 -531 181 95
5898 95 36 -246 -179 -117 274 50 -223 -270 61 226 163 -346 -133 260 347 35 -332 -105 527 223 -90 -165 -287
5921 -287 46 -58 -349 184 105 422 -35 -248 -199 42 202 -131 -201 525 346 -6 -17 -273 71 157 -344 103
5943 103 332 419 -13 -158 -103 413 -196 -132 75 160 257 -147 8 231 492 -156 -175 -324 -128 348 -11 111
5965 111 303 187 -100 -217 -280 189 195 -197 -77 244 510 -181 -175 -72 3 7 5 -273 -39 -103 332 -466 -91 66
5989 66 439 -304 -398 -90 236 114 -56 -144 106 62 -67 -351 238 63 196 -234 -443 -57 183 -10 -300
6010 -300 0 61 -69 -101 -68 303 61 99 -480 -39 252 131 -147 26 -37 -51 69 -152 -137 105 53 -32 -14
6033 -14 -115 123 -18 -283 -92 52 -254 -51 -258 226 362 -74 39 20 -105 90 -257 185 -274 241 135
6054 135 -63 -64 48 115 191 -101 -32 -126 366 313 -472 -11 177 -55 -344 -214 322 261 206 216 271 190 -71 -92
6078 -92 -117 -63 284 -90 105 40 282 414 -75 76 -117 70 -1 -87 17 325 -120 38 -315 -8 226 48
6100 48 -58 -222 326 88 82 -71 -101 173 62 28 -316 279 387 -286 -9 117 236 -23 45 -219 120 184
6122 184 4 -125 248 297 -35 -418 -133 -19 126 29 -436 12 -49 -71 -268 -456 140 146 -168 -349 -312 323
6144 323 220 -465 116 281 230 -131 -193 -200 -14 81 -276 -11 -48 146 -159 -389 -361 308 29 -136 13 55 249
6167 249 66 -267 160 218 178 -125 31 6 245 371 -417 -119 333 154 -308 244 206 83 114 -137 144 -34
6189 -34 -47 -89 61 253 208 98 -3 86 49 366 -22 -212 168 392 148 -103 -143 7 -190 119 -104 190
6211 190 -12 98 33 156 334 122 -117 41 9 410 81 104 41 211 265 98 -34 -299 -123 36 -117 -4
6233 -4 55 56 82 72 -239 141 246 63 -41 65 -65 236 -264 -336 38 196 -37 -544 -193 -31 124 -241 -248
6256 -248 17 273 -18 -145 -419 467 446 34 -240 73 367 148 -394 -238 -34 -19 8 -323 -139 142 -105
6277 -105 -487 -334 46 116 -51 -296 -55 182 -28 -271 -543 -207 343 35 -50 -91 225 99 -91 -38 -70 485
6299 485 -161 -551 -117 107 267 -273 -283 -151 184 75 -225 -144 208 121 62 -374 -213 197 -74 -261 -143
6320 -143 328 394 -51 -206 226 296 26 49 159 402 240 40 -139 -59 129 187 -158 36 192 -11 91 -231
6342 -231 221 187 77 -237 -68 345 686 -182 166 249 165 -297 -45 51 102 245 97 52 278 509 -92 -218
6364 -218 -390 278 -71 -30 -10 -120 80 -51 -176 -113 153 133 23 -158 -49 -27 108 48 -252 -112 -18 34 -371
6387 -371 58 122 -111 16 -117 -190 -236 -10 -279 -393 49 566 -85 -44 -227 -143 -103 -380 -64 30 231 2
6409 2 -146 -172 85 63 -578 49 -389 26 17 -113 -123 75 196 7 -154 -149 376 255 -133 -334 184 142 122 -16
6433 -16 -267 -125 -101 -61 -182 146 386 -281 -329 -36 314 238 -292 -389 244 282 283 -145 97 136 77 -286 -107 133
6457 133 444 134 25 23 105 -162 27 -57 109 162 -71 -228 -119 507 151 -195 -181 150 157 38 -63 -36 401
6480 401 386 -323 -156 391 78 -8 -254 -161 22 107 -174 -21 26 99 213 -238 -58 -122 411 -355 -74 -37 158
6503 158 242 176 -187 -59 -4 114 -269 13 -106 -71 -275 30 104 68 124 -173 -306 104 102 -226 -106 -109 64 -91
6527 -91 -153 -199 126 -111 17 -116 204 -155 188 -199 -202 -52 -163 70 -183 -5 181 247 126 24 -153 40
6549 40 -283 -46 -111 232 28 200 -104 83 283 -140 -208 -80 16 181 -92 49 181 200 -86 -219 -238 25
6571 25 155 108 -147 6 306 -237 188 35 -160 100 -62 182 319 244 153 -158 -171 0 154 44 -99 -31
6593 -31 177 332 42 -74 337 298 102 -84 -9 142 188 122 -237 -47 193 179 -144 -83 167 -134 -59 -339 -109
6616 -109 292 266 16 -153 -23 -66 56 -226 88 46 2 -108 -165 -64 278 92 -206 235 148 -7 -262 -13
6638 -13 -3 347 117 -341 -241 -123 38 -373 -156 -4 520 -55 126 -21 163 56 -737 -112 158 -166 -172
6659 -172 -165 146 112 -237 -430 -219 77 -8 277 -201 131 109 -153 -186 -264 -174 -16 107 -413 131 86 17 -198
6682 -198 -60 335 193 77 169 85 177 7 -18 -95 242 96 276 -33 174 -32 276 4 -108 -101 234 -100
6704 -100 -155 151 -61 236 -14 -54 280 19 -214 206 42 113 156 118 -54 183 342 76 -292 108 249 -205
6726 -205 280 10 -23 -148 193 -95 -369 116 209 120 -97 -61 173 -185 81 -289 0 181 382 132 -148
6747 -148 16 184 -111 -12 -70 16 44 -87 -231 -37 451 51 -229 -189 64 72 -23 -43 30 113 309 -90 23 84
6771 84 181 -368 -317 -237 180 68 -353 339 221 216 -94 -471 -9 202 -139 -153 -413 -19 226 17 -172 -283
6793 -283 195 -57 -171 -199 135 320 -50 -405 151 106 14 -336 -203 -181 18 -270 -309 -444 284 134 -252 58
6815 58 -124 220 50 -310 409 108 -193 -168 -258 132 -51 -49 -313 80 130 55 169 -32 80 398 108 -13
6837 -13 -56 267 108 35 -97 40 430 219 -240 -47 -87 115 89 -501 116 400 -93 -157 -360 -62 20 -9 80
6860 80 72 304 62 -284 163 205 84 -113 85 438 253 -255 -43 211 87 -130 -36 -168 69 116 172 251 -136
6883 -136 296 -163 209 -7 -160 41 -252 47 -129 88 502 144 -300 -103 45 294 170 -85 351 168
6903 168 -8 -237 -350 -39 36 -45 -269 -132 -111 -209 -155 -188 -259 -5 59 -152 -179 -38 -163 -90 -300 -169 315
6926 315 149 -238 -171 339 131 -127 -234 86 -210 -1 -83 -226 50 66 184 33 -197 226 372 -174 31
6947 31 -7 337 110 -304 -285 86 237 150 -163 248 282 187 -9 -335 178 139 -105 -245 65 530 206 -66
6969 -66 -139 -67 110 -53 -100 203 60 -87 -157 -55 297 289 -29 -578 136 233 403 -4 -195 -25 120 -115 -339
6992 -339 -10 123 198 110 -56 131 18 -178 -52 104 75 18 -123 -42 -113 75 359 -127 -31 5 -26 -187 150
7015 150 17 168 221 162 239 0 76 -369 -370 2 -102 -398 -133 -106 170 142 -19 47 -123 -108 -15 113 -36 -172
7039 -172 1 -220 -343 -68 106 233 121 30 -293 365 -452 -374 -44 16 -57 -20 344 166 -253 -143 -276 51
7061 51 -61 -217 -135 6 50 163 -55 -48 -303 -120 11 -155 -199 77 149 121 -8 -277 198 116 145 3 93 135
7085 135 -126 -260 216 -1 -80 41 -70 -131 275 167 -184 -2 -168 82 60 54 -54 67 166 -111 -380 427
7107 427 184 101 -509 -207 279 108 94 104 -147 408 101 179 33 -23 116 -40 119 -62 361 222 34 -175
7129 -175 202 -35 -224 -285 92 248 139 -114 125 358 83 120 -109 45 212 -18 -239 -62 194 -53 67
7150 67 -287 359 85 40 107 -176 154 -51 -118 -484 -124 246 330 -230 -56 28 206 61 -197 42 67 -137
7172 -137 -332 102 90 -20 -5 -357 -100 215 -55 -201 -125 -90 240 -188 -201 101 111 393 -74 -168 172 440
7194 440 -27 -285 -217 -251 -52 72 -68 50 75 -96 -272 3 52 64 6 -231 127 336 166 -268 30 -96
7216 -96 7 0 -197 -71 124 -7 -16 -188 -90 -100 213 138 -159 225 78 -160 -123 -193 303 22 -98 414 213
7239 213 237 -54 -63 -128 149 -36 -470 -202 -46 27 -70 -93 292 -83 232 -3 -19 -65 219 -61 90 14 96 85
7263 85 8 177 -107 1 121 -252 -119 137 -4 78 168 -77 230 -138 -58 -214 -118 72 96 116 -132 433 -14
7286 -14 -340 -586 -23 20 -27 -197 -126 216 228 -111 -135 -35 50 -163 -384 47 -59 70 -175 -125 -365 52 114
7309 114 -187 -57 356 110 -19 -20 -173 102 -342 -679 -164 -24 157 -63 -2 134 259 34 -189 -25 322
7330 322 121 -108 -331 -31 184 -296 -180 -24 161 35 -67 -171 333 209 55 23 53 126 327 -183 -361
7351 -361 -107 309 207 89 211 118 187 -210 -287 61 397 156 -64 -4 133 -74 110 -38 311 -4 119
7372 119 -308 -19 -216 -110 99 -345 9 146 -15 -76 -75 24 78 211 -181 -10 11 -44 -71 -97 413 237 138
7395 138 129 46 -136 -103 64 -72 -32 -47 -249 -86 7 -142 303 82 42 87 -42 59 -187 -273 -200 106 -87 41
7419 41 -59 -138 93 88 -186 186 69 51 184 -30 77 52 -226 -24 -102 77 -66 -184 -138 272 42 -32 -10
7442 -10 -53 215 126 88 -602 -236 -25 163 -27 -182 -313 -108 82 -498 2 25 -285 -570 -82 281 146 -240
7464 -240 -79 71 104 -239 -104 51 272 173 -232 149 29 272 189 -250 5 99 213 -93 -335 -29 429
7485 429 174 46 -137 83 -410 337 -6 317 680 278 -238 -180 238 293 62 -207 14 203 -18 -200 75
7506 75 -35 -6 49 270 -277 -90 54 -243 -119 171 179 -36 -172 19 181 112 -101 -158 271 326 -318 -634 33
7529 33 33 343 -101 -348 95 -12 293 100 36 -124 -16 164 102 284 -24 -209 -289 -106 -144 294 -226 -213 -12
7552 -12 -107 280 -352 -191 -29 8 11 7 -213 157 -50 -201 -361 -68 -35 -104 -173 -388 -113 119 -11 124 -33
7575 -33 177 7 -91 77 208 79 20 -277 -71 214 -90 27 -388 222 226 -248 -128 -50 145 64 -207 53
7597 53 -187 -15 -235 -219 -160 197 302 195 -54 -197 61 248 135 -84 -122 87 -12 -164 -82 330 -60 -146
7619 -146 -231 55 386 126 -490 -3 134 172 -39 363 208 -111 88 -454 17 50 17 -175 -201 452 548 -7
7641 -7 -158 117 286 -28 -57 -213 -24 319 103 -354 91 75 244 -327 141 357 -217 94 -332 113 305
7662 305 -18 34 -151 -29 187 -110 -11 112 78 97 34 -67 -79 402 -444 -128 -110 55 11 54 -52 138 240
7685 240 248 -44 9 270 240 -415 -25 -84 -25 -153 -121 -126 125 -303 -165 16 -68 226 -202 23 -240 122 -188
7708 -188 -51 -112 73 -86 -72 -31 -107 137 176 -202 -190 249 20 -88 -79 -144 -43 -104 -20 -164 -43 -171 -2 -13
7732 -13 -101 61 194 -309 38 -181 308 -253 40 -100 48 -203 -208 -79 81 -69 291 88 33 98 5 -90 83
7755 83 -92 184 345 114 -115 83 81 241 -104 -76 92 315 155 -193 -184 281 48 76 -98 -243 283 -4
7777 -4 -74 62 34 156 482 -88 -83 209 109 -103 -42 380 113 137 -59 -159 150 -40 17 165 258 402 179
7800 179 -288 89 351 165 -378 -61 154 -65 -191 49 -91 11 -96 -366 -137 -94 19 5 -251 -306 249
7821 249 16 -482 -240 134 299 -89 -196 -176 177 84 216 -136 54 390 -1 -25 -197 33 223 -447 -82
7842 -82 -7 -255 -83 -202 76 6 -87 -65 -105 -18 111 -78 -67 -122 -51 157 45 -68 -350 494 165 -202 -252 301
7866 301 141 -110 83 -29 491 -282 39 197 290 287 149 -327 54 201 -77 -156 -94 -342 155 101 78 82 56
7889 56 304 139 150 -7 266 45 38 -313 124 514 -160 120 214 -111 65 117 -7 141 8 -182 -111 -4
7911 -4 168 -210 -47 -4 259 88 183 27 -142 137 84 -4 -202 -112 217 -54 5 -43 -125 108 -130 -107 209 145
7935 145 -35 -136 -89 -173 -108 5 -366 -173 290 313 141 -415 -372 180 152 -103 -95 128 8 -45 -199 58 119
7958 119 125 -123 128 -34 200 -294 -235 -61 334 87 -151 -190 159 -38 -231 -179 -216 317 -203 -181 47 71 278
7981 278 -71 -102 -269 86 277 -31 -178 175 227 20 -425 -33 290 72 -124 6 318 117 -162 -340 -111
8002 -111 296 251 -3 -191 118 276 -377 -317 111 149 198 -55 201 -24 186 266 -192 310 332 155 -221 -71
8024 -71 -140 311 -73 -5 -23 363 107 -52 -287 77 97 87 135 51 49 136 293 -119 322 425 -180 75 120 -137
8048 -137 210 -22 -200 -182 -40 69 -241 176 -39 -63 118 -130 -113 67 279 26 -219 -102 -143 218 -33
8069 -33 -9 -4 -120 -240 -321 -68 -98 -135 -140 248 -165 43 30 90 -51 372 -62 -22 -233 8 226 -415 -126 -105
8093 -105 -179 -217 183 -67 -189 78 -58 -159 -65 166 -240 34 -263 3 -145 -250 -170 -318 -89 383 -305
8114 -305 -544 455 36 17 -195 -184 -8 125 -111 -137 -48 410 -113 -275 -22 499 613 102 77 -32 201 74
8136 74 116 -160 -40 43 -134 129 -167 -25 102 241 62 52 383 26 -356 149 -170 74 -204 -511 144
8157 144 55 84 -237 57 -26 117 -291 -159 186 241 53 -369 -2 284 229 -342 -98 33 231 -17 82 -60
8179 -60 167 300 -246 -170 76 85 -63 -97 124 175 211 -24
8191b4
$$ Imaginary data points
##PAGE= N=2
##DATA TABLE= (X++(I..I)), XYDATA
0 0 0 0 0 0 0 0 1 -8 8 -8 8 -14 16 -16 24 -28 32 -40 48 -56 65 -76 89 -102 116 -134 154 -173 197 -223 251
31 251 -282 315 -353 393 -438 487 -542 601 -666 737 -818 904 -1001 1111 -1233 1370 -1528
48 -1528 1708 -1917 2163 -2463 2828 -3294 3905 -4744 5983 -7998 11852 -21935 105144 244001
62 244001 70305 -40606 -46049 53526 93315 72573 20858 8372 10486 29041 46968 65330
74 65330 52484 30253 22966 40361 36579 7183 -6367 39410 90700 63877 -41055 -105042
86 -105042 -52679 53662 87871 33159 -27620 -24114 17952 40053 25159 -2136 -28787 -44621
98 -44621 -31462 11523 40423 17941 -28687 -37004 438 27697 1871 -39528 -34746 11325 36097
111 36097 14234 -13732 -12262 73 -7755 -25427 -22461 859 11877 2295 -2136 5705 -666
124 -666 -24608 -31724 -494 33550 25530 -16124 -38862 -14174 24762 31019 7 -36331 -51251
137 -51251 -36237 -270 33349 36253 4170 -30256 -28161 7399 28313 4500 -29550 -27154 5006
150 5006 17303 -9052 -37204 -28235 9217 30967 15075 -14593 -25639 -7822 22080 36901
162 36901 16482 -25942 -49864 -29566 11584 26620 1533 -27635 -19219 15968 30410 4019
174 4019 -28014 -24253 11327 35244 17170 -25833 -49585 -31837 8065 31524 14544 -26452
186 -26452 -46521 -19636 26692 40546 9687 -27530 -29739 -4681 8216 -3782 -16632 -6685
198 -6685 10897 10368 -9777 -26825 -20171 6435 29583 30263 9475 -15528 -20170 4246 35122
211 35122 36343 1921 -30714 -25241 12123 40103 33711 10660 561 7594 15228 17046 18502
224 18502 19939 17970 13756 13333 15438 12623 3792 1111 10237 18791 12813 2778 7781 24886 31657
239 31657 16160 -6303 -11357 1215 10612 5386 -3883 -6182 -3299 -145 4417 8626 2420 -14256
253 -14256 -24412 -11930 14174 21811 691 -25416 -27924 -11266 1072 -3606 -15725 -18882 -12544
266 -12544 -4951 -1821 -221 110 -3020 -7993 -11663 -14585 -15607 -11957 -45 11908 8400 -12593
280 -12593 -28936 -19699 6485 19850 7074 -14889 -19528 -2402 16344 16805 3205 -10998 -16216
293 -16216 -12365 -3508 2723 3272 1771 2278 5242 5576 -275 -8680 -8965 1247 9846 3858 -8776
308 -8776 -12414 -817 11503 8302 -9144 -20711 -13875 2778 12160 8536 -905 -4038 -105 2801
322 2801 -1849 -10580 -14320 -10630 -1145 7253 8326 1921 -5968 -6481 -533 3402 -1366 -9445 -8312
337 -8312 2913 11767 8092 -2014 -8215 -6313 -2176 -3459 -7023 -4705 3256 9992 10765 6502 -2104
352 -2104 -9228 -10557 -3840 4760 6038 -1866 -7626 -579 11163 9764 -5264 -16092 -10429 2578
366 2578 8670 4145 4 3063 6281 1268 -7190 -10460 -9052 -5858 -1360 4764 8185 5004 -3824
381 -3824 -7051 -452 4421 -2616 -13300 -10537 3825 11960 4763 -8001 -11340 -4463 -649 -4534
395 -4534 -6984 -3009 1374 3714 4012 1690 -3214 -10391 -13986 -7645 2187 3493 -4763 -8323 303
410 303 8094 3540 -8416 -13259 -5051 4831 4483 -2117 -2676 1467 2229 -836 -2491 -2316 -2229 -2064 1513
427 1513 8958 11820 4351 -5256 -3664 6268 10200 3506 -4041 -568 9749 14111 6600 -1853 -954
442 -954 5355 8088 6732 4689 4285 5172 6155 6819 6070 2241 -2189 -833 7080 11880 7173 -1316 -2914
459 -2914 2825 7419 5018 -2059 -3447 3117 8490 6268 380 -3474 -2139 406 1602 1140 1317 2255
475 2255 2618 3482 3992 1347 -3327 -4427 -780 4751 6710 3761 -258 100 3749 3766 -1314 -5024 -1936
492 -1936 5013 8321 5563 1668 1869 2372 -1063 -4529 -3130 1202 3627 2535 1269 2794 3624 -350
508 -350 -7040 -8533 -3984 -27 74 -1744 -1014 501 -1182 -6425 -9795 -8795 -7295 -7026 -3943 804
524 804 1612 -4343 -10271 -9413 -4633 -5125 -11867 -13549 -4766 5388 3867 -5848 -11039 -7826 -3407 -4877
540 -4877 -8682 -7430 -1379 2781 1597 -548 -2307 -5176 -8095 -6678 -700 2652 -734 -3786 924
555 924 8102 5220 -6980 -12588 -5336 5022 5170 -2054 -5118 1096 6742 2597 -5884 -8860 -4192
570 -4192 575 1585 661 401 48 -225 -554 -674 -3276 -7091 -7073 758 7093 4401 -3418 -5205 1986
587 1986 6731 1391 -6748 -5718 3681 9660 6495 -45 -1322 3705 8262 7072 2836 975 4832
602 4832 9983 12815 10459 4922 2774 7110 12621 12691 6792 2761 7010 14872 16624 9106 2137 3519
618 3519 10443 13709 10356 3580 516 5093 11404 11117 3783 -1837 155 7388 9782 2358 -6581
633 -6581 -6310 1911 6169 647 -6797 -7231 -1123 2483 -1175 -7160 -8954 -7257 -5192 -3197 -2845 -5807
649 -5807 -8896 -8071 -3515 -1010 -6535 -12300 -8313 1285 3475 -5148 -11482 -6501 1368 -21 -8436
664 -8436 -10738 -2272 5169 2295 -3541 -2022 3214 2311 -3273 -5768 -1601 2081 646 -1079 2565
679 2565 4860 500 -4770 -1421 5241 2734 -6359 -6441 4748 11359 2103 -12249 -10523 3533 7994
694 7994 -4028 -13967 -7106 6708 8282 -2935 -10897 -7701 -2475 -4002 -6764 -4901 -3590 -6061
708 -6061 -5737 574 3471 -4824 -16741 -13369 3150 9946 -3589 -17730 -10321 8893 11945 -4422
722 -4422 -17839 -10941 5041 8104 -1301 -6500 -1862 3244 1446 -339 152 -1313 -4110 -2722 6840
737 6840 11784 2856 -9254 -5989 9859 14396 -134 -12934 -6210 11860 15693 3016 -7131
750 -7131 -1773 7939 7048 -369 -2013 2580 4086 1908 1918 4763 4276 -1610 -2847 4166 9286 3825
766 3825 -4673 -2249 7807 10361 1376 -5698 -1479 6813 6088 -910 -2917 4279 7495 3019 -1148
781 -1148 1385 6161 4684 -907 -1644 3169 5674 2070 -1651 -94 2773 3033 1222 1100 1390 3
797 3 -2056 54 4664 4263 -2076 -6418 -1764 4171 3191 -4162 -7569 -2718 3813 3515 -2538 -5555 -2336
814 -2336 1775 2240 -1045 -5675 -6680 -2784 3113 4205 -1057 -7155 -6379 1136 6017 1939 -5730 -6488
830 -6488 633 6419 4988 -1454 -5437 -2307 2930 5040 2214 -2354 -3244 1546 7264 7350 354 -5396
846 -5396 -2634 5224 8374 2751 -3709 -1559 4999 6640 1755 -3031 -2480 811 2867 2098 910 -543
862 -543 -630 427 3546 4201 -340 -5977 -5673 1043 4960 300 -6321 -5966 150 2733 -925 -3701 -972
879 -972 1536 -165 -3407 -3303 -890 -807 -4586 -6180 -2610 -39 -1901 -3872 -841 3763 2438 -2686
895 -2686 -5108 -1177 2119 -630 -4746 -4730 -1137 -261 -1808 -671 2828 3538 -851 -3343 395 5304
911 5304 2767 -4956 -7345 -1373 3576 2014 -2763 -2865 1146 3178 1368 -625 919 1820 -769 -2888
927 -2888 -1372 310 -1068 -3247 -1851 2244 3313 -426 -2581 1253 5850 3101 -4223 -7668 -3022
942 -3022 2531 2814 -834 -2015 80 2142 2370 2001 1643 -10 -2614 -3071 -361 2246 2034 -984 -1832
959 -1832 1194 2730 1270 -494 1192 3761 3854 -318 -3333 -2023 619 985 -608 -1030 688 3112
975 3112 4414 5079 3548 2250 -829 -2601 -2166 278 1418 160 -956 965 3791 4779 2852 264
991 264 602 2290 2365 563 245 188 385 -335 -1599 -910 1110 2720 2369 2433 3339 3500 1350 -1160 -2131
1010 -2131 -1133 -1152 -2410 -2759 1012 4354 3613 -111 -1696 -10 1614 572 -1823 -1834 336 105 -1397
1027 -1397 -1782 539 833 -1469 -3012 -736 2678 2989 -360 -2175 -216 1090 -1114 -3668 -1879 1818
1043 1818 2281 -525 -1363 788 2849 364 -3158 -2168 784 997 -892 -674 1862 2768 233 -3053
1059 -3053 -1591 2306 2085 -1957 -3361 276 3240 1484 -2083 -2248 727 1332 -1218 -2124 679 2437
1075 2437 -525 -3837 -2910 184 727 -2199 -2979 -94 2070 20 -2923 -1504 1736 709 -3287 -4806
1091 -4806 -1041 2433 1298 -2259 -2503 635 1562 -582 -1984 439 1758 408 -1941 -590 1503
1106 1503 2112 -525 -1626 640 2616 1357 -572 734 2449 1789 -1107 -2042 527 3696 2384 -434
1122 -434 -441 2060 3040 557 -1408 -926 644 408 -1236 -1361 889 1647 -34 -1228 -711 126 -193 -782
1140 -782 -1242 -1083 -1015 -2115 -2803 -1481 -271 -1352 -2605 -1926 -83 1629 300 -2899 -3123 -1701 -923
1157 -923 -2352 -3744 -2904 -344 913 -425 -1881 -955 662 818 -646 -2250 -1656 -635 -92 -497 -880
1174 -880 -1096 -1380 -1243 381 1861 1135 -1083 -1350 610 2258 462 -3233 -3792 -179 2344 595 -2403
1191 -2403 -1841 1689 3095 993 -2397 -1914 839 1288 -607 -1157 -334 43 -561 -24 857 657 -1051
1208 -1051 -1483 997 3426 2110 -1928 -2069 2000 3946 1571 -2076 -1223 3267 5049 1773 -1006 722
1224 722 3270 3411 753 228 2156 3667 2945 1542 2605 3804 2423 988 2243 3589 2825 858
1240 858 573 3225 4761 2298 -791 565 4344 4391 388 -1648 1006 4136 2585 -1262 -2445 853
1256 853 2887 1173 -1244 -1415 975 1747 1055 -398 -808 -907 -1057 -341 430 -375 -2218 -2727 121 2422
1274 2422 744 -2767 -3832 -317 3029 1371 -3007 -4244 -715 2620 1772 -1973 -4120 -1789 1633
1289 1633 2220 -377 -2622 -2046 406 1988 1094 -1655 -2779 -1522 772 1257 -13 -2952 -3149 -561
1305 -561 2078 1268 -2447 -4479 -2075 1771 2288 -1330 -5134 -3326 918 1754 -1486 -4581 -3956 -144
1321 -144 966 -1456 -3423 -2477 -960 -681 -1124 -1771 -1896 -2498 -1907 -1044 87 -1216 -3372 -3198 175
1338 175 1631 -751 -3769 -2395 1552 2052 -1484 -3828 -1371 2436 1119 -2374 -2705 1057 2708 331
1354 331 -2275 -1137 2408 2484 -174 -1613 843 2162 875 -389 736 1848 757 -1103 518 3434
1370 3434 2757 -1500 -2269 2300 5192 1741 -3526 -2129 3773 6089 979 -3532 -1344 4152 4638 345
1386 345 -2104 89 2462 2495 868 929 1487 -27 -766 1523 4261 1898 -2709 -2624 3259 6249 1671
1403 1671 -4641 -3290 3808 6159 900 -4373 -2238 3316 3990 36 -2157 -644 1318 1157 9
1418 9 264 708 -1289 -1689 728 2994 510 -3501 -3477 695 3731 481 -4449 -3411 1485 2845 -388
1435 -388 -3635 -2422 1136 1275 -987 -2191 -579 337 -881 -1438 -252 285 -891 -1620 -594 1065
1451 1065 743 -1274 -2271 -55 1247 48 -1719 -814 814 1144 -756 -1325 105 1180 221 -1635
1467 -1635 -1081 1274 1491 -39 -1022 -426 964 1443 179 -897 -331 871 1059 479 65 -728 -236 522
1485 522 1118 553 -536 -693 128 1380 1304 -109 -1258 -859 868 1295 692 -881 -1140 260 1925 1535
1503 1535 -484 -2225 -1115 1568 2190 -94 -2096 -949 1543 2025 400 -1164 -643 631 1262 471
1519 471 44 -371 -681 -698 750 1705 488 -1677 -1139 1217 2781 422 -2532 -2045 1309 2002 -885
1536 -885 -2138 -1045 1403 1030 -870 -1159 390 675 -517 -1091 -10 490 -411 -2104 -1295 1053 719
1553 719 -1526 -2752 -247 1904 497 -2333 -2028 227 1052 -1476 -2592 -839 919 -28 -2129 -1240
1569 -1240 1250 833 -1452 -2402 -423 1230 31 -2890 -2278 612 1689 -911 -2495 -631 1657 665
1585 665 -1532 -1298 535 814 -1440 -1784 40 1589 -351 -2120 -899 1954 1837 -639 -1896 -282
1601 -282 2040 784 -1502 -1689 606 1584 76 -906 -83 1458 860 -433 111 1514 1320 -375 -1272
1618 -1272 509 1954 658 -1101 -413 1651 2394 418 -874 134 1652 1301 198 -114 668 1542
1634 1542 809 -71 527 1626 1067 -60 121 1002 1416 357 -256 132 1284 1453 276 -231 375 1388
1652 1388 752 -74 -114 735 1254 436 -336 -83 860 748 24 -48 271 892 167 -451 -138 806 816 -142 -726
1673 -726 190 842 742 -584 -837 72 828 -184 -1318 -639 178 170 -491 -1141 -394 596 -147 -1532 -1219
1692 -1219 89 185 -1205 -1896 -718 462 -258 -1628 -1542 416 909 -916 -1998 -655 768 -352 -2064
1709 -2064 -1692 156 619 -861 -1948 -629 1182 313 -1932 -1585 658 1080 -649 -1753 -788 1129
1725 1129 576 -1371 -1506 695 1476 -429 -1647 -59 1469 699 -1044 -1654 813 1459 -32 -1419
1741 -1419 8 1925 1155 -1005 -812 780 1872 45 -1813 -201 1911 1177 -844 -890 1006 1663
1757 1663 475 -1114 -160 1813 1228 -854 -946 723 1591 206 -849 48 1467 1015 -683 -812 1312
1774 1312 1511 -235 -1681 -168 1969 1220 -667 -917 516 1926 191 -1187 -581 971 921 -438
1790 -438 -662 599 908 414 -442 28 658 503 -812 -770 646 715 -398 -952 -225 1119 1055 -964 -1440
1809 -1440 -274 997 101 -1389 -1378 -126 660 -160 -1010 -1005 -150 573 81 -840 -395 -207 -352 -835 -392
1828 -392 -675 -442 -634 -627 238 579 -300 -981 -267 596 394 -621 -1382 -805 450 406 -1021 -1498 -461 1405
1848 1405 759 -335 -736 250 1046 140 -918 -907 171 135 -445 -518 245 753 136 -210 836 1157 259
1867 259 -1393 -414 1048 1076 -455 -1125 246 2238 1614 -689 -940 1328 2152 733 -1330 -751 988
1884 988 2004 78 -1002 160 1687 1342 117 563 1106 963 -294 -393 1148 1385 -651 -1546 122
1901 122 2379 1481 -837 -857 1126 2199 429 -1560 -1141 1141 1728 -607 -1690 -193 1609 1202 -430
1918 -430 -538 551 581 -223 -714 5 366 -1108 -1414 -90 1256 342 -1489 -1546 775 1761 -266 -2287
1936 -2287 -1195 1351 1126 -837 -2610 -846 1023 1108 -1219 -1668 -245 770 35 -990 -613 -709 -666
1953 -666 -844 -211 270 -283 -1479 -1438 420 1024 -660 -2440 -1233 683 1201 -548 -1869 -612 1334
1970 1334 1236 -872 -1763 -1069 817 179 -681 -1156 -742 404 298 42 170 -18 -400 -237 69 649 -349
1989 -349 -971 -822 365 1044 120 -949 -241 1406 1621 331 -942 -417 918 1312 -448 -1121 -66
2006 -66 1416 1247 61 274 707 1503 744 -142 13 499 169 -775 -278 682 1138 371 -128 833 1725 1077
2026 1077 -535 -133 1260 1172 -438 -1759 32 1520 1345 -405 -718 1036 2190 1153 -1114 -766
2042 -766 798 903 -411 -1136 -690 981 735 -188 662 804 547 -472 -217 885 609 -817 -2177 -532
2060 -532 1715 1026 -1609 -1873 761 2474 777 -1820 -1793 229 1474 -292 -2098 -1096 118 -68
2076 -68 -962 -535 680 281 -699 -715 286 809 -1243 -2648 -1194 1008 359 -1358 -1972 139 1961 810
2094 810 -1779 -1887 64 1019 -576 -1832 -1027 90 3 -971 -493 126 115 -679 -765 268 1045 -204 -1530
2113 -1530 -954 447 508 -786 -1405 7 1487 939 -191 -269 771 953 -535 -805 -229 458 622 -352
2131 -352 -591 1070 1129 417 -363 11 969 587 275 -246 525 677 572 -9 -12 444 473 307 570 703 885
2152 885 427 -322 -54 873 812 62 -442 478 1016 979 277 -484 -67 776 567 -103 148 8 808 454 -53
2173 -53 -298 -123 368 -142 197 516 431 -311 -97 169 349 -229 -1105 -904 171 1088 419 -1207 -796 237
2193 237 693 -213 -1448 -539 631 -82 -783 -751 362 361 -454 -1043 -438 297 -52 -997 -906 363 665 -893
2213 -893 -1562 -546 663 -224 -1290 -1393 -80 740 -233 -1636 -577 640 34 -1045 -1035 314 779
2230 779 -560 -1453 -255 903 581 -1301 -1129 487 1137 -302 -1324 -348 1002 668 -889 -1111 548
2247 548 1246 -318 -899 188 921 649 -732 -908 780 1400 -94 -1295 -76 1550 984 -723 -817
2264 -817 823 1636 388 -711 -270 1424 829 -135 -431 607 1218 375 -337 69 1244 1030 -430 -502
2282 -502 650 1447 -21 -722 96 946 1232 -201 -413 193 1108 202 -544 -5 1133 976 72 -165 504
2301 504 750 504 -361 -264 1076 1252 -79 -526 459 643 398 -261 -260 525 691 174 -190 319 692 159
2321 159 -577 -567 186 372 129 -689 -94 564 358 -535 -979 -343 -276 -144 -629 -582 177 59 -238 -1022 -971
2342 -971 -232 -635 -530 -747 -145 119 136 -868 -691 -589 -190 -920 -1272 -625 154 211 -859 -1069 -278 -293
2362 -293 -1122 -1416 -888 120 -155 -686 -680 91 566 -706 -1506 -763 432 255 -481 -653 274 901 -52 -1111
2382 -1111 -587 500 646 -360 -592 1054 1644 494 -776 -332 756 633 -722 -476 715 2109 1034
2399 1034 -539 -267 944 806 -608 -878 367 1728 950 -184 -98 864 798 -481 -1077 367 1127 751
2417 751 -433 -7 1505 770 -638 -1130 183 918 337 -534 87 1524 1222 -440 -858 202 538 -185
2435 -185 -970 158 1211 1432 -312 -1309 215 1017 279 -859 -452 986 1212 79 -536 -339 726
2452 726 106 -784 -716 405 959 -234 -482 -4 1078 -372 -1267 -977 300 961 -174 -883 534 1130
2470 1130 264 -1020 -1109 -249 410 -282 -395 -230 413 468 -391 -464 -38 -176 -139 -309 274 920 108 -766 -362
2491 -362 -161 426 -287 -777 136 469 474 -22 -726 -490 316 126 -342 -405 122 890 170 -498 -644 -114 275
2512 275 -259 -439 -18 243 140 -19 -360 177 69 -184 -458 132 640 465 -472 -441 343 663 -112 -741
2532 -741 -278 952 672 -156 -362 -71 435 427 -506 -624 525 902 168 -103 106 462 165 -588 -179 627
2552 627 687 165 -163 618 1152 -157 -1075 -935 871 1164 402 -485 488 1742 433 -1377 -1311 33 861
2571 861 -190 -874 -100 1216 989 -558 -1088 -372 53 -606 -838 -120 862 372 -907 -738 192 130 -1050
2590 -1050 -1794 -178 1532 567 -981 -1309 -45 479 -905 -1611 -1157 581 779 -54 -187 369 140 -1028
2608 -1028 -1397 -727 -156 -81 -889 -219 782 989 -432 -1580 -230 572 -113 -1170 -860 582 1022 -413
2626 -413 -1389 -868 476 546 -626 -768 423 1167 734 -446 -511 -30 19 -808 -747 545 819 763 229 532
2646 532 1092 317 -501 -941 198 699 440 -75 424 909 1066 253 -727 72 1048 644 132 360 850 905
2666 905 139 -40 -239 425 210 201 516 855 1002 299 299 337 493 367 -455 -227 383 897 805 14 -37 851
2688 851 817 -278 -510 -398 338 1034 87 -356 474 564 314 -617 -409 60 658 148 -443 -140 597 12
2708 12 -807 -891 -327 184 -354 -581 59 808 483 -817 -736 78 -65 -889 -1072 -410 767 502 -358 -730
2728 -730 -65 231 -815 -1089 -817 637 178 -837 -417 108 496 -783 -1278 -513 212 34 -1035 -484
2746 -484 632 940 -382 -1097 -870 238 342 -1032 -1130 98 899 303 -1100 -539 174 131 -296 -703 457
2765 457 1186 -138 -840 -164 458 346 -663 -820 159 840 342 -708 82 711 721 -306 -540 142 865
2784 865 648 -301 33 828 301 -393 -432 336 622 416 -472 -29 756 701 -154 -660 363 878 263 -267
2804 -267 -318 741 602 -263 -396 -76 793 398 -393 -135 585 608 -137 -476 -86 574 314 -286 -635 101
2824 101 651 -66 -581 -383 104 407 51 -132 -102 239 -208 -547 -573 -120 -6 226 -39 429 595 213 -550
2845 -550 -912 -284 234 -263 -476 -127 539 419 -242 -907 -445 -11 -322 -481 -571 274 441 -88 -539 -355
2865 -355 13 -523 -1145 -560 569 709 71 -416 -357 173 -378 -1539 -1087 287 1039 460 -199 154 647
2884 647 163 -1105 -1176 -335 414 230 -415 -12 777 626 -516 -869 -299 766 214 -103 157 966 1037 -379
2904 -379 -1044 -321 -82 -382 -642 249 1489 1194 2 -340 260 286 -155 -1087 -449 1304 1481 238 -105
2923 -105 920 1181 199 -959 -65 1211 1490 536 -29 691 1144 283 -409 170 954 1368 671 88 1146
2942 1146 1428 435 -818 -730 305 1055 -2 -58 677 1437 837 29 -131 169 413 -483 -952 233 636
2961 636 321 -379 -194 102 118 -637 -660 -331 306 35 -987 -958 -107 -34 -778 -1366 -720 -34 -198 -784 -569
2982 -569 -279 -139 -940 -1067 -885 -266 -292 -1001 -975 -730 -78 -97 -676 -501 -85 -263 -631 -1075 -671 -308 -134
3003 -134 -480 -484 188 457 -243 -341 -403 -350 -91 -407 -289 116 327 -148 -163 -305 98 -171 -194 -93 -199 634
3025 634 792 -48 -48 96 56 -475 -567 102 691 896 190 -216 82 512 -360 -1067 -266 491 652 225 -162
3046 -162 449 726 217 -792 -613 342 777 -222 -100 673 1018 550 -655 -710 32 564 -59 59 727 1740
3066 1740 802 -195 -405 9 650 33 -121 498 1316 1007 16 -239 892 225 -234 -471 462 1648 895
3085 895 480 226 875 1087 -55 -742 24 1318 663 -89 273 968 832 -468 -1251 -131 1003 514
3103 514 -249 -157 808 938 74 -769 -503 245 155 -471 -3 901 619 -278 -603 -586 143 20 -776 -1051 305
3124 305 829 -41 -1107 -808 171 196 -771 -1101 -82 252 -9 -470 -595 -14 33 -875 -1063 -421 161 -370
3144 -370 -753 -236 41 85 -598 -547 -177 296 27 -1040 -584 167 60 -484 -452 3 89 245 -509 -418 -122
3165 -122 119 11 -273 113 450 337 72 165 101 221 193 -245 55 324 641 217 -62 482 655 -171 -272
3186 -272 -570 393 808 494 241 -106 717 309 -300 -372 52 295 612 266 255 798 374 16 -528 -356 377
3207 377 282 62 203 946 883 32 -432 -213 47 -176 -567 -213 426 1050 231 -893 -308 308 -81 -519
3227 -519 -480 434 1120 240 -595 -419 121 -82 -710 -469 268 767 227 -653 215 519 -40 -964 -851 -129
3247 -129 481 -168 -580 215 941 510 -780 -1378 -154 608 -29 -834 -386 679 624 -247 -821 -339 274
3266 274 -540 -804 -248 959 381 -474 -500 51 336 -509 -1267 -428 636 706 -549 -850 507 1101 -17
3285 -17 -1276 -480 497 722 -17 -536 87 615 242 -855 -120 286 292 -262 -663 381 827 330 -609 -99
3305 -99 593 -43 -386 -653 194 871 589 -264 200 471 294 -197 -793 -311 648 756 242 149 489 611 102
3326 102 -481 -258 294 345 91 59 909 590 11 -376 -216 106 -14 -34 -275 534 912 549 -184 -140 -131 71
3348 71 -529 -185 261 684 659 -8 -567 -65 73 -342 -377 -648 543 388 351 -43 -16 -196 -561 -942 -687
3369 -687 69 -4 35 8 24 90 -97 -1180 -951 -440 -214 -68 -323 1 429 265 -670 -1038 -445 -237 34
3390 34 -252 -43 513 736 -508 -712 -362 -207 -279 -592 -15 398 599 -308 -796 -329 529 -158 -931 -228
3410 -228 409 941 60 -759 -548 316 -43 -748 -474 410 745 103 -363 45 272 -159 -845 -404 738 840
3430 840 -93 -285 269 858 198 -518 -524 548 664 179 33 256 856 182 -681 -446 737 1095 80 58
3450 58 387 969 344 -519 -404 421 775 53 30 546 1297 590 -246 -191 334 499 8 -301 465 973 473
3471 473 59 -114 30 410 -2 -226 513 1102 797 190 -589 179 -174 -581 -712 48 706 903 524 -150
3491 -150 68 111 -515 -812 -370 198 555 128 -337 147 152 -402 -959 -641 -3 283 128 56 -213 64 -365
3512 -365 -1045 -1293 -863 72 471 279 245 30 -32 -634 -1210 -1042 -397 -348 -188 -54 -52 356 -495 -1065 -951 -562
3534 -562 -467 -590 87 276 208 -146 -817 -1095 -625 -241 -564 -511 444 805 505 -92 -304 -240 -231 -882 -338 -132
3556 -132 1206 1091 279 135 496 424 -262 -851 -334 422 537 440 176 698 407 -540 -758 -190 570 146
3576 146 66 251 1035 663 -297 -972 -158 -28 285 -18 -164 983 1013 227 -946 -276 130 -22 -555 -279
3596 -279 525 1203 -30 -231 -324 489 -131 -375 -779 512 795 132 -337 -294 479 155 -678 -530 198 975
3616 975 203 -409 80 471 89 -687 -840 291 854 522 -24 510 872 576 -292 -511 311 734 123 -196
3636 -196 65 501 84 -217 -216 22 500 67 -132 31 553 310 -257 -482 14 405 -251 -455 77 354 263
3657 263 -117 -535 -170 224 -170 -450 -254 -31 186 -375 -447 -233 -174 -206 -259 -317 371 184 -42 -174 -117 -322
3679 -322 264 -332 -414 -88 3 -100 -150 -296 -11 229 60 -400 43 272 -31 -314 -535 -224 458 -258 -299
3700 -299 -138 48 311 264 -163 -4 434 171 -299 -200 288 267 -211 -259 97 551 110 -383 -190 349 375 -112
3722 -112 -286 -181 527 475 -105 -533 131 528 -100 -515 -75 261 463 -216 -244 364 270 -176 -591 -437 485
3743 485 376 -392 -463 -72 465 -352 -645 -619 155 -34 -598 -277 216 656 -173 -946 -770 260 160 -375
3763 -375 -707 -13 460 -189 -585 -634 -74 70 -470 -806 276 581 113 -593 -292 101 201 -676 -807 95
3783 95 559 480 -443 124 436 684 -560 -590 0 592 110 -169 185 816 868 -53 -559 5 335 238 -586
3804 -586 175 848 623 91 -308 179 444 211 -263 -146 606 819 184 -185 -39 384 284 -546 -135 672
3824 672 682 441 77 -105 432 214 -366 -171 373 362 55 -143 138 637 221 -64 -296 -47 535 588 -207
3845 -207 219 243 230 -165 -410 -71 29 422 439 36 487 604 -98 -631 -441 -92 86 -57 13 611 575 203
3867 203 -305 -472 -44 -118 -294 -396 -37 720 141 -293 -272 -238 -39 -199 -479 -107 419 179 138 -473 -328
3888 -328 138 -389 -604 -277 412 194 -301 -241 -162 -132 -468 -885 -740 0 394 -477 -541 63 198 -316 -873
3909 -873 -706 -26 586 -311 -504 301 576 -246 -1014 -635 116 260 -272 -387 19 683 8 -725 -683 398
3929 398 182 -307 -431 131 380 388 -681 -563 503 468 -317 -576 143 793 489 -427 -314 359 335 28 -277
3950 -277 -1 538 485 -253 -27 330 284 -383 -575 277 728 547 -99 -76 201 106 -179 -454 123 572 674
3971 674 37 -47 666 607 -76 -349 39 502 612 -69 126 440 595 -169 -465 120 371 443 38 404 242
3992 242 433 280 -534 -131 140 292 73 315 382 540 237 -97 -418 -298 328 -269 -115 172 306 295 23
4013 23 -196 104 -41 -192 -306 188 280 -18 9 -233 -100 -109 178 -297 -136 18 91 -88 -439 -228 43 -168
4035 -168 -574 -614 -141 266 -70 -251 -50 119 43 -256 -417 -34 -9 297 104 -207 345 126 -224 -643 26
4056 26 357 7 -160 -310 244 563 -328 -266 21 139 45 -145 56 234 650 248 -719 135 417 158 -418
4077 -418 -271 361 577 130 -470 209 429 556 -241 120 486 458 209 -506 -24 781 334 -58 -296 249
4097 249 621 98 -278 57 729 517 -183 -321 497 710 174 -233 -91 400 582 -43 -567 163 387 190
4117 190 -584 -219 610 375 -368 -68 56 572 89 -198 -48 634 140 -300 -420 467 416 -98 -597 31
4137 31 161 137 -565 -421 -153 320 -23 -684 -376 270 206 -444 -429 -391 268 49 -440 -311 -93 481 -266 -474
4159 -474 -9 257 -127 -576 -506 68 487 -413 -231 -19 96 -21 -239 -230 -13 189 -401 -346 -138 297 263 -274
4181 -274 -486 38 216 -175 -67 -107 -30 258 146 -136 127 204 -116 31 -220 -29 154 121 -84 -253 241
4202 241 -83 -274 -85 172 271 187 -26 146 553 574 277 -211 -145 316 93 -72 -69 495 534 -245 -257 233 487
4225 487 264 76 75 279 329 211 -214 178 397 463 -59 -82 276 679 371 -458 16 604 387 18 -70 216
4247 216 328 201 -398 -351 364 155 -220 -353 129 514 127 -619 -147 518 308 -135 -231 57 479 101 -608
4268 -608 -286 613 636 -141 -569 81 792 172 -293 -121 188 440 -236 -390 -166 330 -82 -382 -327 271 106
4289 106 -226 -484 -239 88 89 -557 -232 268 291 -451 -719 72 164 -76 -749 -637 219 402 -314 -379 288 401
4311 401 -46 -400 -513 38 129 -267 -423 -52 496 -58 -337 -209 213 241 -27 -260 -80 390 252 -133 -109
4332 -109 77 326 72 -151 26 353 193 147 -50 46 302 172 -69 -107 264 401 68 28 279 109 -23
4353 -23 -272 159 180 24 156 -41 -219 76 248 28 62 53 430 168 185 -13 14 352 -207 -156 -57 369 184
4376 184 -250 123 49 -13 -137 -599 47 184 235 -517 -325 80 354 139 -483 -414 464 166 -143 -226 27 434
4398 434 195 -521 -144 79 -19 44 -91 52 554 41 -657 -294 286 181 -315 -514 -9 139 -50 -448 -380
4419 -380 57 191 -304 -614 -122 644 58 -484 -524 93 -42 -139 -607 -120 691 -85 -533 -500 374 264 -369
4440 -369 -708 130 397 281 -554 -497 129 365 98 -358 -251 594 40 -494 -395 434 333 -80 -250 76 620
4461 620 284 -272 -371 9 456 -167 -499 28 535 298 -259 -158 515 442 344 -410 -177 405 175 -78 -445
4482 -445 322 673 166 178 256 463 427 -108 -21 469 627 339 -217 15 395 363 -40 -69 437 436 151 -170 233
4505 233 56 411 158 -220 5 125 269 20 -116 272 263 63 -265 186 201 382 -183 -246 117 28 -141 -96
4527 -96 103 76 176 -316 -189 -139 -138 22 -123 -324 -109 -76 -234 -516 139 -52 155 -273 -421 -93 242 -186
4549 -186 -444 -503 23 25 -16 -279 -162 69 -288 -310 -207 154 177 -114 -369 -34 114 21 -393 -487 453 80 -418
4572 -418 -513 -117 208 119 -500 -403 109 250 148 -238 -94 380 188 -408 -453 93 141 -211 -265 210 439 279
4594 279 -328 -115 419 668 102 -171 -17 510 360 -353 -132 441 571 -16 -478 -162 288 251 -262 -385
4614 -385 139 465 -75 34 -218 639 546 -211 -290 303 675 -15 -435 -195 502 266 -71 -253 314 634 114
4635 114 -168 130 562 162 -264 7 -26 592 124 -525 -24 217 406 -275 -231 125 461 91 -545 -276 77
4656 77 119 -12 -93 -38 439 -251 -208 -226 262 111 -155 -360 371 489 148 -122 -178 -74 -86 -115 -618 -113 356
4679 356 -88 -417 -419 -123 99 -197 -259 -283 43 31 -330 -56 -49 325 -115 -264 19 -93 346 92 -125 -108 363
4702 363 -102 -322 -73 116 369 140 65 -5 284 249 142 -451 -294 -48 270 -141 -185 154 136 -179 -85 160
4724 160 56 199 120 -329 155 447 -73 -121 -38 524 311 -119 -215 300 521 117 -206 -21 300 284 -19 -18
4746 -18 254 499 410 -304 14 380 581 -420 -580 -108 673 219 -40 -88 230 141 -242 -434 282 385 -160
4767 -160 -491 -201 308 692 -146 -282 -100 411 84 -584 -456 240 194 -181 -405 281 476 -114 -338 -153
4787 -153 189 331 -119 -373 119 112 107 -383 -73 187 206 -118 -378 39 218 1 -220 -521 208 156 -382 -492
4809 -492 -332 243 62 -532 -199 406 322 -13 -474 -13 139 -18 -382 -499 102 21 -47 -284 -218 -22 415
4830 415 -347 -204 -44 120 224 -420 -321 136 287 207 -215 -376 192 -64 -510 -222 44 43 -126 -338 150
4851 150 173 -70 13 -190 -15 570 -49 -134 159 162 103 -42 145 341 277 237 92 33 140 123 -43 13 355 86
4875 86 62 70 -10 362 290 -20 58 24 296 311 -6 115 143 368 -42 -248 82 404 462 13 -151 107 180 235
4899 235 105 -50 196 -38 -20 -234 -178 204 84 -289 -290 178 -2 -50 -317 -160 270 15 -214 -210 280 -11
4921 -11 -169 -316 -125 -137 157 -370 -348 109 412 -23 -402 -222 272 96 -279 -776 344 482 -285 -555 34
4942 34 86 -3 -353 -306 182 -4 -132 -629 -144 171 -142 -405 -305 49 148 -237 -574 -53 551 -142 -119 -363
4964 -363 -153 466 -122 -357 -127 284 192 -311 -317 235 348 -149 -368 141 491 247 -130 7 296 310 94
4985 94 -203 1 434 42 -389 -415 5 574 -109 -312 11 574 377 -215 -551 122 449 9 -209 312 129
5006 129 515 345 127 248 199 197 42 -167 327 180 -23 -310 -149 133 83 -219 -82 81 416 55 -127
5027 -127 -116 66 262 31 -388 -67 36 -13 48 116 -30 237 -134 -65 -120 37 137 -99 -212 -86 58 119
5049 119 -78 -143 190 -32 -546 -343 20 62 -29 -571 -147 -30 -86 -447 -197 -573 41 -175 -121 -144 135 275
5071 275 16 -549 -193 -73 120 -414 -66 -258 76 -22 -368 30 40 -91 -376 -300 83 388 32 -175 -324
5092 -324 238 491 -272 -275 -111 129 46 -167 -101 484 272 -547 -430 247 172 -38 -388 -129 476 237 -379 -429
5114 -429 178 552 -62 -362 159 210 72 1 -315 350 483 123 -365 -53 162 231 -148 -127 82 466 67
5135 67 -301 157 620 176 -239 -415 117 402 -9 -199 40 667 369 68 -522 190 247 293 56 -179 298
5156 298 562 -203 -425 234 615 215 -266 -22 201 248 -106 23 73 273 -259 -363 4 241 111 156 23
5177 23 -381 215 -52 101 -196 -66 135 -78 -273 7 141 279 -121 -378 6 298 -67 -278 -475 135
5197 135 204 -320 -287 -203 -235 159 -399 -202 59 74 -228 -193 -430 14 -136 71 82 -328 182 229 -212 11 235
5220 235 -124 91 -210 -342 -9 244 -31 -88 -7 183 -89 -39 -73 -33 243 -10 -176 -101 382 -247 -203 61
5242 61 154 104 55 98 128 284 26 -85 56 223 457 150 -193 110 341 289 -461 -131 307 330 -166 -365 314
5265 314 286 141 -25 -123 196 346 38 -105 -21 392 -2 -531 29 388 328 154 -301 9 -143 -107 -231 -101
5287 -101 80 305 -27 -342 -113 393 44 -202 -330 49 315 38 -399 -89 101 -117 -362 -28 123 115 -207
5308 -207 -552 126 120 -17 -529 -144 -243 200 -166 -116 -213 122 349 -257 -301 64 289 -255 -625 11 -12 77 -216
5331 -216 -247 -62 198 -116 -462 -15 -73 -9 149 -286 41 -125 -173 -208 106 -19 -17 -78 -12 -137 228 -30 -131
5354 -131 -59 41 460 -55 -148 62 186 101 100 49 73 -82 104 21 129 84 -149 -38 159 140 138 340 129 -104
5378 -104 255 270 46 -228 160 368 137 -13 351 -140 177 35 -203 -37 418 91 53 14 191 162 -76
5399 -76 -23 -33 151 398 -20 -237 21 258 309 -231 -42 213 401 -133 -153 182 207 -58 -204 -67 78 584
5421 584 169 -139 40 406 46 -96 -99 79 432 -168 -162 -190 202 342 -260 -230 55 -94 -118 -343 -44 85
5443 85 236 -263 -530 -293 193 -321 -408 37 -13 89 -60 -160 235 230 -109 -442 -131 153 -69 -573 -444 170
5465 170 51 155 -445 -299 139 6 27 -402 -144 263 -76 -515 -97 161 308 -547 -327 344 150 166 -245
5486 -245 -431 232 13 -238 -88 49 139 2 -234 -175 62 219 -228 -353 90 -12 82 -215 33 -11 164
5507 164 73 -226 295 333 -81 -37 -237 63 211 113 1 134 403 124 108 60 17 371 -36 -145 35 9 100
5530 100 -334 -113 94 288 63 168 47 355 118 156 -149 -42 -11 255 58 -125 88 402 -35 -41 -38 158
5552 158 7 231 -340 -283 465 71 -308 -92 90 -180 166 -292 88 239 -243 -306 -91 177 163 -207 -201 -7
5574 -7 -113 -285 34 -365 306 -28 40 -492 -10 -126 12 -345 -54 -164 15 51 -309 -198 251 -110 -128 -25
5596 -25 -232 352 -298 -189 -311 72 108 -244 -484 145 238 -152 -385 -132 24 17 -655 -429 176 270 110 -189
5618 -189 -91 262 287 -479 -317 188 174 113 -107 -102 183 139 -225 -336 134 127 73 -125 -282 218 512 -233 -257 -25
5642 -25 255 98 -164 -20 283 360 -189 -107 -67 608 -12 -186 -116 260 362 16 74 -85 508 32 -522 42
5664 42 449 116 -290 63 -161 100 221 -104 -52 302 101 -166 -100 132 423 12 -163 -264 -34 170 346
5685 346 -287 -110 14 80 96 -278 88 176 -137 85 -196 -98 485 -119 -230 -44 105 217 -18 -141 171
5706 171 -28 -11 -143 65 -217 -84 -86 -215 57 134 3 -190 84 74 -104 -227 -317 -297 -29 -24 -329 -384 -137
5729 -137 14 57 -396 -274 331 140 -156 23 34 -119 225 -320 -120 153 39 -152 -201 -96 80 16 -135
5750 -135 78 -52 185 -40 -287 189 278 181 -77 -100 79 152 -105 81 290 442 122 -245 -59 358 148
5771 148 91 -217 164 503 154 71 52 103 334 35 63 61 405 260 -203 -254 195 402 0 -387 -70 260 217
5794 217 -359 -299 185 378 38 30 -82 459 48 -291 -56 234 229 -75 -513 -297 311 -24 -171 16 233 355
5816 355 -34 -335 -265 -60 259 -230 -56 359 63 -139 -337 -111 6 76 -548 -76 -110 403 -5 33 -35 135
5838 135 178 -156 -376 -123 213 -11 -213 -38 -29 -90 -414 -164 -341 -231 0 -235 23 376 -129 -271 -167
5859 -167 -361 -44 260 -378 47 -82 291 54 -235 -92 41 -68 51 -211 -42 10 -65 -157 -70 25 239 47
5881 47 -37 -279 -12 97 -89 -90 9 179 113 -215 -29 187 168 140 -106 252 -157 -57 -133 -53 132 101 71 267
5905 267 194 334 73 -105 288 -60 80 -76 304 431 32 195 -360 -131 61 210 285 -187 288 93 180
5926 180 -75 -199 39 134 108 9 29 307 169 35 -266 157 212 -186 -286 73 139 321 -150 -111 -158 69 -102
5949 -102 -252 -148 289 134 -61 -87 9 368 -7 -376 -162 454 326 -391 7 352 191 26 -359 -19 86
5970 86 -83 -425 -339 -30 115 -305 -564 -121 -58 135 -159 -312 12 1 182 -744 -133 69 266 -280 -155
5991 -155 112 143 151 -366 -30 41 -122 -168 -164 172 124 -81 -84 73 -44 146 -169 -90 118 202 19 -76 -139 34 30
6016 30 -38 -258 18 346 -71 -207 116 202 136 58 -49 0 318 121 -87 -103 203 30 251 -413 37 -73
6038 -73 299 110 -79 266 177 4 -127 86 13 257 23 52 221 214 -91 -117 -173 101 81 164 -229 26 217
6061 217 264 -95 37 -341 424 -159 182 -188 145 148 109 6 49 -111 80 -123 -173 113 220 35 56 -132
6083 -132 223 -150 -353 -278 162 258 -105 -83 205 413 46 -113 -91 -165 -5 -96 -183 77 238 93 -368 -295 318
6106 318 -54 7 -107 -225 323 205 -39 -259 -84 -120 -510 -432 -307 254 176 25 -256 -203 -5 -205 -444 -46
6128 -46 -69 167 -271 -187 91 366 175 -381 -117 167 238 -112 -474 149 319 56 -296 -306 94 240 7 187
6150 187 282 -80 75 -238 -139 57 81 -226 13 338 247 195 -122 -75 164 164 -56 -159 60 276 95 -142 -179
6173 -179 297 170 85 -72 -29 492 192 -255 162 211 209 -214 -69 -187 414 159 -295 88 -172 262 125 -482
6195 -482 -174 -85 -153 -177 15 181 17 256 4 59 -57 -294 -355 -125 180 296 184 -18 -6 -269 224 13
6217 13 -248 -82 -187 48 13 160 -55 92 -138 -195 -317 -29 187 92 -109 -204 -32 117 -433 -284 -308 636
6239 636 -133 -107 -99 113 -124 -317 -51 -46 167 -304 -307 -364 108 -1 71 -75 100 -120 160 -55 -242 202 -136
6262 -136 -93 -386 -162 282 -76 -175 -327 -46 297 257 -125 48 305 -209 -150 -174 303 114 219 -331 -60 -145
6284 -145 260 -155 -121 212 75 185 178 -340 266 26 -223 -378 331 412 -61 -223 109 271 69 -51 -182
6305 -182 436 158 336 -103 15 567 266 -103 -100 167 85 192 -161 -144 216 352 -181 -189 161 157 -185 -72 -141
6328 -141 242 170 -32 -57 -40 239 -198 8 -49 173 209 -73 -232 68 38 -187 -263 50 292 198 18 -403 103
6351 103 231 -450 -373 -312 108 285 -29 -126 188 105 -413 -316 -192 4 134 158 -246 -60 156 -34 -247 -87
6373 -87 -408 93 62 -10 -94 80 -90 -313 -17 -144 -248 27 195 101 16 -348 -118 169 153 41 177 -103
6395 -103 -364 299 161 223 -195 68 49 -263 -204 -23 73 246 352 101 -187 180 256 34 -189 -91 188 228
6417 228 94 -188 46 193 -164 -351 283 169 165 33 29 150 214 -8 -98 -31 455 214 69 151 518 302 -24
6440 -24 -19 185 204 449 -106 -54 481 331 169 -264 -226 205 308 -110 1 266 85 293 80 104 182 307 18
6463 18 -129 172 25 89 -472 -15 299 4 -59 -142 144 159 509 -335 -69 26 195 -52 -313 43 242 -110
6485 -110 -125 -307 67 151 51 -22 -54 191 218 -304 -291 55 311 -368 -393 141 28 199 -534 -223 111 -63
6507 -63 -152 -282 -40 518 -293 -450 -85 114 183 -166 -425 157 59 -222 64 -53 256 133 -203 -243 -174 27
6529 27 41 38 -102 -93 303 -65 -240 -32 -193 92 -180 -278 210 130 168 179 114 -192 192 116 -57 -82 153 148 -140
6554 -140 321 92 268 66 158 85 156 -21 22 4 277 166 18 -292 71 102 362 100 -67 111 164 284
6576 284 -288 76 -16 340 78 97 59 204 66 -69 -86 -61 194 19 60 139 128 93 -99 -108 154 327 132 -320
6600 -320 -133 -162 305 54 40 -272 89 -97 -214 -37 -1 187 -303 186 143 533 -132 -230 169 86 -27 -32 -293
6623 -293 -104 286 -68 -133 85 -78 63 -129 -235 -80 127 -28 -332 -261 188 -33 -197 -252 58 -100 -6
6644 -6 71 -114 197 91 -96 -269 161 -16 -65 -234 61 288 219 13 -122 10 257 117 -348 92 -57 308
6666 308 -51 -117 227 313 -88 18 16 118 309 96 -212 -194 -85 -175 -254 86 65 12 442 -376 -25 317 158
6689 158 -228 -494 12 -11 31 75 8 297 -32 -201 -47 127 258 167 56 -136 -130 -6 -26 93 -91 -189 -141
6712 -141 129 176 370 -108 -127 -435 -86 -35 172 -246 95 -110 -187 -136 120 0 170 -57 -199 73 -104 -140
6734 -140 -38 152 -336 108 -36 -364 -247 -25 -108 -180 -26 131 245 147 92 -182 -267 -85 142 -157 -93 0
6756 0 -91 -102 -509 -364 -78 29 94 -204 130 16 -21 -458 188 241 -76 3 -307 -60 46 272 41 -332 84
6779 84 352 -191 -100 -24 101 29 -178 -157 230 325 22 -179 114 366 -176 -382 -275 165 206 204 -179 146 260
6802 260 121 -298 -331 165 339 59 -181 54 357 -142 -139 -74 258 101 52 111 28 542 15 -264 -241 -110 82
6825 82 56 -3 360 673 276 -133 15 531 218 -251 -382 -157 347 118 -235 -5 232 190 -297 -308 -113 -74
6847 -74 156 -106 -212 147 14 71 -399 37 354 285 35 -265 377 20 -173 -24 -304 -89 45 -96 377
6868 377 -152 345 -71 66 129 -118 45 127 -122 -102 -62 2 -161 -16 -10 -210 -80 -263 6 -62 241 -270 -135
6891 -135 10 186 -6 -63 -234 -108 302 219 -84 -2 262 195 -336 153 -201 102 47 -68 -63 -337 -195 -221 -19
6914 -19 60 194 98 58 -9 345 37 -64 -156 -44 208 168 260 130 366 62 -153 -105 133 146 213 -94 -94 68
6938 68 410 -314 -233 -11 352 -66 121 98 348 87 70 84 -442 156 232 -3 68 127 454 27 -366 -249 -48
6961 -48 332 -10 53 191 144 -51 -431 -246 95 385 -339 -279 140 244 280 -322 82 584 -57 -186 -104 241
6983 241 236 -160 156 37 127 49 -46 -370 -3 -93 -13 -136 -272 303 -41 -249 -132 -313 217 -234 -179 -52 242
7006 242 256 -143 -308 -372 195 116 -396 -255 214 165 16 -401 100 19 54 -356 -168 -118 101 -252 -263 -207 -84
7029 -84 -246 -232 52 350 159 -201 -305 -272 -73 -197 290 -108 113 18 -35 -161 -214 265 243 -92 -144 -176 175
7052 175 195 93 -110 146 308 -65 -204 -106 -195 260 -112 -51 -284 268 95 -62 -43 118 114 -166 -213 -8 29
7075 29 129 254 -9 210 3 211 67 -52 337 47 101 -130 -118 1 -245 -373 136 82 -208 -118 -268 -49
7097 -49 365 99 46 -107 -34 555 222 -287 45 -28 114 -106 -160 -263 202 -9 -174 52 24 -43 -56 -6 407
7120 407 -31 -19 -326 -179 -247 -180 -325 -72 142 -121 -162 -101 -220 241 -186 -56 -28 67 309 -444 -376 -172 225
7143 225 -4 -168 -107 96 -21 -24 -447 -198 214 74 -145 -110 -76 228 113 -210 45 32 22 -357 -99 117
7165 117 -181 -181 -229 -144 26 63 -22 -149 282 53 -107 90 -70 265 96 -86 -253 138 -55 -271 -269 115 199
7188 199 53 3 -97 270 252 -11 2 132 -16 134 -380 -94 294 330 -77 -148 91 -184 25 133 130 175 343
7211 343 125 128 -35 -14 288 -50 -42 169 317 -102 22 131 3 345 114 -172 5 -82 50 -236 -262 154
7233 154 218 257 -141 -102 262 2 -13 -18 51 19 -48 -297 -392 -9 104 -110 -19 -126 -20 98 25 -12 -292 200
7257 200 -10 -394 -169 166 20 -99 175 -182 -68 23 90 -182 -31 149 -50 -135 30 53 176 -99 -72 -50
7279 -50 -148 -163 192 68 148 31 100 -207 -64 174 -167 126 -337 172 86 -337 -345 -10 317 84 -17 -33 158
7302 158 108 -99 -482 115 -126 165 -438 79 458 175 -125 -417 100 -53 192 -239 102 277 94 -114
7322 -114 -278 133 392 -69 -67 -95 185 91 -4 41 -187 -5 66 -81 137 318 86 -225 38 158 348 -175
7344 -175 -56 -177 -45 437 -141 -5 83 413 270 -81 -13 294 134 89 -407 -44 211 251 89 -37 109
7365 109 152 -122 -269 80 -21 -88 -391 -109 542 69 66 77 136 253 2 -11 -311 281 -34 -166 -160 89 76
7388 76 -210 -74 -297 -191 -35 128 -203 -359 191 -18 39 18 59 44 -225 -253 -58 -180 6 15 -25 -119 71
7411 71 69 -295 -176 -131 135 244 -327 60 -148 237 -251 -66 -434 218 50 -279 232 312 72 181 116 12
7433 12 148 -185 -211 -12 119 285 -54 -261 -2 -102 -2 -402 -245 -201 53 -254 -192 322 344 41 76 203
7455 203 301 122 -8 -14 141 192 -240 266 -199 40 500 -210 -82 -10 187 444 61 -56 71 -10 221 -74
7477 -74 143 192 295 32 30 -4 277 -53 -53 -138 318 221 6 -77 -15 298 88 -63 -2 243 52 -5 60 221 -58
7502 -58 283 171 63 135 -42 -90 -138 266 73 103 50 -195 205 -25 105 -93 150 205 -5 -172 -213 238 199
7525 199 169 -57 -225 45 62 -249 -150 -41 -313 30 18 -196 60 118 -174 192 -286 -216 50 -129 351 49
7547 49 88 -62 142 89 163 -350 -114 -231 113 -59 26 -288 144 -123 -117 132 -317 -26 5 39 -185 -3 221
7570 221 36 -54 71 87 71 177 -93 120 105 21 -79 -70 253 -104 177 -149 -103 174 200 4 140 47 127 212
7594 212 -136 -33 -6 339 -66 -219 -112 123 92 -6 8 228 202 188 17 76 -2 113 -6 6 -49 -115 -14 -340
7618 -340 75 93 19 166 -152 289 84 84 -57 90 236 -20 -85 -154 120 259 322 15 -118 98 -109 -222
7640 -222 -301 -84 -4 75 -81 -520 320 359 -334 -238 -146 180 232 -273 -108 -235 339 -256 -205 -281 317 -231 108
7663 108 -12 61 119 -85 -266 -181 368 116 -200 -78 213 58 5 -40 310 181 -186 77 -213 80 154 -347
7685 -347 -295 -79 131 262 20 -167 113 9 11 -234 341 421 3 -392 -283 -178 -46 53 -517 44 -100 -66
7707 -66 38 -155 17 -208 59 252 -30 -53 163 24 -200 -109 181 232 19 -241 71 16 -67 -35 154 178 503
7730 503 204 13 18 3 344 301 100 -84 28 21 -179 350 302 151 153 43 -44 332 -26 -74 110 162 274 176
7754 176 -242 145 144 56 -130 155 332 126 49 -220 -4 -40 304 -44 -104 383 301 -304 8 -125 9 43 -17
7777 -17 -138 258 194 -44 -46 -65 160 -230 -274 34 -4 256 -161 21 -135 191 189 -239 -38 72 118 -107 -214
7800 -214 -19 224 -316 229 -220 61 12 324 -124 110 290 264 -212 -290 150 -1 -185 -383 -127 164 123
7821 123 -247 147 170 -138 -55 -186 -94 -54 -43 -2 -185 99 107 286 -331 4 318 267 -450 -221 148 111 -21
7844 -21 -272 -25 248 223 -79 -200 164 111 -151 -46 -38 308 76 -23 -189 324 333 -108 -129 -147 226 180 -50 40
7868 40 103 -57 -33 -337 0 322 34 22 -106 415 386 45 90 -331 123 408 111 14 148 100 -15 37 -208
7891 -208 65 141 114 -229 141 -116 91 -101 20 124 88 189 31 99 -82 -69 59 -79 79 17 185 17
7913 17 -70 388 25 66 106 -621 -382 526 67 -235 -167 88 -164 14 131 253 -378 -253 -139 -125 251 -301
7935 -301 45 -89 21 106 -95 -37 -144 286 -128 -223 2 423 -17 -350 -37 -385 485 184 57 -401 35
7956 35 86 -146 -361 -236 299 211 -174 -59 -45 178 51 -401 -47 26 66 -214 -146 243 182 -90 160 132 108
7979 108 186 12 -62 18 426 195 -264 118 35 271 -73 -69 27 431 423 37 81 150 121 186 138 192 16 -103 123
8004 123 232 417 -4 -307 -124 52 204 -158 174 73 245 116 -29 150 49 238 -138 -292 -75 30
8024 30 126 47 -110 -139 47 56 -253 -189 66 208 -101 -78 -113 185 2 60 -26 308 185 25 23 -133 418 -44
8048 -44 96 -326 -80 286 179 46 -72 51 139 22 -82 132 -10 -202 -364 -377 -228 138 -24 128 -207
8069 -207 195 -146 76 -45 306 414 234 -11 80 -1 149 -80 8 -12 121 -163 -31 76 -33 -274 -70
8090 -70 -171 -172 2 195 -384 -112 83 181 355 -88 57 219 -112 -206 -319 15 370 -47 142 104 -13 -86
8112 -86 -163 193 192 194 203 186 247 259 48 290 11 -57 118 38 -259 12 232 118 -211 -267 -309 78 -68 -157 -58 152
8138 152 234 50 -118 -60 80 101 -15 -78 133 114 -96 -320 79 -126 -208 -212 -338 291 -12 34 91 -284 21
8161 21 101 225 -149 22 139 141 -141 -133 42 66 -244 61 -92 175 8 -333 61 -111 -134 -165 -161 -92 353 13
8185 13 -330 -136 20 63 -363 -37
8191c7
##END NTUPLES=NMR FID
##END=
