##TITLE=1H_PrC4-Eth
 200.13MHz, CDCl3,
 8 sc
 
 31.1.2025
##JCAMPDX= 6.0         $$ Bruker NMR JCAMP-DX V2.0
##DATA TYPE= NMR FID
##DATA CLASS= NTUPLES
##ORIGIN= UXNMR, Bruker Analytische Messtechnik GmbH
##OWNER= pz
$$ XWIN-NMR		Version 3.5
$$ Fri Jan 31 16:38:12 2025 Russian Standard Time (UT+4h)  she@DPX200
##.OBSERVE FREQUENCY= 200.1313
##.OBSERVE NUCLEUS= ^1H
##.DELAY= (6, 6)
##.ACQUISITION MODE= SIMULTANEOUS
##.ACQUISITION SCHEME= undefined
##.AVERAGES= 8
##.DIGITISER RES= 18
##SPECTROMETER/DATA SYSTEM= spect
##.PULSE SEQUENCE= zg30
##.SOLVENT NAME= D2O
##.SHIFT REFERENCE= (INTERNAL, D2O, 0, 14.3821)
##AUDIT TRAIL= $$ (NUMBER, WHEN, WHO, WHERE, WHAT)
$$ ##TITLE= Audit trail, XWIN-NMR		Version 3.5
$$ ##JCAMPDX= 5.01
$$ ##ORIGIN= Bruker BioSpin GmbH
$$ ##OWNER= she
$$ F:/spectra/data/she/nmr/H-C/1/audita.txt
$$ ##AUDIT TRAIL=  $$ (NUMBER, WHEN, WHO, WHERE, WHAT)
(   1,<2025-01-31 16:37:12.48 +0400>,<she>,<DPX200>,
      <created by zg, POWCHK disabled, PULCHK disabled
       configuration hash MD5:
       00 E9 B6 7A A2 85 ED C7 34 08 36 98 17 FE 4E 26
       data hash MD5: 16K
       08 0E 48 1D A0 2D DF B3 61 78 06 78 13 47 16 46>)
$$ ##END=
$$ 
$$ hash MD5
$$ FF A8 CD 48 7E 46 82 2F C3 6C 83 96 A4 4E 58 9B
##$RELAX= 
##$RELAX= 
##$RELAX= 
##$RELAX= 
##$RELAX= 
##$RELAX= 
$$ Bruker specific parameters
$$ --------------------------
##$DU= <F:/spectra>
##$EXPNO= 1
##$NAME= <H-C>
##$PROCNO= 1
##$TYPE= <nmr>
##$USER= <she>
##$AMP= (0..31)
100 100 100 100 100 100 100 100 100 100 100 100 100 100 100 100 100 100 
100 100 100 100 100 100 100 100 100 100 100 100 100 100 
##$AQSEQ= 0
##$AQ_mod= 1
##$AUNM= <au_zg>
##$AUTOPOS= <>
##$BF1= 200.13
##$BF2= 200.13
##$BF3= 200.13
##$BF4= 200.13
##$BF5= 200.13
##$BF6= 200.13
##$BF7= 200.13
##$BF8= 200.13
##$BYTORDA= 1
##$CFDGTYP= 0
##$CFRGTYP= 5
##$CHEMSTR= <none>
##$CNST= (0..31)
1 1 145 1 1 1 1 1 1 1 1 1 1 1 1 1 1 1 1 1 1 1 1 1 1 1 1 1 1 1 1 1 
##$CPDPRG= <>
##$CPDPRG1= <>
##$CPDPRG2= <>
##$CPDPRG3= <>
##$CPDPRG4= <mlev>
##$CPDPRG5= <mlev>
##$CPDPRG6= <mlev>
##$CPDPRG7= <mlev>
##$CPDPRG8= <mlev>
##$CPDPRGB= <>
##$CPDPRGT= <>
##$D= (0..31)
0 0.7 0 0 0 0 0 0 0 0 0 0.03 0 0 0 0 0 0 0 0 0 0 0 0 0 0 0 0 0 0 0 0 
##$DATE= 1738327031
##$DBL= (0..7)
120 120 120 120 120 120 120 120 
##$DBP= (0..7)
150 150 150 150 150 150 150 150 
##$DBP07= 0
##$DBPNAM0= <>
##$DBPNAM1= <>
##$DBPNAM2= <>
##$DBPNAM3= <>
##$DBPNAM4= <>
##$DBPNAM5= <>
##$DBPNAM6= <>
##$DBPNAM7= <>
##$DBPOAL= (0..7)
0.5 0.5 0.5 0.5 0.5 0.5 0.5 0.5 
##$DBPOFFS= (0..7)
0 0 0 0 0 0 0 0 
##$DE= 6
##$DECBNUC= <off>
##$DECIM= 32
##$DECNUC= <off>
##$DECSTAT= 4
##$DIGMOD= 1
##$DIGTYP= 9
##$DL= (0..7)
0 120 120 120 120 120 120 120 
##$DP= (0..7)
150 150 150 150 150 150 150 150 
##$DP07= 0
##$DPNAME0= <>
##$DPNAME1= <>
##$DPNAME2= <>
##$DPNAME3= <>
##$DPNAME4= <>
##$DPNAME5= <>
##$DPNAME6= <>
##$DPNAME7= <>
##$DPOAL= (0..7)
0.5 0.5 0.5 0.5 0.5 0.5 0.5 0.5 
##$DPOFFS= (0..7)
0 0 0 0 0 0 0 0 
##$DQDMODE= 0
##$DR= 18
##$DS= 0
##$DSLIST= <SSSSSSSSSSSSSSS>
$$ [...]
##$SUBNAM0= <"">
##$SUBNAM1= <"">
##$SUBNAM2= <"">
##$SUBNAM3= <"">
##$SUBNAM4= <"">
##$SUBNAM5= <"">
##$SUBNAM6= <"">
##$SUBNAM7= <"">
##$SUBNAM8= <"">
##$SUBNAM9= <"">
##$SW= 18.0517328524113
##$SWIBOX= (0..15)
0 0 2 0 0 0 0 0 0 0 0 0 0 0 0 0 
##$SW_h= 3612.71676300578
##$TD= 16384
##$TD0= 1
##$TE= 0
##$TE2= 300
##$TE3= 300
##$TEG= 300
##$TL= (0..7)
0 120 120 120 120 120 120 120 
##$TP= (0..7)
150 150 150 150 150 150 150 150 
##$TP07= 0
##$TPNAME0= <>
##$TPNAME1= <>
##$TPNAME2= <>
##$TPNAME3= <>
##$TPNAME4= <>
##$TPNAME5= <>
##$TPNAME6= <>
##$TPNAME7= <>
##$TPOAL= (0..7)
0.5 0.5 0.5 0.5 0.5 0.5 0.5 0.5 
##$TPOFFS= (0..7)
0 0 0 0 0 0 0 0 
##$TUNHIN= 0
##$TUNHOUT= 0
##$TUNXOUT= 0
##$USERA1= <user>
##$USERA2= <user>
##$USERA3= <user>
##$USERA4= <user>
##$USERA5= <user>
##$V9= 5
##$VALIST= <valist>
##$VCLIST= <CCCCCCCCCCCCCCC>
##$VD= 0
##$VDLIST= <DDDDDDDDDDDDDDD>
##$VPLIST= <PPPPPPPPPPPPPPP>
##$VTLIST= <TTTTTTTTTTTTTTT>
##$WBST= 1024
##$WBSW= 4
##$XGAIN= (0..3)
0 0 0 0 
##$XL= 0
##$YL= 0
##$YMAX_a= 788834
##$YMIN_a= -823128
##$ZGOPTNS= <>
##$ZL1= 120
##$ZL2= 120
##$ZL3= 120
##$ZL4= 120
##$ABSF1= 10
##$ABSF2= 0
##$ABSG= 5
##$ABSL= 3
##$ALPHA= 0
##$AQORDER= 0
##$ASSFAC= 0
##$ASSFACI= 0
##$ASSFACX= 0
##$ASSWID= 0
##$AUNMP= <proc_1d>
##$AZFE= 0.1
##$AZFW= 0.1
##$BCFW= 1
##$BC_mod= 2
##$BYTORDP= 1
##$COROFFS= 0
##$CY= -3
##$DATMOD= 1
##$DC= 2
##$DFILT= <>
##$DTYPP= 0
##$F1P= 0
##$F2P= 0
##$FCOR= 0.5
##$FTSIZE= 0
##$FT_mod= 4
##$GAMMA= 1
##$GB= 0.15
##$INTBC= 1
##$INTSCL= 1
##$ISEN= 128
##$LB= 0.25
##$LEV0= 0
##$LPBIN= 0
##$MAXI= 10000
##$MC2= 0
##$MEAN= 0
##$ME_mod= 0
##$MI= 1.114404
##$NCOEF= 0
##$NC_proc= 0
##$NLEV= 6
##$NOISF1= 3.799351
##$NOISF2= 2.8
##$NSP= 1
##$NTH_PI= 0
##$NZP= 0
##$OFFSET= 14.38212
##$PC= 1
##$PHC0= 249.0476
##$PHC1= 15.19223
##$PH_mod= 1
##$PKNL= yes
##$PPARMOD= 0
##$PSCAL= 0
##$PSIGN= 0
##$REVERSE= no
##$SF= 200.129724274929
##$SI= 16384
##$SIGF1= 3
##$SIGF2= 2
##$SINO= 400
##$SIOLD= 16384
##$SREGLST= <1H.CDCl3>
##$SSB= 0
##$STSI= 0
##$STSR= 0
##$SW_p= 3205.1282051282
##$SYMM= 0
##$S_DEV= 0
##$TDeff= 0
##$TDoff= 0
##$TI= <>
##$TILT= no
##$TM1= 0
##$TM2= 0
##$TOPLEV= 0
##$USERP1= <user>
##$USERP2= <user>
##$USERP3= <user>
##$USERP4= <user>
##$USERP5= <user>
##$WDW= 1
##$XDIM= 8192
##$YMAX_p= 0
##$YMIN_p= 0
$$ End of Bruker specific parameters
$$ ---------------------------------
##NTUPLES= NMR FID
##VAR_NAME=  TIME,          FID/REAL,        FID/IMAG
##SYMBOL=    X,             R,               I
##VAR_TYPE=  INDEPENDENT,   DEPENDENT,       DEPENDENT
##VAR_FORM=  AFFN,          ASDF,            ASDF
##VAR_DIM=   8192,          8192,            8192
##UNITS=     SECONDS,       ARBITRARY UNITS, ARBITRARY UNITS
##FACTOR=    0.0002768,     1,               1
##FIRST=     0,             0,               0
##LAST=      2.2672688,     0,               0
##MIN=       0,             -823128,         0
##MAX=       2.2672688,     788834,          0
$$ Real data points
##PAGE= N=1
##DATA TABLE= (X++(R..R)), XYDATA
$$ [...]
1905a230J401R77j686J57Q94k17j78q4M06j06j191N63J160j046j53O01j013R98
$$ -1230 171 1148 -538 -381 513 296 118 34 440 334 -857 -294 866 -180 -333 268 -745 253
1923B53l22q26O23O10k35J90r63j23J539o31k22K31m85Q91jp99L86L11r40L14
$$ 253 -69 -895 -272 338 103 293 -670 -793 746 115 -107 124 -361 530 529 -270 116 427 -513 -199
1943a99R0j09o6p84J208R50j688k45J305j56j92k29j15J058l32j104R90Q5l09
$$ -199 -109 -218 -284 -1068 140 1090 -598 -843 462 306 114 -115 -230 828 496 -608 382 467 158
1962A58l84P3P19k98j708J449J081j490k26K68N72M14p62m20J181m92J98k17o97
$$ 158 -226 -153 566 268 -1440 9 1090 -400 -626 -358 214 628 -134 -554 627 135 333 116 -581
1981e81J061k86p73Q59Q10j625j9P43K73p13j088J138J301j493nO50l8K17p1o26
$$ -581 480 194 -579 280 1090 -535 -554 189 462 -251 -1339 -201 1100 -393 -398 252 214 431 360 -266
2001b66P94p0o85P86q0l90l65m61R92K72j403M14Q69k68k13j95k03Q16n12j24
$$ -266 528 458 -227 559 479 89 -276 -737 255 527 -876 -462 407 139 -74 -269 -472 344 -168 -292
2021b92Q45m82K43M3n94Q13j08j373N66R84l20l97n77O80P68j385m70J452J73
$$ -292 553 71 314 357 -237 576 468 -905 -339 645 325 -72 -649 31 799 -586 -1056 396 569
2040E69n17j93M5Q80o00j003J513K77j590K61J091j18o41q06P43O91r35m66J023
$$ 569 52 -141 -96 784 184 -819 694 971 -619 -358 733 615 -26 -832 -89 602 -333 -799 224
2059B24l3J44o45J72R14r40p68J331K36r35L75L78J86m78q87Q97P4o93O85k04
$$ 224 191 335 -310 -138 776 -164 -932 399 635 -300 75 453 639 161 -726 171 245 -448 237 33
2079C3p85R77j6p59K36j00J065m67o12Q84K46j281N42N31n32J42l72L81Q43j416
$$ 33 -752 225 209 -550 -314 -414 651 184 -428 456 702 -579 -37 494 -38 104 -268 113 956 -460
2099d60l27J174j07m42m77J89J448r87r35J343L04r95l10Q39L81p39j076J583
$$ -460 -787 387 280 -162 -639 -450 998 11 -924 419 723 -272 -582 257 638 -101 -1177 406
2117D06M90j273J6O48m84M6k63J39M03j48j99N58l48j86J32K22P7jk73N50m61
$$ 406 896 -377 -361 287 -197 -151 -414 -275 128 -20 -219 339 -9 -195 -63 159 236 235 -38 512 51
2138E1o49J118l84p02Q78m8l82j13l19Q73l94j087J053J054j346K64M56J76l58
$$ 51 -598 520 136 -566 312 264 -118 -231 -550 323 -71 -1158 -105 949 -397 -133 323 499 141
2157A41q23P59O57p96k47P14k42M95j069R8Q75m03j220J499Q8j026K62J13O51
$$ 141 -682 77 734 -62 -309 405 163 658 -411 -313 562 159 -1061 438 526 -500 -238 -125 526
2176E26o64o88J205P9r36N06P06j089L12K27k19O8o69N77K47n88M84L49j008P26
$$ 526 -138 -826 379 458 -478 28 734 -355 -43 184 -35 33 -636 -59 188 -400 84 433 -575 151
2196A51l09k72R36n41m77R25J30o59K4L65L31p35o18J417m41j136P42N70o86l63
$$ 151 -158 -430 506 -35 -512 413 543 -116 -92 273 604 -131 -749 668 227 -909 -167 403 -283 -646
2216f46K19P23l86p57R23P27j109Q3O97k11o2j92j18N69n69k12N28k16k02j07
$$ -646 -427 296 -90 -847 76 803 -306 -223 474 263 201 9 -109 460 -109 -321 207 -9 -211 -318
2236c18K56L42n51l92J016J03j270J012J76n41K31K31k2j07o69O69M83j092K99
$$ -318 -62 280 -271 -663 353 456 -814 198 374 -167 64 295 273 166 -503 166 649 -443 -144
2255a44K97J13j35m24lN63o45j26J044k43p25J45Q00N4o64m41J158j84j063Q01
$$ -144 153 266 131 -293 -296 267 -378 -504 540 297 -428 -283 517 571 -93 -534 624 440 -623 178
2275A78J84n61Q8j49N16n67j70N41J49p11M63J68k44K58m44K86L09m85j1P38l04
$$ 178 362 -199 -111 -260 256 -311 -481 60 209 -502 -39 129 -115 143 -301 -15 294 -191 -202 536 232
2296B32m10J71K8M16p49m81J526o51j212J297o4j76j54J76M04j18o39O82M30r92
$$ 232 -178 -7 21 437 -312 -793 733 82 -1130 167 103 -73 -227 -51 353 235 -404 278 708 -284
2316b84L35L72n45K67nm47P39k78o17N71kk82p3J80J31k40l52J324o67m66P05
$$ -284 51 423 -122 145 140 -307 432 154 -463 108 106 -176 -249 -69 62 -178 -530 794 127 -339 366
2337C66j2l48J38l41M21l75l04Q96l17n49M69J38j78l30k02M85Q31j182r2R45
$$ 366 354 6 144 -197 224 -151 -455 441 124 -425 44 182 4 -326 -528 -43 788 -394 -486 459
2357D59n11p8J15L44P4o81Q2R71q04m50M74K40l10k34k7K90O0k56K62L20o00O09
$$ 459 -52 -130 -15 329 403 -278 -196 775 -29 -479 -5 235 -75 -309 -336 -46 14 -242 20 340 -260 349
2379C49k07l59P74l31k75L39m4j58L44p18K46m8J8O3k75J94O58r05m14J087K78
$$ 349 142 -217 557 226 -49 290 246 88 432 -286 -40 -88 -70 -7 -282 -88 570 -335 -749 338 616
2400F16r70P3M01K69k29l88P38k47p71P25J82k37mp07L61O40o86k24K89K04J14
$$ 616 -354 -281 120 389 160 -228 510 263 -508 217 399 162 158 -549 -188 452 -234 -458 -169 35 149
2421A49k71k7M06j12k03L54k40j27M41j49j28N4m88L68J72l91L2o6j89P40p6n15
$$ 149 -122 -149 257 145 -58 296 56 -71 370 221 93 147 -341 27 199 -192 -160 -226 -415 325 249 -266
2443b66J18k10N76q7p34O28j07j23K08K03l94K35m86M90N51o96o74J028j92k75
$$ -266 -148 -358 218 131 -603 25 -82 -205 3 206 -188 47 -439 51 602 -94 -768 260 68 -207
2463b07j06L8O47k87k17K70j44QP7Q9k49M67n81J1P13m15m19J24N2M07k94q36
$$ -207 -313 -275 372 85 -132 138 -6 2 79 168 -81 386 -195 -184 529 114 -305 -181 -129 278 -16 -852
2485h52J131P2r14M94p8J09J36Lj58K86j67N2p6J44K02n21l63Q71k35p32O35j39
$$ -852 279 351 -563 -69 -147 -38 98 101 -57 229 62 114 38 182 384 -137 -500 371 136 -596 39 -100
2507a00J42J4n68N77J43l65L29l00L00K57m72r6N06o97M62N9k14l1k63mL88J40
$$ -100 42 56 -512 65 208 -157 172 -128 172 429 -43 -139 367 -330 132 191 -23 -54 -317 -321 67 207
2529B07n13J95j72j18N54m51n5P50l59j0L57j33j06P2k28M51n88l75M28M01l56
$$ 207 -306 -111 -283 -401 153 -298 -353 397 38 28 385 252 146 218 -10 441 -147 -522 -94 307 -49
2550d9r5j62N79k23k01R8L65m06K10k81L20O3l56P1M95l73m65O57k21k06J06k09
$$ -49 -144 -306 273 50 -151 -53 312 -94 116 -165 155 218 -138 -67 428 55 -410 247 26 -180 -74 -283
2572b83K17k0j04J54j52J26L44l29n7K48j70J36q0k25M65k07k07J55j43o8N4n4
$$ -283 -66 -86 -190 -36 -188 -62 282 -47 -104 144 -26 110 30 -195 270 63 -144 11 -132 -200 -146 -200
2594b00K5P36q18k54Q39n51M9R6K32K75n08L5P74o52l25O50j99j45k24q7L92j70
$$ -200 -175 561 -257 -511 328 -223 -174 -78 154 429 -79 -44 730 78 -247 403 204 59 -165 -252 140 -30
2616c0k42m3L25l04J13q5K37K21m52Q9N69n31j40M75j36j7R3p7J06m38p9Q67o37
$$ -30 -272 -315 10 -294 -181 -266 -29 192 -260 -171 398 -133 -273 202 66 49 142 65 171 -267 -346 521 -116
2639a16j21N69l53l34L13K9J62k29l97R10q4m69J90K94j59k10l76L48K96n62K91
$$ -116 -237 332 -21 -355 -42 -13 149 -80 -477 433 349 -120 70 364 205 -5 -381 -33 263 -299 -8
2660hL23o2n40j72O85K93r96J91P22k08m88K85L31k80r1j86M22K1l69R5R4j08
$$ -8 315 253 -287 -459 226 519 -477 -286 436 228 -260 25 356 76 -15 -201 221 242 -127 -32 62 -46
2682d6j3K80k43j15m48M35L74o92L80J81l65J07K19L97j45n91J24O97m59n52P01
$$ -46 -59 221 -22 -137 -585 -150 224 -468 -88 93 -272 -165 54 451 306 -285 -161 536 77 -475 226
2703B26K2k37l49L30K21k37k85K49J83n91M13J87j64K58m80K97L91o61O8L16l16
$$ 226 248 11 -338 -8 213 -24 -309 -60 123 -468 -55 132 -32 226 -254 43 434 -227 -159 157 -159
2724a59K96l25K47L30p41N8Q17n51m39O78n6j35J3k86N20R2p30L54K7j14J54o1
$$ -159 137 -188 59 389 -352 -294 523 -28 -467 211 155 20 33 -253 267 359 -371 -17 10 -104 50 -11
2746a1R1j41l47M85m8l91L97O5k61j15N21Q3n02j77Q2O62m16k78O86m07K54n34
$$ -11 80 -61 -408 77 29 -362 35 100 -161 -276 245 328 -174 -351 -269 393 -23 -301 385 -22 232 -302
2768c02L13L62j24m73Q8J66n9q3j73M39r2m12L19L68m72J62K22k92J39j29K03
$$ -302 11 373 249 -224 -136 30 -29 -112 -285 154 62 -350 -31 337 -135 27 249 -43 96 -33 170
2789A70k43l19M29M40p88j9M88j66L4k42o4L23k00k3N19p0l05K12k93M43k45m38
$$ 170 -73 -392 37 477 -311 -330 158 -8 26 -216 -280 43 -157 -180 339 269 -36 176 -117 326 81 -357
2811c57M10K86o70L75K25j86l6k29J88J43o06L8R43n04m67N24J23j86r1J30L08
$$ -357 53 339 -331 44 269 83 47 -182 6 149 -457 -419 524 20 -447 77 200 14 -77 53 361
2832C61k94l88N05j07l24L94m86M93J9o82Q17k35l34j02P20k47n47L24M28p6l22
$$ 361 67 -321 184 77 -247 147 -339 154 173 -509 308 73 -261 -363 357 110 -437 -113 315 239 -83
2853h3j4O75p26l8K92J06k97j87J74K73k47j78O46k63l35K40J7J56k54n3K56j45
$$ -83 -97 578 -148 -186 106 212 -85 -272 -98 175 -72 -250 396 133 -202 38 55 211 -43 -96 160 15
2875A5k44J88M47k51M0o04N05L12q29K28L21m99J49K89o3m9N6k9J96k46j0L99
$$ 15 -229 -41 406 155 195 -409 96 408 -421 -193 128 -371 -222 67 4 -45 11 -18 178 -68 -78 321
2897C21l77k67Q69m96j50J2K0J49J54m17K17k26J77ml4K02l3l37J53M39n19k79
$$ 321 -56 -323 546 50 -100 -88 -68 81 235 -182 35 -191 -14 -18 -52 150 117 -220 -67 372 -147 -426
2919d26L48J22p5N1P0K80n34O1J30J26Q1k13l16L83l28k43M19K86j94j14O0l6
$$ -426 -78 44 -31 20 90 370 -164 -103 27 153 234 21 -295 88 -240 -483 -64 222 28 -86 -26 -62
2941f2q2K89K2L3l45K47K09n21L45k47l19L98J04J17L3l69J04M71o49q3K76Q4
$$ -62 -144 145 167 200 -145 102 311 -210 135 -112 -431 -33 71 188 221 -148 -44 427 -222 -305 -29 55
2963E5j81J02j46M01k99K93p7k4k60N3n2K33J48o78K72M04j16n0p8NJ41j0k09
$$ 55 -126 -24 -170 231 -68 225 148 124 -136 -83 -135 98 246 -432 -160 244 128 78 0 5 146 136 -73
2986g3M71l05j64L98n09M3K52j98K02r5n2j7M9j67M08n15M8M41m78M52k03j02
$$ -73 398 93 -71 327 -182 -139 113 -85 117 22 -30 -47 2 -165 243 -272 -224 217 -261 191 -12 -114
3008a14K93J03l40K65j9r3k87O5J61J25r59P10K36l15j08J72J62%J64m09P1L21
$$ -114 179 282 -58 207 188 95 -192 -127 34 159 -800 -90 146 -169 -277 -105 57 57 221 -188 -117 204
3030B04k97L49k58R8J01j76NN6l27K80j3l48J46J0J35L43k96m0K09O7j61O6k21
$$ 204 -93 256 -2 96 197 21 26 82 -245 35 22 -326 -180 -170 -35 308 12 -28 181 248 87 153 -68
3053f8J2M56l22N9j00k39L34j15j67K22l26O9J14k4J12Ol05K72J07j99M3J90j43
$$ -68 -56 400 78 137 37 -202 132 17 -150 72 -254 -185 -71 -95 17 23 -282 -10 97 -102 -59 131 -12
3076a2l1ko1J82j11l03M24oj57R7l4K20m92p7N31j14j14L13o56M18L45p26L95
$$ -12 -43 -45 -106 76 -35 -338 86 80 -77 20 -14 206 -286 -363 168 54 -60 253 -403 15 360 -366 29
3099B9J19j79L0R8J5Q0n11J84L44J16l78k32M38k19Q7j76J53J30k17Q5N0L12l78
$$ 29 148 -31 -1 97 112 192 -319 -135 209 325 -53 -285 153 -66 21 -155 -2 128 -89 -4 46 358 -20
3122b0M1j32N48m71o7LQ6n2K21p1k39L34n24K29k48K20K30J53m68L58l00K64r9
$$ -20 21 -111 437 -34 -101 -98 -12 -64 157 86 -153 181 -343 -114 -362 -142 88 241 -227 131 -169 95 -4
3145dk6J24n6j21K13j6l75N9J18J82n2k55K45K28l06j63J17k9K2NK5J49P9l26
$$ -4 -30 94 38 -83 130 114 -261 -202 -84 98 46 -209 36 264 -42 -205 -88 -117 -95 -90 -65 84 163 -163
3169a63K16N9l9l86L33J5n9l19M53N1m04L69n96M45k4qLj01M1L35k11l78N36J39
$$ -163 53 112 73 -313 20 35 -24 -343 110 161 -243 126 -470 -25 -49 -57 -54 -155 -114 221 10 -368 168 307
3193C07l61Q8j72K88l08NJ01J46o8m3l00N63j93j50NP74n82k22J07k69L42m5q7
$$ 307 -54 34 -138 150 -158 -153 -52 94 26 -17 -317 246 53 -97 -92 682 100 -122 -15 -284 58 13 -74
3216g4K02N9q40N76N0j2k2j70M40k53L96m20P1rO8q7nM0k93K33K43o9m54L32O7
$$ -74 128 187 -653 -77 -27 -39 -61 -231 209 -44 352 -68 3 -6 62 -25 -30 10 -283 -50 193 124 -330 2 69
3241F9p8j6J63o6j66j38M08j99L6K26m0j87l9L68m43L69k11JJ06k75p2L74j09
$$ 69 -9 -25 138 72 -94 -232 176 -23 13 239 199 12 -27 341 -102 267 56 57 163 -112 -184 190 81
3264H1j02Lo9J54k07r2M56l24j83L87K1j10R7k24M35m97K06J69j23l27J04J95
$$ 81 -21 -18 -87 67 -140 -232 224 -100 -283 104 125 15 112 -112 323 -174 32 201 78 -249 -145 50
3286E0l03J93p9L46k65j45J99N1k51L30j70J50J5M7k08j9J48j37J65J03j15j67
$$ 50 -253 -60 -139 207 -58 -203 -4 47 -204 126 -44 106 121 168 -40 -59 89 -48 117 220 105 -62
3308f2K38o2j88o3K77J5j34J22j95r3R7k89L52L92n13M3K79k02k67J71k4J71P3
$$ -62 176 114 -74 -137 140 155 21 143 -52 -145 -48 -337 15 407 -106 -63 216 14 -253 -82 -106 65 138
3331A38l26L04J48l73R4p4K78l70k06N15j7j90L91j38k99K98k71J85%k57M2K31
$$ 138 -188 116 264 -109 -15 -89 189 -181 -387 128 111 -79 312 174 -125 173 -98 87 87 -170 -128 103
3353A03j37J10m9j59L70k23m8R2m6k24K49J79k48j14J86K88m01K41l4K17n02K59
$$ 103 -34 76 27 -132 238 15 -33 59 13 -211 38 217 -31 -145 41 329 -72 169 135 352 -150 109
3375A09k8l44K16P2R8m4j4m55M02j07j9K81j19l7l46L67K26k97q0N3Q9O3j0J08
$$ 109 81 -263 -47 25 123 79 65 -390 12 -95 -114 167 48 11 -335 32 258 -39 -119 -66 23 86 76 184
3399A84N9m28N8K49r6j81J45N1l98K57N8M5j69m3L16j05L13m08J74j18M8J78l40
$$ 184 243 -185 -127 122 26 -155 -10 41 -357 -100 -42 3 -166 -209 107 2 315 -93 81 -37 11 189 -151
3422a51L18O9m94K18Q9j53L66l88J14l6O8L00o8k77KK46k29P6k80K72P1l09J21
$$ -151 167 236 -258 -40 49 -104 262 -126 -12 -48 20 320 252 -25 -23 223 -6 70 -210 62 133 -176 -55
3445e5J38M0l38O5k07N62l18L27M4l37Q8k94L26M2j0l08K1Q5M85k53k58M8R9L4
$$ -55 83 123 -215 -150 -357 205 -113 214 258 -79 9 -285 41 83 73 -235 -214 -129 356 103 -155 -107 -8 26
3469B6j5j44J62N1j22j70L81L2K4j87J09k61K42j82l2L53k53k74K68J1j08J35
$$ 26 11 -133 29 80 -42 -212 169 201 225 38 147 -114 128 -54 -86 267 14 -260 8 19 -89 46
3491D6l82L64j62K44k12N5L38l60J11KR6j79L73j24k26O2N9kK3k75O0L26j61k59
$$ 46 -336 28 -134 110 -102 -47 291 -69 42 44 140 -39 334 210 -16 46 105 103 126 -149 -89 237 76 -183
3515a83J41l14J72L29M5l45O7j03n7M02l52J93K19j94j14J44n0K07m80J36J88
$$ -183 -42 -356 -184 145 190 -155 -88 -191 -248 154 -198 -5 214 20 -94 50 0 207 -273 -137 51
3536E1l12J41J93N5J08l35K55q6J44m15M34k80R6J37j56k66K12M8J23j24k5J2
$$ 51 -261 -120 73 128 236 -99 156 70 214 -201 233 -47 49 186 30 -236 -24 24 147 23 -2 10
3558A0k62K77k16j53J04L84R6k22j98J43K97l39j54M02J36l14k54L59q2l7k15
$$ 10 -252 25 -191 -344 -240 144 240 18 -180 -37 260 -79 -233 169 305 -9 -263 96 14 -23 -238
3579b38n8L47k73J54J56N4o8r4j71L67N8j71K69l31K12j99k17L82k64k2O6j46
$$ -238 -296 51 -222 -68 88 142 74 -20 -191 176 234 63 332 1 213 14 -203 179 -85 -107 -41 -187
3601a87J44K01k9J48k70J26j30J29l29K58j06J97j47J64j38M8j40j19Q7N2K3K19
$$ -187 -43 158 129 277 7 133 3 132 -197 61 -45 152 5 169 31 79 -61 -180 -93 -41 -18 201
3623B01k15l36J30J78j25R2J11j80L04n46M70k21L80l58j24J09J00j7r9K13K9
$$ 201 -14 -350 -220 -42 -167 -75 36 -144 160 -386 84 -137 243 -115 -239 -130 -30 -47 -146 67 96
3644I6k62J33r6K68k14K20J4k28M53m92N4K21k32k46j5K84J37M3r1P8k9j52R4
$$ 96 -166 -33 -129 139 -75 145 159 -69 384 -108 -54 167 -65 -311 -326 -42 95 138 47 125 96 -56 38
3667C8K4q3o4R0J82j43m7P1m91N25j33rj07L69p7l73N38K29l37j90K14k32J80
$$ 38 62 -21 -85 5 187 44 -3 68 -423 102 -31 -40 -147 222 145 -228 310 539 202 12 226 -6 174
3690A74l09J25J64k89J66j33M0J77j53j15J07J84m16L67n1L1k67L11k06p4Q6J80
$$ 174 -135 -10 154 -135 31 -102 -62 115 -38 -153 -46 138 -278 89 38 69 -198 113 -93 -167 -81 99
3712I9j75o3qP0k93L66j13N7J21j32j67J10K69j67n7l74J66K91J47R6k66R5l5
$$ 99 -76 -139 -147 -77 -370 -4 -117 -60 61 -71 -238 -128 141 -26 -83 -457 -291 0 147 243 -23 72 37
3735C7j09K0r5L65m63N73m14K0j17K1K10o6k32L36j37kK65k89K38m48o4K0N67
$$ 37 -72 -52 -147 218 -245 328 -86 -66 -183 -162 48 -18 -250 86 -51 -53 212 -77 161 -287 -351 -331 236
3758B36m09Q1J54j56J18j0M4M3r0q8K43K13l22K8j67K96k71M7Q4K5j91P4q3J78
$$ 236 -173 -92 62 -94 24 14 58 101 11 -77 166 379 57 85 -82 214 -57 -10 74 99 -92 -18 -101 77
3782G7m9%j00rJ17J25j96n3L02k41K52l24K39Qk66J94q0j3j71kJ16J59k01P0N3
$$ 77 28 28 -72 -81 36 161 -35 -88 214 -27 225 -99 140 148 -118 76 -4 -17 -188 -190 -74 85 -116 -46 7
3807GNq9q8J93p6M7j25J98k78Q0K01lJ59l20K32p3k79L51m15J73%j30j0L7K35
$$ 7 12 -77 -165 28 -48 -1 -126 72 -206 -126 75 72 231 -89 143 70 -209 142 -273 -100 -100 -230 -240 -203 32
3832C2J89j29Q7j06j31J63J94k98RL6j10J63j44P6j44O0K21j18Q0o8K1j91J56
$$ 32 221 92 179 73 -58 105 299 1 10 46 -64 99 -45 31 -113 -53 168 50 130 62 83 -108 48
3855D8k7j41L66o9l53L07j30k29J29J68j40M05m34Q1K22r7o9J88n27L88j17J67
$$ 48 21 -120 246 177 -176 131 1 -228 -99 69 -71 334 -100 -19 203 106 37 225 -302 86 -31 136
3877A36j71N5m9Q2j77L6J63j98M1P9J58j10j25j10J8K27j74M03j69j8j6m2j32
$$ 136 -35 20 -29 53 -124 -88 75 -123 -82 -3 155 45 -80 -190 -172 55 -119 284 115 97 81 39 -93
3900i3K99k53K98n2k18J12m8l1K4J04j09M1j23l04L83J98j57l07j17M00m8j34
$$ -93 206 -47 251 199 -19 93 45 14 38 142 33 74 -49 -353 30 228 71 -236 -353 47 -1 -135
3922a35Q6P6k94K9K01j41Q8J42j39l8O46n53rM8j10j73K14K28m61K5P2J41j7J66
$$ -135 -49 27 -267 -238 -37 -178 -90 52 -87 -125 521 -32 -41 7 -103 -276 -62 166 -295 -270 -198 -57 -74 92
3946I2J38k50Qk01K10K8j57J6K79k29L0J02k43L98j60L3m36K37k63M58j41P8K7
$$ 92 230 -20 -12 -213 -3 25 -132 -116 163 -66 -36 66 -177 221 61 94 -342 -105 -368 90 -51 27 54
3969E4j69jJ84Q8p1J46k41O9k7k24L85j74p9K12m6k2j25r4M13n6k21j04J16K92
$$ 54 -115 -116 68 156 85 231 -10 59 32 -192 193 19 -60 152 106 84 -41 -135 278 222 1 -103 13 305
3993C05l41k8o4K15k10M8J69q2K01k06L35n93J61L3J81o6l20K0J67j43L25j69
$$ 305 -36 -64 -128 87 -123 -75 94 12 213 7 342 -251 -90 -57 124 58 -262 -242 -75 -218 107 -62
4015f2K9P1k61M07K9kl64J89N7k30J42J85k10j36K63k6j9J4j48j17M55k21m8j48
$$ -62 -33 38 -223 184 213 211 -153 36 93 -137 5 190 -20 -156 107 81 62 76 -72 -189 266 45 -3 -151
4039a51J40k54K10K5j82L55l48N0O3J08J90j07j99Q0O3j56jJ9J75K5K03l69P8
$$ -151 -11 -265 -55 -30 -212 143 -205 -155 -92 16 206 99 -100 -20 43 -113 -114 -95 80 105 308 -61 17
4062A7L15k51M7J81j02l5k37K50j34j1J26p7p7m2l0J97j2j15k18J53J15Q5jo6
$$ 17 332 81 128 309 207 172 -65 185 51 40 166 89 12 -30 -60 137 125 10 -208 -55 60 145 144 78
4086G8J6J02l79L32j91Q8p0J85k34j09K80Nq1l83M22K1k74M0J92O9n7R6j93j6
$$ 78 94 196 -183 149 -42 46 -24 161 -73 -182 98 103 22 -361 61 82 -192 -152 40 109 52 148 -45 -61
4110f1J32j03J53j23k6K48p7m7j29k54M80k02k33K25K30j16k67L82k18K45m25
$$ -61 71 -32 121 -2 -28 220 143 96 -33 -287 193 -9 -242 -17 213 97 -170 212 -6 239 -186
4131a86LL32p5k84m2L33j11mK44n03K49o5O7Q9j31K29m31J30K51J52k84J00L9
$$ -186 -183 149 74 -210 -252 81 -30 -34 210 -293 -44 -109 -42 47 -84 145 -286 -156 95 247 -37 63 102
4154A02j04P4J57l72qL86o0j51J01k83q9K46K39k14J62k73J33j88J2J30o0Q9J84
$$ 102 -2 72 229 -143 -151 235 175 24 125 -158 -247 -1 238 24 186 -87 46 -142 -130 0 -60 29 213
4177B13j31j4j33r7l5j40P7L14J0r4N6R3o0J8M0n28L81J06l65M03k49J28K70m69
$$ 213 82 68 -65 -162 -197 -337 -260 54 64 -30 26 119 59 77 117 -411 -30 76 -289 114 -135 -7 263 -206
4201b06L13k63J01J26N6n0o0L0j99L53j35j10J41j2k25J34J55l15J94k15L59k70
$$ -206 107 -156 -55 71 127 77 17 47 -152 201 66 -44 97 85 -140 -6 149 -166 28 -187 172 -98
4223i8Q0K25k87K2J12j96M13l37J3j05K16L39n80L38k46K9J41j81J12L2p3J96
$$ -98 -18 207 -80 -58 54 -142 271 -66 -53 -158 58 397 -183 155 -91 -62 79 -102 10 42 -31 165
4245A65l65j1J95k54M02j9j60J94j72o4P1M4J91j30P3j11K8N8k08J01k76j32M41
$$ 165 -200 -211 -16 -270 132 113 -47 147 -25 -89 -18 26 217 87 160 49 77 135 -73 28 -248 -380 61
4268F1j04L01l80J82k36J72r5r5K43o9J77q6O9k30O7L6k7r7L9Q7l6J24k00J82
$$ 61 -43 258 -122 60 -176 -4 -99 -194 49 -20 157 71 140 -90 -23 13 -14 -111 -72 15 -21 103 -97 85
4292H5M1r9j24P7K50m36M04j90k10o9J95L23k54r2K80l69j41L76M5J66K0n64J58
$$ 85 126 27 -97 -20 230 -206 198 8 -202 -271 -76 247 -7 -99 181 -188 -329 47 92 258 278 -286 -128
4315a28k6R0N7M4j66O6K88o01L54J59j08o8l7O1J55j66p8n3O4J6N1j06K2J13O9
$$ -128 -154 -64 -7 37 -129 -63 225 -376 -22 137 29 -39 -76 -15 140 -26 -104 -157 -93 -77 -26 -132 -110 3 72
4340G2j14k00K74q0l41L07J44k19q4M2L64K7k12J73l0L1j07m5M4mJ34l48K76M7
$$ 72 -42 -242 32 -48 -389 -82 62 -157 -241 -199 165 192 -20 153 123 154 47 2 46 42 176 -172 104 151
4364A51j75J93l36K53q2j68r9K27N7Q6k88K76lJ9j34J31l06M12r3k87K12l35M80
$$ 151 -24 169 -167 86 4 -164 -263 -36 21 107 -181 95 92 111 -23 108 -198 214 121 -166 46 -289 191
4387A91j54j58K9K57O0l32j45N45j03j97L9r3J96j28m2L01n50K49j01Q7q6J9K21
$$ 191 37 -121 -92 165 225 -107 -252 293 190 -7 32 -61 135 7 -35 266 -284 -35 -136 -49 -135 -116 105
4410A05m2k6k5o3R8j3J24k91J50J01l9q8p0j08L50k48L67j18m23K50m6M7m07L74
$$ 105 63 37 12 -51 47 34 158 -133 17 118 79 -9 -79 -187 163 -85 282 164 -259 -9 -55 -8 -415 -41
4434d1k03L84m92K16O1K86J08m32j55K73J03j65m6J78p4K70n34K42Pj93K36K1
$$ -41 -244 140 -352 -136 -75 211 319 -113 -268 5 108 -57 -103 75 1 271 -263 -21 -14 -207 29 50
4456E0j11J51J0J37j90j35OK4L01M2l88j8J45l03J30J6J57K28k64jJ66l29P2L36
$$ 50 -61 90 100 237 47 -88 -82 -58 243 285 -103 -121 24 -279 -149 -133 24 252 -12 -13 153 -176 -104 232
4480B32j43j73K26N0k68L5R4r1n3J19R9k28p9J46J13j67J07j30P9Q3lj49K53j85
$$ 232 89 -84 142 192 -76 -41 53 -38 -91 28 127 -101 -180 -34 79 -88 19 -111 -32 51 48 -101 152 -33
4504c3J9q5pJ39k01K70j53J23j01J24l85K50L5o1J91k23q8L24J02l08K06k95L39
$$ -33 -14 -99 -106 33 -168 102 -51 72 -29 95 -290 -40 -5 -66 125 -98 -186 138 240 -68 138 -157 182
4527A82k39j97O5LL26j83J04j2k67M21j67J6r9M5r6J87M4q0qK3j2ol1M6j24J14
$$ 182 -57 -254 -189 -186 140 -43 61 49 -218 203 36 52 -47 -2 -98 89 133 53 45 68 56 50 19 65 -59 55
4553E5k60J74J40k3ml27J93K10N3j51M4R2j34p0J70R2l67L26q7k89l9J06P1P0
$$ 55 -205 -31 109 86 82 -245 -52 158 211 60 104 196 62 -8 162 254 -113 213 126 -163 -202 -96 -25 45
4577D5k9J0j85PK20j91J60k21N8N4J37j9j18o5L40p7rj22k33K63J6j56M8K61n9
$$ 45 16 26 -159 -152 68 -123 37 -184 -126 -72 65 46 -72 -137 203 126 117 -5 -238 25 41 -115 -67 194 135
4602A35P4k04QJ30k72K61p5k23J48o0J56Q3j51k97J31K62Q8Q8p6k71J45r1L4m0
$$ 135 209 5 13 143 -129 132 57 -166 -18 -78 78 161 10 -287 -156 106 194 282 206 -65 80 -11 23 -17
4626a7O0K6k67K30J22k92N0K04j61k07K74K5r7J97k94K58lJ42k74r5q6J49P9l2
$$ -17 43 69 -198 32 154 -138 -88 116 -45 -252 22 47 -50 147 -147 111 108 250 -24 -119 -205 -56 23 -9
4650iM0r6J14O8j27n2P8J74j66j32n7JlJ19J33k74J4L9J11K48p1k98J50N2R7j64
$$ -9 31 -65 49 117 -10 -62 16 190 24 -108 -165 -164 -167 -48 85 -189 -175 -136 -25 223 152 -146 4 56 153 -11
4676a1j76J02p3J53j49J72j11J35J10j42J74k5j26r6J30j02J3J44N3m17M82p8
$$ -11 -187 -85 -158 -5 -154 18 -93 42 152 10 184 159 33 -63 67 -35 -22 122 175 -242 240 162
4698A62j71qo7Q0J89k79J93j89J98J66l99J87q7r3N7j29M54l22pJ58l84N26m18
$$ 162 -9 -17 -84 -4 185 -94 99 -90 108 274 -125 62 -25 -118 -61 -190 264 -58 -65 93 -291 235 -183
4721a83M15j52m6J87k30P2J05j57q0J24ol13Q5K27j52k5J30K6j67K02KK7P4l05
$$ -183 232 80 34 221 -9 63 168 11 -69 55 49 -264 -179 48 -104 -129 1 27 -140 62 64 91 165 -140
4745a40j79J05K23M4j52l9K15m1l5J84o4q0J4J35k24m7K5Q8M3m6L7j29j31J07
$$ -140 -319 -214 9 53 -99 -138 77 36 1 185 121 41 55 190 -34 -81 -56 32 75 29 66 -63 -194 -87
4769h7j34m9K00RJ74K25l70K55J7l08q3J15j0j17J58j4o7Q2J6k46J37M2L9M0j09
$$ -87 -221 -270 -70 -61 113 338 -32 223 240 -68 -151 -36 -46 -163 -5 -19 -86 -4 12 -234 -97 -55 -16 24 -85
4794h5L61l99J09j75J17J45K3l2J08k39j69L03j41j59J68L65k46k2j29J8K20k43
$$ -85 276 -123 -14 -189 -72 73 96 64 172 -67 -236 67 -74 -233 -65 300 54 32 -97 -79 141 -102
4816a02M6J42j55K03m00R3Q5k09K49J70j42j68Q7j77L93r8Q2N8j51K76j64m8n0
$$ -102 -56 86 -69 134 -266 -173 -88 -297 -48 122 -20 -188 -101 -278 115 17 99 157 6 282 118 70 20
4839B0kl66L93L1Q2K3l66L40k10m6N2P8j87K28j40L1p1K41J62l26m3J03K55l91
$$ 20 18 -348 45 76 158 181 -185 155 -55 -101 -49 29 -158 70 -70 -39 -110 131 293 -33 -76 27 282 -109
4863a09K23k21K17p4k06M31l09J70l75L15k53L25j17j21K88j92j9l7k8O7j5L06
$$ -109 114 -107 110 36 -170 261 -48 122 -253 62 -191 134 17 -104 184 -8 -27 -64 -92 -25 -40 266
4885B66k28q6j8K35k34K69q8k09ok41L57k37L11k12j32K33J5k54K77J4j50J82
$$ 266 38 -48 -66 169 -65 204 116 -93 -99 -340 17 -220 91 -121 -253 -20 -5 -259 18 32 -118 64
4907F4j5Q5J76k56K1j26o1N5K25k99L6K11j88J56j39J27j42l1K33j58K32l37K8
$$ 64 49 134 310 54 75 -51 -112 -57 168 -131 -95 116 -72 84 -55 72 -70 -101 132 -26 206 -131 -103
4930a03L7K79m18N9QR2l75L14q6J69J08m9k11L11l77j74L71J10j45PO4J73j70
$$ -103 -66 213 -205 -146 -138 -46 -421 -107 -193 -24 84 35 -176 135 -242 -416 -45 65 -80 -73 -9 164 -6
4953fJ27j39n2L27j60j05K6j09K02Q6k45n0J99Oj10K57l86J95j09PJ74j1k27M3
$$ -6 121 -18 -70 257 97 -8 18 -91 111 197 -48 -98 101 107 -3 254 -132 63 -46 -39 135 124 -103 -60
4977f0%K84l68K4j74N2J44J14m1O1k36J78J12k26JK62q2k6k54k5L14L2j45L1P3
$$ -60 -60 224 -144 -120 -294 -242 -98 16 -25 36 -200 -22 90 -136 -135 127 45 19 -235 -260 54 86 -59 -28 45
5002D5O0k17Q9k59L00J18k86M26k84J03k14J88O9pN1k15k13J88J50N2l65Q4M2
$$ 45 105 -112 -23 -282 18 136 -150 276 -8 95 -119 69 138 131 182 -33 -246 -58 92 144 -221 -137 -95
5025i5J37o0k33M22k77K23k8l2k14J12m5o3L8M25l65J56K0N6k30p3J07J09J70
$$ -95 42 -18 -251 171 -106 117 89 57 -157 -45 -90 -153 -115 310 -55 101 121 177 -53 -126 -19 90 260
5048B60j57m5j30K24K9l85n8K32N5M9j54l7j5o9R2J48J00j73J48n6J31k29k5J67
$$ 260 103 58 -72 152 181 -204 -262 -30 25 74 -80 -117 -132 -201 -109 39 139 -34 114 58 189 -40 -65 102
5072A02o8J26k06j47K89r0R9Jn4J06j40P3j59pJ79j42M9L0m8J94l50J76j86J78
$$ 102 34 160 -46 -193 96 6 105 106 52 158 18 91 -68 -75 104 -38 11 41 -7 187 -163 13 -173 5
5096Ek46L87q9K3L8q8mp7k47L74j49J13j50J55K04m41M7K26m3P5j29n2l37K02
$$ 5 -241 146 57 80 118 30 26 -51 -298 76 -73 40 -110 45 249 -192 -145 81 38 113 -16 -68 -405 -203
5120b03K49r2r1K83Q1k70O2o9o7J44k76M93k16M9m9l19LQ1L83m07J12J97o4j12
$$ -203 46 -46 -137 146 227 -43 19 -50 -117 27 -249 244 28 77 28 -291 -288 -207 176 -231 -119 78 14 -98
5144i8K75j92J74m90J31N10k33K80k42p1k39K09r0J62j4k01N6k44M78n7o5n6j37
$$ -98 177 -15 159 -331 -200 310 77 357 115 44 -195 14 -76 86 72 -129 -73 -317 161 104 39 -17 -154
5167a54J87n6Q6J14K5m2ln64N27k03L63k52N4j95R1K1o2K87j07J20k33N8j69J18
$$ -154 33 -23 63 177 202 160 157 -407 120 -83 280 28 82 -113 -22 -1 -63 224 117 237 4 62 -107 11
5191A1l0p2J35n4j54J24j86K62l1J28j96O9j2j67K15k4o0K99m17K19r3M5J43o9
$$ 11 -19 -91 44 -10 -164 -40 -226 36 5 133 -63 6 -6 -173 42 18 -42 257 -160 59 -34 11 154 85
5215H5j7K34n4J6m85K28O3jk63J5R6j2j14R2L45l75L17j61J63PJ28k70n1O8l5
$$ 85 68 302 248 264 -221 7 70 69 -194 -179 -83 -95 -209 -117 228 -147 170 9 172 179 307 37 -14 54 19
5240A9L09l50K77p84N58O1j91j53J31qm3J66K20k91J52M7j12r6K48k4r0j11Q2
$$ 19 328 -22 255 -529 29 90 -101 -254 -123 -131 -174 -8 212 -79 73 120 8 -88 160 136 46 -65 17
5263A7K34l71jk43M76j47l76N00Jj17Q3k68K06J35k2j97K70k96K19lk37j10P9
$$ 17 251 -120 -121 -364 112 -35 -411 89 90 -27 56 -212 -6 129 107 -90 180 -116 103 100 -137 -247 -168
5286a68J81J41j69j80J26J23l8K36k64K33k98J06M2Q7j61j13p5K73j67K4J81l43
$$ -168 13 154 -15 -195 -69 54 16 252 -12 221 -77 29 71 158 -3 -116 -191 82 -85 -61 120 -223
5308b23O4L96j63k4k52K35J1M7K6j01k53J50L54l42n5K06j43L44j83j97K99l97
$$ -223 -159 237 74 50 -202 33 44 91 117 16 -237 -87 267 -75 -130 76 -67 277 94 -103 196 -201
5330b01R5N5n7K66k7j44j02J39J27k34J67j1k26J35lJ34J17j87l15L58lk09K24
$$ -201 -106 -51 -108 158 131 -13 -115 24 151 -83 84 73 -153 -18 -21 113 230 43 -272 86 83 -126 98
5353I8J49%k17o7r7P0J46j03j14L73l64Q0J12j60J40L8k0Jk78R7L46l54J66n6
$$ 98 247 247 30 -37 -134 -64 82 -21 -135 238 -126 -46 66 -94 46 84 64 65 -213 -116 230 -124 42 -14
5377a4j80K52q4K5L8J05J28m81K79K1J42j38j55K26j60j10p4K33m5K6o1K2l5j15
$$ -14 -194 58 -26 -1 37 142 270 -211 68 89 231 93 -62 164 4 -106 -180 53 8 34 -27 -5 -40 -155
5401a55P6M9p9n3J74k2J4K8j26J69j27J10P7j7k58Lj41L96j15K02j29k3Q3j70
$$ -155 -79 -30 -109 -162 12 -10 4 32 -94 75 -52 58 135 118 -140 -137 -278 118 3 205 76 53 136 -34
5425c4J44j60o7N1J06r4j88L79k28j03K29k13J97N2j37q2L59m23J15K21l2j79
$$ -34 110 -50 -117 -66 40 -54 -242 137 -91 -194 35 -178 19 71 -66 -148 211 -212 -97 124 92 -87
5447h7K17j67J32l19L41j69J40l16J95J01J5j98l3N63k50l34K30o4j5J12l87L02
$$ -87 130 -37 95 -224 117 -52 88 -228 -33 68 83 -115 -148 415 165 -169 61 -3 -18 94 -293 9
5469IR1k21k38M92j8k80J65P6j22j50O8L42o0j19J17k05L5R5j60J05P1P6n6L3
$$ 9 100 -121 -359 133 115 -165 0 76 -46 -196 -128 214 154 35 152 -53 -18 77 -83 22 93 169 113 146
5493A46k38J61j24r5J14o5J95j58j70K55j13k9K22K14n41N75j12l99K53k12R3
$$ 146 -92 69 -55 -150 -36 -101 94 -64 -234 21 -92 -121 101 315 -226 349 237 -162 91 -121 -28
5514b8K23k39k48R3K7M5O3J94j26pJ24k09Pq4M52j43o0k03J88l03K29L1j43r1
$$ -28 195 -44 -292 -199 -172 -127 -64 130 4 -3 121 -88 -81 -165 287 144 84 -119 69 -234 -5 26 -117 -208
5538b08m0M94j35N1n64M66kr1k2K58k06K14j42k51K61j30J81M3l56J05l41M89
$$ -208 -248 246 111 162 -402 64 62 -29 -51 207 1 215 73 -178 83 -47 134 177 -179 -74 -415 74
5560G4r4k29K07k43M35j67j52L13j94Q8j27K0J8K10j03nO1J07j50N6j21j57R9
$$ 74 -20 -249 -42 -285 150 -17 -169 144 -50 38 -89 -69 -51 159 56 51 112 219 69 125 4 -153 -54
5583e4L38m05L15j81j39L35l59L45k66L98l82Q3O2j07l10J53J08M1k2q6P5J25
$$ -54 284 -121 194 13 -126 209 -150 195 -71 327 -55 28 90 -17 -327 -174 -66 -25 -47 -133 -58 67
5605F7j4j90K33J14k35R8j32j29J09M0MO4J21N7l34K17N4j91N9J21k37P8j39n0
$$ 67 53 -137 96 210 -25 73 -59 -188 -79 -39 -35 29 150 207 -127 90 144 -47 12 133 -104 -26 -165 -215
5629b15N4P9K65k93L24l66M68n57M61l76P9L18k93n6L7K51j57l0M9o8j60K95L1
$$ -215 -161 -82 183 -110 214 -152 316 -241 220 -156 -77 241 -52 -108 -71 180 23 -7 42 -26 -186 109 140
5652A40J30j03o03M35O4j82P6r2K84l88L56k16o8j3J16R8o8l0j7M24m38n1j70
$$ 140 270 167 -436 -1 63 -119 -43 -135 149 -239 117 -99 -167 -180 -64 34 -34 -64 -81 343 -95 -146 -316
5675c16M51n4l0l8j55N2L23j95J93l3k99K86p2k32L49k42j72L13q5k14k61M31
$$ -316 135 81 51 13 -142 -90 233 38 231 198 -101 185 113 -119 230 -12 -184 129 44 -170 -431 0
5697@P0j81QJ46R1j07L8j81K39O6j57J40k44O2Q6L5j50j04K67l38R5J16Q2o0j64
$$ 0 70 -111 -103 43 134 27 65 -116 123 189 32 172 -72 -10 76 111 -39 -143 124 -214 -119 -3 79 19 -145
5722a45jJ90O4k03L9M9J53m39N18lm32N5J44m1m3J6J3N2o3k3L85l53k44L9K53
$$ -145 -146 44 108 -95 -56 -7 146 -293 225 222 -210 -155 -11 -52 -95 -79 -66 -14 -77 -100 285 -68 -312 -273 -20
5747b0K53m5k03j82K98o9K21j50j90J37P2k20j8J19K29k08L6j32k29L69K4j03
$$ -20 233 188 -15 -197 101 32 253 103 -87 50 122 -98 -116 3 232 24 60 -72 -301 68 92 -11
5769a1l7j04J20J45j86J62k12J02r0K30j14m9J04k03K45j43J26n2OK48n38L23
$$ -11 -48 -152 -32 113 -73 89 -123 -21 -111 119 5 -44 60 -143 102 -41 85 33 39 287 -251 72
5791G2N7p8J91k42j39M07j07K5j47K30k84K9L1J83k60P0M7j25J77j62j46K78K0
$$ 72 129 51 242 0 -139 268 161 186 39 269 -15 14 45 228 -32 38 85 -40 137 -25 -171 107 127
5814A27l86M74k52l6J75l07L07N3k43J95K0J3k74j25M3K23J4l5J39k2j96L02j58
$$ 127 -259 215 -37 -73 102 -205 102 155 -88 107 127 140 -134 -259 -216 7 21 -14 125 103 -93 209 51
5837E1Oj39j3J06K62j54k43R7r3L91k20L9Q9k68J60j16J35l8J83m86R2K04j44
$$ 51 57 -82 -95 11 273 119 -124 -27 -120 271 51 90 179 -89 71 -45 90 52 235 -251 -159 45 -99
5860i9K4K49k01J93m16L82j18j58M12p5m25K95K8J43l04j91K28J55j90O9J46l01
$$ -99 -75 174 -27 166 -250 132 14 -144 268 193 -232 63 91 234 -70 -261 -33 122 -68 1 147 -154
5882a54n4o1J82K95l09R9J27j90Q0K6k20K76r6j32Q9R4j1J42l16q5L4k66L88J08
$$ -154 -208 -269 -87 208 -101 -2 125 -65 15 41 -179 97 1 -131 -42 52 41 183 -133 -218 -184 -450 -62 46
5906D6k46M19k44L32m69m2M33j82N5N7k32J33N9J05j42K5j6l28P4J64r6k26M23
$$ 46 -200 219 -25 307 -162 -204 229 47 102 159 -73 60 119 224 82 107 91 -237 -163 1 -95 -321 102
5929A02r8k8nK9M1j49J77l67R3L39K8k53N4l8lR2K06Q0k86J77l84K42q3j62K34
$$ 102 4 -24 -29 0 41 -108 69 -298 -205 134 162 -91 -37 -75 -78 14 220 300 14 191 -193 49 -34 -196 38
5954C8k24K5J0J6M68o01N07O2m21q9J05K88k92J45k85K20K58m11K5K88j64l3J83
$$ 38 -186 -161 -151 -135 333 -268 239 301 -120 -209 -104 184 -108 37 -248 -28 230 -181 -156 132 -32 -65 118
5977A18Q6l5q8j85Q9m5q6j24J86r1K85n8j1m3K81j93K8l50L59k24K86m72K91J27
$$ 118 204 169 81 -104 -15 -60 -146 -270 -84 -175 110 52 41 -2 279 86 114 -236 123 -101 185 -287 4 131
6001A31l55M20k02j9K27l88O3K10j78J53O0Q8j59O6n3nQ2R9j9j54q8j74K99j82
$$ 131 -224 196 -6 -25 202 -186 -123 87 -91 62 122 210 51 117 64 59 141 240 221 67 -21 -195 104 -78
6025g8J10J21j30K7K04j17k25L8J89j7r9k0j31L06l67K97l41L06m4lk06J08j7
$$ -78 32 153 23 50 254 137 -88 -50 139 122 23 3 -128 178 -189 108 -233 73 29 26 -180 -72 -89
6048h9j99K42J51l21J73J28L0Q6l00K03m8k38K06K4j48J10J71j04k88J20q9p7
$$ -89 -288 -46 105 -216 -43 85 115 201 -99 104 56 -182 24 48 -100 10 181 77 -211 -91 -180 -257
6070b57L35j16j84J12J50n1klJ25q6O4k3rL9o8ko3L17n76J93K0J91K88n75K60
$$ -257 78 -38 -222 -110 40 -11 -13 -16 109 23 87 64 55 94 26 24 -39 278 -298 -105 -85 106 394 -181 79
6095G9J1J23l16o1Q1Mn6K14j14N1j77j11q5q8L89J7L3k5K42j23M1K07k83j21j
$$ 79 90 213 -103 -164 -83 -79 -135 79 -35 16 -161 -272 -357 -445 -56 -39 -6 -31 211 88 129 336 53 -68 -69
6120f9J62j03Q6j72l4J14p0J09j0j67n2M53j80o8J27j47l29L73J24j37n7K27%
$$ -69 93 -10 76 -96 -130 -16 -86 23 13 -154 -206 247 67 -1 126 -21 -350 23 147 10 -47 180 180
6143A80Kl64J21Q3L24m76M87k74k4j72P3N4p4K02J64n85M30n5P8q2k01J60k25
$$ 180 182 -182 -61 22 346 -130 357 83 59 -113 -40 14 -60 142 306 -279 151 96 174 92 -109 51 -174
6166a74K11K5p8m2j51L97k61Q3j49Q0p6j91M01j21K25l45L33l01P4o3J81j5L8
$$ -174 37 62 -16 -58 -209 188 -73 10 -139 -59 -135 -326 75 -46 179 -166 167 -134 -60 -123 58 43 81
6189H1j39L4J91k30L9k07p6L04j60j73L68o3L9J20n7R6j37k03K35L40m25j66J48
$$ 81 -58 -24 167 -63 -24 -231 -307 -3 -163 -336 32 -31 8 128 71 167 30 -173 62 402 -23 -189 -41
6212d1J62j13q6J73j07j16J13p2K00q6L9o2M9k61K10k3j47J64J12j96Q7n4K20
$$ -41 121 8 -78 95 -12 -128 -15 -87 113 27 66 4 53 -208 2 -21 -168 -4 108 -88 -1 -55 165
6235A65k20K8j19j03K94j75k0k10M51J29M7l03n9k72N88n9m3Np3J75l03Q5M8J9
$$ 165 -55 -27 -146 -249 45 -130 -150 -360 91 220 267 -36 -95 -367 221 162 119 124 51 226 -77 8 56 75
6259G5J09l68K80j57N3K9l5r4M45m22K88j08M5r3l74K71J38LJ02j35N7m8m5J90
$$ 75 184 -184 96 -61 -8 21 -14 -108 337 -85 203 95 140 47 -327 -56 82 85 187 52 109 61 16 206
6283B06k49Pn9J11K17j75q7j88M86j1j65j3j12J13N2j44qJ28n8p7O3k54%L60P9
$$ 206 -43 -36 -95 16 233 58 -29 -217 269 258 93 80 -32 81 133 -11 -19 109 51 -26 37 -217 -217 143 222
6308B22l98K1K51R5l04j39L35j86L37l65K23k67J86J12pM0p7J39k63P4j34K21
$$ 222 -176 -155 96 191 -113 -252 83 -103 234 -131 92 -175 11 123 116 156 79 218 -45 29 -105 116
6330A16q1k7J29j13r9j44K23J72l90L92k25J18k14l1J79K50n14M7K54j49K2ol9
$$ 116 35 8 137 24 -75 -219 4 176 -214 178 -47 71 -143 -174 5 255 -259 -212 42 -107 -85 -91 -130
6353a30L10k51Q1J90k80J63l8m6J62j14k45J87p2n1J80L5j18l04K65K28n2j85
$$ -130 180 -71 10 200 -80 83 45 -1 161 47 -198 -11 -83 -134 46 81 -37 -341 -76 152 100 -85
6375h5j18j6N47m56M6j30J51J41k18M08k96J59k64L1L4K87k16J96k62k31M21J04
$$ -85 -203 -219 328 -128 -82 -212 -61 80 -138 270 -26 133 -131 -100 -66 221 5 201 -61 -292 129 233
6397B33l89J93J20k16J85K03l01k84L83k19pQ5n8r2J58k49M54n3o5J04q9L1m7
$$ 233 -156 37 157 -59 126 329 28 -256 127 -92 -99 -14 -72 -164 -6 -255 199 146 81 185 96 127 80
6420H0o4k50N35l77N6qM7J82j67j91K0m8n8K93j85J17K44j84j50M9J1Q3l40K29
$$ 80 16 -234 301 -76 -20 -28 19 201 34 -157 -137 -185 -243 50 -135 -18 226 42 -108 -59 -48 35 -305 -76
6444g6j0J54J03j64j53K28j14J35p1L7Q7lk27K8J0j54J73k66J82J15K29k26J25
$$ -76 -86 68 171 7 -146 82 -32 103 32 69 156 153 -74 -46 -36 -190 -17 -283 -101 14 243 17 142
6467A42r5j46L2j14k4K98l54K83P9O5j15k72K91m9n6p0K84l72L55K3j98L7L6K22
$$ 142 47 -99 -67 -181 -205 93 -261 22 101 166 51 -221 70 21 -35 -105 179 -193 162 185 -13 24 60 282
6491B82l42K5P3n2o7K47j36p0M4l62L51q2K81j23k7Q1l65L19J54k04M8j90K12
$$ 282 -60 -35 38 -14 -81 166 30 -40 4 -358 -7 -89 192 69 42 123 -242 77 231 27 75 -115 97
6514I7k12M04k37j00J0J53p4j44K1J02J02l03J38k22M73k15l4j29L7N7K61q5r
$$ 97 -115 289 52 -48 -38 115 41 -103 -82 20 122 -181 -43 -265 208 -7 -41 -170 -133 -76 185 100 91
6537I1M3k44k3J13j06K48k70J70M8L64m79J60l43K10q0K66l26K69j8r3M0j04L8
$$ 91 134 -110 -133 -20 -126 122 -148 22 70 434 -45 115 -228 -18 -98 168 -158 111 93 0 40 -64 -26
6560b6J54m0k18L00l23K29j05J85k30P6r3J41K8m0k78l5N67n15l3L01j9P7k1K68
$$ -26 128 88 -130 170 -153 76 -29 156 -74 2 -91 50 78 38 -240 -275 292 -223 -256 45 26 103 82 350
6584C50k27j27n58M27K52m53L34R7j84R6j98K41K24m75K18J02k12J53J7k24M38
$$ 350 123 -4 -562 -135 117 -336 -2 95 -89 7 -191 50 274 -201 17 119 -93 60 77 -147 291
6605B91k22j31P1j81R8j86K17j23L41k62p9L62m37n7M29K6n8R2j50P4M2k92K38
$$ 291 69 -62 9 -172 -74 -260 -43 -166 175 -87 -166 196 -241 -298 131 157 99 191 41 115 157 -135 103
6628A03j36j1K26J11k49l9k12J30K94m87O23l58O1jj4r0J3n1L45j38l80K00P0
$$ 103 -33 -44 182 293 44 5 -207 -77 217 -270 353 -5 56 55 41 -49 -36 -87 258 120 -260 -60 10
6651A0p7L32j3l72PJ84J13l01L7J53l53L01J12Jk28K12k21J38k48K94j14J8M2
$$ 10 -67 265 252 -120 -113 71 184 -117 -80 73 -280 21 133 134 -94 118 -103 35 -213 81 -33 -15 27
6674B7j85J90J17j65L28j91k57J14L59l60j06K56k05L0J62j86J15K0j32K08P8
$$ 27 -158 32 149 -16 312 121 -136 -22 337 -23 -129 127 -78 -48 114 -72 43 63 -69 139 217
6695B17L6l64Q4N5j26J13p5m9l0K20l58M79m03J49p4J19J57j43k1j43j13K58k71
$$ 217 253 -111 -27 28 -98 15 -60 -109 -139 81 -277 202 -201 -52 -126 -7 150 7 -14 -157 -270 -12 -283
6718b83M48j08K0j93Q7j91L64n5r8K43k04k04J34K30k62K3L12k12j6j32K95J3
$$ -283 165 57 77 -116 -29 -220 144 89 -9 234 30 -174 -40 190 -72 -49 263 51 35 -97 198 211
6740B11k50Q5j60N1M2j29K22j93J13J38m15K26L81n5k27l0j6J61j78Mmo0j2K78
$$ 211 -39 46 -114 -63 -21 -150 72 -121 -8 130 -285 -59 322 267 40 10 -6 155 -23 -19 -23 -83 -95 183
6764A83k89J14L25p02J99j4J93l8l5j19R6k05L61r8K19j74K14l75K45j9k58O9
$$ 183 -106 8 333 -369 -170 -184 9 -29 -64 -183 -87 -292 69 -29 190 16 230 -145 100 81 -177 -108
6786a08L52l89P7J67O1J39j34l95J75n5K87m34J19R4q7R1q9J66j33N4r6K39k28
$$ -108 244 -145 -68 99 160 299 165 -230 -55 -110 177 -257 -138 -44 -131 -40 -129 37 -96 -42 -138 101 -127
6809a27O2j69J93k1P8L6R5j50J60k03J4j12J52K59l02p8m1M21k62j30M19l29p6
$$ -127 -65 -234 -41 -62 16 52 147 -3 157 -46 -32 -144 8 267 -35 -113 -154 267 5 -125 294 -35 -111
6832a11J19n5l41K18J13P8K24j79n4n7K4J9j27K12l14J29P1j07K85j54J12k77
$$ -111 8 -47 -388 -170 -57 21 245 66 12 -45 -21 -2 -129 83 -231 -102 -31 -138 147 -7 105 -172
6854a72L10m30K12K55M7k97J17n3K14k60P0l4k1l5K39l58M2L13L2k43L05k59L1
$$ -172 138 -292 -80 175 222 -75 42 -11 203 -57 13 -21 -42 -77 162 -196 -154 159 191 -52 253 -6 25
6877B5j30m9k02J54M36j95Q4j38j69J42O6J88j58J4o3P9K01l01j03J90j72J36
$$ 25 -105 -154 -356 -202 234 39 123 -15 -184 -42 24 212 54 68 5 84 285 -16 -119 71 -101 35
6899C5p7J59q7k86L93j7k31qK74l99L34l00K14j67J27j03j67L15O1j21J91k06
$$ 35 -42 117 30 -256 137 120 -111 -119 155 -244 90 -210 4 -163 -36 -139 -306 9 70 -51 140 -66
6921f6P8j06Q9P0j20O9J82o07K90J56pMp5O9j63K61l63L04q8K6N5J11J20j49k9
$$ -66 12 -94 -5 65 -55 14 196 -411 -121 35 28 32 -43 26 -137 124 -239 65 -23 3 58 169 289 140 111
6946A11r5J08O4j80r5J99O1k71M33p4j61k42M3j0K61j81o0j51L56k21Q8j11K01
$$ 111 16 124 188 8 -87 112 173 -98 335 261 100 -142 -99 -109 152 -29 -89 -240 116 -105 -17 -128 73
6969G3R3Om9m3o3j14r7j6J50L6J96r5J76r9j37q6J83Q9j38K04j73j53Mj35L62
$$ 73 166 172 123 80 17 -97 -194 -210 -60 -24 172 77 253 154 17 -69 114 203 65 269 96 -57 -53 -188 174
6994A74j85l47M38J17k56K09J5k34k19M26J57q2j61m1L90q5j75k09m9J51K30n10
$$ 174 -11 -358 80 197 -59 150 165 -69 -288 138 295 213 52 11 401 316 141 -68 -117 34 264 -246
7016b46K13J57N9k62K08q0o1N5M9J2J3J50m12J68j73j32J46L42j57j79k2J06N
$$ -246 -33 124 183 -79 129 49 -12 43 92 104 117 267 -145 23 -150 -282 -136 206 49 -130 -152 -46 -41
7039d1L7L8%j97Q8K1J76j56K6L5k06K16p3k69M15o2k07R2Q6J08q7j17P6K06l98
$$ -41 -4 34 34 -163 -75 -54 122 -34 -8 27 -179 37 -36 -305 110 48 -159 -67 19 127 40 -77 -1 205 -193
7064a93K58j48m4L6J96j07Q7j85K42l04O4J33J20k17j46K84J19j48k39j84N56
$$ -193 65 -83 -127 -91 105 -2 85 -100 142 -162 -98 35 155 -62 -208 76 195 47 -192 -376 180
7085A80j91M2J47k93J37o3%L8R5j76L35j85j16LJ04j29K24j57o1k7M4L6P9n1L6
$$ 180 -11 31 178 -115 22 -41 -41 -3 92 -84 251 66 -50 -47 57 -72 152 -5 -66 -93 -49 -13 66 15 51
7110E1k99M42n92L13l7K83k60N1n3P8J40j9k27m5L24R7l85K79k15jJ15j82q2n4
$$ 51 -248 194 -398 -85 -122 161 -99 -48 -101 -23 117 98 -129 -174 150 247 -138 141 -74 -75 40 -142 -224 -278
7134b78K41J42j51R7k80L93j24k6j06J95J29L1j67k17O9K70M1m74K80j43J00k42
$$ -278 -37 105 -46 51 -229 164 40 14 -92 103 232 263 96 -121 -52 218 259 -215 65 -78 22 -220
7156b20J27N35j7o40K35j49N9j00J8K04j09J15l09L27n8j9P4m64M66o1q9L7r3
$$ -220 -93 442 425 -215 20 -129 -70 -170 -152 52 -57 58 -251 76 18 -1 73 -391 75 14 -75 -38 -131
7179a31J68k09j65M36r3J07m20K91j80l1J42j78L76L0j47m8m1j71J36LJ33K64
$$ -131 37 -172 -337 99 6 113 -307 -16 -196 -227 -85 -263 113 143 -4 -52 -93 -264 -128 -125 8 272
7201B72l08j08K83J40Jp2k76J46l38K50Q1p9R1j59J30K7n1J62j10l80L16j72K8
$$ 272 -36 -144 139 279 280 208 -68 78 -260 -10 71 -8 83 -76 54 81 30 192 82 -298 18 -154 -126
7224a26L78k22pJ05r7k6J07k05K53k31O9k55N37k04Q6j50j02K29m11L36r7J46
$$ -126 252 30 23 128 31 5 112 -93 160 -71 -2 -257 280 76 162 12 -90 139 -272 64 -33 113
7246A13j29Q0j84K45k17l3J32K35l30j45Q2J94J79m51L28k20j20L46J73j43m03
$$ 113 -16 64 -120 125 -92 -125 7 242 -88 -233 -151 43 222 -229 99 -121 -241 105 278 135 -268
7267b68M70J09k47jN8j40j7K73k59j05K71j14k98M99k78m9j7K43k9m7j87K33J50
$$ -268 202 311 64 63 121 -19 -36 237 -22 -127 144 30 -268 231 -47 -96 -113 130 101 54 -133 100 250
7290B50l25M30l23K3j41K4K02k13r1K9J61j3p0pl6O6j60J32Q1J07M3k27j49J65
$$ 250 -75 355 32 55 -86 -62 140 -73 -164 -135 26 13 -57 -64 -100 -34 -194 -62 19 126 169 -58 -207 -42
7314d2rk58K44J7J44J71k30M2m66M21n5K28J05J9k45l12J99m9Q2o7J55j53j48
$$ -42 -51 -309 -65 -48 96 267 37 79 -387 34 -21 207 312 331 86 -226 -27 -76 6 -61 94 -59 -207
7337b07n9L24l58o8N12k15k77L18j53M0K90j31O4k23l6N08n01K32L24l40j90J01
$$ -207 -266 58 -300 -368 144 -71 -348 -30 -183 -143 147 16 80 -143 -179 329 -172 60 384 44 -146 -45
7359d5n1J58P2k10J16o4P4L4n3R4k39L7RK38r7k73J37K56j71k7n9N6J45l98Q4
$$ -45 -96 62 134 -76 40 -24 50 84 31 125 -114 -77 -68 170 73 -200 -63 193 22 -5 -64 -8 137 -261 -177
7384a77L0J86k77J17K00l24L19j3j01N9r3q0j3N05k40l81J19J23o1J23j15K5j25
$$ -177 -147 39 -238 -121 79 -245 74 61 -40 19 -74 -154 -167 338 98 -283 -164 -41 -102 21 -94 -69 -194
7407a94K96M5l41J03J84J0j24n4K40l88J54M1J38q5J03k56K12n5K10l45q3L05
$$ -194 102 147 -194 -91 93 103 -21 -75 165 -223 -69 -28 110 25 128 -128 84 29 239 -106 -189 116
7429A16k28R9J42K0p4n1j03J43l1j94K02j54L08m74M70j98J73j37M0k66L00k35
$$ 116 -112 -13 129 149 75 24 -79 64 33 -161 41 -113 195 -279 191 -7 166 29 69 -197 103 -132
7451a32K42j74n0o2R4L2N1m3J36n0j4M6J3kk95J27o2L25j23J72l32L3k2J01K93
$$ -132 110 -64 -114 -176 -82 -50 1 -42 94 44 30 76 89 87 -208 -81 -143 182 59 231 -101 -68 -90 11 304
7476C04J83k77n46K41o2N2j06L81j45l0L2L8j29j36L07j81J53j46j79M50k26Q2
$$ 304 487 210 -336 -95 -157 -105 -211 170 25 -5 27 65 -64 -200 107 -74 79 -67 -246 204 -22 60
7498F0q9j52K15j77K71O5l6l03O9K18j97J06j59K5N0Q3N1jj99J43L8m6R1l5j81
$$ 60 -29 -181 34 -143 128 193 157 -146 -77 141 -56 50 -109 -84 -34 49 100 99 -100 43 81 35 126 91 -90
7523i0K06J4l24N26oj26n9k53L50k97K26k25K51j07l00K31m6j4O4Q5K45j43rj25
$$ -90 116 130 -194 332 326 200 141 -112 238 -59 167 -58 193 86 -214 17 -29 -43 21 106 351 208 199 74
7547G4k6o8OK34k01Lj28r1K98o1kk72L17o0k12L29O3j67j00J29K6n2k33M54j72
$$ 74 48 -20 -14 220 19 22 -106 -197 101 40 38 -234 83 23 -189 140 203 36 -64 65 91 39 -194 260 88
7572H8N6J6n78M50K13k06o0l3j03K97m6l54J15p5O44m06J00k11N5L2Kq3P9K86
$$ 88 144 160 -418 32 245 39 -21 -54 -157 140 94 -260 -145 -220 424 18 118 -93 -38 -6 -4 -87 -8 278
7596B78j15j82L34l18k41M38n25L96r6K01r5J11j50O6M7M1m75J90J18j22L00k83
$$ 278 163 -19 315 -3 -244 194 -331 65 -31 170 75 186 36 102 149 190 -285 -95 23 -99 201 -82
7618h2J79J7k63l2m6J65P6j20j50L74k59Q6J75j55j11Q7k33K10K44j13k53L69
$$ -82 97 114 -149 -181 -227 -62 14 -106 -256 118 -141 -55 120 -35 -146 -59 -292 -82 162 49 -204 165
7640A65L1k92P4m4j38K34PJ7J4k28L48k06K7j79L07r0j95M29j35j1l0l86J30M4
$$ 165 196 -96 -22 -66 -204 30 37 54 68 -160 188 -18 9 -170 137 47 -148 281 146 135 105 -281 -151 -107
7664a07L0l7J86j61k03N22m91P6K42j79J36m09N21k46J07O1q1mn2K8K75j86j3
$$ -107 -77 -114 72 -89 -292 230 -261 -185 57 -122 14 -395 126 -120 -13 48 -33 -37 -89 -61 214 28 15
7687A5j54k3J39J08j10m2r4J86K9M0j61J77R8m03J47j3K1J56q4j03J08m56L98
$$ 15 -139 -162 -23 85 -25 -67 -161 25 54 94 -67 110 208 -195 -48 -61 -40 116 32 -71 37 -419 -21
7710b1q3K16n0m46N35k59N4L8l90L72K61k65l3J46j22M4j56K28j69J23k5k86J87
$$ -21 -104 112 62 -384 151 -108 -54 -16 -406 -34 227 -38 -71 75 -47 -3 -159 69 -100 23 -2 -288 -101
7733a01M2j23Q5K54j33lk73J88k57M16Jk90J58l46K4L61qo1j47M00Ol94L74n1
$$ -101 -59 -182 -97 157 24 21 -252 -64 -321 95 96 -194 -36 -382 -358 3 -5 -66 -213 187 193 -201 173 122
7757A22k34n0M5j08K31J08J3Q2k89J89m5R4j02Q9r9J5Nj69J16k28K11K29k85n0
$$ 122 -112 -162 -117 -225 6 114 127 209 -80 109 64 158 56 145 46 61 66 -103 13 -215 -4 225 -60 -110
7781a10O2O3K8J08j56J55m93K32R4J61r7J06l60P9J0l25M14K16k83J75L73l48
$$ -110 -48 15 43 151 -5 150 -343 -111 -17 144 47 153 -207 -128 -118 -443 -29 187 -96 79 452 104
7803A04k26j93M33l09n8J78P8m3j77r5J79K30J76j85J4j02r6j0K68q8j96l1n0
$$ 104 -122 -315 118 -191 -249 -71 7 -36 -213 -308 -129 101 277 92 106 4 -92 -102 166 78 -118 -149 -199
7826a99J08L05k13mk53J66J63J41k90L54j47l71R8R6R6n1m7j92K51j28K65K0k08
$$ -199 -91 214 1 -3 -256 -90 73 214 -76 278 131 -240 -142 -46 50 -1 -48 -240 11 -117 148 168 -40
7849d0J75j51j73J24J88r3j35K48%Ml6j4j10J79k36L7p2o0R4J98jk75L12m68Q4
$$ -40 135 -16 -189 -65 123 30 -105 143 143 147 111 97 -13 166 -70 -33 -105 -165 -71 127 126 -149 163 -305 -221
7874b21K95l5L4j36M1J71k61o8J89J9o8k80K28j3Q9k5p9Q1J2J8j04l6Q3k6l7K58
$$ -221 74 39 73 -63 -22 149 -112 -180 9 28 -40 -320 -92 -105 -16 -41 -120 -39 -27 -9 -113 -149 -66 -92 -129 129
7900A29O1k55N8m9K98k11j23L37l11J44Q4p1j05J80k13J12j46k36K46l0K1o2J22
$$ 129 190 -65 -7 -56 242 31 -92 245 -66 78 162 91 -14 166 -47 65 -81 -317 -71 -101 -80 -142 -20
7923b0j32J94k10J68K48k51M0L8j00j43J23J21j84L96n53M90j90N9l91J76J78
$$ -20 -152 42 -168 0 248 -3 37 75 -25 -168 -45 76 -108 288 -265 225 35 94 -297 -121 57
7944E7r9j00J14q8oR1r9J32Q7j14j9R9o8K47j86j31J23j34P7J20j60J62j09J5
$$ 57 -42 -142 -28 -116 -122 -31 -130 2 89 -25 -44 55 -13 234 48 -83 40 -94 -17 103 -57 105 -4 11
7968A1k27K10j2K4J40R8k03J1r0j2J54j76K37j97K02l01jQ2J11k1l09M71k40r1
$$ 11 -216 -6 -18 6 146 244 41 52 -38 -50 104 -72 165 -32 170 -131 -132 -50 61 40 -269 202 -38 -129
7992a29K53J1n7j86K31l57J64J56o0Q6m8n3k5J8K40l75P6Q3J41k95J29m0K01j52
$$ -129 124 135 78 -108 123 -234 -70 86 26 112 64 11 -14 4 244 -131 -55 28 169 -126 3 -37 164 12
8016A2l31L61j10K62m74L48J13j40j15J26Q5j88p1q3K63l01K07k10R9o4J46K38
$$ 12 -319 42 -68 194 -280 68 181 41 -74 52 137 -51 -122 -205 58 -243 -36 -246 -147 -211 -65 173
8038A73l44J54l45L0L00M2Q8j58R1L08m53j22N6K21q8j36J92j1l8Lk12M93k28
$$ 173 -171 -17 -362 -332 -32 10 98 -60 31 339 -114 -236 -180 41 -47 -183 9 -2 -40 -37 -249 244 16
8061A6k6k69J69K36J88k09k23M5J75n3O4l5m0m8K42l95k7J59K50k86K80j92j93
$$ 16 -10 -279 -110 126 314 105 -118 -73 102 49 113 78 38 -10 232 -163 -190 -31 219 -67 213 21 -172
8084a72K86k10j91N0L67m59M65q3np6MKj33K56r9J78k81R6k1J46n2m1m8j5K49
$$ -172 114 -96 -287 -237 130 -329 136 53 48 -28 -24 -22 -155 101 2 180 -101 -5 -26 120 68 27 -21 -36 213
8109B13k98J69k74M02k6m5r5P3J70l07j51K61J31j50r1Nj58K16j08NO0r8K02j81
$$ 213 -85 84 -190 212 186 141 46 119 289 -18 -169 92 223 73 -18 -13 -171 45 -63 -58 2 -96 106 -75
8133g5j05J28R6LL99k18p3j18o9L3J23k31k0P1K76o2r6J08l58J20j8J05q9j6J03
$$ -75 -180 -52 44 47 446 228 155 37 -32 1 124 -107 -127 -56 220 158 62 170 -188 -68 -86 19 -70 -86 17
8158A7j9j6K18j60L0j15o7R3j75K16j21q3J04J45J07o1j47j06L15n8k96J55J22
$$ 17 -2 -18 200 40 70 -45 -112 -19 -194 22 -99 -182 -78 67 174 113 -34 -140 175 117 -179 -24 98
8181I8k28NQ9k6J36J72k69O1J72k37
$$ 98 -130 -125 -36 -62 74 246 -23 38 210 -27
8191b7
$$ Imaginary data points
##PAGE= N=2
##DATA TABLE= (X++(I..I)), XYDATA
0@%%%%%%%qJ6j6J6k4L2m0M9n7P6j00J20j44J76k08K48k96L45m01M68n44O28p21
$$ 0 0 0 0 0 0 0 0 -8 8 -8 8 -16 16 -24 25 -32 44 -56 64 -80 96 -112 136 -160 185 -216 252 -292 336 -385
30c85Q26r45J074j218J378j553J748j959K190k447K728l033L366l732M132m566
$$ -385 441 -504 570 -648 730 -823 925 -1034 1156 -1291 1437 -1596 1770 -1962 2170 -2396
46b396N040n560O131o757P442q197R034r964J1001j2167J3491j5001J6745j8790
$$ -2396 2644 -2916 3215 -3542 3900 -4297 4737 -5227 5774 -6393 7098 -7903 8842 -9948
60i948K1223k4177K7852l2569L8878m7796O1457q5218J38043m63362K42910R21541
$$ -9948 11275 -12902 14950 -17619 21259 -26537 34920 -50298 87745 -375617 -132707 788834
72G88834o32099o20954J87875N07003n3487j42014n2345j14443q6294L62743K15152
$$ 788834 156735 -464219 -276344 230659 177172 35158 -17187 -131630 -217924 144819 359971
83C59971l47461l91629K10459M55721L4096m74143k12169L31284L18238j31258
$$ 359971 12510 -379119 -168660 287061 321157 -152986 -365155 -33871 284367 153109
93A53109k81801n1889J78809R5376p377m8438j60975n6512K72078J41443k58488
$$ 153109 -128692 -180581 -1772 93604 86227 37789 -123186 -179698 92380 233823 -24665
104b4665j79649J92830J58030j40861q8281J38745l9706j67290J67342K06316
$$ -24665 -204314 -11484 146546 5685 -82596 56149 16443 -150847 16495 222811
114B22811k34875k54087K10443L00645j45003l08895J06306K62957r6205j60203
$$ 222811 -12064 -266151 -55708 244937 99934 -208961 -102655 160302 64097 -96106
124i6106J17132P0886j65035n6318K30598J00352k93147j60673L00588J97198
$$ -96106 21026 91912 -73123 -129441 101157 201509 -91638 -252311 48277 245475
134B45475k43545k19414J51558K25469p7591j86223N6208R9874p1731o328J02664
$$ 245475 1930 -217484 -65926 159543 81952 -104271 -48063 51811 -19920 -26248 76416
145G6416m1724j47008L3288K07278P093k44436l5477K19720L7212j47284k2942
$$ 76416 34692 -112316 -79028 128250 135343 -109093 -144570 75150 112362 -34922 -57864
156e7864P3395r712l9221O6699L1661j38361k7291J81766J5652j68569l068J32101
$$ -57864 15531 5819 -33402 33297 64958 -73403 -100694 81072 96724 -71845 -74913 57188
168E7188O967j00323J300Q5875l9660q7167P2280Q5789o6997q6517K5775R5562
$$ 57188 64155 -36168 -34868 51007 11347 -75820 -3540 82249 15252 -71265 -45490 50072
180E0072J0226j03418j4872Q7580n114n1219L6925M0901p0081p4922J06885J25362
$$ 50072 60298 -43120 -57992 29588 24474 -26745 10180 51081 -19000 -93922 12963 138325
192A38325j38134j53855J39012J50723r6718j25362M1434Q4501j6286k5422K6118
$$ 138325 191 -153664 -14652 136071 39353 -86009 -44575 39926 23640 -1782 24336
203B4336n3215n4601J13535Q2318j18285j08877P1241J32237q886j30364k8524
$$ 24336 -28879 -83480 30055 112373 -5912 -114789 -43548 88689 79803 -50561 -79085
214g9085R1466M6005k5263m9323k9853K8977M2542J7296k6201p7152J332J15256
$$ -79085 12381 58386 33123 -16200 -46053 -17076 25466 42762 16561 -60591 -59259 55997
226E5997K4543j12012n7247Q2841Q9210n5646r1558M0947N6586k7902p114J5594
$$ 55997 80540 -31472 -88719 -5878 83332 27686 -63872 -22925 33661 5759 -1355 14239
238A4239k5547j7429L6037M2429m0716p0537M9029P5189n2332o0119L6247M2399
$$ 14239 -11308 -28737 7300 49729 9013 -61524 -12495 62694 10362 -49757 -13510 28889
250B8889j7575l6543J8272L0916l4787j2417M6623n867l7743J2183K5297q46k5488
$$ 28889 11314 -25229 -6957 23959 -10828 -23245 23378 17511 -20232 -8049 17248 16402 -9086
263i086o976L1863l452l1037J3754J8978j0623j4939l095K8547P301m6031K057
$$ -9086 -16062 15801 12349 -18688 -4934 14044 3421 -11518 -14613 13934 21235 -24796 -22739
276b2739M9783j0345l7950P862L2082j768l5986J1634L4616l3877j7601M8279
$$ -22739 27044 16699 -21251 -13389 18693 16925 -19061 -7427 27189 -6688 -24289 23990
288B3990l371m5816Q912L7894l149m0396j990M2246m327l0479J2314O260n303
$$ 23990 20619 -25197 -16285 21609 18460 -21936 -23926 18320 13993 -16486 -4172 2088 -3215
301c215J2428m708r724M615j0J0160L902k0717n343J4831J4213p481l5301Q818
$$ -3215 9213 4505 -5219 -604 -614 9546 13448 -7269 -12612 2219 16432 8951 -26350 -17532
315a7532M5912j9359l5083K2799J5547j4626l122J1203Q02k0012P126L3911k1017
$$ -17532 28380 9021 -26062 -3263 12284 -2342 -5464 5739 6541 -13471 -6345 27566 6549
328F549l4061K8145K0658j8347j1422N94J2303N638j4631j492M544j799P346l943
$$ 6549 -27512 633 21291 2944 -8478 -7884 4419 10057 -4574 -6066 -1522 -3321 4025 82
342H2p854R560m012R88J5108j5752j1502K1902N172j5054q037Q175J5065j2383
$$ 82 -7772 1788 -2224 -1236 13872 -1880 -13382 8520 13692 -1362 -9399 -1224 13841 1458
356A458j2968J5510l586j0848J6595o60j6708M878R611O953r034j5668J4103J2970
$$ 1458 -11510 4000 414 -10434 6161 5501 -11207 -6329 3282 10235 1201 -14467 -364 12606
370A2606j0157k827k820j4J2167n356o073M707r585K447J6658q128j2873q38P990
$$ 12606 2449 -378 -3198 -3212 8955 3599 -2474 2233 -7352 -4905 11753 3625 -9248 -10086 -2096
385b096J5889r183k0330Q509J1439L162J582j5315l543J5089L269L49p346j7799
$$ -2096 13793 4610 -15720 -7211 4228 7390 8972 -6343 -9886 5203 8472 8821 1475 -16324
399a6324J1438J9414n412j3068j2106O883K1566k310j3365q374n006K5132K0199
$$ -16324 -4886 14528 9116 -3952 -16058 -9175 12391 10081 -3284 -11658 -16664 8468 28667
412B8667l0885k3209J9312K2822J662k1411j2975J1593Q858R477K6l1090o716
$$ 28667 -2218 -25427 -6115 16707 18369 -3042 -16017 -4424 4434 13911 13937 -17153 -23869
425b3869L2498J0772j2656k0067j3331K5492K9692j2946l5952j1203L8753L1568
$$ -23869 8629 19401 6745 -13322 -26653 -1161 28531 15585 -20367 -31570 7183 38751
437C8751l4884l0275J9136J3149O426M613k1138j8758J2484K8645O654l5242k1023
$$ 38751 3867 -26408 -7272 5877 12303 16916 -4222 -22980 -10496 18149 24803 -10439 -31462
450c1462K5547K3318K960j8791l5625J2796N2313j784m3157j4442K6523K6095
$$ -31462 -5915 17403 20363 1572 -34053 -21257 31056 29272 -13885 -28327 -1804 24291
462B4291j2415j8475K85o096Q684K7452j0923l0840k495J8194K4534k231l7707
$$ 24291 11876 -6599 -6314 -12410 -3726 23726 12803 -18037 -20532 -2338 22196 19965 -17742
475a7742j4962L0113L3869q708m8591m877M7908Q360k7180o383J713M93J0432
$$ -17742 -32704 -2591 31278 22570 -26021 -30898 17010 25370 -1810 -8193 -6480 -5987 4445
488D445J2705k013l3556j5742M3314K8632l3139l8785N594M7046K2529m4082l4141
$$ 4445 17150 15137 -18419 -34161 9153 37785 4646 -34139 -28545 18501 41030 -3052 -37193
501c7193K4365L0624M021j9735j9078P898J2949P798P024k2058k7073J7372L6562
$$ -37193 -12828 17796 21817 2082 -16996 -9098 3851 11649 18673 -3385 -30458 -13086 23476
514B3476Q277l8774l8944L3414N3685j5476m8546j3654L2996L6165j3580l5826
$$ 23476 31753 -7021 -45965 -12551 41134 25658 -22888 -36542 -3546 32619 19039 -16787
526a6787l281J7940J7584J958j9841j1229J360Q929K8492N25m9669j6740M8963
$$ -16787 -20068 -2128 15456 17414 -2427 -13656 -12296 -3367 25125 25650 -24019 -40759 8204
539H204L7268l5261n8253J9047O2115j658m0741j1651J0464J7656Q816j0362r791
$$ 8204 45472 10211 -48042 -28995 33120 31462 -9279 -20930 -10466 7190 16006 5644 -4147
552d147r229K988K7034R987k7486l1921P990N2452J4278o1035k7483M9090L3070
$$ -4147 -13376 -10388 16646 26633 -853 -32774 -24784 27668 41946 -19089 -46572 2518 35588
565C5588k2474l2718k717K2052J2699K311p857k5970P7L3879Q854j8636k0700
$$ 35588 13114 -19604 -22321 -269 12430 14741 6884 -19086 -19009 14870 23724 5088 -15612
578a5612r027K5038L1951j4107m3247j1004M5120L4408m0966m2463K3896L4977
$$ -15612 -24639 399 32350 18243 -25004 -36008 9112 43520 2554 -39909 -16013 18964
590A8964J823j7395j8618K348J6140R708M8j8687j5564J6355K4139J989k4038
$$ 18964 20787 3392 -15226 -12878 3262 12970 13018 -5669 -21233 -4878 19261 21250 -2788
603b788k9937J8126M5023q707m2735n603L3025J8911k2436k1016J4168P511m878
$$ -2788 -32725 -14599 30424 21717 -21018 -26621 6404 25315 2879 -18137 -3969 3542 -1336
616a336R973o07j6360k595J4929J2921j1668k1584O697J7775J211n695j1265m913
$$ -1336 8637 8030 -8330 -10925 4004 16925 5257 -16327 -9630 8145 9356 3661 -7604 -12517
630a2517J6287O553j0839o118J056N721M407k038K820n853j1414J3834J2633j3558
$$ -12517 3770 10323 -516 -6634 -5578 143 4550 2512 5332 -521 -11935 1899 14532 974
644I74j0626L336J0647Q417j0216j3150J056J0363J1549r026j9173J0970J5462
$$ 974 -9652 -6316 4331 12748 2532 -10618 -9562 801 12350 3324 -15849 -4879 10583
657A0583p586l503J219p702J535J2712O640j4819j6783J8056J9129j7178j4877
$$ 10583 2997 -506 713 -6989 -5454 7258 13898 -921 -17704 352 19481 2303 -12574
670a2574P135O284N407j499j0327j704N460P882N62j3548l83R592K96K885l82
$$ -12574 -5439 845 6252 4753 -5574 -7278 -1818 6064 6626 -6922 -7305 2287 2583 5468 5086
685E086j3675L056J4745k137r903m160O111P317n282k399J036o798N625R648r608
$$ 5086 -8589 -5533 9212 7075 -2828 -6988 -877 6440 1158 -1241 -205 -7003 -1378 8270 -1338
700a338n387O074K355J645j767l963J168p82M695N245j0358l193Q503N20k028
$$ -1338 -6725 -651 1704 3349 1582 -2381 -1213 -1995 2700 7945 -2413 -5606 2897 3417 1389
715A389k073n066M776L873k986M69l476o64O263q82j975j62l797O107N829q421
$$ 1389 -684 -5750 -974 2899 -87 382 -3094 -3758 2505 1623 -352 -514 -4311 1796 7625 -796
731g96k514L758R36K980l828n638M695J974o62K50n662K163N083l703R47j04m615
$$ -796 -3310 448 1384 4364 536 -5102 -407 1567 905 1155 -4507 -2344 2739 -964 -17 -121 -4736
748d736P000L221p619k5K857J959R79n408j16L921j919K314j822p609O456N889
$$ -4736 2264 5485 -2134 -2159 698 2657 3636 -1772 -1888 2033 114 2428 606 -7003 -547 5342
764E342p148j751K147J901K342l852o06K275k241M776J543q953K455O442l626
$$ 5342 -1806 -3557 -1410 491 2833 -1019 -1625 650 -1591 3185 4728 -4225 -1770 4672 1046
779A046j051n17k004L355P36j207j950l639O622L498r329L13P051k620N03P53
$$ 1046 -5 -522 -2526 829 1565 358 -1592 -5231 1391 4889 -4440 -4127 2924 304 807 1560
795A560l362K223J498j67m21m305L073M613o562O1L443m049J850J781l883J406
$$ 1560 -1802 421 1919 1752 1331 -2974 99 4712 -1850 -1789 1654 -2395 -545 1236 -2647 -1241
811a241J073J55J461l563P91M430l273K45K032m301L070L643n775k89J777j78
$$ -1241 -168 -13 1448 -2115 -1324 3106 -167 78 2110 -2191 879 4522 -1253 -1542 235 57
827E7J062l296n5L635l116N66L118m138M96L112k168K344o37l703M206J103k649
$$ 57 1119 -2177 -2232 1403 -1713 -1147 1971 -2167 -1671 1441 -727 1617 980 -2723 1483 2586 -63
844f3O25k064J491K895l947Q88P47m051M160K817o026k01K474R17J909l715j077
$$ -63 562 -1502 -11 2884 -1063 -175 572 -3479 681 3498 -2528 -2729 -255 662 2571 -1144 -2221
861b221L135q36K546L57p066K078N817j481j784l111j355O709J70m880n95l91
$$ -2221 914 78 2624 2981 -4085 -2007 3810 2329 545 -2566 -3921 2788 2958 -1922 -2517 -2908
877b908M128K467n524j24J266j285N755M32q444O81N979K367k369o761J397O403
$$ -2908 1220 3687 -1837 -1961 -695 -1980 3775 4207 -4237 -3556 2423 4790 2421 -4340 -2943 3460
893C460k332j074Q18n055J734N418m51k300n799J176J0900j408q997J0M175M197
$$ 3460 1128 54 872 -4183 -2449 2969 2518 218 -5581 -4405 6495 5087 -3910 -3900 275 4472
909D472j461n545J598J679k608N773N32r211o73O271M472k064j0200J011R679
$$ 4472 3011 -2534 -936 743 -1865 3908 4440 -4771 -5444 827 5299 3235 -6965 -5954 3725
924C725O05l324m402k356Q188L753n750j894j209O95P671j419o952j476J889O553
$$ 3725 4330 1006 -3396 -5752 2436 6189 439 -1455 -2664 -1969 5702 4283 -2669 -4145 -2256 4297
940D297L85p787j390K041K737P097n737j2348O610J2309j147j0434m882R855N603
$$ 4297 4682 -3105 -4495 -2454 283 7380 1643 -10705 -4095 8214 7067 -3367 -8249 1606 7209
955G209q217j70L119n235J197P132k19o497p807N742J4155n301j4179O85J1751
$$ 7209 -1008 -1178 1941 -3294 -2097 5035 4816 -1681 -9488 -3746 10409 5108 -9071 -8386 3365
970C365O769r749j0676R375P664p170Q35K879m858k294M569O892m790j2764M233
$$ 3365 10134 385 -10291 -916 6748 -422 413 3292 -1566 -3860 709 7601 2811 -9953 -5720
985e720J3769k331q505l995K371R570M61q848k190L569N437K227p109k887M819
$$ -5720 8049 5718 -2787 -6782 -4411 5159 5620 -3228 -5418 -1849 3588 5815 -1294 -4181 638
1000F38L67J481N28m852r19O12M214O076q753j1286R180J1963l615j2778k736
$$ 638 1005 2486 3014 -1838 -2757 -2145 2069 8145 -608 -11894 -2714 9249 5634 -7144 -9880
1015i880J4582N442j3133k807P394j11k150J687L239k001r739M114J4749o392
$$ -9880 4702 10144 -2989 -5796 1598 1487 -663 1024 4263 2262 -7477 -3363 11386 4994
1029D994j6159K633J4683M840j4425q664J3276O392r097j163L022j396R25K082
$$ 4994 -11165 -8532 6151 10991 -3434 -12098 1178 7570 -1527 -2690 332 -1064 -139 1943
1043A943K953l858p554N529P773m753m368j782J459P972p77q323j273L552N177
$$ 1943 4896 1038 -6516 -987 6786 2033 -2335 -4117 -2658 5314 4537 -3786 -5059 -1507 3670
1058C670Q2q151R5O575J206j227l539j386L852m39k097N523j827q051K990R039
$$ 3670 3752 -4399 -4304 2271 3477 2250 -1289 -2675 1177 738 -1359 4164 2337 -5714 -2724 6315
1074F315o07j2627l750J5768N288j5544k207J0278R34n476r31M543j24o298M096
$$ 6315 5708 -6919 -10669 5099 10387 -5157 -7364 2914 3848 -1628 -2559 1984 1860 -4438 -342
1089c42Q683p107q109M513P408L58q974l574R515K993p097j188J995J050L15q61
$$ -342 8341 1234 -6875 -2362 5046 5404 -3570 -7144 2371 5364 -1733 -2921 -926 124 439 -422
1105d22K233k230m211O793M296p472k114L507J385l27k152M18J031k929L387L398
$$ -422 1811 -419 -4630 2163 6459 -1013 -3127 380 1765 1438 -714 -296 735 -2194 1193 4591
1121D591p236l395O595L141k897m715K249O423m107m665N797L52m738J886M585
$$ 4591 -2645 -6040 555 3696 799 -3916 -1667 4756 649 -4016 1781 2133 -2605 -719 3866
1136C866k51o241k560R077J108r604J017N689j58k461k172K783K029m742J079
$$ 3866 3615 -2626 -5186 3891 4999 -4605 -3588 2101 1943 -518 -2690 93 2122 -2620 -1541
1151a541N555l745l306K650L553M29o446n88Q021k262p046M720L218l917k021
$$ -1541 4014 269 -3037 -387 3166 3595 -2851 -3439 4582 2320 -4726 -6 3212 -705 -2726
1166b726L210L013n725l362Q240J442q221K088N512k252k402J42K633j72l560
$$ -2726 484 3497 -2228 -5590 2650 4092 -4129 -2041 3471 1219 -1183 -1041 1592 1420 -2140
1181b140K686L067m398j096K395N38k01l281J60N304j955m638L170K200j684j816
$$ -2140 546 3613 -785 -1881 514 1052 851 -2430 -2270 3034 1079 -3559 -389 1811 127 -1689
1197a689J531L330l138l776O757J238p801J472N642j755l959m00M274K16n571
$$ -1689 -158 3172 34 -3742 3015 4253 -3548 -2076 3566 1811 -2148 -2548 1726 1942 -3629
1212c629K873M218m611j526L148J008p65l019J867M503m082k987M703Q23l199
$$ -3629 -756 3462 -1149 -2675 473 1481 716 -2303 -436 4067 -15 -3002 1701 2524 -675
1227f75j032K025K532l170l545N427J009n399Q41L069n43j477j236L541J066m669
$$ -675 -1707 318 2850 -320 -3865 1562 2571 -2828 -1987 1082 539 -938 -2174 1367 2433 -2236
1243b236J288L759k400j749J146J877N8l467N9M449k549l236L591J070k760o40
$$ -2236 -948 2811 411 -1338 -192 1685 1743 -1724 -1665 2784 235 -3001 590 1660 -1100 -1740
1259a740J623K702l381k205N198m11m235K567K231k164p64L83K360j070l874K860
$$ -1740 -117 2585 -796 -3001 2197 1786 -2449 118 2349 185 -579 -196 2164 1094 -2780 80
1275H0K202l498k4J192J94N24k343J19M033k682k080K916J021j773r03J155K879
$$ 80 2282 -1216 -1240 -48 146 670 -1673 -1554 2479 -203 -2283 633 1654 -119 -1022 133 3012
1292C012l096k920M708O58m473J002K149k37j840j021L247j30l343J937K151k494
$$ 3012 -84 -3004 1704 2362 -2111 -1109 1040 803 -1037 -2058 1189 1059 -2284 -347 1804 -690
1308f90K92P23l6J101j824j01K686k158q53J782p88l15L82o77Q98j088j117L099
$$ -690 -398 325 289 1390 -434 -535 2151 -7 -860 922 134 -181 201 -476 422 -666 -1783 1316
1326A316n90k709J821M35j21j24p28J663j15k152K125R25k868R03J015o8n91k284
$$ 1316 726 -1983 -162 273 152 28 -700 963 848 -1304 821 1746 -1122 -219 796 728 137 -2147
1344b147J253L154k423j828J923P9M37o55l72J720j228r98K946q61k615J621Q43
$$ -2147 -894 2260 -163 -1991 -68 11 448 -207 -579 1141 -87 -1085 1861 1000 -1615 6 849
1361H49l07Q1j614P96Q83j403R26o75j339K310K27j806J377q79K71J527j091m19
$$ 849 542 623 -991 -195 688 -715 211 -464 -1803 507 734 -1072 305 -574 -303 1224 133 -286
1379b86N15k85J177k12j466J172q21o41K562j512k531J700J399n12m91j334J662
$$ -286 229 -56 1121 909 -557 615 -206 -847 1715 203 -2328 -628 771 259 -232 -1566 96
1396I6R38j532J050l83o95J950l63j475Q29o65j73J574p07r07n34q0K639n45l605
$$ 96 1034 -498 552 169 -526 1424 1061 -414 415 -250 -423 1151 444 -463 -997 -1077 1562 1017 -2588
1415b588J786J567l50n7j591L68K640j589m94P44o65L73J91l3J047k059j396K931
$$ -2588 -802 765 415 358 -1233 -865 1775 186 -308 436 -229 144 335 302 1349 -710 -2106 825
1433H25L55k048m44L5K024R57k741l94J854N05j34j266l20K256j135p92K031p48
$$ 825 1180 -868 -1312 -1277 747 1704 -1037 -1431 423 928 794 -472 -792 1464 329 -463 1568 820
1451H20k097R88N77J167j534k591K466J745j179j498q44J787L244l438j917L310
$$ 820 -1277 -289 288 1455 -79 -2670 -204 1541 362 -1136 -1980 -193 3051 -387 -2304 1006
1467A006Q23k491M83R26N56k087r53M234r16m037J206K540j90j367k172J299L017
$$ 1006 1829 -662 -179 747 1303 -784 -1737 2497 1581 -2456 -1250 1290 1100 -267 -2439 -1140 1877
1484A877j278j678K03J126J310k403l15L209j486k561L033J389k441j513N69K107
$$ 1877 599 -1079 -876 250 1560 -843 -1158 2051 565 -1996 1037 2426 -15 -1528 -959 1148
1500A148Q7l147N17J756J79P37k481q89L338K19k618Q14J060l4p08k66K108j009
$$ 1148 1235 -1912 -1395 361 540 1277 -1204 -2093 1245 1464 -1154 -340 720 686 -22 -288 1820 811
1518H11l385K394K570j876j703m86K146J862l277k173L371J052j042j070L61K317
$$ 811 -2574 -180 2390 514 -1189 -1675 471 2333 -944 -3117 254 1306 264 -806 -445 1872
1534A872j804j755L171K21l259M88K197M80j326k500K114J916k419r32R06O42
$$ 1872 68 -1687 1484 1705 -1554 -1066 1131 1611 285 -2215 -101 1815 -604 -1536 -630 12
1550A2Q58r00o67J612j320p62K050k93q98M24N8R84m76j788P77L28k27J369j765
$$ 12 870 -30 -697 915 -405 -1167 883 590 -308 116 174 1158 682 -1106 -329 -1 -228 1141 -624
1569f24j117K441L69j787n5L70J121o26j250J952L50k006J095Q67j291K5q04J395
$$ -624 -1741 700 1069 -718 -773 -403 718 92 -1158 794 1144 -862 233 1100 -191 -166 -970 425
1587D25J631k537r74J904p0p22j168N59K085j154j528L137n17k571R51J520o7
$$ 425 2056 -481 -1455 449 379 -343 -1511 -952 1133 -21 -1549 1588 1071 -1500 -549 971 904
1604I04j489r11K901L95k893N93J001j097J37M98J0J88j406O63J820j980o43J295
$$ 904 -585 -1496 1405 1800 -1093 -500 501 -596 -459 39 49 237 -1169 -506 1314 -666 -1309 -14
1622a4L11J37m44o18J678o30p80J064o08j131J563m53j02j82q22J667k43j782
$$ -14 297 434 -10 -628 1050 420 -360 704 96 -1035 528 75 -27 -209 -1031 636 393 -1389
1640a389J050J075j094L32N65K11k95j672J512J469k446l38K371l96j595k04R09
$$ -1389 -339 736 -358 -26 539 750 455 -1217 295 1764 -682 -1020 1351 955 -640 -844 65
1657F5Q61k107m2K336n32j797J147Q41p29o65l13J919R4j444N00O85m15n74j95
$$ 65 926 -1181 -1223 1113 581 -1216 -69 772 43 -622 -935 984 1078 -366 134 819 404 -170 -365
1676c65O08P39k210N34J890j169j507J402N87l60j110L23K167j994l17K238r81
$$ -365 243 982 -1228 -694 1196 27 -1480 -78 509 149 -961 -638 1529 -465 -782 1456 475
1693D75j559J756j41p45L6nJ298j028j110J515j76j505R08L73j67L40r42R15R78
$$ 475 -1084 672 531 -214 -178 -183 1115 87 -1023 492 316 -1189 -281 92 -75 265 -677 238 1216
1712A216j655m25J544j51k72o74N94J404j913r71K805j080j815J071Q51J2j307
$$ 1216 -439 -864 680 529 257 -417 177 1581 -332 -1303 1502 422 -1393 -322 529 541 -766
1729g66j97J837k27k221J534Q42n31l23k81R25L65j582O15J035j485l1P76K21
$$ -766 -963 874 647 -1574 -40 802 271 -52 -333 592 957 -625 -10 1025 -460 -491 285 506
1747E06n28n61L10P66j615K34J819j111n64R82L28m63k78R4R36l65j175R57K92
$$ 506 -22 -583 -273 493 -1122 -888 931 -180 -744 238 566 103 -175 -81 855 490 -685 272 564
1766E64j023O76o94N48J36j343J020J147j738l97J438N44p13j079J368Q73j932
$$ 564 -459 217 -477 71 207 -1136 -116 1031 -707 -1104 334 878 165 -914 454 1327 -605
1783f05J98J920j063j266R89M31n76p90M05J270j124j174J712N5q91N28k78L66
$$ -605 -407 1513 450 -816 173 604 28 -762 -357 913 -211 -1385 327 382 -509 19 -259 107
1801A07L41r54P79P04j357k6P34K15L1j336L76J478j569l62J879p93j165P06K97
$$ 107 448 -506 273 977 -380 -406 328 543 574 -762 -386 1092 -477 -839 1040 247 -918 -212 85
1820H5L16j047J54J351l85j525J136O07q54L61l26K94J42n81N60L35j325M48O72
$$ 85 401 -646 -492 859 474 -1051 85 692 -162 199 -127 167 309 -272 288 623 -702 -254 418
1839D18o05P4o63P03Q87j666O6J792q31q55J285L1k48p24j24J929j466j121J161
$$ 418 -187 -113 -776 -73 814 -852 -786 1006 175 -680 605 636 388 -336 -460 1469 3 -1118 43
1858D3L14n55M4q63J065L08j295J017O93j012J46P46K4l27j380J368P65j528k
$$ 43 357 -198 -154 -1017 48 356 -939 78 771 -241 -95 651 675 348 -1032 336 1101 -427 -429
1877d29J447p28n91O23j54l48o66N04J592j541o16J309J8o72K23j70M24K94q43
$$ -429 1018 290 -301 322 168 -180 -846 -342 1250 -291 -907 402 420 -252 -29 -199 225 519 -324
1896c24Q51m2j013N34M49l73J80j588J292J112k090J76J215l90p3p4K1O78r40
$$ -324 527 485 -528 6 455 82 262 -1326 -34 1078 -1012 -836 379 -11 -84 -158 -137 541 -399
1915c99J24J589r47j034R77j47l79N96q72L26O37n93M7l51L6Q37l40o46L30L4
$$ -399 -275 1314 367 -667 310 163 -216 380 -492 -166 471 -122 -75 -426 -390 447 107 -539 -209 -175
1935a75K45M64q89L06N79r58N07K80m71O6l87P03P57j509p94J744l18n99m9k03
$$ -175 70 534 -355 -49 530 -428 79 359 -112 -46 -433 270 1027 -482 -1276 468 150 -449 -498 -701
1955g01J084r3q33P70K3m05M66J80j25L92j568Q18J432j712o93O85J47L75m26
$$ -701 383 290 -543 227 250 -155 311 491 366 758 -810 8 1440 -272 -965 -280 -133 242 -184
1974a84n56J203p2q39K74l7J26O78j024O58Q83j499j39J234J2p73q08M49J543
$$ -184 -740 463 391 -448 -174 -211 -85 593 -431 227 1110 -389 -528 706 718 -55 -863 -414 1129
1993A129j164q05Q64J18l06J06l50N06J51p85P75N43r62K52j69O29M01j603J55
$$ 1129 -35 -840 24 142 -164 -58 -408 98 249 -536 239 782 -180 72 -97 532 933 -670 -515
2012e15J372n30p36Kj39R00Jq25M76ko3J50m04K3R81j246L19R92m38l26O5L17
$$ -515 857 327 -409 -407 -546 354 355 -470 6 4 -59 91 -313 -290 691 -555 -236 756 318 -8 57 374
2034C74L13j137p10J806r1q63r7J12Q60m50j008J109J141k074J59J404m41n99
$$ 374 687 -450 -1160 646 555 -308 -405 -293 567 117 -891 218 1359 -715 -556 848 407 -192
2052a92j81M41J199j454m64Q53o7L9o91l44J222m81q76J182J43n97K61J26R7J81
$$ -192 -373 68 1267 -187 -651 202 135 174 -517 -861 361 -120 -996 186 329 -268 -7 119 216 397
2072C97j167J000N81j293N74N43r29K98K02o66J87L2L97O5p97N07N26j087J39
$$ 397 -770 230 811 -482 92 635 -294 4 206 -460 -273 -241 156 221 -576 -69 457 -630 -491
2091d91J075o42k14K34N87N27j319o08J072L48n60l85K90N78Rj763J294Q66j725
$$ -491 584 -58 -272 -38 549 1076 -243 -851 221 569 9 -376 -86 492 501 -1262 32 898 -827
2110h27Q2J167m9m87p24J217M22j302J40O27%m19K83k83P70p02o48J022l82k51
$$ -827 -745 422 373 -114 -838 379 801 -501 -361 266 266 -153 130 -153 617 -85 -733 289 -93 -344
2130c44L63n9j22p1l91O93K04p88N35M62l86J9N77o35k63J64M48K1j322P71R12
$$ -344 19 -40 -162 -233 -624 69 273 -515 20 482 96 115 692 57 -206 -42 406 427 -895 -124 788
2151G88j168m9O73r1m97l13M77Q31p58k74N23K57J22o49o27J246l0j300R78O84
$$ 788 -380 -429 244 153 -344 -657 -180 651 -107 -381 142 399 521 -128 -755 491 461 -839 139 823
2171H23j198k69P90K94q43n97Q92P97j432N85O09o99o9N64J30l35j55M33k5k63
$$ 823 -375 -644 146 440 -403 -1000 -108 689 -743 -158 451 -248 -317 247 377 42 -113 320 295 32
2191C2l52P78r85K11L79m94K74Q2o41J059J15j187O57J80L36p04l16R27M52j870
$$ 32 -320 458 -527 -316 63 -431 -157 -75 -716 343 458 -729 -72 108 444 -260 -576 351 803 -1067
2211a067P22J161q20n69P67L69n72p99N64R75j217J30L65j06j95K53k31P62l35
$$ -1067 -345 816 -4 -573 194 563 -9 -808 -244 731 -486 -356 9 -97 -292 -39 -270 492 157
2230A57q04R28M2n19rO14n5m10l96N59L19j009L74P20r76J99L61R8j90n59N85
$$ 157 -647 281 323 -196 -205 409 354 -56 -452 107 426 -583 -209 511 -465 -266 95 193 3 -556 29
2251B9O10p25l06J118n65p5l49L49J44l84j97N30R4q44M47K52R4l72n78R66K56
$$ 29 639 -86 -392 726 161 86 -263 86 230 -154 -351 179 273 -571 -124 128 222 -150 -728 238 494
2272D94j102N96O36n44j56K09m5J57o48N92M24j094%O49n68K81J64k97O73l83
$$ 494 -608 -12 624 80 -76 133 88 245 -403 189 613 -481 -481 168 -400 -119 45 -252 421 38
2292C8k55Q17n22m87L38O45j74l71o07J452m85j063O30N73q85l74N18K62j01m56
$$ 38 -217 600 78 -409 -71 574 400 29 -578 874 389 -674 -44 529 -356 -730 -212 50 -51 -507
2312e07L98N24p89r4P54o9J74j66m53P35m77k74L41O9j72J97k13J93p9n37N12
$$ -507 -109 415 -374 -468 286 217 391 225 -228 507 30 -244 97 166 -6 191 -22 171 92 -445 67
2333F7J33r05Q94Q2q36N60L37n13L91l95M17J00o59K32N18n44J96m39K33N98o93
$$ 67 200 -705 189 271 -565 -5 332 -181 210 -185 232 332 -327 -95 423 -121 75 -364 -131 467 -226
2354b26n60Q89j1n44K23K12M06n09q0N19J47j079M77O85l06l76Q9K59j51j34L
$$ -226 -786 103 92 -452 -229 -17 389 -120 -200 319 466 -613 -136 549 243 -133 -44 215 64 -70 -67
2375f7R6n91O18J38n48K98Jj97N52j40l30K08J00p2J8j32P5j72n2N88l27n93Q76
$$ -67 29 -562 56 194 -354 -56 -55 -252 300 160 -170 38 138 66 84 -48 27 -145 -197 391 64 -529 347
2398C47Q7r04J10N09k18j14N1M75j35n52K72N13k91o4J17l42O49o89l37L86L18
$$ 347 434 -470 -360 149 -69 -183 -132 343 208 -344 -72 441 150 86 203 -139 510 -179 -516 -130 188
2419A88k77j37k89K67K05n23N36J79m18O13l01l1K37n91M84J42l62K62j17m57
$$ 188 -89 -226 -515 -248 -43 -566 -30 149 -269 344 43 12 249 -342 142 284 -78 184 67 -390
2439c90P69j22p52K41M63l03J76n07J07N94n52J77L43m30K45J21k03N44p68k92
$$ -390 379 257 -495 -254 209 -94 82 -425 -318 276 -276 -99 244 -186 59 180 -23 521 -247 -539
2459e39Q89m4n96o8J77L17k36k98K43L01k85n5J99p3K94k76l03O49q1m07K7L79
$$ -539 350 306 -290 -358 -181 136 -100 -398 -155 146 -139 -194 5 -68 226 -50 -353 296 215 -192 -165 214
2481B14P1j53o77P04J00o30J43M4P6P0n8j57K45J69j83PL09k51j95j58R38l51
$$ 214 285 132 -545 159 259 -371 -228 -184 -108 -38 -96 -253 -8 161 -22 -15 294 43 -152 -310 628 277
2503B77n43Q8N69r0m16pLK44l29L26p7k07j67L48j44N10j68m25M29O8j53n0kL6
$$ 277 -266 -178 391 301 -115 -122 -119 125 -204 122 45 -162 -329 19 -125 385 217 -208 221 289 136 86 84 120
2527A20N9l75MK75l75J21k7m47P96q9m91K45L58J7k93q7M76k3m86L85L87p03L07
$$ 120 179 -196 -192 83 -292 -171 -198 -645 151 62 -429 -184 174 191 -102 -189 287 264 -222 163 550 -153 154
2550A54l6j43jj24l8N99k79n81M70p6pj21J67M56k5p94P24q8l95J36k49O41l08
$$ 154 118 -25 -26 -150 -188 411 132 -449 21 -55 -62 -183 -16 440 415 -379 345 257 -138 -2 -251 390 82
2573H2q1K44l04k56M42l92j35N27M1l65K92j86Q5J63l1k11L95k75j02P8p3P10
$$ 82 1 245 -59 -315 127 -265 -400 127 168 -197 95 -91 -6 157 126 -85 310 35 -67 11 -62 648
2595F48r04J27N50k30o01RP28Om74j55P72j93j095R50K61n36J76J65M8K1o33M36
$$ 648 -256 -129 421 191 -410 -401 327 333 -141 -296 476 283 -812 138 399 -137 39 204 252 273 -360 76
2617G6O3l39J45k07J90L67j46o91R29n66k65O28Q7k56k09L67j3k19r7O32o24R3
$$ 76 139 -200 -55 -262 -72 295 149 -542 387 -179 -444 184 271 15 -194 173 160 -59 -156 476 -148 -55
2639e5J24K97n60K49J71l9k83m72P17k57m15N15M09l11n4q4K29J56m62J04L17
$$ -55 69 366 -194 55 226 187 -96 -568 149 -108 -523 -8 401 90 36 -48 181 337 -125 -21 296
2660B96k07j03l44N68j18m61J14O68l56l73K21Q3j54L15k93L16L29r70M32K87
$$ 296 89 -14 -358 210 92 -369 -255 413 57 -316 -95 -12 -166 149 -144 172 501 -469 -37 250
2680B50o18J48O15m24j18j46m6N64n36M9K91L2j65M6m0N2K0j02P32n83l34N07
$$ 250 -368 -220 395 -29 -147 -293 -339 225 -311 -262 29 61 -104 -58 -98 -46 -26 -128 604 21 -313 194
2702A94K9l67L84j16J99k37n06N15J99o40M19o9o4j38K2K89R6j67m67O89k2o25
$$ 194 223 -144 240 124 323 86 -420 95 294 -346 73 4 -60 -198 -176 113 209 42 -425 264 242 -383
2724c83M28J09K86m33k12N87l42m64L64K85j49k39N1J68qm50M24L37l49l23P20
$$ -383 45 154 440 7 -205 382 40 -424 -60 225 76 -163 -112 56 48 -402 22 359 10 -313 407
2745D07m58K97o97J015j62m89j79M96l13j30O7M44m12k02NO86k99o54O63J73k17
$$ 407 -51 246 -451 564 402 -87 -266 230 -83 -213 -146 298 -114 -316 -311 375 76 -578 85 258 41
2766D1k8J32J69On12L36L1l81K06o5J63o8k87L10J99o15j08P96j45k61L7K42r4
$$ 41 13 145 314 320 -192 144 175 -206 0 -65 98 30 -257 53 252 -363 -471 325 180 -81 -44 198 104
2789A04m62N21K12l99j35M98J1p40J71K68L73o03j33K84Q0k32pL10Mj19j58L56
$$ 104 -358 163 375 -24 -159 339 350 -390 -219 49 422 -181 -314 -30 50 -182 -189 121 125 6 -152 204
2811B04N6n45L01L09m7j69k22j53N19k88k90Q23n77m14N39l9j89k32M71J19p9
$$ 204 260 -285 16 325 278 109 -113 -266 253 -35 -325 498 -79 -493 46 7 -182 -414 57 176 97
2832I7n76K59N44n56K37M2R7k18O9K19j31p8q9K21o6l41K12j5N57q54K87N91o27
$$ 97 -479 -220 324 -232 5 47 144 -74 -5 214 83 5 -84 137 71 -270 -58 -73 484 -370 -83 508 -119
2855a19k86N11Q5j31j06R0L77n80j55M27L40o69M3O8K4j2K18m6Q5n67K24J10K50
$$ -119 -405 106 191 60 -46 44 421 -159 -314 113 453 -216 -173 -105 -81 -93 125 79 164 -403 -179 -69 181
2878A81o88N06K92j01q0l80N43n34K42M98q15K41K05j51J5k31k64O09M6m28K24
$$ 181 -507 -1 291 190 110 -270 273 -261 -19 479 -336 -95 110 -41 -26 -257 -521 88 134 -294 -70
2899g0K03o2k3j15k2M18n31J80N63n61J9j31L70k9l08k57L94j15k16N66l7l80
$$ -70 133 71 48 -67 -89 329 -202 -22 541 -20 -1 -132 238 209 -99 -356 38 -77 -293 273 236 -144
2921a44J20J05J94k1q11Q56k46l45J34L0J92K67n22K92N5n48L93j59o2K58l0j16
$$ -144 -24 81 275 254 -557 299 53 -292 -158 -128 64 331 -191 101 156 -392 1 -158 -220 38 8 -108
2943a08N9j75n2O48l22N7K85l97K07p7j06K1l06k4L86ll93J67R3L31j81n09N86
$$ -108 -49 -224 -276 372 50 107 392 -5 202 125 19 40 -266 -290 96 93 -300 -133 -40 291 110 -399 187
2966A87k14j90L86j05j62J95J51j33J61m72J29L32m42K9L39k33m1j46j83N28k03
$$ 187 -27 -217 169 64 -98 97 248 115 276 -196 -67 265 -177 -148 191 -42 -83 -229 -412 116 -87
2987h7o0K36j65K63K57m65L14k47j60M05L4k08q0j73J04K90j51k24M38n77J76
$$ -87 -147 89 -76 187 444 -21 293 46 -114 291 325 117 37 -136 -32 258 107 -117 321 -256 -80
3008h0N03l83p7L09k57Q8Q9q0K03m54m7M23l58k38J61L91l37J82l52J72%N5K49
$$ -80 423 40 -37 272 15 103 192 112 315 -139 -186 237 -121 -359 -198 193 -144 38 -314 -142 -142 -87 162
3031A62l25K00J90l45K38J6n0J8O4k33K15M4k18J07rj55K98n86L56K36k75o9L70
$$ 162 -163 37 227 -118 120 136 86 104 168 -65 150 194 -24 83 74 -81 217 -369 -13 223 -52 -121 249
3054B49l77j89L59M3j21J17l96N06j10p7K58j36M0k49M8M1K91n86L24J19l99L26
$$ 249 -128 -317 42 85 -36 81 -315 191 81 4 262 126 166 -83 -35 6 297 -289 35 154 -245 81
3076H1k18J91P0m68L21J81j67l8L69l51p5K71k44N6L05l91o1J2J99L36q02N3P81
$$ 81 -137 54 124 -344 -23 158 -9 -47 322 -29 -104 167 -77 -21 284 -107 -168 -156 43 379 -423 -370 411
3099D11m93k28N90l12K57o08K21M72r8j53J15j47K21k62l43M34N65j044L18K8
$$ 411 -82 -310 280 -32 225 -383 -162 310 212 59 174 27 248 -14 -357 77 642 -402 -84 -56
3119e6q6k6J25J1L46k50j45Q9J11j6J22k89l6L66m11K91j6k06J86k38M6J06m7
$$ -56 -142 -168 -43 -32 314 64 -81 8 119 103 225 -64 -100 266 -145 146 130 -76 110 -128 -82 24 -23
3142b3p5K32N3j75J73k85J79n9L2m12L68L12l23k6K53k40j99K06P4l06K33N2l01
$$ -23 -98 134 187 12 185 -100 79 20 52 -360 8 320 -3 -29 224 -16 -215 -9 65 -241 -8 44 -257
3165b57L33J34o46M19N0J75J7l32K51J48m80M66p8m04J34K17k89J44j13j35M78
$$ -257 76 210 -436 -17 33 208 225 -107 144 292 -188 278 200 -204 -70 147 -142 2 -111 -246 232
3186B32k31K76l16J40l0Q1mj55K52j31m9rj98L29l43R1J48k37J97o0j77K34J07
$$ 232 1 277 -39 101 71 152 148 -7 245 114 65 56 -142 187 -156 -65 83 -154 43 -17 -194 40 147
3209A47m32%K18M76n89K79K84j42n90L51M41n38K04qJ48l44j09K58L28n12l6L47
$$ 147 -285 -285 -67 409 -180 99 383 241 -349 2 443 -95 109 101 249 -95 -204 54 382 -130 -166 181
3231A81j90j56K87k60L46l2l83J68O0j20J15K25j38K1j29j50K31k27K06%l27K84
$$ 181 -9 -165 122 -138 208 176 -207 -39 21 -99 16 241 103 124 -5 -155 76 -151 55 55 -272 12
3253A2l0ml2J18k44J39k88L27L07k65j53K63j70K90j35l02M0J90m37J33J33K45
$$ 12 -18 -22 -54 64 -180 -41 -329 -2 305 40 -113 150 -20 270 135 -167 -127 63 -374 -241 -108 137
3275A37l61J7K85J39l87J66L25m66J06J77k50J64J25l19M98m49N3mJ9N1j75j05
$$ 137 -224 -207 78 217 -170 -4 321 -145 -39 138 -112 52 177 -142 356 -93 -40 -44 -25 26 -149 -254
3297b54L82M5m32L54J92m70L40j32k06j07M35J3pJ29j61L0k05o8K13k4j83P1R9
$$ -254 128 173 -259 95 287 -183 157 25 -181 -288 147 160 153 282 121 151 -54 -122 91 67 -116 -45 54
3320E4J75l09j6NL19k04J97k60L50q1m97M98J66n80J21Oj24O9j78L28J30m23K93
$$ 54 229 -80 -96 -91 228 24 221 -39 311 230 -267 231 397 -183 -62 -56 -180 -111 -289 39 169 -254 39
3343C9K0j6l7J59k44P9n9j17M5K4j04J74L7M9n9k57M10r2l97O04m30pM31k78J0
$$ 39 59 43 6 165 -79 0 -59 -176 -131 -107 -211 -37 0 49 -10 -267 143 51 -346 258 -172 -179 252 -26 -16
3368a6M5k7k5R4l04M14j87O3Qo7K9j38J41R1m5j45J14q8J00l47L32o9J64j38J69
$$ -16 29 2 -23 71 -233 181 -6 57 65 -2 27 -111 30 121 76 -69 45 -43 57 -290 42 -27 137 -1 168
3393A68j25j12J46j01J66j68L9j35J58N7p9k61J47r9J15N0p8K25l31j2Q9p0q8
$$ 168 43 -69 77 -24 142 -26 13 -122 36 93 14 -247 -100 -199 -84 -34 -112 113 -218 -230 -141 -211 -299
3416b99M73m02rL98n5q4j24K04M3j49j19o0K78j83p0J28M4j68j36RK8K34J15M6
$$ -299 174 -228 -237 161 106 22 -102 102 145 -4 -123 -183 95 -88 -158 -30 14 -154 -290 -281 -253 -19 96 142
3440A42J9j3j34p7j96M05j20K1J9k62K69m66K07O0j14M08j87j80K85K4j39Pj81
$$ 142 161 148 14 -63 -259 146 26 47 66 -196 73 -393 -186 -126 -240 168 -19 -199 86 110 -29 -22 -203
3463b03K02J62jm4J54l04j41O2J32j70M6o9K03Q6j25K34j87J15j07k65J97R8j
$$ -203 -1 161 160 116 270 -34 -175 -113 19 -151 -105 -174 29 115 -10 224 37 152 45 -220 -23 75 74
3486G4%j5J37L3J3j04k70Q7K03J7l66J88k11M1L38k55l0Q1j54J27k2K54j8j84
$$ 74 74 59 196 229 242 138 -132 -45 158 175 -191 -3 -214 -173 165 -90 -120 -39 -193 -66 -88 166 148 -36
3510c6K4O2j41r2P1J41j83J46R9k42L31l81m2K94k40M68j33l99M3L82j37J01o1
$$ -36 -12 50 -91 -183 -112 29 -154 -8 91 -151 180 -201 -243 51 -189 279 146 -253 -210 172 35 136 75
3533G5J3O6j91K05j77j2J32q1k33K36Q9m05K02K58j42N2Mj11j17J89K41j3k28
$$ 75 88 154 -37 168 -9 -21 111 30 -203 33 122 -283 -81 177 35 87 91 -20 -137 52 293 280 52
3556E2M5rk0O8r0Kl8M03l60l26J99J20q9j66K22K19j88k28K14j36K3L30j85m9
$$ 52 97 88 68 136 46 48 10 413 53 -273 -74 46 -43 -209 13 232 44 -184 30 -106 -83 247 62 13
3580A3j23o6J43k53M16l9l43J43K42m76K78J30J65j87p3J53J1k58P0M9k51M35
$$ 13 -110 -176 -33 -286 130 91 -252 -109 133 -343 -65 65 230 43 -30 123 134 -124 -54 -5 -256 179
3602A79l07J96l0l06J47Q4m4R6O8Q1j63J3J52l17L88k43K33k39J03o0K46j51o
$$ 179 -128 68 38 -268 -121 -37 -81 15 83 164 1 14 166 -151 237 -6 227 -12 91 31 277 126 120
3625A20j33rQ4j14M8l97K72K31L2jj83j37L55j61P4L3M3k00R2K80j87l21L17j92
$$ 120 -13 -22 62 -52 -4 -401 -129 102 134 133 -50 -187 168 7 81 114 157 -43 49 329 142 -179 138 -54
3649e4J66m28K71l4N7j70K78J94k26J19l21R6N1K52m7k18L22l07N9J8k7Lk2n6
$$ -54 112 -316 -45 -79 -22 -192 86 280 54 173 -148 -52 -1 251 204 -14 308 1 60 78 51 54 32 -24
3673b4o7L66l81k54K08J4J56j6Q0J39j46J33L0p4j44K0J09n7L4QO9k47n8k2L38
$$ -24 -91 275 -106 -360 -152 -138 18 2 82 221 75 208 238 164 20 40 149 92 126 134 203 -44 -102 -124 214
3698B14l38n3K05j75J67K13k42%m3k23L25k7J31J09l00K84j40j06k9q3J42k69
$$ 214 -124 -177 28 -147 20 233 -9 -9 -52 -275 50 23 154 263 -37 247 107 1 -28 -111 31 -238
3720b38L52J53m67k9L48J94j90Kqq7l6l36J42mJ42j10L24k7l88M61j07j94P7O
$$ -238 114 267 -200 -229 119 313 123 125 117 30 -6 -342 -200 -204 -62 -172 152 125 -263 198 91 -103 -26 -20
3744b0L8j62j21J01J15L2k7K71l13K89l37J56K23k28l08O44l65M8l1l10N51j72
$$ -20 18 -144 -265 -164 -49 -17 -44 227 -86 203 -134 22 245 17 -291 353 -12 36 5 -305 246 74
3766G4j32j60J50j33Q0r1N1k8J38J74K00k61j56J17k0L61m05J42J90k16q8K94
$$ 74 -58 -218 -68 -201 -121 -212 -161 -189 -51 123 323 62 -94 23 3 364 -41 101 291 75 -13 281
3788B81k16QM3o8k33K55k28J26l0r8K86J47m95L04j81K8k15J70j01P1n8L04l52
$$ 281 65 73 116 48 -185 70 -158 -32 -62 -160 126 273 -222 82 -99 -71 -286 -116 -217 -146 -204 100 -252
3811b52L56m32K48K46j01J03l95K9R1L0k5O1J35l20J81K39j13l6j14J35K6j69
$$ -252 104 -328 -80 166 65 168 -227 -198 -107 -77 -102 -41 94 -226 -45 194 81 45 -69 66 92 -77
3833g7j10J29L25k56k73K64lJ20J09l86K7J31n4j81L05m34K61r0K41p8R3Rj02
$$ -77 -187 -58 267 11 -262 2 -1 119 228 -158 -131 0 -54 -235 70 -364 -103 -193 48 -30 63 72 -30
3856c0K00l12R4M7l6j62K48j09n9n2j96N12K2o8k10o1K10j19q9K66k1j94m2J57
$$ -30 170 -142 -48 -1 -37 -199 49 -60 -119 -171 -367 145 167 99 -111 -172 38 -81 -170 96 75 -119 -161 -4
3880dj35o8M3J78k63K52qj84L25j10k51M01j27j92K06O6k43M5J63k08r6JK71K04
$$ -4 -139 -207 -164 14 -249 3 -5 -189 136 26 -225 176 49 -143 63 129 -114 -69 94 -114 -210 -209 62 266
3904B66k29K69n15L98j60M2j55K28k08J08j18J77j39l0J4K0J42j06J36k29J50
$$ 266 37 306 -209 189 29 71 -84 144 -64 44 -74 103 -36 -66 -52 -32 110 4 140 -89 61
3925F1j32K20k01L1K32j33K45j79j45J75j0m1n1j38p4J90m0lk06J00J58k02J01
$$ 61 -71 149 -52 -21 211 78 323 144 -1 174 164 123 72 -66 -140 50 10 7 -199 -99 59 -143 -42
3948d2J87r2j9kkN1m1j99N1K49Q5k27J6j15J78J7k1j12l0M24p05O55m54K78j58
$$ -42 145 53 34 32 30 81 40 -159 -108 141 226 -1 15 -100 78 95 74 -38 -68 356 -349 306 -148 130 -28
3973b8j02L75o9R4j79k6k6KJ24j24k8K51k00o7j09M1M0mq1J94J06k67N3M2j64
$$ -28 -130 245 176 270 91 65 39 41 165 41 13 264 64 -3 -112 -71 -31 -35 -116 78 184 -83 -30 12 -152
3998a52Q1K22k72q3K77j62ko0K14j77J36J20l43L72l41M30l50Q2r6J05R9J52l19
$$ -152 -71 151 -121 -204 73 -89 -91 -151 63 -114 22 142 -201 171 -170 260 -90 -8 -104 1 100 252 -67
4021f7L00j75%Q4K0m3k07L04j78j18J88Pk85N3q3k2J31J4R4J8l59K76J28j19k15
$$ -67 233 58 58 142 162 119 -88 216 38 -80 108 115 -170 -117 -200 -222 -91 -77 17 35 -324 -48 80 -39 -254
4046b54M85m59J5K60r5n1M2%J78j91n4J40K5Mj34R6J05k65K70L1r7J39k19K4r8
$$ -254 231 -228 -213 47 -48 -99 -57 -57 121 -70 -124 16 41 45 -89 7 112 -153 117 148 51 190 -29 -5 -103
4071a03K15k30o4K66j30J4k2ql7K3J49l48O9K14J20k60J23K53k69j94M9P3J74
$$ -103 112 -118 -182 84 -46 -32 -54 -62 -99 -76 73 -275 -206 8 128 -132 -9 244 -25 -219 -170 -97 77
4094G7K0M2J4l66K18J47q2m0j07k3n9K96l2J97j89j60P9l5j53M4L27m46L86k04
$$ 77 97 139 153 -213 5 152 70 30 -77 -100 -159 137 105 302 113 -47 32 -3 -156 -112 215 -231 155 -49
4118d9J61j69J46j9K36n24J40Mj65L88k24m3L67l01N4K7l8j05K22o6j18K01K68
$$ -49 112 -57 89 70 306 -218 -78 -74 -239 149 -75 -118 249 -52 2 29 -9 -114 108 42 -76 125 393
4141C93j95j28l74L49p1o0K37l05N08l48J91k20M8J12l08L37j07r7j0J8l5L5J16
$$ 393 198 70 -304 45 -26 -86 151 -154 354 6 197 -23 25 137 -171 166 59 -38 -48 -30 -65 -30 86
4164H6k96R4M7L7K81k76k7j29K69p7r7K44j65O4j47K53J09k97R8L1j76J4m9Q8
$$ 86 -210 -116 -69 -32 249 -27 -54 -183 86 9 -88 156 -9 55 -92 161 270 -27 71 102 -74 -60 -109 -21
4188b1J42j79N1J3k09J52R2O5k51L1J62r2j36K11j29L01m03J86K68l30k82J58
$$ -21 121 -58 -7 6 -203 -51 41 106 -145 -114 48 -44 -180 31 -98 203 -200 -14 254 -76 -358 -200
4210b00M17k60l12K18N2N1K01k92K97J80J0m92J33k52J9M11k42r4Q5K46j90j04
$$ -200 217 -43 -355 -137 -85 -34 167 -125 172 352 362 -130 3 -249 -230 181 -61 -155 -70 176 -14 -118
4232a18K66j41k81M36k50N8k6P5j50j94J87k30L40j62K57L3k48K62j5M1j05P1
$$ -118 148 7 -274 162 -88 -30 -56 19 -131 -325 -138 -368 -28 -190 67 100 -148 114 99 140 35 106
4254A06r8j44N2Q1j47J27P2J08j45Lk49j11K99m0J98l5k47J89J74j39p5J34L6
$$ 106 8 -136 -84 -3 -150 -23 49 157 12 15 -234 -345 -46 -86 112 77 -170 19 193 54 -21 113 149
4277A49k12p5J41K02k13r6N6R7j56J02j59L12N5k25J11o8m2k62J57l7J3n3J72
$$ 149 -63 -138 3 205 -8 -104 -48 49 -107 -5 -164 148 203 -22 89 21 -21 -283 -126 -163 -150 -203 -31
4300c1J37k76K01l94M59O3l09K29k47K03k3j03J58j68R4j24j6J2R7rk17O49n87
$$ -31 106 -170 31 -363 96 159 -150 79 -168 35 12 -91 67 -101 -7 -131 -147 -135 -38 -47 -264 385 -202
4323b02M06k01k87K89Q0oj6j44J64J6j33K3k83L82k43O8K02k14j54N8K45L6J27
$$ -202 204 3 -284 5 85 79 63 -81 83 99 -34 -11 -294 88 -155 -87 115 -99 -253 -195 50 86 213
4346B13l05k5J27R4kJ70k79K9J21j99j47K62l85K21M4J80j36J41k25K38l6Q7m49
$$ 213 -92 -117 10 104 102 272 -7 22 143 -56 -203 59 -326 -105 -61 119 -17 124 -101 137 101 188 -261
4369b61L68p3J7L18k65l29R8K7P2k3j64K84n0K3k45K21O9q3Q6p0j05J49J54k51
$$ -261 107 34 51 369 104 -225 -127 -100 -28 -51 -215 69 19 42 -203 18 87 4 90 20 -85 64 218 -33
4393c3k71L27l00L43k47M0L91k50K12l62J33J42K31j95l11L32j9j60J11k63J39
$$ -33 -304 23 -277 66 -181 -141 250 0 212 -150 -17 125 356 161 -150 182 163 3 114 -149 -10
4414a0j60L40j39l98K88p2j68M96k31K28l5j05l7M6l3j40j92M43l29P0l0J86j70
$$ -10 -170 170 31 -367 -79 -151 -319 177 -54 174 139 34 -3 43 10 -130 -322 121 -208 -138 -168 18 -152
4437a52J19j61P1L76l29L08j74k94K03K4J93l21J13m3J36k40L35l25J47M0k73
$$ -152 -33 -194 -123 253 -76 232 58 -236 -33 -9 184 -137 -24 -67 69 -171 164 -161 -14 26 -247
4458b47j0J62j02R2M79j72j73p0J2J82K48l88K21J05m80J39R7k72m3J37J53k70
$$ -247 -257 -95 -197 -105 374 202 29 -41 -29 153 401 13 234 339 -141 -2 95 -177 -220 -83 70 -200
4480b00M00k29L21l47k02J38j7P5L33k58n8J81q4o3m0k4m0L04R3j52l05L27k80
$$ -200 200 -29 292 -55 -257 -119 -136 -61 272 14 -44 137 53 -10 -50 -74 -114 190 283 131 -174 153 -127
4503a27j28L48j52r1K74p7p4r4R0R5j54R2Jl37M03K0J54m60J68J92r1Kk8J85j63
$$ -127 -255 93 -59 -150 124 47 -27 -121 -31 64 -90 2 3 -334 69 89 243 -217 -49 143 52 54 26 211 48
4528D8J09k09p8R4J24j35q7K50j0M9j05l6r3L9J68q9J49k75K5O1j75J86J23P5
$$ 48 157 -52 -130 -36 88 -47 -134 116 106 155 50 14 -79 -40 128 39 188 -87 -62 -1 -176 10 133 208
4552B08l41K95Q6q5L1m7j41K25k23p9l9R4K08k55K04m10J65Q6j12K30j30L55m95
$$ 208 -133 162 248 163 194 147 6 231 8 -71 -110 -16 192 -63 141 -269 -104 -18 -130 100 -30 325 -170
4575a70N01m00J4J4J89j80o0L80m32J31J51j18N1J59m00J24m3j46M49j95J63k95
$$ -170 331 -69 -55 -41 148 -32 -92 288 -144 -13 138 20 71 230 -170 -46 -89 -235 214 19 182 -113
4597a13pJ65jR5l03j7J33J35KNpq8J17l12k2K31R0k08k5M2o2M40j98l77J26J85
$$ -113 -120 45 44 139 -164 -181 -48 87 89 94 87 -1 116 -196 -218 13 103 -105 -130 -88 -150 290 92 -285 -159 26
4623B6j03rk51K53L3N2o6J19k96L67k16n2J37J24j96J76k05K62k56m2N3P7J63
$$ 26 -77 -86 -337 -84 -51 1 -65 54 -242 125 -91 -143 -6 118 -78 98 -107 155 -101 -143 -90 -13 150
4646A50l00K22l33M35j78n2K07r6m16L74j31L4j12K90k71J06N9j0K05k7l30K27
$$ 150 -150 72 -261 174 -4 -56 151 55 -361 13 -118 -84 -196 94 -177 -71 -12 -22 183 156 -174 53
4668E3j2j57N1J17r2J00P3o7p8K29j96k44K01k1J65l0j0J61q7k76JJ35k13K41
$$ 53 41 -116 -65 52 -40 60 133 66 -12 217 21 -223 -22 -43 122 92 82 243 156 -120 -119 16 -197 44
4692D4k43J14K63l23O9K27j65L46m09r9J75j05L29k70k32L41j10n9R9K01J23l37
$$ 44 -199 -85 178 -145 -76 151 -14 332 -77 -176 -1 -106 223 -47 -279 62 -48 -107 -8 193 316 -21
4714b1J21l35K29n5J1J3j4K3R3j48p5K97ql33J67j13L7K14l02J03J8J30k70J66
$$ -21 100 -235 -6 -61 -50 -37 -51 -28 65 -83 -158 139 131 -202 -35 -148 -111 103 -199 -96 -78 52 -218 -52
4738e2Q2M5m4l6N2O2j83K40K4p9j3j19L44m36NK53M7j06J53l40O1k9J42l93M7
$$ -52 30 75 31 -5 47 109 -74 166 190 111 98 -21 323 -113 -108 145 192 86 239 -101 -40 -69 73 -320 -273
4763b73L16J00j85K46j73l31L72J47k34P0m2J17j25k32K07m7M4K8j82J23l91M23
$$ -273 43 143 -42 204 31 -300 72 219 -15 55 13 130 5 -227 -20 -67 -23 5 -177 -54 -445 -22
4785b2K7o0K18l75J44J62J11k87rk7P5p2j08K0J63k4K36N0l12J36J85k18j05j75
$$ -22 5 -55 163 -212 -68 94 205 -82 -91 -118 -43 -115 -223 -203 -40 -64 172 222 -90 46 231 13 -92 -267
4809b67K52k29M13j13l09K08K01jj84J59k23K40k52K89Pm8k38L41j53P3%l29J40
$$ -267 -15 -244 169 56 -253 -45 156 155 -29 130 -93 147 -105 184 191 143 -95 246 93 166 166 -163 -23
4832b3J22K24k95OL9J8j40k10L85j63J64l66K12P7j64m6M3J10J48l26K57m7Rp8
$$ -23 99 323 28 34 73 91 -49 -259 126 -37 127 -239 -27 50 -114 -160 -117 -7 141 -185 72 25 34 -44
4856d4j48J67j91K05K32k9m64K97j50L04n67M26q7K46m96K65P2j15l5J89j59K02
$$ -44 -192 -25 -216 -11 221 192 -272 25 -125 179 -388 38 -49 197 -299 -34 38 -77 -112 77 -82 120
4878A20q9P8q9r2N8m9J68r5K46k48q3q9R9P5O7n5J3J32j00k19K4L9L14o07M18
$$ 120 31 109 20 -72 -14 -63 105 10 256 8 -75 -164 -65 10 77 22 35 167 67 -152 -128 -89 225 -382 36
4903C6j57N7K22q5Mo2n9P2j29J6n2j74K01L12Nn99L59J4O9N1l92K97j32L06o1
$$ 36 -121 -64 158 73 77 15 -44 28 -101 -85 -137 -311 -110 202 207 -392 -33 -19 50 101 -291 6 -126 180 119
4928A19p6j75J81QK2M0l77KM98o9k52L0K26j52LJ44r7Nj82J16R9l77K57k03K0
$$ 119 43 -132 49 57 79 119 -258 -256 242 173 -79 -49 177 25 28 172 75 80 -102 14 113 -264 -7 -210 -190
4953a90K07j02J12J5j96p4L21j00j90K71q7m7J72j71q2K15q4ol3J82J76k35p9
$$ -190 17 -85 27 42 -154 -228 93 -7 -197 74 -13 -60 112 -59 -141 74 -10 -16 -49 133 309 74 -5
4976ek15M45j32P7k38M3k43N08k66pk23L13j17J03k17J65K8n2L38m28j6L3L1L5
$$ -5 -220 225 93 170 -68 -25 -268 240 -26 -33 -256 57 -60 43 -174 -9 19 -33 305 -123 -139 -106 -75 -40
5000d0KMK8n1j9R1k61N9J28L65q0l36K78n5j52j21K43J3J47m9j47J21n64L43q8
$$ -40 -38 -34 -6 -57 -76 15 -246 -187 -59 306 226 -110 168 113 -39 -160 83 96 243 194 47 168 -396 -53 -141
5025a41J19j80P6J28j49K62l16J62j39J12k34L06j54k55M93q4k04K10J83m24J82
$$ -141 -22 -202 -126 2 -147 115 -201 -39 -178 -66 -300 6 -148 -403 90 6 -198 12 195 -229 -47
5046d7j65P9j40K06n0J21J19l96N51k49p0q4K62j38J70l26O1M75l80o3j06M96
$$ -47 -212 -133 -273 -67 -117 4 123 -273 278 29 -41 -125 137 -1 169 -157 -96 379 -1 -64 -170 326
5068C26l63k4J73m23K85k46J88K82l82L91Jj42j8j25p1k4J77o4N9j46J40M4J0
$$ 326 -37 -61 112 -311 -26 -272 -84 198 -184 207 208 66 48 -77 -148 -172 5 -59 0 -146 -6 38 48
5091D8J30o0k55K0N0r4L6k21L51k28K14j92J38KL2J7J25j83K34l70K08j14O0P5
$$ 48 178 118 -137 -117 -67 -161 -125 -346 5 -223 -9 -201 -63 -61 -29 -12 113 -70 164 -206 2 -112 -52 23
5115B3p6J21r3J90j32o5N2j04J57q4O1m6o0m6j06J74j05J93j71J70r7n9J88j16
$$ 23 -53 68 -25 165 33 -32 20 -84 73 -11 50 4 -56 -102 -208 -34 -139 54 -117 53 -44 -103 85 -31
5139c1J23j27J76l88k4M0K60J02j64J48o4k71K17J01L0Qj74l3J58j40K15l65M09
$$ -31 92 -35 141 -247 -271 -231 29 131 -33 115 51 -220 -3 98 128 136 -38 -71 87 -53 162 -203 206
5162B06o9l35J70O5Q7j47J68j83Q9O1kk98P3J94j1r2Ljr6QK07K58m04L8k4J41
$$ 206 137 -198 -28 37 124 -23 145 -38 51 112 110 -188 -115 79 68 -24 -21 -22 -118 -110 97 355 -49 -11 -35 106
5188A06J1m24K57j75L77j33N5j59L75j13j39K24m01M10m52K39j26R3j63M0q2O06
$$ 106 117 -307 -50 -225 152 19 74 -85 290 177 38 262 -139 271 -181 58 -68 25 -138 -98 -180 426
5210D26m40M2N9Rp6r8M5j11L60j13N9l12Q3P8k2Q9j43r1Q7J55j85j3p4K94J29
$$ 426 -14 28 87 96 20 -78 -33 -144 216 103 162 -150 -67 11 -11 78 -65 -156 -69 86 -99 -112 -186 108 237
5235B37k41k9k7j85J67L04k43k07J2M05j02oQN7J1m6k25R8p5K13j40k37J67J88
$$ 237 -4 -33 -60 -245 -78 226 -17 -224 -212 193 91 85 93 150 161 115 -110 -12 -87 126 -14 -251 -84 104
5259A04k39K04k85l1N21o31J83K83R6j34KO8J58n21J23K09L8j77K7j99J68k13
$$ 104 -135 69 -216 -247 274 -357 -174 109 205 71 73 141 299 -222 -99 110 148 -29 -2 -201 -33 -246
5281b46K29q3K31q7L2k25J27J62j22k53NJ29J88J12l92j12M24J21l06L22k84l34
$$ -246 -17 -100 131 44 76 -149 -22 140 18 -235 -230 -101 87 199 -193 -305 119 240 -66 256 -28 -362
5303c62M02o7k0j9J47l27K31o9L6r4P5J45L6k7P6p7j78J19o0j99J42K85n9k3J07
$$ -362 40 -27 -47 -66 81 -246 -15 -84 -48 -142 -67 78 114 87 163 86 -92 27 -33 -232 -90 195 136 113 220
5328B20j30q8K28j25m57L53L26k67j39K15j74J90k16O7q9J63m1o6Oj20j48J04
$$ 220 90 2 230 105 -352 1 327 60 -79 136 -38 152 -64 3 -86 77 36 -30 -24 -144 -292 -188
5350a88J01k76M81k09L13l14J65l00M57J0l91K19M20m83o8J81j99J73j89L10k47
$$ -188 -87 -363 118 -91 222 -92 73 -227 230 240 -151 68 488 5 -63 118 -81 92 -97 213 -34
5371c4J89m23L00Ok54K44j65J24r2j02J41P8k42L49J7j59q8J62J37k39K44l47
$$ -34 155 -268 32 38 -216 28 -137 -13 -105 -207 -66 12 -230 119 136 -23 -111 51 188 -51 193 -154
5393a54O3O3K0K9l80K08K42j18K38l74J67K03k22j2P5k6o0m7L81k99j20K05k8
$$ -154 -91 -28 -8 21 -359 -151 91 -27 211 -163 4 207 -15 -27 48 22 -38 -85 296 -3 -123 82 54
5416E4k28J85J18k23O5J15k00K54q9Lj03k0M7k3J77j77K06j22J8j88J31j60L6
$$ 54 -174 11 129 -94 -29 86 -114 140 51 54 -49 -69 -22 -45 132 -45 161 39 57 -131 0 -160 -124
5439a24J00p2L92j36j12M4J66k81k28K35j1O0J57j14k14K02j62J40m5j66l7l5
$$ -124 -24 -96 296 160 48 92 258 -23 -251 -16 -27 33 190 76 -138 64 -98 42 -3 -169 -206 -241
5461b41L49J15k70n5J90l9J45k91KJ23K2j47j99L93l4j94J1K1K45k62l3K1O4q6
$$ -241 108 223 -47 -102 88 49 194 -97 -95 28 50 -97 -296 97 63 -131 -120 -99 146 -116 -149 -128 -64 -150
5485a50L00j42k10J42J75J29n27L35k06k4N79k26j68J51o4j98K20k49L45l14J14
$$ -150 150 8 -202 -60 115 244 -283 52 -154 -178 401 175 7 158 94 -104 116 -133 212 -102 12
5506A2Q3J1k10M12k43j52O3j48J47r8J24P2l3J23k44O6K58L2j18l33J54j0K9o6
$$ 12 95 106 -104 308 65 -87 -24 -172 -25 -123 1 73 40 163 -81 -15 243 275 157 -176 -22 -32 -3 -69
5530f9Q7j24J92j31k05K73J83k15j22J13K71k60N2n63N74j02R4J77k13mk32K54
$$ -69 18 -106 86 -45 -250 23 206 -9 -131 -18 253 -7 45 -518 56 -46 48 225 12 8 -224 30
5552C0J52l02P2n0Pj06J7j5qL78k91O10o69J39j34J92N4j42L0q7L56k54oN6k9
$$ 30 182 -120 -48 -98 -91 -197 -180 -195 -203 175 -116 494 -175 -36 -170 22 76 -66 -36 -123 233 -21 -27 29 0
$$ [...]
8191E8
##END NTUPLES=NMR FID
##END=
