##TITLE=1H_Pr 
 CCl4
 8 sc, 
 23.10.2023
##JCAMPDX= 6.0         $$ Bruker NMR JCAMP-DX V2.0
##DATA TYPE= NMR FID
##DATA CLASS= NTUPLES
##ORIGIN= UXNMR, Bruker Analytische Messtechnik GmbH
##OWNER= root
$$ XWIN-NMR		Version 3.5
$$ Mon Oct 23 14:19:43 2023 Russian Standard Time (UT+4h)  she@DPX200
##.OBSERVE FREQUENCY= 200.13135
##.OBSERVE NUCLEUS= ^1H
##.DELAY= (6, 6)
##.ACQUISITION MODE= SIMULTANEOUS
##.ACQUISITION SCHEME= undefined
##.AVERAGES= 8
##.DIGITISER RES= 18
##SPECTROMETER/DATA SYSTEM= spect
##.PULSE SEQUENCE= zg30
##.SOLVENT NAME= CDCl3
##.SHIFT REFERENCE= (INTERNAL, CDCl3, 0, 15.7039)
##AUDIT TRAIL= $$ (NUMBER, WHEN, WHO, WHERE, WHAT)
$$ ##TITLE= Audit trail, XWIN-NMR		Version 3.5
$$ ##JCAMPDX= 5.01
$$ ##ORIGIN= Bruker BioSpin GmbH
$$ ##OWNER= she
$$ F:/spectra/data/she/nmr/H-F/1/audita.txt
$$ ##AUDIT TRAIL=  $$ (NUMBER, WHEN, WHO, WHERE, WHAT)
(   1,<2023-10-23 14:17:41.29 +0400>,<she>,<DPX200>,
      <created by zg, POWCHK disabled, PULCHK disabled
       configuration hash MD5:
       00 E9 B6 7A A2 85 ED C7 34 08 36 98 17 FE 4E 26
       data hash MD5: 16K
       94 0E 5B 18 C4 D0 A4 A6 96 37 35 7D 9D CC 73 01>)
$$ ##END=
$$ 
$$ hash MD5
$$ CA BD 4F 27 8E 81 DC 76 25 AA 37 44 CC 90 42 A2
##$RELAX= 
##$RELAX= 
##$RELAX= 
##$RELAX= 
##$RELAX= 
##$RELAX= 
$$ Bruker specific parameters
$$ --------------------------
##$DU= <F:/spectra>
##$EXPNO= 1
##$NAME= <H-F>
##$PROCNO= 1
##$TYPE= <nmr>
##$USER= <she>
##$AMP= (0..31)
100 100 100 100 100 100 100 100 100 100 100 100 100 100 100 100 100 100 
100 100 100 100 100 100 100 100 100 100 100 100 100 100 
##$AQSEQ= 0
##$AQ_mod= 1
##$AUNM= <au_zg>
##$AUTOPOS= <>
##$BF1= 200.13
##$BF2= 200.13
##$BF3= 200.13
##$BF4= 200.13
##$BF5= 200.13
##$BF6= 200.13
##$BF7= 200.13
##$BF8= 200.13
##$BYTORDA= 1
##$CFDGTYP= 0
##$CFRGTYP= 5
##$CHEMSTR= <none>
##$CNST= (0..31)
1 1 145 1 1 1 1 1 1 1 1 1 1 1 1 1 1 1 1 1 1 1 1 1 1 1 1 1 1 1 1 1 
##$CPDPRG= <>
##$CPDPRG1= <>
##$CPDPRG2= <>
##$CPDPRG3= <>
##$CPDPRG4= <mlev>
##$CPDPRG5= <mlev>
##$CPDPRG6= <mlev>
##$CPDPRG7= <mlev>
##$CPDPRG8= <mlev>
##$CPDPRGB= <>
##$CPDPRGT= <>
##$D= (0..31)
0 1.2 0 0 0 0 0 0 0 0.06 0 0.03 0 0 0 0 0.0002 0 0 0 0 0 0 0 0 0 0 0 0 
0 0 0 
##$DATE= 1698056260
##$DBL= (0..7)
120 120 120 120 120 120 120 120 
##$DBP= (0..7)
150 150 150 150 150 150 150 150 
##$DBP07= 0
##$DBPNAM0= <>
##$DBPNAM1= <>
##$DBPNAM2= <>
##$DBPNAM3= <>
##$DBPNAM4= <>
##$DBPNAM5= <>
##$DBPNAM6= <>
##$DBPNAM7= <>
##$DBPOAL= (0..7)
0.5 0.5 0.5 0.5 0.5 0.5 0.5 0.5 
##$DBPOFFS= (0..7)
0 0 0 0 0 0 0 0 
##$DE= 6
##$DECBNUC= <off>
##$DECIM= 32
##$DECNUC= <off>
##$DECSTAT= 4
##$DIGMOD= 1
##$DIGTYP= 9
##$DL= (0..7)
0 120 120 120 120 120 120 120 
##$DP= (0..7)
150 150 150 150 150 150 150 150 
##$DP07= 0
##$DPNAME0= <>
##$DPNAME1= <>
##$DPNAME2= <>
##$DPNAME3= <>
##$DPNAME4= <>
##$DPNAME5= <>
##$DPNAME6= <>
##$DPNAME7= <>
##$DPOAL= (0..7)
0.5 0.5 0.5 0.5 0.5 0.5 0.5 0.5 
##$DPOFFS= (0..7)
0 0 0 0 0 0 0 0 
##$DQDMODE= 0
##$DR= 18
##$DS= 0
##$DSLIST= <SSSSSSSSSSSSSSS>
##$DSPFIRM= 0
$$ [...]
##$SUBNAM2= <"">
##$SUBNAM3= <"">
##$SUBNAM4= <"">
##$SUBNAM5= <"">
##$SUBNAM6= <"">
##$SUBNAM7= <"">
##$SUBNAM8= <"">
##$SUBNAM9= <"">
##$SW= 18.05172834244
##$SWIBOX= (0..15)
0 0 2 0 0 0 0 0 0 0 0 0 0 0 0 0 
##$SW_h= 3612.71676300578
##$TD= 16384
##$TD0= 1
##$TE= 0
##$TE2= 300
##$TE3= 300
##$TEG= 300
##$TL= (0..7)
0 120 120 120 120 120 120 120 
##$TP= (0..7)
150 150 150 150 150 150 150 150 
##$TP07= 0
##$TPNAME0= <>
##$TPNAME1= <>
##$TPNAME2= <>
##$TPNAME3= <>
##$TPNAME4= <>
##$TPNAME5= <>
##$TPNAME6= <>
##$TPNAME7= <>
##$TPOAL= (0..7)
0.5 0.5 0.5 0.5 0.5 0.5 0.5 0.5 
##$TPOFFS= (0..7)
0 0 0 0 0 0 0 0 
##$TUNHIN= 0
##$TUNHOUT= 0
##$TUNXOUT= 0
##$USERA1= <user>
##$USERA2= <user>
##$USERA3= <user>
##$USERA4= <user>
##$USERA5= <user>
##$V9= 5
##$VALIST= <valist>
##$VCLIST= <CCCCCCCCCCCCCCC>
##$VD= 0
##$VDLIST= <DDDDDDDDDDDDDDD>
##$VPLIST= <PPPPPPPPPPPPPPP>
##$VTLIST= <TTTTTTTTTTTTTTT>
##$WBST= 1024
##$WBSW= 4
##$XGAIN= (0..3)
0 0 0 0 
##$XL= 0
##$YL= 0
##$YMAX_a= 52126
##$YMIN_a= -58214
##$ZGOPTNS= <>
##$ZL1= 120
##$ZL2= 120
##$ZL3= 120
##$ZL4= 120
##$ABSF1= 10
##$ABSF2= 0
##$ABSG= 5
##$ABSL= 3
##$ALPHA= 0
##$AQORDER= 0
##$ASSFAC= 0
##$ASSFACI= 0
##$ASSFACX= 0
##$ASSWID= 0
##$AUNMP= <proc_1d>
##$AZFE= 0.1
##$AZFW= 0.1
##$BCFW= 1
##$BC_mod= 2
##$BYTORDP= 1
##$COROFFS= 0
##$CY= 11.3945322036743
##$DATMOD= 1
##$DC= 2
##$DFILT= <>
##$DTYPP= 0
##$F1P= 15.7292609196834
##$F2P= 12.9074282941183
##$FCOR= 0.5
##$FTSIZE= 0
##$FT_mod= 4
##$GAMMA= 1
##$GB= 0.15
##$INTBC= 1
##$INTSCL= 1
##$ISEN= 128
##$LB= 0.24
##$LEV0= 0
##$LPBIN= 0
##$MAXI= 10000
##$MC2= 0
##$MEAN= 0
##$ME_mod= 0
##$MI= 1.114404
##$NCOEF= 0
##$NC_proc= 0
##$NLEV= 6
##$NOISF1= 3.799351
##$NOISF2= 2.8
##$NSP= 1
##$NTH_PI= 0
##$NZP= 0
##$OFFSET= 15.70392
##$PC= 1
##$PHC0= -23068.03
##$PHC1= 24.2527
##$PH_mod= 1
##$PKNL= yes
##$PPARMOD= 0
##$PSCAL= 0
##$PSIGN= 0
##$REVERSE= no
##$SF= 200.130013532006
##$SI= 16384
##$SIGF1= 3
##$SIGF2= 2
##$SINO= 400
##$SIOLD= 16384
##$SREGLST= <1H.CDCl3>
##$SSB= 0
##$STSI= 0
##$STSR= 0
##$SW_p= 3612.71676300578
##$SYMM= 0
##$S_DEV= 0
##$TDeff= 0
##$TDoff= 0
##$TI= <>
##$TILT= no
##$TM1= 0
##$TM2= 0
##$TOPLEV= 0
##$USERP1= <user>
##$USERP2= <user>
##$USERP3= <user>
##$USERP4= <user>
##$USERP5= <user>
##$WDW= 1
##$XDIM= 8192
##$YMAX_p= 0
##$YMIN_p= 0
$$ End of Bruker specific parameters
$$ ---------------------------------
##NTUPLES= NMR FID
##VAR_NAME=  TIME,          FID/REAL,        FID/IMAG
##SYMBOL=    X,             R,               I
##VAR_TYPE=  INDEPENDENT,   DEPENDENT,       DEPENDENT
##VAR_FORM=  AFFN,          ASDF,            ASDF
##VAR_DIM=   8192,          8192,            8192
##UNITS=     SECONDS,       ARBITRARY UNITS, ARBITRARY UNITS
##FACTOR=    0.0002768,     1,               1
##FIRST=     0,             0,               0
##LAST=      2.2672688,     0,               0
##MIN=       0,             -58214,          0
##MAX=       2.2672688,     52126,           0
$$ Real data points
##PAGE= N=1
##DATA TABLE= (X++(R..R)), XYDATA
0@%%%%%%%%%%%%%%qJ6j6J6j6J7k5L2m0M8n6O4p2Q8j04J20j36J52j69J93k24K55
$$ 0 0 0 0 0 0 0 0 0 0 0 0 0 0 0 -8 8 -8 8 -8 9 -16 16 -24 24 -32 32 -40 48 -56 64 -72 80 -89 104 -120 135
36A35k87L21l57L97m42M96n52O10o76P49q28R15j010J113j226J348j484J636j805
$$ 135 -152 169 -188 209 -233 263 -289 321 -355 394 -434 481 -529 584 -642 706 -778 858 -947
55i47J992k202K443k716L031l402L843m377N042n899P046q676J1222j6013L8832
$$ -947 1045 -1157 1286 -1430 1601 -1801 2042 -2335 2707 -3192 3854 -4822 6400 -9613 29219
70B9219o5662L9283J0092k9637N1693r3202J10340o7709r67M3294n8761P4750
$$ 29219 -36443 2840 12932 -16705 34988 -58214 52126 -15583 -16550 26744 -32017 42733
82D2733q4046N6759K389n4673P8872q4100P5885m6118j410M5783p2808Q1216o7156
$$ 42733 -41313 15446 17835 -36838 42034 -42066 33819 -12299 -13709 32074 -40734 40482 -26674
95b6674K7617K1341n5541P1108p7953O9368k9373k8660O6233p0096O3462n7384
$$ -26674 943 22284 -33257 37851 -40102 29266 -107 -28767 37466 -32630 30832 -26552
107b6552K9857K6492p3971P7895n4392L6278j7848k4421P4585q9201O1095k6034
$$ -26552 3305 29797 -44174 33721 -20671 15607 -2241 -26662 47923 -41278 19817 -6217
119f217L691K3574o2789Q4065o3682K1100J2310l4714N8261p3452N9689k0321
$$ -6217 -2526 21048 -41741 42324 -21358 -258 12052 -22662 35599 -37853 21836 1515
131A515j9851M6603o2786O7541n2469J9080J7814m6206O2246o1552M0490o901
$$ 1515 -18336 28267 -34519 33022 -19447 -367 17447 -28759 33487 -28065 12425 5524
143E524k4377M6852o1224O1367l8306k14L2324m8009N5053n5698L7896L24l6948
$$ 5524 -18853 27999 -33225 28142 -10164 -10378 21946 -26063 28990 -26708 11188 11512 -25436
156b5436N1312m8516M2447k8913k572M0572n9527N2795l6614K0617L115l5553
$$ -25436 25876 -22640 19807 -9106 -11678 28894 -30633 22162 -14452 6165 9280 -26273
168b6273N7955n4565L3043j0178j0665L3770n2304N2172l1487L229K1028l9249
$$ -26273 31682 -22883 10160 -18 -10683 23087 -29217 22955 -8532 -5303 15725 -23524
180b3524N0365m8861L1670m467k2426M0924m6991M0053k2885MK3924m2711M8343
$$ -23524 26841 -22020 9650 5183 -17243 23681 -23310 16743 -6142 -6138 17786 -24925 23418
193B3418l7305J5717O513k5294M0563m7376L8034j4243j0893K6987l5211L8575
$$ 23418 -13887 1830 8343 -16951 23612 -23764 14270 27 -10866 16121 -19090 19485
205A9485l2047J1059J5977l4043L8167l4556K6637j0333j3929L4539m0222L2433
$$ 19485 -12562 -1503 14474 -19569 18598 -15958 10679 346 -13583 20956 -19266 13167
217A3167j9687N149J2817l0692L8548l1220J4171L659j8535L0559l6896L2203
$$ 13167 -6520 -1371 11446 -19246 19302 -11918 2253 5912 -12623 17936 -18960 13243
229A3243j5935m838K1189k9464L0868k5909J3156N801k3507L1806k9081J9787
$$ 13243 -2692 -7530 13659 -15805 15063 -10846 2310 8111 -15396 16410 -12671 7116
241G116p555p488K3460l3397L1180j8779L997Q553j9443K7617k7487J6101R26
$$ 7116 -439 -7927 15533 -17864 13316 -5463 -1466 7087 -12356 15261 -12226 3875 4801
254D801j4657K1918k4993K3966j5399n29J6369k4354K3986j9430J2139m95j3621
$$ 4801 -9856 12062 -12931 11035 -4364 -4893 11476 -12878 11108 -8322 3817 3322 -10299
267a0299K3064k2614J4636m910m431J4191k2538K4012j6187L753O833j3706J8322
$$ -10299 12765 -9849 4787 -123 -4554 9637 -12901 11111 -5076 -1323 5510 -8196 10126
280A0126j9837J4834l333q817J5608j6576J4683j0397J848R699j8228J9212j4378
$$ 10126 -9711 5123 1790 -7027 8581 -7995 6688 -3709 -1861 7838 -10390 8822 -5556
293e556Q115j613o421J4383j7191J2475l985l169Q067j2358J4962j2249L828N381
$$ -5556 2559 946 -5475 8908 -8283 4192 207 -2962 5105 -7253 7709 -4540 -712 4669
307D669j0615J2028j2188J0793n449l029R613j0724Q037n007J730L616r742J2353
$$ 4669 -5946 6082 -6106 4687 -762 -3791 5822 -4902 3135 -1872 -142 3474 -6268 6085
321F085r380L885K42l083O590r766R182m182j437M098m565N310n634K967K464
$$ 6085 -3295 590 832 -2251 4339 -5427 3755 -427 -1864 2234 -2331 2979 -2655 312 2776
336B776o697P057n307M248l434N58L723n801M096j262J46O4j682M009l968R19
$$ 2776 -3921 3136 -2171 2077 -1357 -799 2924 -2877 1219 -43 103 167 -1515 2494 -1474 -555
352e55K020k442J758k387L648k957K67J376l58j225R13L70j43j478J751K74j904
$$ -555 1465 -977 781 -1606 2042 -915 -648 728 370 -855 58 428 285 -1193 558 832 -1072
369a072J101P00r26k21K51J201j531p16L468l965K759k230K551j539j527M058
$$ -1072 29 729 -197 -418 -167 1034 -497 -1213 2255 -1710 1049 -1181 1370 -169 -1696 2362
385B362l611J265L38r51K461n003N901l395o92L399m439N520o612N430j200l498
$$ 2362 -1249 16 354 -597 1864 -3139 2762 -633 -1325 2074 -2365 3155 -3457 1973 773 -2725
401b725N611n245M359l137q7N202r039R022o098K782L76m473Q817j0362P458k098
$$ -2725 2886 -2359 2000 -1137 -1224 3978 -5061 3961 -2137 645 1021 -3452 5365 -4997 2461 363
417C63k480N570q115R477p374J347N492r654J0786j0329Q182l027m341J0229j1705
$$ 363 -2117 3453 -4662 4815 -2559 -1212 4280 -5374 5412 -4917 3265 238 -4103 6126 -5579
432e579R339n467P88N230j1211J3621j0633M285K129p510J2126j4673J2629n740
$$ -5579 3760 -1707 -919 4311 -6900 6721 -3912 373 2502 -5008 7118 -7555 5074 -666
446f66k655Q804j1855J2579j0468M323M665j2341J5354j3889R745l544m742J3007
$$ -666 -3321 5483 -6372 6207 -4261 62 4727 -7614 7740 -6149 3596 52 -4690 8317
460H317j7239J5408r210J687N777j2550J6566j5123P970J687j0020J5490j7804
$$ 8317 -8922 6486 -2724 -1037 4740 -7810 8756 -6367 1603 3290 -6730 8760 -9044
473i044J5995r147j270J1183j6845J7330j3851P141K343j2283J8522j8208J2269
$$ -9044 6951 -2196 -3466 7717 -9128 8202 -5649 1492 3835 -8448 10074 -8134 4135
486D135l852n163J3906k0095K0273j3473L072O666j3937J8421j8457J2101q47
$$ 4135 283 -4880 9026 -11069 9204 -4269 -1197 5469 -8468 9953 -8504 3597 2750
499B750j0222J7104j9380J7580j1035J8J1821j9550K1007j7223R663P89j1823
$$ 2750 -7472 9632 -9748 7832 -3203 -3185 8636 -10914 10093 -7130 2533 3322 -8501
512h501J9458k0738J5679o317m790J4885k1264K1962j6472O046O380j6771K1816
$$ -8501 10957 -9781 5898 -419 -5209 9676 -11588 10374 -6098 -52 6328 -10443 11373
525A1373k0866J4934m938p557J8473k2880J9639j1690J627R851k0588K5432k1188
$$ 11373 -9493 5441 503 -7054 11419 -11461 8178 -3512 -1885 7966 -12622 12810 -8378
538h378J0843K97j0488J9636k4369K0336q723m035J3661k0309K3431j9438P554
$$ -8378 2465 2762 -7726 11910 -12459 7877 -846 -4881 8780 -11529 11902 -7536 18
551A8O632j6957K2201k3245J8595p165p059J7710k2183K1440j5459L813J0036
$$ 18 6650 -10307 11894 -11351 7244 79 -6980 10730 -11453 9987 -5472 -1659 8377
564H377k0160K3728k1745J4666k246j2027K1719k3993K0830j3496J238J3353k3047
$$ 8377 -11783 11945 -9800 4866 2620 -9407 12312 -11681 9149 -4347 -3109 10244 -12803
577a2803K3573j8017J0027J312j5646K6028k5879J7644p859k493J5229k5848K6294
$$ -12803 10770 -7247 2780 4092 -11554 14474 -11405 6239 -1620 -4113 11116 -14732 11562
590A1562j6394M180N902j6000K5079k5882J5515j062j0098J8364k5168K5716j5746
$$ 11562 -4832 -652 5250 -10750 14329 -11553 3962 2900 -7198 11166 -14002 11714 -4032
603d032L22J1921j9048K3380k2777J3091K384j4990K1117k3331K1392j1473m369
$$ -4032 -3710 8211 -10837 12543 -10234 2857 5241 -9749 11368 -11963 9429 -2044 -6413
616f413J7289k2495K2901k0107J0567N303j8683K2836k0705J6581p817p497K1732
$$ -6413 10876 -11619 11282 -8825 1742 7045 -11638 11198 -9507 7074 -743 -8240 13492
629A3492k5707K0927j4427O225P490k2126K7133k0802J1405k985q265K1582k7340
$$ 13492 -12215 8712 -5715 510 8000 -14126 13007 -7795 3610 625 -7640 13942 -13398
642a3398K0541q337j691J1173k2169K7932k1676P971L919j2579K1013k5775K0047
$$ -13398 7143 -1194 -2885 8288 -13881 14051 -7625 346 4265 -8314 12699 -13076 6971
655F971n951p110J5217k1243K4312j8493M131R802j7619K1767k3375J7714l521
$$ 6971 1020 -6090 9127 -12116 12196 -6297 -2166 7636 -9983 11784 -11591 6123 2602
668B602j1073J8432k0274K0187j4935J349J3888k1287K0897j8331J3129q78j4608
$$ 2602 -8471 9961 -10313 9874 -5061 -3712 10176 -11111 9786 -8545 4584 3706 -10902
681a0902K3036k1482J6240j0367L5J4194k3292K1489j3726O085L005j5309K4373
$$ -10902 12134 -9348 6892 -3475 -3440 10754 -12538 8951 -4775 1310 4315 -10994 13379
694A3379k3045J3816m088m762J4973k3074K2158j2562J468P440j5751K2081k0801
$$ 13379 -9666 4150 62 -4700 10273 -12801 9357 -3205 -1737 5703 -10048 12033 -8768
707h768J0984J092j0283J7220k2046K0435j0525k095J1205j6676J9938j8010Q296
$$ -8768 2216 3308 -6975 10245 -11801 8634 -1891 -3986 7219 -9457 10481 -7529 767
720G67M702j3789J7651j8833J6359p193n962J5614j8576J7741j4516O385N971
$$ 767 5469 -8320 9331 -9502 6857 -336 -6298 9316 -9260 8481 -6035 350 6321
733F321j5917J8510j5754J0971l411p536J7216j9989J6061r546J771P918j6751
$$ 6321 -9596 8914 -6840 4131 720 -6816 10400 -9589 6472 -3074 -1303 6615 -10136
746a0136J9613j5431P878L19q937J6334j8562J4045n707k984J1029j7285J8739
$$ -10136 9477 -5954 1924 2243 -6694 9640 -8922 5123 -584 -3568 7461 -9824 8915
759H915j3829N144L633j1075J6380j7174J1942k966n657J2054j6062J6151j0668
$$ 8915 -4914 230 3863 -7212 9168 -8006 3936 970 -4687 7367 -8695 7456 -3212
772c212J339P511j3258J5926j5290J0050r98p886J3096j4377J2620p488q22R312
$$ -3212 -1873 5638 -7620 8306 -6984 3066 2068 -5818 7278 -7099 5521 -1967 -2789 6523
786F523j4299J4661j1612O056J631r504J4328j4399J0612m566k593R346j3353
$$ 6523 -7776 6885 -4727 1329 2960 -6544 7784 -6615 3997 -569 -3162 6184 -7169
799g169J3033q826K362M740j0790J3890j2943Q470j937m985J0558j3040J1560
$$ -7169 5864 -2962 -600 4140 -6650 7240 -5703 2767 830 -4155 6403 -6637 4923
812D923o832N29N796j0692J2486j0332N080J290p088J1206j2541J0239m824j629
$$ 4923 -1909 -1380 4416 -6276 6210 -4122 958 2248 -4840 6366 -6175 4064 -760 -2389
826b389O957j0156J0776q314L118L071q029J0385j0013P107k117l691Q438j0508
$$ -2389 4568 -5588 5188 -3126 -8 3063 -4966 5419 -4594 2513 396 -3295 5143 -5365
840e365R529o272J597L527p610R309q033M370M02m969Q220r349P907m187o55N059
$$ -5365 4164 -2108 -511 3016 -4594 4715 -3318 1052 1454 -3515 4705 -4644 3263 -924 -1579 3480
856C480p786Q365o801L396J029n089P410p397N269j798k231N863p929P693n307
$$ 3480 -4306 4059 -2742 654 1683 -3406 4004 -3393 1876 78 -2153 3710 -4219 3474 -1833
871a833J729J953n004O710o422M107o05k835N273o248N628l374pL417n668O267
$$ -1833 -104 1849 -3155 3555 -2867 1240 635 -2200 3073 -3175 2453 -921 -928 2489 -3179 3088
887C088n310L172k75k702M726n061L778j560j004L348m865N042l673J282J215
$$ 3088 -2222 950 675 -2027 2699 -2362 1416 -144 -1148 2200 -2665 2377 -1296 -14 1201
902A201l151M226m324L251j164j151K753l317K983j888J35J870l383L781l141
$$ 1201 -1950 2276 -2048 1203 39 -1112 1641 -1676 1307 -581 -446 1424 -1959 1822 -1319
917a319J906m11j132K406k866K288j046k28J209j859K061j543M10Q89j773K116
$$ -1319 587 176 -956 1450 -1416 872 -174 -402 807 -1052 1009 -534 -124 765 -1008 1108
933A108k081J673r15q8Q76j041P66l93qM88r40J028o66J12K71m43N99p29O31l60
$$ 1108 -973 700 -215 -303 573 -468 298 -95 -103 385 -555 473 -193 -81 190 -253 346 -383 248 -112
953a12J31j75M23n61N33m91M65k90p3M15m42J42K13m88P23r17Q63k97n13J178
$$ -112 19 -156 267 -294 239 -252 213 -77 -150 265 -177 -35 178 -310 413 -504 359 62 -451 727
973G27j567J675j502R31Mr47J492j381Q22m9r38J960k545K352j440J76J072k150
$$ 727 -840 835 -667 264 268 -679 813 -568 254 205 -733 1227 -1318 1034 -406 -230 842 -1308
991a308K799k682J683j66j318K290k662K276j073o78K479l621L769l015J560L50
$$ -1308 1491 -1191 492 326 -992 1298 -1364 912 -161 -839 1640 -1981 1788 -1227 333 683
1007F83k288L576l701K697r27j076K883l978L917k599L86K006l855M802m608L172
$$ 683 -1605 1971 -1730 967 40 -1036 1847 -2131 1786 -813 -427 1579 -2276 2526 -2082 1090
1023A090p65j827L748m523M000k319j88K885m860N372m403K244N46l309N346n891
$$ 1090 325 -1502 2246 -2277 1723 -596 -784 2101 -2759 2613 -1790 454 1000 -2309 3037 -2854
1039b854M739k288p56L529n267N503m052J276K007m838O341o188M440j412k084
$$ -2854 1885 -403 -1159 2370 -2897 2606 -1446 -170 1837 -3001 3340 -2848 1592 180 -1904
1054a904N037o495O029l900P26K698n446O649n759L082M72l919O436p384O264
$$ -1904 3133 -3362 2667 -1233 -507 2191 -3255 3394 -2365 717 1189 -2730 3706 -3678 2586
1069B586l285n69M050o310O859n444K270J685n102P025p017N077j633k480N955
$$ 2586 -699 -1268 2782 -3528 3331 -2113 157 1842 -3260 3765 -3252 1825 192 -2288 3667
1084C667p719P358n080J433K677n968P435o702M099k01l983P096q163O997l992
$$ 3667 -4052 3306 -1774 -341 2336 -3632 3803 -2899 1200 999 -2984 4112 -4051 2946 -1046
1099a046j75M496p574Q312o707L479O58m824P739q144N930k183k018N989q676
$$ -1046 -1221 3275 -4299 4013 -2694 785 1443 -3381 4358 -3786 2144 -39 -2057 3932 -4744
1114d744Q853o240J981K383o112Q481q430N547r65l529O842q555Q065m926J1M702
$$ -4744 4109 -2131 -150 2233 -3879 4602 -3828 1719 754 -2775 4067 -4488 3577 -1349 -1338 3364
1130C364p825R059q187M862J85m948P832q514P192l722j361O145q723Q805o936
$$ 3364 -4461 4598 -3589 1273 1458 -3490 4342 -4172 3020 -702 -2063 4082 -4641 4164 -2772
1145b772L224J984o869R292q862O526k827k168P019r351Q364n337J393L398q077
$$ -2772 452 2436 -4433 4859 -4003 2523 -304 -2472 4547 -4804 3560 -1777 -384 3014 -5063
1160e063J0313q883N095p97l678Q005j0195Q556m232l75M473q104R914q109L264
$$ -5063 5250 -3633 1462 665 -3013 4992 -5203 3353 -879 -1254 3219 -4885 5029 -3080 184
1175A84J886n817Q751j0085Q224l183k350O162q399R195p253K171L654p359Q767
$$ 184 2070 -3747 5004 -5081 3143 -40 -2390 3772 -4627 4568 -2685 -514 3140 -4219 4548
1190D548q710O537j514m503Q323r167Q370o034J224M762q596Q889p198M545j15
$$ 4548 -4162 2375 861 -3642 4681 -4486 3884 -2150 -926 3836 -4760 4129 -3069 1476 1361
1205A361n680R629r599P006l783l84N801r890R846o573K726J220n897R679r641
$$ 1361 -4319 5310 -4289 2717 -1066 -1450 4351 -5539 4307 -2266 460 1680 -4217 5462 -4179
1220d179N825j194k740O695j0062J0084o019P31L404o696R356r360N352L55m641
$$ -4179 1646 452 -2288 4407 -5655 4429 -1590 -859 2545 -4151 5205 -4155 1197 1552 -3089
1235c089P266r035Q744m783j266N898q053Q967q422M680J416o309Q112q096P060
$$ -3089 4177 -4858 3886 -897 -2163 3735 -4318 4649 -3773 907 2323 -3986 4126 -3970 3090
1250C090l547k355P365q909P956o219K900K585p738R440p901N413k200k653P600
$$ 3090 -457 -2812 4553 -4356 3600 -2619 281 2866 -4872 4568 -3333 2080 -120 -2773 4827
1265D827r386P406m027O45L589q108R915p750L733Q0l892P774r534P419k962j189
$$ 4827 -4559 2847 -1180 -535 3054 -5054 4861 -2889 844 924 -2968 4806 -4728 2691 -271 -1460
1281a460M515p585R041o879K065K488n639P949q925O794j898k921N861p432P856
$$ -1460 3055 -4530 4511 -2368 -303 2185 -3454 4495 -4430 2364 466 -2455 3406 -4026 3830
1296C830n810J053L903o684P481p157N030m81m556P360p645O656m375K54M516
$$ 3830 -1980 -927 2976 -3708 3773 -3384 1646 1165 -3391 3969 -3676 2980 -1395 -1141 3375
1311C375p305P217n536K985Q09n162P870p585N248k261j305N222p740P377m786
$$ 3375 -3930 3287 -2249 736 1545 -3617 4253 -3332 1916 -345 -1650 3572 -4168 3209 -1577
1326a577J519J854n220P372o874L996l72k951N830p581O898l858L1L241n655O961
$$ -1577 -58 1796 -3424 3948 -2926 1070 698 -2253 3577 -4004 2894 -964 -933 2308 -3347 3614
1342C614o198L135P61l860N803o571N560k509j439M569o176O444n199K292J509
$$ 3614 -2584 551 1312 -2548 3255 -3316 2244 -265 -1704 2865 -3311 3133 -2066 226 1735
1357A735m543N843n620M152j360k209N060o129N462l612Q25K491n184O150n287
$$ 1735 -2808 3035 -2585 1567 207 -2002 3058 -3071 2391 -1221 -396 2095 -3089 3061 -2226
1372b226L192m05k609M965n678M565k300m99L293n363N808m510K124O85l290N083
$$ -2226 966 561 -2048 2917 -2761 1804 -496 -995 2298 -3065 2743 -1767 357 1042 -2248 2835
1388B835n415M064j608j090L457m913M981l482R04J837l978N109m964L392q15
$$ 2835 -2580 1484 -124 -1214 2243 -2670 2311 -1171 -267 1570 -2408 2701 -2263 1129 314
1403C14j838L800m660M257k628J42K347m072M595l875K111K96k622M158m515L630
$$ 314 -1524 2276 -2384 1873 -755 -613 1734 -2338 2257 -1618 493 789 -1833 2325 -2190 1440
1419A440j846m20K529l798L879k833J011J146k980L981l875K719q35j269K981
$$ 1440 -406 -826 1703 -2095 1784 -1049 -38 1108 -1872 2109 -1766 953 118 -1151 1830
1434A830l782L490k273M93J369k822L444k947J622J16j853L086l491K945j585
$$ 1830 -1952 1538 -735 -242 1127 -1695 1749 -1198 424 540 -1313 1773 -1718 1227 -358
1449c58j31J678k707K979k401J080N14j867K673k727J982o74q31K108k781K693
$$ -358 -489 1189 -1518 1461 -940 140 654 -1213 1460 -1267 715 41 -790 1318 -1463 1230
1465A230j887N90P16j749K284k079J250p4j089J959k301J976j110m3J124j851
$$ 1230 -657 -67 649 -1100 1184 -895 355 281 -808 1151 -1150 826 -284 -327 797 -1054
1481a054K099j778J005K4j005J563j603J220m50m62J249j749J745j258M69L61
$$ -1054 1045 -733 272 296 -709 854 -749 471 21 -441 808 -941 804 -454 15 376
1497C76j040J406j356R38k69m27R14j150J027n86k4O54j079J221j062O66j58l58
$$ 376 -664 742 -614 324 55 -372 542 -608 419 -167 -191 463 -616 605 -457 209 51 -307
1515c07P02p63O13k89j08M79o73O51m41J12K47n01N85n66M13j82KJ42j82J01K6
$$ -307 395 -368 245 -44 -152 327 -346 305 -136 -24 223 -278 307 -259 154 -28 -26 116 -66 35 61
1536F1j53K25k82K50j53O5J3n3K7j0n0N1K9j17K43l18L34k97J80j5j48K51k06
$$ 61 -92 133 -149 101 -52 13 26 -27 0 -10 -60 -9 20 -97 146 -172 162 -135 45 30 -118 133 -73
1559g3O1J27l44N46o05M68k05j15M15o62P66o14L10R3m85O74o38M21Pm84Q90j086
$$ -73 -12 115 -229 317 -288 180 -25 -140 275 -387 379 -235 75 168 -317 357 -281 140 147 -337 553 -533
1581e33R71o58J75L89q76J080r52N69J3o45J050j161R52m14l12R72j392J491j196
$$ -533 438 -220 -45 344 -532 548 -404 165 178 -467 583 -578 374 -40 -352 620 -772 719 -477
1600d77N70K07r01J339j375J001k75n45J226j615J536r93J72P41j485J835j693
$$ -477 93 300 -601 738 -637 364 89 -456 770 -845 691 -302 -130 611 -874 961 -732
1617g32J094j81p81J480j752J528q33j89J169j875K074j675Q34K31j251J942k123
$$ -732 362 181 -600 880 -872 656 -177 -366 803 -1072 1002 -673 161 392 -859 1083 -1040
1634a040J640o87m18J414k016K018j425M00Q06j819K387k306J574l89q58J841
$$ -1040 600 -87 -505 909 -1107 911 -514 -114 692 -1127 1260 -1046 528 139 -719 1122
1650A122k306K113j286P6J164k088K422k079J124K17j491K366k594K131j111k83
$$ 1122 -1184 929 -357 -281 883 -1205 1217 -862 262 479 -1012 1354 -1240 891 -220 -503
1666e03J534k309K440j864P47O56j943K622k563J827n91q32K071k760K596j711
$$ -503 1031 -1278 1162 -702 45 701 -1242 1380 -1183 644 53 -779 1292 -1468 1128 -583
1682e83M36R96k147K653k383J378L1j427K509k965K582j403j15J542k567K909
$$ -583 -147 849 -1298 1355 -1028 350 381 -1046 1463 -1502 1080 -323 -438 1104 -1463 1446
1698A446k388J133M52j843K689k847K179p81q62K206k935K918k165P18R57k252
$$ 1446 -942 191 643 -1200 1489 -1358 821 40 -822 1384 -1551 1367 -798 -80 877 -1375
1714a375K802k622J800l33j377K598k968K597j640J26J586k818L158k592J455
$$ -1375 1427 -1195 605 272 -1105 1493 -1475 1122 -518 -392 1194 -1624 1534 -1058 397
1729C97K7j645K841l036K292j000m59J928l092L255k328Q80O54k056L066l154
$$ 397 424 -1221 1620 -1416 876 -124 -583 1345 -1747 1508 -820 60 714 -1342 1724 -1430
1745a430K114n59r61K231l039K992j886J58J413k520L152l048J901l9j598K560
$$ -1430 684 125 -836 1395 -1644 1348 -538 -380 1033 -1487 1665 -1383 518 479 -1119 1441
1761A441k953K709j553k90J951k811K920k477J283N76k276L075k955K343j196
$$ 1441 -1512 1197 -356 -646 1305 -1506 1414 -1063 220 796 -1480 1595 -1360 983 -213
1776b13n97K318l050K728j860O74R83k629L321k806J697m09j164K676l327K760
$$ -213 -810 1508 -1542 1186 -674 0 983 -1646 1675 -1131 566 157 -1007 1669 -1658 1102
1792A102j479J13J282k640L252k591J068M14j678K805l324K640j019o05J774k634
$$ 1102 -377 -264 1018 -1622 1630 -961 107 521 -1157 1648 -1676 964 -55 -660 1114 -1520
1808a520L047k379P30R84k058K631k828K157n10j319K422k771K731k021M35J372
$$ -1520 1527 -852 -122 862 -1196 1435 -1393 764 254 -1065 1357 -1414 1317 -704 -269 1103
1824A103k469K681k418J657j25j662K717k731K178j335k7J732k884K874k083J073
$$ 1103 -1366 1315 -1103 554 429 -1233 1484 -1247 931 -404 -431 1301 -1583 1291 -792 281
1840B81J99j733K776k689J720n93n93J905k881K807j734M17P82j918K794k714
$$ 281 480 -1253 1523 -1166 554 -39 -632 1273 -1608 1199 -535 -118 664 -1254 1540 -1174
1856a174J575j19j037J966k649K539j382k01J449k229K674k469J320L20j571K156
$$ -1174 401 282 -755 1211 -1438 1101 -281 -482 967 -1262 1412 -1057 263 583 -988 1168
1872A168k346K092j068n44J834k314K287j878Q00P33k048K510k224J641o35q22
$$ 1168 -1178 914 -154 -698 1136 -1178 1109 -769 31 764 -1284 1226 -998 643 8 -814
1888h14K017k403K053j275K40J031k150K508j993J067j8j111K121k437J864q82
$$ -814 1203 -1200 853 -422 -182 849 -1301 1207 -786 281 263 -848 1273 -1164 700 -182
1904a82j48J181k019K261j657N52N25j445K138k292J641m40o67J501k023K033
$$ -182 -330 851 -1168 1093 -564 -12 513 -932 1206 -1086 555 115 -552 949 -1074 959
1920I59j436L05Q31j573J913j847J208j02j049J779j954J718j101L6J064j698
$$ 959 -477 -172 659 -914 999 -848 360 258 -791 988 -966 752 -349 -313 751 -947
1936i47J797j474P73K58j242J771j761J335n77l54J263j778J689j182M69L89j201
$$ -947 850 -624 149 407 -835 936 -825 510 -67 -421 842 -936 753 -429 40 429 -772
1953g72J652j533R52j74o39J333j718J557q96R0O84j324J608j390P50O0p82J279
$$ -772 880 -653 299 125 -514 819 -899 658 -238 -148 536 -788 820 -570 180 240 -542 737
1971G37j471J222n62k90R89j404J484j195N28K90r51J297j299R86l32m05J016
$$ 737 -734 488 -74 -364 625 -779 705 -490 38 328 -623 674 -625 361 29 -376 640
1988F40j303J213q25J92N36j081J325j198P68j35n26R93j175R68n06p1O54j086
$$ 640 -663 550 -275 -83 453 -628 697 -501 267 132 -394 599 -576 392 -114 -185 469 -617
2006f17J195r46M40J39o86J030j103Q40l21j95O48r38R40o76J81L49p48R82r26
$$ -617 578 -368 72 211 -475 555 -548 292 -29 -224 424 -514 426 -250 -69 280 -468 514 -412
2025d12O13j77k82O98q84P90n05O8L91o76P85o59L29P3m54P36q35O93l62m2L98
$$ -412 201 24 -258 440 -444 346 -159 -91 300 -376 409 -250 79 152 -302 434 -401 292 -70 -112 286
2046B86o21O60m87J98J21m52O21o13M31j22k37M97o13N84l86Q6J89m13N36m20
$$ 286 -335 325 -162 36 157 -295 326 -287 144 22 -215 282 -331 253 -133 -47 142 -271 265 -155
2066a55J99K9k58M56n09M27k19k7K51m09M23l28J63L1k26L21l04K39o8j49K70
$$ -155 44 73 -185 271 -238 189 -30 -57 194 -215 208 -120 43 74 -152 169 -135 104 36 -113 157
2087A57l42L65k66R6N7k13K66k14J59m0j24K19k38J92r9oJ37k48K65k05J08k7
$$ 157 -185 180 -86 10 67 -146 120 -94 65 25 -99 120 -118 74 -25 -31 106 -142 123 -82 26 -1
2109an3J10j24P7%m8J15j30J10p6L0j9k5J07q9L7j3j%Pm3M1l9O0o7K8j6J4j5K7
$$ -1 -54 56 -68 9 9 -39 76 -54 56 -20 10 -9 -34 73 -16 21 8 7 7 14 -29 12 -27 33 -34 -6 -22 -8 -23 4
2139Dl1M2n2M4Jo7P0p1P6l2QJ6l8Q8q8K6M9r0J50k04J74n9n2J20j84J61q2L3N8
$$ 4 -27 15 -37 7 8 -59 11 -60 16 -16 -8 8 -30 58 -30 -4 45 -45 105 -99 75 16 -36 84 -100 61 -21 12 70
2168G0j72K10j35L0M0j47K37k97K74j81K3J57k60K42j66Q2N3j89K76k84J84n0
$$ 70 -102 108 -27 3 43 -104 133 -164 110 -71 -48 109 -151 91 -75 7 60 -129 147 -137 47 -3
2190cr4K34l01L29k58R7O1k21L01k60J83nj84K95l58L57k18jJ77l01L72l29J66
$$ -3 -97 137 -164 165 -93 4 65 -156 145 -115 68 63 -121 174 -184 173 -45 -46 131 -170 202 -127 39
2213C9K4j97L08l17K62j12j02K73m00M34l26J14P7k74L82l99K97n1j56L01m05
$$ 39 63 -134 174 -143 119 7 -95 178 -222 212 -114 0 77 -197 185 -214 83 32 -124 177 -228
2234b28M02k59L5K32m15M60m04K41jk10L78m57L87j78m8K65m22M65l50J27P1l19
$$ -228 174 -85 -50 182 -233 227 -177 64 63 -147 231 -226 161 -17 -65 200 -222 243 -107 20 91 -228
2256b28M60m46L41j42q4L08m62M51k92M8J86l80M96m75K90j9k23L86m64M27k42
$$ -228 232 -214 127 -15 -99 209 -253 198 -94 -46 140 -240 256 -219 71 52 -171 215 -249 178 -64
2277f4k6K84m12M38l57J57J25l59M88m84L65j59q5L25m73M64l28R4J65l78M90
$$ -64 -90 194 -218 220 -137 20 145 -214 274 -210 155 -4 -89 236 -237 227 -101 -7 158 -220 270
2298B70m71K99o3k13M39n33M46k83O2K06m02M79m08J90N3k97M91n31L84j41p3
$$ 270 -201 98 35 -178 261 -272 174 -109 -47 159 -243 236 -172 18 71 -226 265 -266 118 -23 -96
2319i6K92m69M94l48J32R5l13M46m20L35q2k18L74m57M69l46J02J82m10M67l90
$$ -96 196 -273 221 -127 5 100 -213 233 -187 148 66 -152 222 -235 234 -112 -10 172 -238 229 -161
2340a61K34K7k65L89m27L26j89m7L03m55M98m01J85N1k97M47l93K57q8j18L12
$$ -161 73 100 -165 224 -203 123 -66 -113 190 -265 233 -168 17 68 -229 218 -175 82 -6 -124 188
2361A88m26M16k52N5J78l69M47l95K18m4j29L26m32L95k10k5K00l34M30l75J56
$$ 188 -238 178 -74 -19 159 -210 237 -158 60 16 -113 213 -219 176 -34 -59 141 -193 237 -138 18
2382A8R0k70L58l97L22j21j09K45l02L39k87R3J49l45L88l27K14n5j23L09l36
$$ 18 108 -162 196 -201 121 0 -109 136 -166 173 -114 -21 128 -217 171 -156 58 3 -120 189 -147
2403a47K39j94O4J93l40L29k33J45J1k28L70l46K31j04l8J92l08L28k16L2J10
$$ -147 92 -102 -38 155 -185 144 -89 56 67 -161 209 -137 94 -10 -48 144 -164 164 -52 -20 90
2424I0k28L41l45K22o7r5K04k72L01k09J2J22k38K90k49J30N9k09K56k47K02q0
$$ 90 -138 203 -142 80 13 -82 122 -150 151 -58 -46 76 -162 128 -121 9 68 -141 115 -132 70 -10
2446a0p9J98k43K37j91P9J14k40K62k20J49lj51K48k59J93r4J1Q3k00K35j85R9
$$ -10 -89 109 -134 103 -88 -9 105 -135 127 -93 56 53 -98 150 -109 84 -10 1 84 -116 119 -66 33
2469C3K7j44K15k40J49o5j5J52k19K10j41J5N5j43J90j69J22k0r2J81j92J80j51
$$ 33 60 -84 131 -109 40 -25 -40 112 -107 103 -38 -23 32 -111 79 -90 32 12 -80 101 -91 89 -62
2492f2L3R8j47J44j43J02J6r0J30j19R0m5m0J20j64J39j06O0M3j24J05q5P0J0
$$ -62 -29 69 -78 66 -77 25 41 -49 81 -38 52 7 -33 87 -77 62 -44 16 59 -65 40 -45 25 35
2516C5r9J03j09J05l1m6R8j45J45j05L9L9j21J41j00Q7kq0R4j04Q3n4J2K8q7J38
$$ 35 -64 39 -70 35 4 -42 56 -89 56 -49 -10 29 -92 49 -51 36 34 -46 48 -56 27 -27 -15 13 -74 64
2542F4q1M4K3q2J06q4L4k4l2J07q8M7m7RN4j16R7o9M2K1n3O6q4O1l4j5Q1j11P6
$$ 64 -17 27 50 -32 74 -10 24 0 -32 75 -13 34 -13 -4 50 -66 31 -38 4 25 -28 38 -46 15 -19 -34 47 -64 12
2571A2l8L4K4n9P3p1M0Rn0P0o1N7m1RN4q8N6j9J6Nn1N9mk0mn6O3k3Qmj5N9o6O3
$$ 12 -26 8 32 -27 46 -25 15 24 -26 44 -17 40 -1 8 62 -26 30 11 27 32 -19 40 36 16 12 -44 19 -4 4 0 -15 44 -22 41
2605D1m4J3k8j5K9k2L6Mm3N7o0M3j4mK6n6L3QrK9l9L0l3J5M5o2P7q4O2Nn7L3l4
$$ 41 -3 10 -18 -33 -4 -26 10 14 -29 28 -32 11 -3 -7 19 -37 -4 4 -5 24 -15 15 -18 -3 42 -20 57 -27 35 40 -17 16 -18
2638a8N3m2K3K3q3N4l9K7j1oL9p1O8k7KK9m4K5k2K3j1%J5kK2l1J1Qm9O8m3J3L
$$ -18 35 -7 16 39 -44 10 -29 -2 -13 -19 20 -51 17 -10 -8 21 -23 2 -20 3 -8 -8 7 5 27 -4 7 15 -34 34 -9 4 7
2671Gk7L3rK6J1k7KNj6k0J3K2qJ2o2OM8k9QLJ1jk3K2m2K4JOPkK2k8Oj0K2Pj6K0
$$ 7 -20 13 4 30 41 14 16 21 5 -15 -2 20 12 24 -38 -32 16 -13 -5 -2 9 8 -15 7 -35 -11 -10 -4 3 1 23 -5 1 -9 13 20 4 24
2709B4Mk4%lnJ2jK0l1J8j0J3j0j1J4LnJk0pK1lj9NKMknJ4Lk9L5Nn8J7K9lL0n7
$$ 24 28 4 4 1 -4 8 7 27 -4 14 4 17 7 -4 10 13 8 9 -11 -18 3 0 -19 -14 -12 -8 -10 -15 -1 2 -27 8 13 -45 -28 1 -2 28 -29
2748b9K9pNL9n1N3m5L1rJ1prK0k8k4O3n5P7p7J5Ol3L5m1M3Mj4J9n0M4l2jN8n2
$$ -29 0 -7 -2 37 -14 39 -6 25 16 27 20 11 31 3 -21 42 -13 64 -13 2 8 -25 10 -31 12 16 2 21 -29 15 -17 -18 40 -12
2782a2M2n7L0k8J8L0p4J00n5NJ8o3R2n3L6%o8J07r7Q8m7j5N3q6R1q6N9pm7Q2j14
$$ -12 30 -27 3 -25 -7 23 -51 49 -6 -1 17 -46 46 -7 29 29 -39 68 -29 59 12 -3 50 -36 55 -31 28 21 -26 56 -58
2813e8R3m5l6Q1r8R4r4O9Qq7J19r7Q1j3o6J38j45J25j02J5N7r5J54j58P7J2p6
$$ -58 35 -10 -46 35 -63 31 -63 6 14 -73 46 -51 30 17 -49 89 -56 69 -33 -18 39 -56 98 -60 17 29 -47
2840d7J20j30J06k1p0J51j80J85j39N5L0j33J59j31P8l7n0J34j70J66j13jJ12
$$ -47 73 -57 49 28 -42 109 -71 114 -25 30 60 -73 86 -45 33 -4 -54 80 -90 76 -37 -38 74
2863G4j81J92j81J19j4q7J92k34J83q1k4J44j96K03j52M2M7j17J88k04J59n8m2
$$ 74 -107 85 -96 23 9 -78 114 -120 63 -18 -42 102 -94 109 -43 -1 46 -71 117 -87 72 14 -28
2886b8J68k47J92j08L5P4k01K55k34J30j1j16K09k51K06r6k8J27j75K00j71P0
$$ -28 140 -107 85 -23 12 86 -115 140 -94 36 25 -91 118 -133 73 -23 -51 76 -99 101 -70 0
2908@M5j67K18k56K10n2o0J70k42K35j69O8R1j81K01k25J82l8j09K40k97K46j50
$$ 0 45 -122 96 -160 50 -2 -62 108 -134 101 -68 0 91 -90 111 -114 68 30 -79 161 -136 110 -40
2931d0M1R5k26K68k00J16Rj94K85k87K24j27k1J73k93K88k19J26L8j99K55k41
$$ -40 1 96 -130 138 -62 54 63 -131 154 -133 91 -36 -57 116 -177 111 -108 18 56 -143 112 -129
2953a29J71l6r3K40l46L30k00L1J18k29L19k97J60L2j73K59k88K69j38m9K03k84
$$ -129 42 6 -87 153 -193 137 -63 -32 86 -143 176 -121 39 71 -102 157 -131 138 0 -49 154 -130
2975a30K95k43J03P0k37K98k85K10r1j24K97l16K57k00O7Q7k60L45k99K16o2r1
$$ -130 165 -78 25 95 -142 156 -129 81 -10 -134 163 -153 104 -96 -29 58 -202 143 -156 60 -2 -93
2997i3K59l46K93j59K9J29l00L75l13J44M3j72L13l79K82j06n7J91k76L21k52
$$ -93 166 -180 113 -46 -17 112 -188 187 -126 18 61 -111 202 -177 105 -1 -58 133 -143 178 -74
3018g4O8J09k44L04l01K40j05j25K76l11K77k07N5J30k45L06l19K02J7k04L29
$$ -74 -6 103 -141 163 -138 102 -3 -128 148 -163 114 -93 -38 92 -153 153 -166 36 53 -151 178
3039A78l34K97j65j8J82l14L23k40J28M6k03K94k90J94p4p4K27k97L13k16O3P8
$$ 178 -156 141 -24 -42 140 -174 149 -91 37 83 -120 174 -116 78 4 -70 157 -140 173 -43 20 98
3061I8k29L07l02J69k6j16K47l14K79j49j1J49k75L36k87J47L9j96K73l00K53
$$ 98 -131 176 -126 43 17 -99 148 -166 113 -36 -47 102 -173 163 -124 23 62 -134 139 -161 92
3082I2q5q1K01l06L22k29R2R8k19K88k87J96m3j18K28l00L06k00J3J60k63L04
$$ 92 7 -74 127 -179 143 -86 6 104 -115 173 -114 82 39 -79 149 -151 155 -45 -32 128 -135 169
3104A69k95J64k5j35K74k70K24j22m3J67k95L42k61J23K9j82K96l24K64j06o9
$$ 169 -126 38 13 -122 152 -118 106 -16 -59 108 -187 155 -106 17 46 -136 160 -164 100 -6 -75
3125g5K22l09K59j63M4O8j72K59k50J73j7j40K49k62K75j74rJ45k58K72k06J26
$$ -75 147 -162 97 -66 -22 46 -126 133 -117 56 39 -101 148 -114 161 -13 -22 123 -135 137 -69 57
3147E7jj83K61k70K03q4m6J33j94K13j49L5N6j87K68k25J60l0r6J99k48K27j51
$$ 57 56 -127 134 -136 67 -17 -63 70 -124 89 -60 -25 31 -156 112 -113 47 17 -79 120 -128 99 -52
3170e2K0J11j94K30k04J22J6j39K29k14J96j03n1J28j85J93j55Q1K1j33K21k03
$$ -52 -32 79 -115 115 -89 33 49 -90 139 -75 121 18 -33 95 -90 103 -52 29 50 -83 138 -65
3192f5J20l9n6J47k05J75j38M4O9j59J70j61J23l7m6J32j29Q7n6k2J10j39J92
$$ -65 55 16 -40 107 -98 77 -61 -17 52 -107 63 -98 25 -12 -58 74 -55 32 -24 -46 64 -75 117
3215A17j59M7J1o8J42j52J17o5m1J53j91J71j17N4O1j44J35j29J23o9n9J29j22
$$ 117 -42 5 16 -52 90 -62 55 -10 -51 102 -89 82 -35 19 80 -64 71 -58 65 -4 -63 66 -56
3238e6R7p1nP1r0J13j30O2L0p9R9j04Q8l6J6M9j09J10q5J4N5p7J08q5N9l6j5M8
$$ -56 41 -30 -35 36 -54 59 -71 -9 21 -58 41 -63 25 -11 5 54 -55 55 -30 -16 39 -38 70 -15 44 8 -7 41
3266D1p2O4j6nN5o5K3l4K5J8n9N0m8N0l0J2K3m4J2lnL8p1O9l6PKk6M1k7J2jnJ6
$$ 41 -31 33 17 12 67 2 25 -9 16 34 -25 25 -23 27 -3 9 32 -12 0 -3 -8 30 -41 28 -8 -1 1 -25 16 -11 1 0 -5 11
3300A1k2L6nk6M0n0L8n0K2K3kj6PKrj1OK1l5L0m0N1j6J0j3l5K5J3onl1N6m7ML2
$$ 11 -11 25 20 -6 34 -16 22 -28 -6 17 15 -1 6 8 -1 -12 -6 15 -20 10 -30 21 5 15 2 -33 -8 5 -1 -6 -37 19 -28 -24 8
3335Hl2L6l4L2Jk8N4n8N9o1lO3p2R1q2L8Pk9O5p3O1n1nK9n4Q5p0K7K4q9J01j05
$$ 8 -24 12 -22 10 11 -17 37 -21 38 -23 -26 37 -35 56 -26 12 19 -10 55 -18 43 -8 -13 16 -38 47 -23 4 28 -61 40 -65
3367f5P6n1NO9j00J00n6J4M3j07J32j13O2l0j2Q2j14J10q6K3M5o5J14j12L1M9
$$ -65 11 -40 -35 34 -66 34 -22 -8 35 -72 60 -53 9 -21 -33 49 -65 45 -41 -18 27 -38 76 -36 -5 44
3393D4j11J57j56J46p2j5M8j08J43j05K4M4r7J26j39P2Lp4J37j73J72j06L5M6
$$ 44 -67 90 -66 80 8 -7 41 -67 76 -29 -5 39 -58 68 -71 1 4 -70 67 -106 66 -40 -5 41
3417D1j44J63j21Q5J0j13J85j87J48o4m6J35j62J77j52Q7J1j15K02k13J41o6n6
$$ 41 -103 60 -61 24 34 -79 106 -81 67 3 -43 92 -70 107 -45 42 53 -62 140 -73 68 2 -54
3440e4J61j94J49j03M2O2j63J88j78J12K2j08J48k17J85r4PJ14j96K23j80P6K8
$$ -54 107 -87 62 -41 1 63 -100 88 -90 22 44 -64 84 -133 52 -42 -35 79 -117 106 -74 2 30
3463C0j25K12k05J35l2l6J25k23K36j64L7J03j75K11k24J43k3p4J73k20K18j59
$$ 30 -95 117 -88 47 15 -21 104 -119 117 -47 -10 93 -82 129 -95 48 25 -49 124 -96 122 -37
3485c7pJ59k14K32k36J32k8j06K09k32J90j03j8J56k04J93j57O1Q1j77K35k42
$$ -37 -44 115 -99 133 -103 29 1 -105 104 -128 62 -41 -59 97 -107 86 -71 -10 71 -106 129 -113
3507a13J54m9m2J77k50K21j23J4J12k28K73k19J34l8q4K16k76K44j69M5R9k18
$$ -113 41 -8 -50 127 -123 98 -25 -11 101 -127 146 -73 61 23 -61 155 -121 123 -46 -1 98 -120
3529a20K50k09O8L2j23K63k92K00q7n2J78k44K61k34R8J05k15K22j99J40j0j33
$$ -120 130 -79 -11 21 -102 161 -131 69 -18 -70 108 -136 125 -109 -11 94 -121 101 -98 42 32 -101
3551a01K38k59K56j81L8J33k40K85k62J39J9j55K34k57K18r7q0J84k59K77j75
$$ -101 137 -122 134 -47 -9 124 -116 169 -93 46 65 -90 144 -113 105 8 -72 112 -147 130 -45
3572d5O8J2j46K67k77J68o7m7K03k96K82j80M0R0k15L07k80J60oj24K00k61K44
$$ -45 23 35 -111 156 -121 47 -20 -67 136 -160 122 -58 -18 72 -143 164 -116 44 38 -86 114 -147 97
3595I7j09n2J63k11K59k32J19L6j72K33k28J70p7m2J90k74K32j69J00M5k10L06
$$ 97 -12 -64 99 -112 147 -85 34 70 -102 131 -97 73 -4 -46 144 -130 102 -67 33 78 -132 174
3617A74k65J37l9j05K34k30J85j40K5J04k35K86k09J09%j16K15k50J72o0m1J39
$$ 174 -91 46 7 -98 136 -94 91 -49 -24 80 -155 131 -78 31 31 -85 130 -120 52 -8 -49 90
3639I0k10K34j99R8P2j79K30k63K22p2r2J98k49K29j29K2N3j51K06k16J52j3j35
$$ 90 -120 114 -85 13 85 -94 136 -127 95 23 -69 129 -120 109 -20 2 55 -96 110 -106 46 33 -102
3662a02K24k32J91j34%J46k26K38j89J04J2j37K12k13J62n7l5J45k39K36j57N8
$$ -102 122 -110 81 -53 -53 93 -133 105 -84 20 32 -105 107 -106 56 -1 -36 109 -130 106 -51 7
3684GM8j61K61k16P8J0q8J79k23K06j30J5P9j57J98j82R1Rj15J71j91J59n7l8
$$ 7 55 -106 155 -61 17 27 -61 118 -105 101 -29 -14 65 -92 106 -76 15 24 -91 80 -111 48 -9 -47
3708d7J29k07K01j44M9M6j28K04k09J32k3o2J28j53J54q3J6Q7j69J80j65J10q
$$ -47 82 -125 76 -68 -19 27 -101 103 -106 26 3 -59 69 -84 70 -13 3 90 -79 101 -64 46 38
3731C8q2J48j89J69j00OJ08j79J59j15M0K2r3J79j89J38m8o1R2j26J25q7L3N9
$$ 38 -44 104 -85 84 -16 -10 98 -81 78 -37 3 25 -68 111 -78 60 12 -49 43 -83 42 -45 -12 47
3755D7j27J40j38R5Kr2J46j39J29r5L6N1j24J56j36N8M3r6J44j36R3o8OP1j39
$$ 47 -80 60 -78 17 19 -73 73 -66 63 -32 4 55 -69 87 -49 9 52 -44 100 -36 57 -11 -5 66 -73
3780g3J32r1K2L6q8J12r3R4m1m2Q1j56J44o0J0J0o1Q2o9O2qk6Q6j03Q1q4L5P6
$$ -73 59 -32 -10 26 -62 50 -43 51 10 -32 49 -107 37 -23 -13 -3 -64 18 -51 11 3 -23 63 -40 41 -43 -8 68
3808F8j07O4m0K8jk2O0n2K6kn2R4j03Q0n0L0L2p6P6r6L7Pl1K0mN3o4J1K7o7P6
$$ 68 -39 25 -15 13 12 -10 50 -2 24 22 -30 64 -39 41 -9 21 53 -23 53 -43 -6 1 -30 -10 -14 39 -25 -14 13 -54 22
3839B2m1K1qk9M4m7M6l0J7Ol8Q2m3K0K6o9N0l5L6k8qO7o6N2l1%K1m6PqJ5k5oM9
$$ 22 -19 2 -6 -35 9 -38 8 -22 -5 1 -37 45 2 22 48 -21 29 -6 30 2 -6 61 -5 47 16 16 37 -9 -2 -10 5 -20 -26 23
3873B3l6L4j5j6L2m0L3k5olMK1k4J3J4Kj2JRj0lL6k8RmJL8n0J0MqPJj5M1n5L0
$$ 23 -13 21 6 -10 22 -18 15 -10 -16 -19 -15 6 -18 -5 9 11 -1 0 9 -1 -4 32 4 13 9 10 48 -2 8 12 4 11 12 -3 38 -17 13
3910A3k9J8j%K1m7K9J8m3L3m2J3qpK1k0N2m6M5l5MrJ4J5O%J6m9L2l0L0Pm3P5m5
$$ 13 -16 2 1 1 22 -25 4 22 -21 12 -30 -17 -25 -32 -11 -31 21 -25 20 -15 -11 -20 -6 9 15 15 31 -18 14 -16 14 21 -22 53 8
3945H%j6J1M1m5J0Ql5L9m5L0kKol7M4j9N2m5k9M6m1L3jl1K4m4Q7o1M4k2k5O5p2
$$ 8 8 -8 3 44 -1 9 17 -18 21 -24 6 4 6 0 -37 7 -12 40 -5 -34 12 -29 4 3 -28 -4 -48 39 -22 22 0 -25 40 -32
3979c2M9Mj7L6p2Q0l2J5j5k9Q8q1LJ7l0J6l4O9l5nL0o8O5n1J5pj2N2n4Q0p7NM6
$$ -32 17 21 4 40 -32 48 16 31 16 -13 75 -6 -3 14 -16 0 -34 35 0 -5 25 -43 22 -29 -14 -21 -33 19 -35 45 -32 -27 19
4012A9n8P7o6M2%n1Q3j08R2l4k4O6q6R4n7RM2o8R1q1P0m6m2P8r7P2k6OK5r8J11
$$ 19 -39 38 -28 14 14 -37 46 -62 30 -4 -28 38 -48 46 -11 -2 40 -28 63 -18 52 6 -36 42 -55 17 -9 -3 22 -76 35
4043C5n6K4j0l9Q2q4P4m7PO4j22J14m9j0L8n8R8r5N2km1J01j34J38p6l5P8q8Q9
$$ 35 -21 3 -7 -46 36 -48 26 -21 -14 50 -72 42 -7 -17 21 -37 61 -34 18 16 -25 76 -58 80 4 -31 47 -41 48
4072D8q1N2mk7Q0q9N6n0PN0j26J23o7K9J2n2Q3j00O0k5k3J01j08Q0l1j8N2o6J06
$$ 48 -33 19 15 -12 68 -21 35 -15 -8 42 -84 39 -28 1 13 -39 44 -56 4 -21 -44 57 -51 29 -2 -20 32 -34 72
4101G2j04M9km0R4j16R6p0K7O7p8O4o7J6L2n3O4q7O8l7OM6j00J03p4J0M5p6J15
$$ 72 -32 17 15 -25 69 -47 49 -21 6 73 -5 59 -8 8 40 -13 51 -36 32 -5 1 47 -53 50 -24 -14 31 -45 70
4130G0j16O2j9m0O9q9P0n3L3K8r7J25p1L3Jn7J07j03O6k1j5N4o3P2m5MM2p9J09
$$ 70 -46 16 -3 -43 26 -63 7 -46 -13 15 -82 43 -28 5 6 -51 56 -47 19 -2 -17 37 -26 46 1 5 47 -32 77
4159G7p7K5J0q2J22j08J03q6K4L3r5R5r1N1Qn6Q0p2M0l0NM9q0J07j00N8J5p9R8
$$ 77 0 25 35 -47 75 -33 70 -16 8 41 -54 41 -50 1 9 -47 33 -39 1 -29 -24 25 -55 52 -48 10 25 -54 44
4188D4q0P1k0l3P5q7Q0n6J2J2o3J19q2M6J2j03J09p7O6o6J0M6q3R4o8MM1o5Q3
$$ 44 -36 35 15 -18 57 -30 50 -6 6 18 -45 74 -8 38 50 -53 56 -21 45 -21 -11 35 -48 46 -22 -18 23 -42 41
4217D1r9Q7k0n2R2j09P1l0j7N0n9J02j05N7Kl4P0n9L4k3l0P4n5P9j03M8K4p1J04
$$ 41 -58 29 9 -43 49 -60 11 -19 -36 14 -45 57 -48 9 11 -23 47 -12 22 -1 -31 43 -12 67 -36 12 36 -35 69
4246F9p5N8o3J9N5j27R6n8K1K6n3O5r3P2k8j6O8p6P2k6l6P4n9O9q6K3K2l1N2m3
$$ 69 -6 52 -11 8 63 -64 32 -26 -5 21 -32 33 -60 12 -16 -32 36 -40 32 6 -30 44 -15 54 -32 -9 13 -18 34 -9
4276iM2k1k8N1l6L4k6J5Nm3O3o7K9Jk5O5n6J4j3J2L0q0P9m3mK1j4J0m5M4mm7P4
$$ -9 33 12 -16 35 -1 33 7 22 27 -16 47 -20 9 10 -15 50 -6 8 -5 7 37 -43 36 -7 -11 10 -4 6 -39 5 1 -46 28
4309B8q0P6j1l4N3p0L6l0N8j1m1O6n7L7l0QK8n3N6k2K2j0l5L7l2K6Kk4M1m4L1
$$ 28 -52 24 13 -21 32 -38 -2 -32 26 15 -26 40 -17 20 -10 -2 26 -27 29 7 29 19 -16 21 -11 15 17 -7 34 -10 21
4340B1k5j3Qk3L8Nj9Pj1J5m4P4k4m3K6j2M5m5M9l3ML0m8L7j5ML3o1Q3p7K5jlJ8
$$ 21 -4 -17 -9 -32 6 11 -8 -1 -12 3 -41 33 9 -34 -8 -20 25 -20 29 -4 0 30 -18 19 4 8 41 -20 63 -14 11 10 7 25
4374B5k2rK2j8K1o5P1m2j5N8q0P9m5L5j2l6M5m1J4j2pN3k7Rk6OL8m9O3nj5k6J2
$$ 25 3 -6 16 -2 19 -46 25 -17 -32 26 -54 25 -20 15 3 -33 12 -29 -15 -27 -34 19 -8 1 -25 -19 19 -30 33 28 13 -13 -1
4407aK1k8L7k3K4pj9J6j9J1J7l7J2qK0jk9K5m9L4J7j1Nl5K0J2J1j5j0RjRrLK6
$$ -1 20 -8 29 6 30 23 4 20 1 12 29 -8 4 -4 16 15 -14 11 -38 -4 13 2 7 -28 -8 4 15 0 -10 -1 -2 7 -2 1 27
4442B7j6pKKjj4L2mm%j5J8rJ0l3K4J0k4L4j3l6J9JK5l3j7K1J9j7Ok5oK4nqJ4J
$$ 27 11 4 6 8 7 -7 25 21 17 17 2 20 11 21 -12 12 22 -2 32 19 -17 2 3 28 -5 -22 -1 18 1 7 -18 -24 0 -5 -13 1 2
4479BK8j8j5j3QL2j7Nk2J6j0K8j0KJ1%mJ6m5K4j4J8j3%J6mk3JPl3K5LMj2Mj4q
$$ 2 30 12 -3 -16 -8 24 7 12 -10 6 -4 24 14 16 27 27 23 39 -6 18 4 22 9 9 25 21 -2 -1 6 -27 -2 1 5 -7 -3 -17 -25
4516b5K3oj5J5%Nmk8O1n3L1j3KK4qQj2J6Mk0JQJ9j8K3qqj6Rk0J9l5J9pmK1pJ7
$$ -25 -2 -8 -23 -8 -8 -3 -7 -35 26 -27 4 -9 -7 17 9 17 5 21 25 5 6 14 33 15 38 30 22 6 15 -5 14 -21 -2 -9 -13 8 1 18
4554A8k8L4k9k3K7k5RJ0NJ6m8O0o3L3J1j0J9j9oKJ0K2J8k8%oK1k6M0j3J3l0mK3
$$ 18 -10 24 -5 -28 -1 -26 -17 -7 -2 14 -34 26 -37 -4 7 -3 16 -3 -9 -7 3 25 43 15 15 9 30 4 44 31 44 14 10 33
4588C3m7J9K3l2K2l8L3l8K7J0o4O9m0M0j5j4J9j6J9kj1L0m9L4k6J2J1k9M0j9L9
$$ 33 -14 5 28 -4 18 -20 13 -25 2 12 -52 17 -23 17 2 -12 7 -9 10 8 -3 27 -22 12 -14 -2 9 -20 20 1 40
4619D0l7J4J1l0K8l2J4Nj9M5o0N1l3PK3n6J7j2J7J0m0P2l6J7j3j2M5l0J5l9J1
$$ 40 3 17 28 -2 26 -6 8 13 -6 39 -21 30 -3 4 27 -29 -12 -24 -7 3 -37 35 -1 16 3 -9 36 6 21 -18 -7
4650gK8k5L2l8L1Rm8N6m5K3Jn8N8lkj5K4K8n7P4p7M0j5j0M0l8K6j6m0L2l8K4J0
$$ -7 21 -4 28 -10 21 30 -18 38 -7 16 17 -41 17 14 12 -3 21 49 -8 66 -11 29 14 4 44 6 32 16 -24 8 -30 -6 4
4683Dplj1J7l5K1j0j8Q2p1N4l4J2M9q3O3o2N0rl3N6o3Q6m8LM6o6N0l7K4Po3N7
$$ 4 -3 -6 -17 0 -35 -14 -24 -42 40 -31 23 -11 1 50 -33 30 -32 18 9 -24 32 -31 55 7 10 56 -10 40 3 27 34 -29 28
4716B8m1N0m8jM8o2M1l0LK1n8O0n7N5Nn7Q1o9P0m2j7N3r2J02l5K7j0n5Q0p5N9
$$ 28 -13 37 -11 -12 36 -26 15 -15 -12 9 -49 11 -46 9 14 -43 38 -31 39 -3 -20 33 -59 43 8 35 25 -30 50 -25 34
4747C4j4k8M6p2J02q9RO3q1R4o7M7k9j6J5j6Qj0k1O0p5M9nkol0N9o8O6qm1L1l1
$$ 34 20 -8 38 -34 68 -21 -12 51 -30 64 -3 44 15 -1 14 -2 6 -4 -25 35 -40 9 4 2 -4 -34 25 -43 23 15 -26 5 -26
4780b6N0l9j5O3n8P5o5P5l6n4P1p7M9jj6N9o6N9o4L6J4r5J48j11M4j3k7K9o6Q6
$$ -26 24 -15 -30 33 -25 50 -15 60 24 -30 41 -36 13 12 -4 55 -11 48 -16 20 34 -61 87 -24 20 7 -20 9 -57 29
4810B9o2J3K6n8P4n9K7K6n9O8m7L9j5KQm0N8k9Rj2l0J18r9M9k9nK5l9N1k9Pjp0
$$ 29 -33 -20 6 -52 22 -37 -10 16 -43 25 -22 17 2 4 12 -28 30 1 10 -2 -32 86 -13 36 7 2 27 -12 39 10 17 16 -54
4843e4R8p9N7J3m6M0p5Q2m3j6M4o7R6p6K4Kn1P2o5R3p3j3M5n7P0l6M2k4l5O4l6
$$ -54 44 -35 22 35 -11 29 -46 36 -7 -23 21 -46 50 -26 -2 0 -51 21 -44 49 -24 -37 8 -49 21 -15 27 3 -32 32 -4
4874dJ8rrN7n0N7p2LL3k4Q9j23O5n3OK9n8O4n9j0P2n8P1l8Qj2l9Q3j07J13m9k2
$$ -4 14 5 -4 53 3 60 -12 -9 24 0 89 -34 31 -22 -16 13 -45 19 -40 -50 22 -36 35 -3 5 -7 -46 37 -70 43 -6 -28
4906b8L1j2N9o8L7nn9Q1l9J4mlK9l0J7Jk7N0o9M8l6L9kl8P2o7M2l8Rk2k0N6j8
$$ -28 3 -9 50 -18 19 14 -45 36 -3 11 7 4 33 3 20 21 -6 44 -25 23 -13 26 24 -14 58 -9 33 -5 4 -18 -38 18 0
4939@j3J2m8P5p7N8Jk8M2n4P2q6L2RJ5L0o5L6lk8Q3r7N8j7lK4l7L1j7j2Rj1N4
$$ 0 -13 -1 -49 26 -51 7 8 -20 22 -32 40 -46 -14 -5 10 40 -25 11 8 -20 63 -34 24 7 4 28 -9 22 5 -7 2 -9 45
4972D5m3K5j3k1L0l4M7p6O4l8j7K5k0K5Jj2J0nK2%n0N2l8M6k5K9k0pJ0%nK7j6
$$ 45 2 27 14 -7 23 -11 36 -40 24 -14 -31 -6 -26 -1 0 -12 -2 -7 15 15 -35 17 -21 25 0 29 9 2 12 12 7 34 18
5005A8K1m7L1l4J1M7m1M1p7K8j0QJ6l8N7n2J7j0j8K4k9J7K5krnJ1Pl2M2k8L4m8
$$ 18 39 -8 23 -11 0 47 6 47 -30 -2 -12 -4 12 -26 31 -21 -4 -14 -32 -8 -37 -20 5 3 -6 -11 0 7 -25 17 -11 23 -25
5038b5K1M0n3J9rK1oRk0j2N0m4K1Pm6N3j4QPl9J5J7j0Lk0pj7K1J9j1k0PJ4J3o
$$ -25 -4 36 -17 2 -7 14 8 17 -3 -15 35 -9 12 19 -27 26 12 20 27 -12 3 20 10 13 -7 -14 -31 -10 9 -2 -22 -15 -1 12 6
5073Fj4mJJ2Onj8K2MJ2j4J5j3J6nMpJ3pnr%j6Pj8K6J0k7J2JK0n1J5NOok1L5k1
$$ 6 -8 -12 -11 1 7 2 -16 6 10 22 8 23 10 26 21 25 18 31 24 19 10 10 -6 1 -17 9 19 -8 4 5 25 -26 -11 -6 0 -6 -27 8 -13
5112a3K9m8L8J5k6J9j6J1OOk9JL9k0pK6j4qj6OL7l5L2l5L2l6L0j2l7O5m2J1j4
$$ -13 16 -32 6 21 -5 14 -2 9 15 21 -8 -7 32 12 5 31 17 9 -7 -1 36 1 33 -2 30 -6 24 12 -25 40 -2 9 -5
5145em6P9o9K3J8j7J3k2K7OLj4m1P3l2J8j2Oj1j6N1j6%j1jL7k0nKkL1l7K3o0M3
$$ -5 -51 28 -41 -18 0 -17 -4 -26 1 7 10 -4 -45 28 -4 14 2 8 -3 -19 32 16 16 5 4 41 21 16 18 16 47 10 33 -27 16
5180A6Jl2K7j4L3j9k0J6m9O7l3j4L2m1M8l5KL3m3L4k6K7Pp0R8r7J08o4rL3m1M9
$$ 16 17 -15 12 -2 31 12 -8 8 -41 26 -7 -21 11 -30 18 -17 -15 18 -25 9 -17 10 17 -53 45 -52 56 -8 -17 16 -25 24
5212B4k8J8K5l7M2l8j1J0k9N6n6Q4j02L4K7n2N1p2N5Mk4M7n3L8k5k4M4n0P7p3
$$ 24 -4 14 39 2 44 6 -5 5 -24 32 -24 60 -42 -8 19 -33 18 -54 1 5 -19 28 -25 13 -12 -36 8 -42 35 -38
5242c8M6j1oK9m9M8j5j4L6o7Q7n9L8Ll9N0o1O7n1JO7j10R6p0K3N2q5Q3q7L3K3
$$ -38 8 -3 -9 20 -29 19 4 -10 26 -41 46 -13 25 28 -11 39 -22 45 -6 -5 62 -48 48 -22 1 53 -32 51 -36 -3 20
5273B0l2N4r9Q8l6j3N2q9O8m1jK4m6P2o2M7j5KL4o0R1n5LJ2k8P5j20P3j6K3ql6
$$ 20 -12 42 -57 31 -5 -18 34 -55 13 -28 -29 -5 -51 21 -41 6 -9 -7 27 -33 58 3 6 18 -10 65 -55 18 2 25 17 -19
5305a9N1l0K9j2l5M6p5P4m7j3P2p7M7m1J7K5p2P5l7K4Jm9J03r6N3k5J0M5p2R5
$$ -19 32 2 31 19 -16 30 -45 29 -18 -31 41 -36 11 -30 -13 12 -60 15 -22 2 3 -46 57 -39 14 -11 -1 44 -28 67
5335F7p2K5jm4P9o0L1j9l3R5r6O3m2qN5o5P5r6P6k7l6R8j05N6ol6P7j24J05o8
$$ 67 -5 20 19 -25 54 -6 25 6 -27 68 -28 35 -7 -15 40 -25 50 -46 30 3 -33 65 -40 16 10 -26 51 -73 32 -36
5365c6K7L1n2O4n7M3j0m7R6j07P5j6j9N3o8R7q6M0K1q2Q5o0J7rRL2q1J03r3N4
$$ -36 -9 22 -30 34 -23 20 10 -37 59 -48 27 11 -8 45 -23 74 -12 28 49 -33 52 -8 9 0 9 41 -40 63 -30 24
5395B4Po5Q7q0O3p5PN3m8M7n6M6Rn1Q4j05Q1k5l3P0r7Q2k0j2N6q7Q5l8J6j1n0
$$ 24 31 -34 53 -27 36 -39 -32 21 -27 20 -36 10 19 -32 52 -53 28 3 -30 40 -57 25 5 -7 49 -38 47 9 25 14 -36
5426c6P0o9P3n5L3K5p8Q8o1K5J3o1N2l3K0j2j7K8m7N8n2L5Oo4P8m3K9k3j3N6p2
$$ -36 34 -35 38 -17 16 41 -37 51 -10 15 28 -33 19 -14 6 -6 -23 5 -42 16 -36 -1 5 -59 19 -24 5 -18 -31 25 -47
5457d7O6j9j7N0p9J06q8N8mm0P5r5P6j2k7M2o5O9o1PK7o3R3r5O2rn6P4o2N7m5
$$ -47 19 0 -17 33 -46 60 -28 30 26 -14 61 -34 42 30 3 45 -20 49 -12 -5 22 -41 52 -43 19 10 -46 28 -34 23 -22
5488b2OK8q4Q2n2O0m8lN9o9N3l1L1J3q0R2o9N5Om6O7q0Q0n9NN4m7N2l9j6K2j7
$$ -22 -16 12 -72 10 -42 18 -30 -33 26 -43 10 -21 10 23 -57 35 -34 21 27 -19 48 -32 48 -11 -6 48 1 53 14 -2 20 3
5520CL6p1P2k3k4M0r8R1k9nRj5N4p0LLLN3r2P8pnj2l7Q6m4LJ2l3M7m3K8lnJ4k1
$$ 3 39 -32 40 17 -7 33 -65 26 -3 -8 1 -14 40 -30 -27 -24 -21 32 -60 18 11 6 -6 -43 43 -1 2 14 -19 28 -15 13 10 5 19 -2
5556bL5j7ONk3N6o7K2Rk9L4m4M1l7qL1m9M4k0J8jj5K9j5l0J9J5j3k4M6l7%L5l2
$$ -2 33 16 22 27 4 60 -7 15 24 -5 29 -15 26 -11 -19 12 -37 7 -13 5 4 -11 18 3 -27 -8 7 -6 -30 16 -21 -21 14 -18
5590a8O2l3J0qj0J9j8OK0qpk8L9k1Qk4K2J5l2J6j1J6j1l6N5k2j2L2n0M3l2J7q
$$ -18 44 11 21 13 3 22 4 10 30 22 15 -13 26 5 13 -11 11 26 -6 10 -1 15 4 -32 23 1 -11 21 -29 14 -18 -1 -9
5623iKLokMJ1J2rKj3L2j4l0L3Qm1K3LKpK2qnkkJ0l6J7j2K0k1mPK1qj5j3K1Qj8
$$ -9 -7 -4 -10 -12 -8 3 15 6 8 -5 27 13 -17 16 24 -17 6 9 11 4 26 18 13 11 9 19 -17 0 -12 8 -13 -17 -10 11 3 -12 -25 -4 4 -14
5663a4k4K8K1l2L4j2Lj1NjK9m7M5L0n2J9j1PJ0j1J6k2Mj5J5pj2Rojk7L7LKj4o
$$ -14 -38 -10 11 -21 13 1 4 -7 -2 -3 26 -21 24 54 2 21 10 17 27 16 32 10 14 -1 14 7 -5 4 -2 -3 -30 7 10 12 -2 -8
5699hnJ1Qk3l0M8k8K3J9l6PRJ1oRMk3J8kk7P1m6J6Kj9J2k1ML9l5J0RJ6l8pL0l4
$$ -8 -13 -2 6 -17 -47 1 -27 -4 15 -21 -14 -5 6 0 9 13 -10 8 6 -21 50 4 20 22 3 15 -6 -2 37 2 12 21 37 -1 -8 22 -12
5736a2L6m7K4kk4J7j3K2rJ0J2k8M5k3nj1L5no1O6m7J9Kl6M3j6NK2nK3m0M4k0m
$$ -12 24 -23 1 -1 -25 -8 -21 1 -8 2 14 -14 31 8 3 -8 27 22 -39 27 -20 -1 1 -35 8 -8 -3 19 14 37 -3 41 21 17
5770A7LmJ0m2K4Mk1K4k3K1ll6N5m7J4j3kJ2j2K1m5K4K6l1M6n4M1J5k7J1k0N9n7
$$ 17 20 16 26 -16 8 12 -9 15 -8 13 10 -26 29 -18 -4 -17 -19 -7 -19 2 -43 -19 7 -24 22 -32 9 24 -3 8 -12 47 -10
5803a0J8J3j9L0l7M7k1k5M6l7N0p6K8lk4O1o0L8l0mL5n4N5oj8Ln2O6l9M2j2m6
$$ -10 8 21 2 32 -5 42 21 -4 42 5 55 -21 7 4 -20 41 -19 19 -11 -15 20 -34 21 15 -3 0 -52 14 -25 17 5 -41
5835d1N3m6O8l9LL5q0Q9o5M4Rm3O2r3R3l7k9L5k3O8o8J0J8j6L5q9Q8kn7M7n4M1
$$ -41 12 -34 34 -5 -2 33 -47 42 -23 21 30 -13 49 -44 49 12 -17 18 -5 63 -5 5 23 7 42 -47 41 39 -18 29 -25 16
5867A6l8JOl1M9l0M3k3k2O6q6O4m1PL7n7P3p8O1Jm2Q3r8O7k7k2N7m4O4o5jN4o9
$$ 16 -22 -21 -15 -46 3 -27 16 -7 -29 37 -49 15 -26 -19 18 -39 34 -44 17 18 -24 59 -39 28 1 -21 36 -8 56 -9 -10 44 -25
5900b5P0o5N2k1k3M7q9O9l2%L2o4Q9r2P4j4o2O7o5P6k4j6L9o3Q6n4pM9p4J23j21
$$ -25 45 -20 32 11 -12 35 -54 15 -17 -17 15 -49 40 -52 22 8 -54 13 -52 24 0 -16 23 -40 46 -8 -15 34 -40 83 -38
5931c8Q0k9lM2r6Q5m0PK4p8J02q6O3j1m4O0p3N5k8K6Oo2O1n2L4on4P4q2J08o3
$$ -38 42 13 10 52 -44 41 1 8 32 -46 56 -30 33 22 -22 38 -35 20 -8 18 24 -38 23 -29 5 -1 -55 19 -63 45 -18
5962a8k1N5n9N9l9RJ6j9O5r7N7mk4N0o1P8l5j8J7l9O8p3O7k1k7M9m8L5j8qLm7
$$ -18 -39 16 -43 16 -23 -14 2 -17 48 -49 8 4 -20 30 -31 47 12 -6 11 -28 40 -33 34 13 -14 35 -13 22 4 -4 -1 -48
5994d8P2n0L6oj5M4p9M9Ln4N9p2R2n4J2L9p6J00o5L0j5j7N6m8L2j0k1L2o8J14
$$ -48 24 -26 10 4 -11 33 -46 3 6 -48 11 -61 31 -23 -11 28 -48 52 -13 17 2 -15 41 -7 25 15 -6 26 -42 72
6024G2j14Q0j4n1R4j03L7j8J0N3n9L8k5K5ro7Q3q9P5k9J2kk8O8p0K4J8l8O6o4
$$ 72 -42 38 24 -27 67 -36 1 -17 -7 46 -13 25 0 25 16 -51 32 -57 18 -11 1 -1 -29 39 -31 -7 11 -27 39 -25
6054b5L1J6k1M4o1N4k7pM1p7Q3n7K3j5rO5p6K8k1J9Ln8P3l5qL1n5N8m2oL2p%l8
$$ -25 6 22 1 45 -16 38 11 4 45 -32 51 -6 17 2 -7 58 -18 10 -11 8 11 -47 26 -9 -17 14 -41 17 -25 -31 1 -6 -6 -44
6088d4N9m2J6L4o2O5n1O3j3l7L6m8O3l5jM7o1L2k%j0l2M8o6O2Nj9K3q1O0oK2j9
$$ -44 15 -27 -11 23 -39 26 -25 38 25 -12 24 -24 39 4 3 50 -11 21 19 19 9 -23 25 -41 21 26 7 30 -51 9 3 25 6
6121Fl9Q8p6J4K6k9N3j04O6k5J1K2o1O9k6%Qk4L3k7M4k0mM6q7J00o1Rj2l2M6j0
$$ 6 -33 55 -21 -7 19 -10 43 -61 5 -20 -9 13 -48 21 -5 -5 3 -21 12 -15 29 9 5 51 -36 64 3 12 0 -32 14 4
6153DJ7mj7M7n8J7oJ0j3k4M8o9O7l9%L9p7L2J2K3rk4J5k1K2K0lkKJ8k7mJ7j0K8
$$ 4 21 17 0 47 -11 6 0 10 -3 -27 21 -48 19 -20 -20 19 -58 -26 -14 9 0 -24 -9 -30 -8 12 9 7 9 27 0 -4 13 3 31
6188C1j0j5MoJ9j4%k7KM4m5L7j2nK5j2Ml1qK2j3J4QMk8k1K8k0K7jl1L7l1K0j1
$$ 31 21 6 10 4 23 9 9 -18 -16 28 -17 20 8 3 28 16 20 -11 -19 3 -10 4 12 16 -12 -33 -5 -25 2 1 -30 7 -24 -4 -15
6223a5J6j2K4J2qOk7K0mK2J7l5j5K1j0j4J3lNJ4j9qnK0K0m9K4k7Rpj3J5J4j3K5
$$ -15 1 -11 13 25 17 23 -4 16 12 34 51 16 1 22 12 -2 11 8 13 27 8 0 -5 15 35 -14 10 -17 -8 -15 -28 -13 1 -12 13
6258A3j9j9L6k3k7M8k2Rj6J6L5k1M2l7mOj6J2rk4J8j7M7n8K9K4l7K7k5J1l0J5
$$ 13 -6 -25 11 -12 -39 9 -13 -4 -20 -4 31 10 52 15 11 17 1 13 4 -20 -2 -19 28 -30 -1 23 -14 13 -12 -1 -31 -16
6290a6NpK3k2j2K1j7K2qOj1PK1l0K4K3m4MJ1L9l8KmNJ8m3N0l7NJ7Pj1l4K5mnM
$$ -16 -11 -18 5 -17 -29 -8 -25 -3 -11 -5 -16 -9 12 -18 6 29 -15 -11 0 39 1 3 -1 4 22 -21 29 -8 -3 14 21 10 -24 1 -3 -8 -4
6327dj2K4j4J2j8QJ6k1qM0l3K3n8J8L8k5L0m5M5j7PjmJ6j3Pqj0K9k2M3j5o4O5
$$ -4 -16 8 -6 6 -12 -4 12 -9 -17 23 -10 13 -45 -27 11 -14 16 -29 16 -1 6 5 1 17 4 11 3 -7 22 0 43 28 -36 29
6361B9m7O7o5L9j0k6M0n9N9j6k7M1o6N6l0J8ql8N2l9L6j9j2K7k8L1l8K1L0m8N1
$$ 29 -18 49 -16 23 13 -13 27 -32 27 11 -16 25 -41 15 -15 3 -5 -43 9 -30 6 -13 -25 2 -26 5 -33 -12 18 -30 21
6392B1n1M6j2J0Ll8M2j6J0Jl1N9o3M7ok4O0r1K7K6l4M2l7J8k5K8j1m1N7l9K1j9
$$ 21 -30 16 4 14 17 -21 21 5 15 16 -15 44 -19 28 22 -2 58 -33 -6 20 -14 28 -9 9 -16 12 1 -40 17 -22 -1 -20
6424b0OL5o7N4k0lM2l4K9o0N1%n2P5o0O8j9l1L0l2L5j6j7L1l3M1m7L0pJ1L0q3
$$ -20 -14 21 -46 8 -12 -15 27 -7 22 -38 13 13 -39 36 -24 44 25 -6 24 -8 27 11 -6 25 -8 33 -14 16 9 20 50 -33
6456c3P5n8L7k2l7Q1p9N5l2NJ8o2Q2l7MK5j9M1o2J8nMK5m9N7l5K3Jm1Q6q4L0N
$$ -33 42 -16 21 -1 -38 43 -36 19 -13 -8 10 -52 30 -7 -3 22 3 44 -18 0 -5 -1 24 -25 32 -3 20 21 -20 66 -18 12 17
6489A7jK4q4Q8k8k6L3o3O9m9JN1q4R2o6K5lk0N4p4N3l8nM5l8N4o4O7j4o0Q2o2
$$ 17 16 40 -44 44 16 -10 23 -40 29 -20 -19 32 -52 40 -26 -1 -4 -24 30 -44 9 -29 -34 11 -27 27 -37 30 16 -44 38 -24
6521b4M0K0k7Ml4N3m3L4J4p4P9o5M9j3k4M8n9N8n1K2J6n5O5o4K4j5pK4m0O7k1
$$ -24 16 36 9 13 -21 32 -11 23 37 -37 42 -23 26 13 -11 37 -22 36 -15 7 23 -32 33 -31 -7 -22 -29 -5 -45 22 1
6552Aj6O2q4M3k7L0nm2O8o5P1m8OL2p1Q2n5M6j5m8R1o3N7k6l7P2q8Q1n5J4K5p4
$$ 1 -15 47 -37 6 -21 9 4 -38 30 -35 36 -12 -6 26 -45 37 -18 28 13 -35 56 -7 50 24 -13 59 -29 52 -3 11 36 -38
6584c8J09r4O6n6lRm0O3j1j6N7q2N7m6K0Nm0O0n2N0j7J4Oo8P2j1%L4m9N9q3K1
$$ -38 71 -23 43 -13 -16 -7 -47 16 5 -11 46 -36 21 -25 -5 0 -40 20 -32 18 1 15 21 -47 25 14 14 48 -1 58 -25 -4
6616dK9l9O1p7Q1l8Orl3M4o5Q0k8j2J8o1O6k3l0N7p6P6m2K1lk3M3n3K6Kk4O6o4
$$ -4 25 -14 47 -30 51 13 19 10 -23 21 -44 36 8 -4 14 -47 19 -4 -34 23 -53 23 -19 2 -1 -24 19 -34 -8 -6 -30 36 -28
6649b8P5p3M6jl9N6m5M8k8l6O0l6L5m4J0K8m6N9n4K5j1j1L8m6K9l8J9J4n4O4k9
$$ -28 47 -26 20 19 -20 36 -9 39 11 -25 35 -1 34 -10 0 28 -18 41 -13 12 1 -10 28 -18 11 -27 -8 6 -48 16 -13
6680a3J6Jk3L1m6P2l0%J3l2M9l5NJ8l7O7m7K2j4Mrj4j1M8j3j4l0O7l1LJ2l6L0
$$ -13 3 4 -19 12 -34 38 8 8 21 -11 38 3 8 26 -11 56 9 31 17 21 12 -2 -13 35 22 8 -22 45 14 17 29 -7 23
6713B3n5K6rKJ0k1K1lK0pm2N7l6M2n8OL3m4M0k2J5K6m0M9l8L1J7m5L9k1LK0k7
$$ 23 -32 -6 -15 -13 -3 -24 -3 -6 14 7 -35 22 -14 28 -30 -24 9 -35 5 -17 -2 24 -16 33 -5 26 43 -2 37 16 19 39 12
6746A2qmL6m5J8J1j9M2n9K4j1j6K4m3P3m8PK0j8kk1K8nK0Ol9L6k7J7J5l1K5k9
$$ 12 4 0 36 -9 9 20 1 43 -16 8 -3 -19 5 -38 35 -13 -6 14 -4 -6 -27 1 -4 16 22 -17 19 -8 9 24 -7 18 -11
6779a1K6J9l2K0k8J4J7k4K2j4PkqJ0j3j7QJ8mj5Lk2K3k3K0J8l8M6m1M0l4J7j1
$$ -11 15 34 2 22 -6 8 25 1 23 9 16 14 6 16 3 -14 -6 12 8 -7 -4 -26 -3 -26 -6 12 -26 20 -21 19 -15 2 -9
6812iQj5L1k7K4rRk0J2mKL0n2L2KLRk8NKK9n6L6%j6OnmJ5j1llK0k2JJnL4j4jk1
$$ -9 -1 -16 15 -12 12 3 12 -8 4 0 2 32 -20 12 14 17 26 -2 3 5 34 -22 14 14 -2 4 -1 -5 10 -1 -4 -7 13 -9 -8 -7 -12 22 8 7 -14
6853a4J1K2l8RK7j7qlML5rnrJ1POj2Pk7K5Oj3kj2J3j2KPk5J8j9J3qJ9J2m7L6l2
$$ -14 -3 19 -19 -10 17 0 -8 -11 -7 28 19 14 5 16 23 29 17 24 -3 22 28 15 13 1 14 2 4 11 -14 4 -15 -2 -10 9 21 -26 10 -22
6891b2K0j5okL6lj0J2J3l8J1J2qJ5l2%K8Qj1LL1m3Qk1lM9k7K7l3J0Rj1k2k0K4
$$ -22 -2 -17 -23 -25 11 8 -2 10 23 -15 -4 8 0 15 -17 -17 11 19 8 11 42 -1 7 -14 -17 32 5 32 -1 9 18 7 -15 -35 -11
6926a1%OJ0k6MK0J1l6PJ8k7K1j9LN3o7M5Jl6L1k3M3l5LJ5l3L2mNJ1j8L4l0L4n2
$$ -11 -11 -5 5 -21 -17 3 14 -22 -15 3 -24 -3 -22 -19 34 -33 12 13 -23 8 -15 28 -7 -4 11 -22 10 6 11 22 4 38 8 42 -10
6961a0K2ok4K4l5L3k8PL5m1L4m2J0M6l5K2k2JkrL8l2J9pj7L5l0N2m7K4ljL3n9
$$ -10 12 6 -18 6 -29 4 -24 -17 18 -23 11 -31 -21 25 -10 12 -10 -9 -11 -20 18 -14 5 -2 -19 16 -14 38 -9 15 12 11 44 -15
6995a5N8l9j9O7q0O8l4K1Km3O0p0O4l8j5L9l0J2j9j1L1n1M7m6J3K9oL2n2M2J9
$$ -15 43 4 -15 52 -28 40 6 27 29 -14 46 -24 40 2 -13 26 -4 8 -11 -22 9 -42 5 -41 -28 1 -5 27 -25 17 36
7026C6n7L7k1M6p2M3jj1N2o4M0lk6N5p2M5n0J8M3n0M8o4L1Kl2N0n2M8k8j6M6l6
$$ 36 -21 16 -5 41 -31 12 11 0 52 -12 28 25 -1 54 -18 27 -23 -5 38 -12 36 -28 3 5 -27 23 -29 19 -9 -25 21 -15
7058a5N7o3K8Pn7P4n8K4nj0K3l1L3j8LK9l5N3l2J6j7k2Q2p6L2ooK0l4K5k5J6J6
$$ -15 42 -21 7 14 -43 31 -27 -3 -8 -18 5 -26 7 -11 -8 21 -14 39 7 23 6 -16 66 -10 22 16 10 30 -4 21 -4 12 28
7091B8l8M4n1L5n1K4K5l1N3m3J6pk9M9m3K8pn3O8n5P0l1lM4p8O8n6M9J5m7O2o8
$$ 28 -10 34 -17 18 -33 -9 16 -15 38 -5 11 4 -25 24 -19 9 2 -51 17 -38 32 1 -2 42 -36 32 -24 25 40 -7 55 -13
7123a3L2Pm3O5p3N8l1RNl6P2r0P8l4pK6q1Q1m7%N6q9O3k2L2l0k5N3l3ORk2L9m6
$$ -13 19 26 -17 48 -25 33 2 11 16 -20 52 -38 40 6 -1 25 -56 25 -22 -22 34 -55 8 -14 18 -12 -37 16 -17 -11 -2 -24 15 -31
7157c1M2k5K6K6n7P3r8R2n7L4K6r4R5o0K9m0qP4q1O7k4k0L7o3L2n6N9J4l0M2n6
$$ -31 11 -14 12 38 -19 54 -44 48 -9 25 51 -43 52 -8 21 -19 -27 47 -34 33 9 -11 26 -37 -5 -61 -2 12 -18 24 -32
7188c2K2j3j2O9o8L3l0L0K6m6M0m9L9qkL5n0J4MoK7j9K9o6N9Pn4O0o3M6j2m0N1
$$ -32 -10 -23 -35 34 -34 -1 -31 -1 25 -21 19 -30 9 1 -1 34 -16 -2 2 -4 23 4 33 -33 26 33 -21 39 -24 22 10 -30 21
7221B1r6P1j8lL3o3O5m1K4j8k6L6LJ9Ol0K1o4O7k8J1K8k0M9o2L3k3j9M8n5O8n5
$$ 21 -75 -4 -22 -25 8 -55 10 -31 -7 -25 -51 -15 -12 7 13 -17 4 -60 7 -21 -10 18 -2 47 -15 18 -5 -24 24 -31 37 -18
7253a8N0j0l0O3l9Kpj8L7o0Q0p6rL5m3N7n5K4N%M6l5J0l3j1K5l3L4k8L1L8m2K9
$$ -18 32 22 -8 55 16 18 11 -7 30 -30 50 -26 -35 0 -43 14 -41 -17 -12 -12 34 -1 9 -24 -35 -10 -43 -9 -37 -6 32 -10 19
7286A9k2J2Jllk7O3n2K6J1n0K8pJ8%n1O5n0J4koM6p9M1j9OK1k6K5j0R%OJ9o0N9
$$ 19 -3 9 10 7 4 -23 40 -12 14 25 -25 3 -4 14 14 -37 28 -22 -8 -10 -16 30 -49 -8 -27 -21 0 -26 -1 -11 -2 -2 4 23 -37 22
7322B2k6Onl2N0l6L3l4K4Kk4J8lK5K8k3J2k8J9k2kJ3l2L4k7JM7p7M6k6LK7m2j3
$$ 22 -4 2 -3 -35 15 -21 12 -22 2 4 -20 -2 -5 20 48 25 37 9 28 6 4 17 -15 19 -8 -7 40 -37 9 -17 -14 13 -29 -42
7356d2K8K7pj8N1k8j6j7K6Pk6N1l7L4l8JK1k5J7j1KJ8k8M6qk1L2n8J6JJ6j6K2
$$ -42 -14 13 6 -12 39 11 -5 -22 4 11 -15 36 -1 33 -5 -4 17 -8 9 -2 0 18 -10 36 28 7 39 -19 -3 -2 14 -2 20
7389B0j8k2MK1Ppj8J8k8J3%Pj4Nj4J3RrlJ2J4Qmj7K5l2J2jL3j9J3Lk0RqNj7J5
$$ 20 2 -20 -16 5 12 5 -13 5 -23 -10 -10 -3 -17 -12 -26 -13 -4 -13 -16 -4 10 18 14 -3 22 -10 2 1 34 15 28 31 11 20 12 17 0 15
7427A5k2J6Ok2K8k9J9mj9%k5K0JL0k0j0k0L7Nj7J7j8J3rqMRJ7J0Lj3opL2k8J2
$$ 15 -7 9 15 -7 21 -8 11 7 -12 -12 -37 -17 -16 14 -6 -16 -36 1 6 -11 6 -12 1 -8 -16 -12 -3 14 24 27 14 8 1 33 5 17
7463A7nRpk5K3nJK0k0ok5K6JlJ0nj5J1ljk5K3j0NJ5k1Rk1L8o2M1rJ9J2MLK9n4
$$ 17 12 21 14 -11 12 7 8 28 8 2 -23 3 4 1 11 6 -9 2 -1 -2 -27 -4 -14 -9 6 -15 -6 -27 11 -51 -10 -19 0 12 16 19 48 -6
7501fJ3k2K5PLPk1J4J4k6Nj9K2j7J8pj8J3l2M6k1j6K4j0J7k2J9lk2MRjJPJ6m6
$$ -6 7 -15 10 17 20 27 6 20 34 8 13 -6 16 -1 17 10 -8 5 -27 19 -2 -18 6 -4 13 -9 10 7 -15 -11 -2 -3 -2 5 21 -25
7537b5L8j4%L5k1j2J9K2m3J4L3l9L1j4j7J1k8L9j5mpqn%Nl1L2lpL0m6L4j2%K2
$$ -25 13 -1 -1 34 13 1 20 42 -1 13 46 7 38 24 7 18 -10 29 14 10 3 -5 -10 -10 -5 -36 -4 -7 -14 16 -30 4 -8 -8 14
7572A4k6Lnj9N1l5K2k8L7ROOm7M4j1l3K9l5N1l1nJ5l5O8n4M6m6mN1q5L9l3L9O
$$ 14 -12 -9 -14 -33 18 -17 5 -23 14 23 29 35 -12 32 21 -12 17 -18 33 2 -3 12 -23 45 -9 37 -9 -13 38 -47 -8 -41 -2 4
7606Dm8M6j9J1j1j8N1n8M3m2L1Rm2Q3n0K7Om9L7j7QJ8k8M2m9N2m2M1l4pJ3l1P3
$$ 4 -44 2 -17 -6 -17 -35 16 -42 1 -41 -10 -1 -43 40 -10 17 23 -26 11 -6 2 20 -8 34 -15 37 -5 36 2 -5 8 -23 50
7639E0n6J1K8n4O3n1oL7l8L3m3mnQM9o9L9j2J0K8n9O4m9K9mk8N5l3K5nj3J7l2
$$ 50 -6 5 33 -21 42 -9 -15 22 -16 17 -26 -30 -35 -27 22 -47 -8 -20 -10 18 -41 23 -26 3 -1 -29 26 -7 18 13 0 17 -15
7672a5M4j7LL5n0M8n5L5j3k3M6m6L0l1lK0o8O2j3J3J7n5M5m2O4l1lK6m6L0k9K8
$$ -15 29 12 15 50 0 48 -7 28 15 -8 38 -8 22 -9 -12 8 -60 2 -11 2 19 -36 9 -33 31 0 -3 23 -23 7 -22 6
7704FJ5p4P7l0J9Kl6L7j4J5m5K9L9l8J3m3M3j1k1O2n6O0o1J6Ln9O2l5J0L1l5L4
$$ 6 21 -53 24 -6 13 15 -21 16 2 17 -28 1 40 2 15 -28 15 4 -17 45 -11 49 -12 4 7 -52 10 -25 -15 16 -19 15
7736A5m1J8J7m7N8n2M5m4J7K1k5K1l0M4J8n2N2n3L4m0K7K0l4M1n1M9J4p2O7k3
$$ 15 -26 -8 9 -38 20 -32 13 -31 -14 7 -18 3 -27 17 35 -17 35 -18 16 -24 3 23 -11 30 -21 28 42 -30 37 14
7766A4Nj7k4O4q1M7k5J1J9k7L7m4M2m1LK8l7L6j8j5O0m5M2n0J8Ok9K5j1N2m5J6
$$ 14 19 2 -22 42 -39 8 -17 -6 13 -14 23 -21 21 -20 -17 11 -26 10 -8 -23 37 -8 34 -16 2 8 -21 4 -7 45 0 16
7798A6Pk9L5m2J4L6n9N0k8M4m9j6L0m1RkMK2m4N7o1L8K4l3L8p2O3k9NRk2J7oJ3
$$ 16 23 -6 29 -13 1 37 -22 28 0 44 -5 -21 9 -32 -23 -25 -21 1 -43 14 -47 -9 15 -18 20 -52 11 -18 -13 -4 -26 -9 -15 -2
7832bK6m5O2n0L5k4mJ2k7P6n5L2On7M0p2Q7m4Rk4k9R5o0L1J0rl0k2K7k3j7M4j8
$$ -2 24 -21 41 -9 26 2 -2 10 -17 59 4 36 42 -15 25 -47 40 -4 5 -19 -48 47 -13 18 28 19 -11 -33 -6 -29 -46 -2 -20
7865b0L8qk2L4o1M4n9M9Qj7N3o1J1K3j5M7q0Q3o0RM3k5Pm1N7Ll3Mk6N6m3RJ4n5
$$ -20 18 10 -12 22 -39 5 -54 -5 3 -14 39 -22 -11 12 -3 44 -36 47 -13 -4 39 14 21 -20 37 40 7 11 -15 41 -2 7 21 -34
7899c4L9k4J2QQl4j6R1n2nJpK3l2J5J5j0K0l5M2l3lQ%M3k9j1J6lOl1J4OMj1NR
$$ -34 5 -19 -7 1 9 -25 -41 50 -2 -7 -6 -13 10 -22 -7 8 -2 18 -17 25 -8 -11 -3 -3 40 11 0 16 13 19 -12 2 8 12 1 6 15
7936A5qj5%l7M4J1K3rl2J0m6N5j1m1N0Qk3Qj4L4m4K5MJ1j1ooQNLpnJ7k3NJ3pj
$$ 15 7 -8 -8 -45 -1 10 33 24 -8 2 -44 11 0 -41 9 17 -6 2 -12 22 -22 3 7 18 7 1 -5 3 8 11 4 -1 16 -7 -2 11 4 3
7974CMKL9m8rL2J0k9M%j8K0ok9L0pj6K1j2K8qj8j7L1l2J5KJ3Ok1LK7k3nL8j4K
$$ 3 7 9 48 0 -9 23 33 4 8 8 -10 10 4 -25 5 -2 -18 3 -9 19 11 -7 -24 7 -25 -10 -8 5 11 -10 -7 20 -3 -8 30 16 18
8011A8oqj4N0k7j3J5j1Qj6mj3Qj9K6J0rJ0k9J1Rj2qJ3Qk9L1j3mk9N3j6J0llOJ
$$ 18 12 4 -10 40 13 0 15 4 12 -4 -8 -21 -13 -32 -6 4 -5 5 -24 -13 -4 -16 -24 -11 -3 -32 -1 -14 -18 -47 6 -10 0 -3 -6 0 1
8048AK3m3M8Lkl3Ql5N3j8J5j0j9k4P1k2Lk1J6j4nOrJ2Kj0Kj0J0Qj8L2m9J4NJ0
$$ 1 24 -19 29 32 30 -3 5 -30 23 5 20 10 -9 -33 38 16 19 -2 14 0 -5 1 -8 4 6 -4 -2 -12 -2 6 -12 20 -29 -15 -10 0
8084@K0k2Oj9RNJ3Qk9K2lnJ4J1j7j4J8q%%j6K8Kk1K0o1O5j3j2Rj6J5l1J9j8qK
$$ 0 20 -2 4 -15 -6 -1 12 20 -9 13 10 5 19 30 13 -1 17 9 9 9 -7 21 23 2 22 -39 26 13 1 10 -6 9 -22 -3 -21 -29 -27
8121b7J6K4jk9M1m5L9l5J5PpJ1j7J1nj6N2m5M0k8J9k0oJ5pK8k3j2L2n0K4j1L3
$$ -27 -11 13 12 -17 24 -21 18 -17 -2 5 -2 9 -8 3 -2 -18 34 -11 29 1 20 0 -6 9 2 30 7 -5 27 -23 1 -10 23
8154B3Km1L8o7M7k3JK9o1O0J5m6K9m1M6l7K8J9o5N1j1N7q0N2K7r6P3mJk1j0P3
$$ 23 25 -16 22 -45 2 -21 -20 9 -52 8 23 -23 6 -35 11 -26 2 21 -44 7 -4 53 -27 25 52 -44 29 25 26 5 -5 68
8186F8o3L3j8m7M5
$$ 68 5 38 20 -27 18
8191A8
$$ Imaginary data points
##PAGE= N=2
##DATA TABLE= (X++(I..I)), XYDATA
0@%%%%%%%%%%%%%%%%%%%qJ6j6J6j6J6j6J6k4L2l2L2l8M6m8N4o2O6p4Q2q9J00j09
$$ 0 0 0 0 0 0 0 0 0 0 0 0 0 0 0 0 0 0 0 0 -8 8 -8 8 -8 8 -8 8 -16 16 -16 16 -22 24 -24 30 -32 34 -40 42 -47 53 -56
42e6J18j31J46j57J68j85K04k23K44k67K94l27L64m05M54n13N82o69P77r18J104
$$ -56 62 -69 77 -80 88 -97 107 -116 128 -139 155 -172 192 -213 241 -272 310 -359 418 -500 604
63F04j358J725k276L182m863Q745k8371j2672Q0702p8534O3905o2404L9136K6477
$$ 604 -754 971 -1305 1877 -2986 5759 -22612 -35284 45418 -33116 30789 -31615 7521 33998
77C3998q8857R8004o7826L9733j4935k9216Q0722j00350P7549l7719p42L9918
$$ 33998 -54859 43145 -24681 15052 117 -29099 51623 -48727 28822 -8897 -9639 30279
89C0279p4802Q6990p0042L5538O557n0574Q0690q0015N4308k3163j0131N2531
$$ 30279 -44523 42467 -27575 7963 14520 -36054 44636 -35379 18929 -4234 -14365 38166
101C8166q8373Q7297m9603R519J5803m3513P7937q6488M8558N315l5765M8351
$$ 38166 -50207 37090 -12513 -2994 12809 -30704 47233 -39255 9303 14618 -21147 27204
113B7204o7204P9554n2686n411M9502o0614O1806o5342M8837o56m9266O8103o1094
$$ 27204 -40000 39554 -13132 -18543 30959 -29655 32151 -33191 15646 14990 -34276 33827 -27267
126b7267M9447l1539n035M8927p2667O7672m7467K1301J2065m6600O6577o4220
$$ -27267 22180 -9359 -14394 34533 -38134 29538 -17929 3372 15437 -31163 35414 -28806
138b8806M5008j5475j9827M9955o1877N4525l6282R976K4912n6693O6474n1811
$$ -28806 16202 727 -19100 30855 -31022 23503 -12779 -2803 22109 -34584 31890 -19921
150a9921K8717o328k1304N2013o5420M9253j8590o071K5218m7244O1796n0015
$$ -19921 8796 2468 -18836 33177 -32243 17010 -1580 -7651 17567 -29677 32119 -17896
162a7896J5849J6251l4095M6139n5511M8635j8822j7245L9174m5679M5550l7328
$$ -17896 -2047 14204 -19891 26248 -29263 19372 550 -16695 22479 -23200 22350 -14978
174a4978J3802J9244m4365N1532m4826L0100p925j9254M2306n1706M4999k6111
$$ -14978 -1176 18068 -26297 25235 -19591 10509 2584 -16670 25636 -26070 18929 -7182
186g182J407K2235l8919M5368l9844K1680N081l0018M3167m3500L5611k0334l578
$$ -7182 -5775 16460 -22459 22909 -16935 4745 9826 -20192 22975 -20525 15086 -5248 -8826
199h826K9519m4022M1019k7694J2226N873k7377M2867m1016K3750l472j2919K7776
$$ -8826 20693 -23329 17690 -10004 2222 8095 -19282 23585 -17431 6319 2847 -10072 17704
212A7704m0279M1403k6013K430J6691k7654L3561l3465K2076m28k1108L2838l3841
$$ 17704 -22575 18828 -7185 -4755 11936 -15718 17843 -15622 6454 6026 -15082 17756 -16085
225a6085K8130j6976m41K0505l4482L5998k6546J2180K992j7890K9905l3053K3875
$$ -16085 12045 -4931 -5372 15133 -19349 16649 -9897 2283 5275 -12615 17290 -15763 8112
238H112o543j0496K2271k9060L0759k3961P587J1701k4534K7947k5362J8776o462
$$ 8112 1569 -8927 13344 -15716 15043 -8918 -1331 10370 -14164 13783 -11579 7197 735
251G35j0589K4627k8093K1642j1454N95J1954k4299K9608k3635J0547K209j1819
$$ 735 -9854 14773 -13320 8322 -3132 -2537 9417 -14882 14726 -8909 1638 3847 -7972
264g972J9555k4127K0849q782n882J5863j9704J9980j6760P619O286j8277K2418
$$ -7972 11583 -12544 8305 -477 -6359 9504 -10200 9780 -6980 639 6925 -11352 11066
277A1066j9409J3552o200l832J4692k0473J7479q792n0P339j4208J9283j8199
$$ 11066 -8343 5209 -991 -4823 9869 -10604 6875 -1917 -1967 5372 -8836 10447 -7752
290g752R578J700r789J3784j5818J5424r759o45J0124j3824J2513r548N295J996
$$ -7752 1826 3526 -6263 7521 -8297 7127 -2632 -3277 6847 -6977 5536 -4012 1283 3279
304C279j0848J6096j4572Q905l340j544P299j2567J3139p826N48M390o868Q970
$$ 3279 -7569 8527 -6045 2860 -480 -2024 5275 -7292 5847 -1979 -1431 2959 -3909 5061
318E061r951O839L25p020R515q926Q034o569K317L995q050P371m205J806L7l365
$$ 5061 -4890 1949 2274 -4746 4769 -4157 3877 -2692 -375 3620 -4430 2941 -1264 542 579 -2786
334b786P237q084M704k09k168L104m896O760n746J669J979k670J797j930K426
$$ -2786 4451 -3633 1071 862 -1306 1798 -3098 3662 -2084 -415 1564 -1106 691 -1239 1187
349A187p40k804M822l661J558j069J391q8k406L113j161p06K26J191r30m43K75
$$ 1187 447 -2357 2465 -1196 362 -707 684 596 -1810 1303 142 -564 -338 853 -77 -520 -245
366b45J678k672J150Q31p08p95J088p0J78k284L908k752J28J172j132J931l857
$$ -245 1433 -1239 -89 742 34 -761 327 257 435 -1849 2059 -693 -565 607 -525 1406 -2451
383b451M392j919j481K888k484K343k691J266K613o169O753m960L187j801r66
$$ -2451 1941 22 -1459 1429 -1055 1288 -1403 -137 2476 -3693 3060 -1900 1287 -514 -1480
398a480N007p371O021k348p91K876n257P530p122K924K616o313P771q458Q195
$$ -1480 3527 -3844 2177 -171 -962 1914 -3343 4187 -2935 -11 2605 -3708 4063 -4395 3800
413C800n056r58O589q764P760n601K601K289q197J1694j0448N876r09l635Q368
$$ 3800 -1256 -2214 4375 -4389 3371 -2230 371 2660 -5537 6157 -4291 1585 676 -2959 5409
428E409j2186J2205p379M04N272q675J0580j0434O341J333q855J2725j2746J0607
$$ 5409 -6777 5428 -1951 -1547 3725 -4950 5630 -4804 1537 2870 -5985 6740 -6006 4601
442D601o480l60Q421j3874J3981r826M150K026q703J4067j4779R732j641n889
$$ 4601 -1879 -2239 6182 -7692 6289 -3537 613 2639 -6064 8003 -6776 2956 1315 -4574
456d574J1570j5406J6114j1662K735O648j2822J5016j3973R522j373q428J5630
$$ -4574 6996 -8410 7704 -3958 -1223 5425 -7397 7619 -6354 3168 1795 -6633 8997
469H997j7346J3975p551n90R619j7091J9534j5519P103K136j0084J5883j7997
$$ 8997 -8349 5626 -1925 -2515 7104 -9987 9547 -5972 1131 3267 -6817 9066 -8931
482h931J4347n141n815J4131j8075J8157j4150N356O332j5966J9639j7618J2078
$$ -8931 5416 275 -5540 8591 -9484 8673 -5477 -121 6211 -9755 9884 -7734 4344
495D344l845o638J6264k0324J7096r188j51R633j8053K2102j8931R751J355j1104
$$ 4344 499 -6139 10125 -10199 6897 -2291 -2442 7191 -10862 11240 -7691 2060 3415 -7689
509g689J8026k0747J7464q339l448J3804j9948K0615j5678O189N455j6055K2500
$$ -7689 10337 -10410 7054 -1285 -4733 9071 -10877 9738 -5940 249 5704 -10351 12149
522A2149k2433J5734m905o442J5817k1618K1514j4005J495J0543j8447K2155k1301
$$ 12149 -10284 5450 545 -5897 9920 -11698 9816 -4189 -2694 7849 -10598 11557 -9744
535i744J3838m64j3070K0886k2374J9752j2682J77J3796k2083K1996j6691Q598
$$ -9744 4094 3630 -9440 11446 -10928 8824 -3858 -3681 10115 -11968 10028 -6663 1935
548A935K824j5889K4449k4048J6703o734m434J6085k4033K3601j5533M372O989
$$ 1935 4759 -11130 13319 -10729 5974 -760 -5194 10891 -13142 10459 -5074 -702 6287
561F287j7478K3945k2424J3479j565j0055K0151k5778K3098j2830L10J0697j9803
$$ 6287 -11191 12754 -9670 3809 2244 -7811 12340 -13438 9660 -3170 -2860 7837 -11966
574a1966K5087k2054J0374L446j3704K0708k4866K1922r477o376J7219k2049K4028
$$ -11966 13121 -8933 1441 4887 -8817 11891 -12975 8947 -530 -6906 10313 -11736 12292
587A2292k1284R645P101j9102K2476k1314J7427p025r195K2158k5224K1333j5154
$$ 12292 -8992 653 7754 -11348 11128 -10186 7241 216 -8979 13179 -12045 9288 -5866
600e866N184R721k2772K6133k0744J2487k504j0739K2734k5685J9079r092j312
$$ -5866 -682 9039 -13733 12400 -8344 4143 1639 -9100 13634 -12051 7028 -2064 -3376
613c376J3460k4448K6860j9055P613K833j3679K3869k6218J7431m312o122J4895
$$ -3376 10084 -14364 12496 -6559 1054 3887 -9792 14077 -12141 5290 978 -5144 9751
626I751k3544K6016j6798J481J0178j7167K3418k5876J7551j046j2477J8404k1400
$$ 9751 -13793 12223 -4575 -3094 7084 -10083 13335 -12541 5010 3964 -8513 9891 -11509
639a1509K2566j5492o92J5796k1848K1884k0346J3687J265j7100K4027k2489J8371
$$ -11509 11057 -4435 -5127 10669 -11179 10705 -9641 4046 5311 -11789 12238 -10251 8120
652H120j1346j984J7102k4312K1653j5202P335M849j8904K5912k2336J3957n304
$$ 8120 -3226 -5210 11892 -12420 9233 -5969 1366 6215 -12689 13223 -9113 4844 -460
665d60n756J8757k5711K1532j1448K150P261j8522K5339k0900Q910J880j0071
$$ -460 -6216 12541 -13170 8362 -3086 -936 6325 -12197 13142 -7758 1152 3032 -7039
678g039J9046k5497K1765q767l924J1610j7841K2884k0047P335O865j4941J8737
$$ -7039 12007 -13490 8275 -492 -4416 7194 -10647 12237 -7810 -475 6390 -8551 10186
691A0186k1238J8364o534q374J7578k0202K0234j6713O034Q440j8163K0130j8030
$$ 10186 -11052 7312 778 -7596 9982 -10220 10014 -6699 -665 7775 -10388 9742 -8288
704h288J3226l184j0393J9971k1304J7476j1444J733J1032k0365K1218j6024R061
$$ -8288 4938 1754 -8639 11332 -9972 7504 -3940 -2207 8825 -11540 9678 -6346 2715
717B715j00j1337K0117k0472J3814n577k811J2704k0911K1313j3657L944M288
$$ 2715 2615 -8722 11395 -9077 4737 -840 -3651 9053 -11858 9455 -4202 -258 4030
730D030j2333J9312j9993J2372j581p000J3347j8314J8618j1326j47R594j5178
$$ 4030 -8303 11009 -8984 3388 1807 -5193 8154 -10160 8458 -2868 -3015 6579 -8599
743h599J8255j7717J0956K25j0052J5330j6914J5108q384k155J1750j6709J7133
$$ -8599 9656 -8061 2895 3120 -6932 8398 -8516 6592 -1792 -3947 7803 -8906 8227
756H227j4035O900L369j2572J7078j6741J2871n730l972J2665j6444J4957j0231
$$ 8227 -5808 1092 4461 -8111 8967 -7774 5097 -633 -4605 8060 -8384 6573 -3658
769c658L148N893j4057J7389j4992R220k009o122J3516j6675J3883p322NP039
$$ -3658 -510 5383 -8674 8715 -6277 2943 934 -5188 8328 -8347 5536 -1786 -1781 5258
783E258j3029J5551j2607N490K384q938J3636j5304J2329n314k726R139j2896
$$ 5258 -7771 7780 -4827 663 3047 -5891 7745 -7559 4770 -544 -3270 5869 -7027
796g027J3447j0156L500M170j0249J3276j2778Q780k106n242J0902j3474J2528
$$ -7027 6420 -3736 -236 3934 -6315 6961 -5817 2963 857 -4385 6517 -6957 5571
809E571q133J401N485j0324J2100j0658O121M96p100J1385j2258J0062n411r58
$$ 5571 -2562 -1161 4324 -6000 6100 -4558 1563 2059 -5041 6344 -5914 4148 -1263 -2221
823b221P293j1257J1618q851M100J658p128J0521j0444P097j936l500Q090j0756
$$ -2221 5072 -6185 5433 -3418 682 2340 -4788 5733 -4711 2386 450 -3050 5040 -5716
837e716J0447p029J711L625p616R503q822N542n63m472P935q998P619m160n31
$$ -5716 4731 -2298 -587 3038 -4578 4925 -3897 1645 1082 -3390 4545 -4453 3166 -994 -1525
852a525N208q432R189p416L789N44m541P311p881N905k147k025N492p501P583
$$ -1525 3683 -4749 4440 -2976 813 1357 -3184 4127 -3754 2151 4 -2021 3471 -4030 3553
867C553n569J862K366n733P304o939M939j672k115N177o405N606l253J30L103
$$ 3553 -2016 -154 2212 -3521 3783 -3156 1783 111 -2004 3173 -3232 2374 -879 -749 2354
882B354n704O735n754L201m9k871M926n694M818k452n30L051m474M634l583J462
$$ 2354 -3350 3385 -2369 832 783 -2088 2838 -2856 1962 -490 -1020 2031 -2443 2191 -1392 70
898G0J288l710M936m757L472j542o81K741l857L596k204L41J435k877L619l241
$$ 70 1358 -2352 2584 -2173 1299 -243 -924 1817 -2040 1556 -648 -307 1128 -1749 1870 -1371
914a371J840P5j802K904l315L029j977L53J208k034K046j533O21N40j720K419
$$ -1371 469 544 -1258 1646 -1669 1360 -617 -264 944 -1090 956 -577 44 584 -1136 1283
930A283k250J504o07l02J152j729J755j180L33K74n63P01o56K53M20r79J105r06
$$ 1283 -967 537 -70 -372 780 -949 806 -374 -41 233 -330 371 -285 -32 388 -591 514 -392
948c92P11n45K69O1j93K1K07k05K5J55k55L98o28O76l95l6L44l51K06nl98J003
$$ -392 319 -226 43 104 -89 -68 139 -66 -41 114 -141 257 -371 305 -90 -126 218 -133 73 68 -330 673
970F73j510J591j228O21L5p46J425j675J256l88n67J295j706J725j137j7J362
$$ 673 -837 754 -474 147 182 -564 861 -814 442 54 -513 782 -924 801 -336 -353 1009
987A009k380K779k585J832n61r68K190k642K220j089l29J785k986L409k736J169
$$ 1009 -1371 1408 -1177 655 94 -874 1316 -1326 894 -195 -524 1261 -1725 1684 -1052 117
1003A17P33k447L605l953L212j492o36K501l502L486k499O16J684l656M639m341
$$ 117 850 -1597 2008 -1945 1267 -225 -861 1640 -1862 1624 -875 -259 1425 -2231 2408 -1933
1019a933K893p27j686L795m867M425k696L05K142m065M850m185K138O91l361N181
$$ -1933 960 233 -1453 2342 -2525 1900 -796 -491 1651 -2414 2436 -1749 389 1080 -2281 2900
1035B900n719M826k586m54L355n179N503m260J751J353m209N884n810M072j160
$$ 2900 -2819 2007 -579 -1033 2322 -2857 2646 -1614 137 1490 -2719 3165 -2645 1427 267
1050B67k180N037o621O410m405J185K292m993O226n712L423M1l609O162o955N874
$$ 267 -1913 3124 -3497 2913 -1492 -307 1985 -3008 3218 -2494 929 970 -2639 3523 -3432 2442
1066B442l284l20M055o629P202n776K873P72m292O621o857M958j653k169N564
$$ 2442 -842 -1162 2893 -3736 3466 -2310 563 1335 -2957 3664 -3193 1765 112 -2057 3507
1081C507p577P520n247J550K439n751P549p128M563p26l232O324p734O825l831
$$ 3507 -4070 3450 -1797 -247 2192 -3559 3990 -3138 1425 699 -2533 3791 -3943 2882 -949
1096i49k81M383p360Q459p279L951M74m541P174p988O572k916j760N752p997Q189
$$ -949 -1230 3153 -4207 4252 -3027 924 1398 -3143 4031 -3957 2615 -301 -2061 3691 -4306 3883
1112C883o327K495K449o621Q592q271O050k186k642O769q523P573m747P47L922
$$ 3883 -2444 51 2500 -4121 4471 -3800 2250 64 -2578 4191 -4332 3241 -1506 -759 3163
1127C163p877R341p859M506k92m256Q070r376P543l781n40M793q180R163o936
$$ 3163 -4714 4627 -3232 1274 982 -3274 4796 -4580 2963 -818 -1358 3435 -4745 4418 -2518
1142b518K632J949n961Q985r730P204k460k334O080q669R186o535J463L602p028
$$ -2518 114 2063 -3898 5087 -4643 2561 101 -2233 3847 -4822 4364 -2171 -708 2894 -4134
1157d134Q893q957O149p43m721Q045r265Q790n978O47N041q314Q792p582M655
$$ -4134 4759 -4198 1951 1208 -3513 4532 -4733 4057 -1921 -1274 3767 -4547 4245 -3337 1318
1172A318M73o137R423r358P251l944r75O524r846R405o580K951J568o631R753
$$ 1318 1791 -4346 5077 -4281 2970 -974 -1949 4575 -5271 4134 -2446 505 2073 -4558 5195
1187E195q985N440j304k951P457j0359R382n237O19L443p367R975q964M471O36
$$ 5195 -3790 1650 346 -2605 4852 -5507 3875 -1362 -743 2700 -4667 5308 -3656 815 1451
1202A451m483P558r627Q573l797j878N809q194R669q643L907K204o366Q110q694
$$ 1451 -3032 4526 -5101 3472 -325 -2203 3606 -4588 5081 -3562 345 2549 -3817 4293 -4401
1217d401P508l015l258P625q838Q392o727K505L694q414R454q151N941k009l765
$$ -4401 3107 92 -3166 4459 -4379 4013 -2714 -209 3485 -4929 4525 -3626 2315 306 -3459
1232c459Q477r383P311m384O00M638r211J0055p349L668J10m737R037r976O905
$$ -3459 5018 -4365 2946 -1438 -838 3800 -5411 4644 -2705 963 1073 -3664 5373 -4603 2302
1247B302k576j169N055q781R649o370J354K707n947Q936r775O573j101l352O142
$$ 2302 -274 -1443 3612 -5169 4480 -1890 -536 2171 -3776 5160 -4615 1958 857 -2495 3647
1262C647q294Q897n936L03M561p029Q188q181N331J95n385P889q343P728n028
$$ 3647 -4647 4250 -1686 -1383 3178 -3851 4337 -3844 1487 1682 -3703 4186 -4157 3571 -1457
1277a457k09N465p949P778o423L668J151o295Q767q010N849k878j608O478q915
$$ -1457 -1666 3799 -4150 3628 -2795 873 2024 -4271 4496 -3514 2335 -543 -2151 4327 -4588
1292d588P909n149J975J987o327Q648p409M021m79l082O799q896P574l751j93
$$ -4588 3321 -1828 147 2134 -4193 4455 -2954 1067 588 -2494 4305 -4591 2983 -768 -961
1307i61L485o485Q220o993L064J206m300O519p666O313k353k134N275o982P482
$$ -961 2524 -3961 4259 -2734 330 1536 -2764 3755 -3911 2402 49 -2085 3190 -3792 3690
1322C690o035K241K290n408O693o638M962j307l020O056o974O280m306Q03L398
$$ 3690 -2345 -104 2186 -3222 3471 -3167 1795 488 -2532 3524 -3450 2830 -1476 -673 2725
1337B725o400P097o027L816m42l464O206o635N121k581o12M114o637O873m963
$$ 2725 -3675 3422 -2605 1211 769 -2695 3511 -3124 1997 -584 -1196 2918 -3719 3154 -1809
1352a809K122J002m176O384o473M443j396j600M216n993N922l760N46K533m885
$$ -1809 313 1315 -2861 3523 -2950 1493 97 -1503 2713 -3280 2642 -1118 -572 1961 -2924
1367b924O158n854L671m05k613M727n662N094k932k22L178m991N500m633K347
$$ -2924 3234 -2620 1051 646 -1967 2760 -2902 2192 -740 -962 2216 -2775 2725 -1908 439
1382D39P66l593N227n487M449k190p91L458m913M927l608J312J482l963N185m858
$$ 439 1205 -2388 2839 -2648 1801 -389 -1180 2278 -2635 2292 -1316 -4 1478 -2485 2700 -2158
1398b158L305r66j716L987n051M617k934N62J877l827M632l967K129K63k554M178
$$ -2158 1147 181 -1535 2452 -2599 2018 -916 -354 1523 -2304 2328 -1639 490 753 -1801 2377
1414B377m709L902j998l68K521l922M228l326J455P97k733L822l816K735q29j305
$$ 2377 -2332 1570 -428 -796 1725 -2197 2031 -1295 160 957 -1776 2046 -1770 965 136 -1169
1430a169L058l984L822k616P37J257k788L458l150J917j27j708L016l440K934
$$ -1169 1889 -2095 1727 -889 -152 1105 -1683 1775 -1375 542 415 -1293 1723 -1717 1217
1445A217j616j33J844l025L332k711J406J75j688K693k799K061p37p85K061k794
$$ 1217 -399 -532 1312 -1713 1619 -1092 314 489 -1199 1494 -1305 756 19 -766 1295 -1499
1461a499K778j986O85P77j943K497k403J661m24q84J825k173J907j099n7J220
$$ -1499 1279 -707 -22 755 -1188 1309 -1094 567 143 -741 1084 -1089 818 -281 -338 882
1477H82k051K298j956J103l3r50J644j831J444o55k90J141j633J641j204L92N27
$$ 882 -1169 1129 -827 276 243 -707 937 -894 550 -105 -395 746 -887 754 -450 -58 469
1494D69j259J641j592J194m85l17R29j222J131o76L6O23j104J272j113O54k4n62
$$ 469 -790 851 -741 453 -32 -349 580 -642 489 -187 -151 472 -632 640 -473 181 157 -405
1512d05R36j058R07n26N5L48n66N85m35J04K65n84P43p02N19k28o6K80l81L51
$$ -405 531 -527 380 -146 -91 257 -309 276 -159 -55 210 -374 369 -333 186 -42 -108 172 -209 142
1532A42k26L8J18j68J73j04n3J65k13K37k06J57j02Q3r4J55k48K80k05P6L5j47
$$ 142 -84 -46 72 -96 77 -27 -80 85 -128 109 -97 60 -42 41 -53 102 -146 134 -71 5 40 -107
1554a07K82l17K12k8j53K79l25K69j13j60M78p18P58n94L08K5m08O76o88M68p5
$$ -107 175 -142 70 42 -111 168 -157 112 -1 -161 317 -401 357 -237 71 96 -312 364 -324 144 69
1575F9l20O71q93Q33n06K2N13r40J109j031O72j27m68R30j084R02m26k13Q59j293
$$ 69 -251 420 -473 360 -146 -124 389 -551 558 -473 199 72 -396 534 -550 352 -74 -287 572 -721
1595g21J371j083M97K53r30J398j477J125m72l30J006j410J419r52J47P35j476
$$ -721 650 -433 64 317 -613 785 -692 433 -39 -369 637 -773 646 -306 -159 576 -900
1612i00J807j708J174k62p13J445j757J611r43mR57j683J901j541P71K56j281
$$ -900 907 -801 373 111 -602 843 -914 697 -246 -250 707 -976 925 -616 155 411 -870
1629h70J978k163J791q94k46J273j919J978j486N38O45j650K232k168J452l86
$$ -870 1108 -1055 736 -158 -404 869 -1050 928 -558 -20 625 -1025 1207 -961 491 105
1645A05q16J849k377K220j441L22Q93j909K333k022J094J67j377K276k598K169
$$ 105 -711 1138 -1239 981 -460 -138 755 -1154 1179 -843 251 418 -959 1317 -1281 888
1661H88j135k10J468k328K545k014Q97M54j662K425k524J847n82q29K007k718
$$ 888 -247 -457 1011 -1317 1228 -786 111 565 -1097 1328 -1196 651 69 -760 1247 -1471
1677a471K709j922N49R73k122K663k464J597k20j288K374k783K457j457k3J561
$$ -1471 1238 -684 -135 838 -1284 1379 -1085 512 292 -996 1378 -1405 1052 -405 -428 1133
1693A133k645K936k441J327J74j662K642k781K099q96n59K012k937K936k080P48
$$ 1133 -1512 1424 -1017 310 484 -1178 1464 -1317 782 -114 -673 1339 -1598 1338 -742 6
1709FP73k167L011k924J925m77j002K273k973K736j597K5J429k584L191k823J543
$$ 6 779 -1388 1623 -1301 624 147 -855 1418 -1555 1181 -416 -391 1038 -1546 1645 -1178 365
1726C65R9j556K584l033K632j324m14J899k760K979k427J061P19k239L001l029
$$ 365 464 -1092 1492 -1541 1091 -233 -647 1252 -1508 1471 -956 105 824 -1415 1586 -1443
1742a443K394j034p92K325k992K792j974N93J201k676L180k771J786l37j400K815
$$ -1443 951 -83 -875 1450 -1542 1250 -724 -131 1070 -1606 1574 -1197 589 252 -1148 1667
1758A667l261K699j546J12J488k830L220k421J035L90j851L047l313K414q50o58
$$ 1667 -1594 1105 -441 -329 1159 -1671 1549 -872 163 553 -1298 1749 -1564 850 0 -658
1774f58J913k920L209k288N57J022k120K868l002K072k67j464K508l030K998k048
$$ -658 1255 -1665 1544 -744 -187 835 -1285 1583 -1419 653 386 -1078 1430 -1600 1398 -650
1790f50K13J579k575K866k638J675J20j894K779k839K426j400l28K103l027K925
$$ -650 -437 1142 -1433 1433 -1205 470 590 -1304 1475 -1364 1062 -338 -666 1437 -1590 1335
1806A335k238J177L96k111L054k759J774o55p50K331l228K850j664L86R13k308
$$ 1335 -903 274 670 -1441 1613 -1146 628 -27 -777 1554 -1674 1176 -488 -102 811 -1497
1822a497L177k791J442o9j110K259k997K601j152m10J550k423K968k596J146N66
$$ -1497 1680 -1111 331 262 -848 1411 -1586 1015 -137 -547 1003 -1420 1548 -1048 98 664
1838F64j710K372k734K342r34q19J994k432K515k068P09J067k251K597k472J922
$$ 664 -1046 1326 -1408 934 0 -819 1175 -1257 1258 -810 -101 966 -1285 1312 -1160 762
1854G62o58j053K272k572K185j495L52J261k497K703k112J246j09j346K542k744
$$ 762 104 -949 1323 -1249 936 -559 -207 1054 -1443 1260 -852 394 285 -1061 1481 -1263
1870a263K014j002j16J399k466K627j757N36N60j645K557k633J713m02p42J677
$$ -1263 751 -251 -367 1032 -1434 1193 -564 -28 532 -1113 1444 -1189 524 122 -620 1057
1886A057k368K414j545J45J047j806K298k205J307Q6j344K054k325K142j248j41
$$ 1057 -1311 1103 -442 -297 750 -1056 1242 -963 344 430 -914 1140 -1185 957 -291 -432
1902d32J368j972K064j795R60L48j567K122k033J578p35n12J672k198K052j460
$$ -432 936 -1036 1028 -767 193 541 -1026 1096 -937 641 -94 -606 1066 -1132 920 -540
1918e40N84N02j578K101j834J117k14p86J708k108J794j004M6R01j715K048j670
$$ -540 44 546 -1032 1069 -765 352 138 -648 1060 -1048 746 -258 -212 689 -1026 1022 -648
1935f48Q10J27r53J594j819J444n64m31J218j734J805j352N00M53j191J602j638
$$ -648 162 289 -664 930 -889 555 -9 -440 778 -956 849 -503 -3 450 -741 861 -777
1952g77J184l32n96J304j605J468r43J27P73j432J637j444R32j06p87J385j503
$$ -777 407 75 -521 783 -822 646 -297 -170 603 -829 808 -636 296 190 -597 788 -715
1969g15J207o35j19R32j468J501j146N65K35r71J400j466J091m20l36R78j318
$$ -715 492 -143 -262 670 -798 703 -443 122 357 -614 786 -680 411 -9 -345 633 -685
1986f85J243q45J96N25j066J339j254Q08j40n36J022j242J125p00K9O01j016J141
$$ -685 558 -287 -91 434 -632 707 -547 261 121 -415 607 -635 490 -210 -181 420 -596 545
2004E45r33M65J82p75J104j141R26m52j34O62r77J043p59K56K76p39R83r40O22
$$ 545 -388 77 259 -516 588 -553 373 -79 -213 449 -528 515 -244 12 288 -451 532 -408 214
2023B14j57l56P86r83R33o28J14L44o54Q08p26M13K4m76P68q50O95l44n1M28o92
$$ 214 57 -299 487 -496 437 -191 -77 267 -387 421 -305 108 132 -344 424 -426 269 -75 -126 302 -390
2044c90P73o08K70Q5m21O17o31M67j32k02M75o37O39m36R9K02m44N54n07L39m7
$$ -390 383 -225 45 130 -291 326 -305 162 30 -172 303 -334 305 -131 -32 170 -274 280 -227 112 65
2065F5k46M26n01M36j95p8L24m91N17m31K25L5k43L58l84K80r1r7K66l68L70k87
$$ 65 -181 245 -256 180 -15 -93 231 -260 257 -174 51 86 -157 201 -183 97 6 -91 175 -193 177 -110
2087a10J17J03k71L31l10K03p1n9J80k26J77o9j7J38k31K73k47J20K2j19J81k09
$$ -110 7 110 -161 170 -140 63 -8 -67 113 -113 64 -5 -22 116 -115 158 -89 31 53 -66 115 -94
2109i4J54q8jQ1p9P3n1j1P9j65J67j19Q9n3lK4pMj8KK6j8K4l6J2J5k0L1k8J9k6
$$ -94 60 -28 -29 52 -27 46 -5 -16 63 -102 65 -54 35 -18 -21 3 -4 0 -18 -16 10 -8 16 -20 -8 7 -13 18 -10 9 -17
2140a7K0k4Q4r9R4p1J2L0p0Q9q0M1J4r0J41j12N9op5J61k03J92j41M8K4r8J69
$$ -17 3 -21 63 -36 58 -13 -1 29 -41 48 -32 9 23 -67 74 -38 21 15 -60 101 -102 90 -51 -3 21 -77 92
2167I2j46O1M7j46K03k34J97r4j0J23k18K68k33J45j3j47K13k04J66p9q3K43l01
$$ 92 -54 7 54 -92 111 -123 74 -20 -30 93 -125 143 -90 55 42 -105 108 -96 70 -9 -92 151 -150
2190a50K99k65J25P7k34L06l09K17n5j14K41l08K88j67l1K17l42M14l76K30k4
$$ -150 149 -116 9 86 -148 158 -151 66 11 -103 138 -170 118 -49 -80 137 -205 209 -167 63 39
2211C9j90L28l54L02j54p1K47l68M09k94Q9J19k92M21m18L02j09q7K66l67L62
$$ 39 -151 177 -177 125 -29 -100 147 -221 188 -106 -17 102 -190 231 -187 115 6 -81 185 -182 180
2232A80k81N5J85l48M54m36K79k5k21M07m67L82k30rK37l94M47l48J62Q2l40M58
$$ 180 -101 -46 139 -209 245 -191 88 63 -158 249 -218 164 -66 -75 162 -232 215 -133 29 111 -229 229
2254B29m67L67j56j17L38m52M51l35J12J63l56M86m55L01p5j98M23n13M56k83
$$ 229 -238 129 -27 -144 194 -258 193 -142 -30 133 -223 263 -192 109 34 -164 259 -254 202 -81
2274h1K6K09m02M87m26K28M4k81M58n06L97j66r0L04m70N28m20J71J24l49M93
$$ -81 -55 154 -248 239 -187 41 85 -196 262 -244 153 -13 -103 201 -269 259 -161 10 134 -215 278
2295B78n06L37q1j98L91m84M86l21P0K19m12M75m85K99L0k63M47n19M32k48l7
$$ 278 -228 109 28 -170 221 -263 223 -98 -28 191 -221 254 -231 68 98 -165 282 -237 195 -53 -90
2316i0L02m83N19l95J98N0l05M51m54L44j39r6L32m95M66l00P4J54l76N11m78
$$ -90 212 -271 248 -147 51 101 -204 247 -207 137 -2 -98 234 -261 205 -95 -21 133 -243 268 -210
2337b10K80n2j62L64m52L76j63p6K58m07M93l76J51P4k99M49m99L98j37j16L23
$$ -210 70 18 -144 220 -232 144 -19 -95 163 -244 249 -127 24 98 -201 248 -251 147 10 -106 217
2358B17m47M24l24J14J59l45M29m25L09p4j68L21m01L83k37K9K10l81L81l02J75
$$ 217 -230 194 -130 -16 143 -202 227 -198 111 37 -131 190 -211 172 -65 -36 174 -207 174 -128 47
2379D7Rk70M52m31K97j71k3K57m14L98k38Q0R5k53L78l76K39n1j00K46l77L94
$$ 47 56 -214 238 -193 104 -67 -90 167 -247 151 -87 -7 88 -165 213 -163 76 25 -75 171 -206 188
2401A88k29QJ43k55L26l18J84K4k05K87l21L05j78n1K35l20L21k59J42Q4k68L23
$$ 188 -41 -33 110 -145 181 -137 47 71 -134 153 -168 137 -41 -92 143 -177 144 -115 27 111 -157 166
2423A66l11K24q6j23L06l48K77j73O1J04k44K98k49J13J9j23K51l10K33j07k2
$$ 166 -145 79 -7 -130 176 -172 105 -68 -7 97 -147 151 -98 15 34 -89 162 -148 85 -22 -44
2444d4J69k81L04j93M4P5j90K53k78J79j3r6K25k88K53j74J5J18k17K72k39J30
$$ -44 125 -156 148 -45 -1 74 -116 137 -141 38 25 -71 154 -134 119 -55 -40 78 -139 133 -106 24
2466B4J6j56K13k14J96q0o2J73k15K13j66P0N0j71K36k32J68o7n8J66k13J89j10
$$ 24 40 -116 97 -117 79 -1 -63 110 -105 108 -58 12 62 -109 127 -105 63 -4 -62 104 -109 80 -30
2489c0J1R6k02K33j90R3L8j24J82k05J21m0%J01j58J60j45L8Q3j25J40j50J16
$$ -30 -19 77 -125 108 -82 11 49 -75 107 -98 23 -17 -17 84 -74 86 -59 -21 62 -63 77 -73 43
2512D3n8m1J18j21J25q6j1R4j24J23j21M3N5j04J49j38R2j6m0P1j22J11o0KM6
$$ 43 -15 -56 62 -59 66 -20 -31 63 -61 62 -59 -16 39 -65 84 -54 38 22 -18 53 -69 42 -18 -16 30
2537C0o8J14j19P0l1l3Q9j14J07m7l2P9r6J05o3J4J9o9J03q5L2Jl8N8n0O9o1m
$$ 30 -38 76 -43 27 -4 -37 52 -62 45 -2 -34 45 -51 54 -9 5 24 -45 58 -27 5 6 -32 26 -24 45 -16 -20
2565b0O5r8Q4n2L1J4p6R6n2L6j4l6L9n3P3m7qN9p9P9o3OM9o5M6n9O8j1l4N4n3
$$ -20 45 -53 31 -21 10 24 -52 44 -8 28 14 -22 17 -36 37 -10 -18 41 -38 41 -22 -16 33 -32 14 -45 23 12 -22 32 -21
2596b1K0j8%N1o9P4p6M8J4m8L7l9N1mj8L2o1M4l1J0K8n2N4o9N7Lm4R2o8L0k5k1
$$ -21 -1 -19 -19 32 -37 37 -39 9 23 -25 12 -27 24 20 2 34 -27 17 -14 -4 24 -28 26 -43 14 17 -27 65 -3 27 2 -19
2628a9L1n2L4Kj0K8m3L9m3L8Rm5L6k2QK7kKl1K6j4K1%k3M1m2jL2k1Ql2L9On1L7
$$ -19 12 -40 -6 -4 -14 14 -29 10 -33 5 14 -31 5 -17 -9 18 16 18 -13 13 -1 20 20 -3 38 -4 -5 27 6 14 -18 21 27 -24 13
2663A3j9M8n1L0k2%K3l9L2nl1N7o4L7j9nM3m1J5l2LRJL6m9N9m7M2j8kJj6K3K3
$$ 13 -6 42 -9 21 -1 -1 22 -17 15 10 -21 36 -28 9 -10 -15 28 -13 2 -30 -27 -18 -17 19 -30 29 -18 24 6 4 5 -11 12 35
2697C5m4Rj3K8k9J3nk3M6k3J5Pl2K6j1KqQlj4J2pK6j1qk2M4m3K4j0K4l1K2j8J2
$$ 35 -9 0 -13 15 -14 -1 -6 -29 17 -6 9 16 -16 10 -1 1 -7 1 -2 -16 -4 -11 15 4 -4 -26 18 -25 -1 -11 13 -18 4 -14 -2
2732bj4J2OKL0m8L9l8K7j9k1K2k4O1m1RJ4j9J7l5M0m0jL8m3M4k7K2lm1K0LJ9j7
$$ -2 -16 -4 2 4 34 -14 25 -13 14 -5 -26 -4 -28 33 -8 1 15 -4 13 -22 18 -22 -23 15 -28 16 -11 11 8 -33 -13 -10 9 -8
2766hj0M3j9K8k6J6ll5N9o8M5J3o6O9o3M3j1jM9p3O4n9K9Pn6P2p2O9l0m3P1j00
$$ -8 -18 25 6 34 8 24 21 -14 45 -23 22 35 -31 38 -25 18 7 6 55 -18 46 -13 16 23 -33 39 -33 36 6 -37 34 -66
2798f6Q7k9J3K9q9J34j29M8L8o9Q1j09Q7l6j2O5j16J33r2N0K4j08J39j17J12p8
$$ -66 21 -8 5 34 -55 79 -50 -2 36 -33 48 -61 26 -10 -22 43 -73 60 -32 18 42 -66 73 -44 68 -10
2824a0k9R8j44J56q2j9R9j63J42j04Q7jp3J14j70J33m6j8Q3j40J74j62N4N9j20
$$ -10 -39 59 -85 71 -11 -30 69 -94 48 -56 31 30 -43 71 -99 34 -12 -30 53 -87 87 -75 -21 38 -82
2849h2J88j85J43q2j3J00j77J59j01L1P3j40K13j87Q7nr6J70j80J64j21K8R1j53
$$ -82 106 -79 64 -18 -31 69 -108 51 -50 -19 54 -86 127 -60 27 22 -74 96 -84 80 -41 -13 78 -75
2873g5J91j82J03J7j10J57k26J90p3l8J41k07K04j53M7O4j47K23k49J45j7j02
$$ -75 116 -66 37 54 -56 101 -125 65 -8 -46 95 -112 92 -61 -14 50 -97 126 -123 22 5 -97
2895i7J93k09K33j73O1P6j99K12j59J13j6j17K07k16J84j28mJ52k52K57j58N8
$$ -97 96 -113 120 -53 8 84 -115 97 -62 51 35 -82 125 -91 93 -35 -39 113 -139 118 -40 18
2917A8M1j60K36k46J70m1q9J94k68K31j37L7J01k43L04k58J58mj55K28k28K11
$$ 18 59 -101 135 -111 59 18 -71 123 -145 86 -51 -14 87 -156 148 -110 48 44 -111 117 -111 100
2939A00r9o5J62k45L05k43R7N2k08K86k60K05q3r7K19k67K68k31R2J05k54L22
$$ 100 1 -64 98 -147 158 -85 12 64 -144 142 -118 87 4 -93 126 -141 127 -104 -12 93 -161 161
2961A61k72J85n6j05K54l20K53j45MJ75k78K92k68J55Nj76L08l46K36n1p5J94
$$ 161 -111 74 18 -87 167 -153 100 -45 -41 134 -144 148 -120 35 40 -136 172 -174 62 11 -64 130
2983A30l32L66k30P7Q3k42L26l10K18n6j12K39l13K84j71K7J48k65K92k67J57
$$ 130 -202 164 -66 11 94 -148 178 -132 86 30 -82 157 -156 128 -43 -16 132 -133 159 -108 49
3004D9Nj91K96k94K62j71J6J69l27L19k58J48L6k18L48l16K50j30p8K37l29L10
$$ 49 54 -137 159 -135 127 -44 -28 141 -186 133 -125 23 59 -159 189 -127 123 -7 -85 152 -177 133
3026A33j82O9P3k63L49k97J68j8j30K69l49L26j86J8J33k58L20k94J50N3k02K71
$$ 133 -49 20 93 -170 179 -118 50 32 -98 171 -178 148 -38 -20 113 -145 175 -119 31 84 -118 153
3048A53l12K44p6r8K29l11L34k76J25J06k58L07l02K04n8j16K49l11K83j86K8
$$ 153 -159 85 9 -89 140 -171 163 -113 12 118 -140 167 -135 69 11 -105 144 -167 116 -70 -42
3069d2J67k91L29k83J89l6j65K96l07K47j37MJ92l40L39k34R6M2k22L29l12K20
$$ -42 125 -166 163 -120 69 33 -132 164 -143 104 -33 -29 163 -177 162 -72 24 66 -156 173 -139 81
3091H1p7j02K57l17K81j99K2J52k50L25l15J92%j49K67l16K48j48NJ50k56L00
$$ 81 4 -98 159 -158 123 -76 -54 98 -152 173 -142 50 50 -99 168 -148 100 -48 -43 107 -149 151
3113A51k42J04O4k02K84l07K35q0p6K12k96K69j89P9P6k16L10k95J85l4j11K40
$$ 151 -91 13 77 -125 159 -148 87 7 -69 143 -153 116 -73 6 82 -134 176 -119 66 32 -79 161
3135A61l18K63j78M7R8j93K53k06R5J8j67K60k66K13p9n1J55k48K65k08J04K3
$$ 161 -157 106 -72 -25 73 -120 133 -73 22 40 -127 133 -133 80 1 -50 105 -143 122 -86 18 41
3157D1j56K18j88J39l0r6J90k41K29j50L2R9k03K55k11R8Mr4J55k23J98p0l2R6
$$ 41 -115 103 -85 54 24 -72 118 -123 106 -44 -12 87 -116 139 -72 26 30 -64 91 -132 66 -4 -36 60
3181F0j90K24j57P3Qj08J94j95J47o1p1J58j80J99j57N7N7j40J78j73J28m9n7
$$ 60 -130 94 -63 10 18 -90 104 -91 56 -5 -76 82 -98 101 -56 1 58 -82 96 -77 51 2 -55
3204e5J33j62J43o5k5J13j58J60j33P2qr0J50j48J15m1m5J15j26J49j40M7L4j30
$$ -55 78 -84 59 -6 -31 82 -76 84 -49 23 15 -75 75 -73 42 1 -44 71 -55 94 -46 1 35 -95
3228i5J91j58Q9n3k7J00j28J46r5nQ6j15J30j19O6j0m0R2j10R8n0lN7q2R1q4M6
$$ -95 96 -62 27 -26 -53 47 -81 65 -30 -35 51 -64 66 -53 13 3 -37 55 -55 43 -7 -10 47 -35 56 -28 18
3255A8J4p6R5q3M3j1m2L3j5M3k1J1j0j4M7n9K6Qm6M4n8R0m8K9Lk3K9l0RolK4l7
$$ 18 32 -44 51 -32 11 0 -42 -9 -24 19 -2 9 -1 -15 32 -27 -1 7 -39 5 -53 37 -11 18 21 -2 27 -3 6 0 -3 21 -16
3288a6J0Pl3O6k5K3l4RJ3l7k0J3K1k0MM9m8J3j1LJ0pPj0J5J4j6k9J5mJ3j4M1j1
$$ -16 -6 1 -32 34 9 32 -2 7 20 -17 -37 -24 -3 -23 -19 30 -18 -5 -16 -13 -3 -10 -3 -13 2 16 0 -29 -14 -18 -5 -19 22 11
3322A1k0J0J9k7M0k7J9pj5Om3N1o7O3k9oN4l3j8K3j7M1m1M1m8M9qk1J1k8K8j5
$$ 11 -9 1 20 -7 33 6 25 18 3 9 -34 17 -50 13 -16 -22 32 -1 -19 4 -13 28 -13 28 -20 29 21 0 11 -17 11 -4
3354dK3Qq2N3J0mL5j02J09j18R6l0kK5m9R6q3RN3q2P4p9M0Jm6J26j31J20q4J9
$$ -4 19 27 -55 -2 8 4 39 -63 46 -72 24 -6 -8 17 -32 64 -19 -10 43 -39 35 -44 -4 -3 -49 77 -54 66 -18 1
3384AN6r7R8p1L0M3j21J34j18Q8p7J3P4j34J30j22Q7Rq1J33j13Q6l3o1J39j64
$$ 1 57 -40 58 -13 17 60 -61 73 -45 43 -34 -21 53 -81 49 -73 14 23 -58 75 -38 48 15 -46 93 -71
3410g1J50j30L3O9j18J78j58Q0or5J43j45J54q4j8J07j77J90j61Q0K8j03J37j99
$$ -71 79 -51 -18 51 -67 111 -47 33 27 -68 75 -70 84 0 -18 89 -88 102 -59 21 49 -54 83 -116
3434a16J66n4m0J42k03J77j18M3M6j47K05j88J39l8j09J89j68J68j21j9J42j76
$$ -116 50 -4 -44 98 -105 72 -46 -3 43 -104 101 -87 52 14 -95 94 -74 94 -27 -46 96 -80
3456h0J82j80J10J6j15J71k01J55p3k0J29j75J74j57O1Q3j94K36k16J82p3p0J58
$$ -80 102 -78 32 48 -67 104 -97 58 -15 -35 94 -81 93 -64 -3 80 -114 122 -94 88 15 -55 103
3479A03k22J91j14M7P5k09K64k15J33k5j17K08k44K11j03JJ13k30K49j88Q6M6
$$ 103 -119 72 -42 5 80 -129 135 -80 53 28 -89 119 -125 86 -17 -16 97 -133 116 -72 14 60
3501F0j78K75k58J55n3l5J24k16K58j88N7R3k02K24j95J23m8j01J87k26K59j55
$$ 60 -118 157 -101 54 1 -34 90 -126 132 -56 1 94 -108 116 -79 44 -4 -105 82 -144 115 -40
3523d0J1J42k46K41j87J07j2j30K31k38J94q0n5J87k57K56k00P8N6j64K48k34
$$ -40 -29 113 -133 108 -79 28 16 -114 117 -121 73 -7 -62 125 -132 124 -76 2 58 -106 142 -92
3545i2J74l7j23K05k57K39j67M7J09k18K90k52J04L5j27J90k39K24j07n9J59k30
$$ -92 82 45 -78 127 -130 109 -58 -11 98 -120 170 -82 22 57 -70 120 -119 105 -2 -61 98 -132
3567a32K84k36R0O5j79K50k65K10r1o1J91k43K46k04L5J22k14L11k78J71l0j42
$$ -132 152 -84 6 71 -108 142 -123 87 -4 -65 126 -117 129 -75 -40 82 -132 179 -99 72 42 -100
3589a00K30k76K36j42M0J41k46K74k19R1kj32K22k44K06r1l6J54k62K63j77P0
$$ -100 130 -146 90 -52 -12 129 -117 157 -62 29 27 -105 117 -127 79 -12 -48 106 -156 107 -70 0
3611@P0j94K68k79J72k5p2J79k66K81j86PJ38j84K19k18J52qj53K36k43K22j32
$$ 0 70 -124 144 -135 37 12 -60 119 -147 134 -52 -45 93 -91 128 -90 62 54 -99 137 -106 116 -16
3634a6l2J66k50K32j46O8N7k05K35k19J79o2q0J85k38K32j67P2Q7k13K28k24J39
$$ -16 -48 118 -132 100 -46 22 79 -126 109 -110 69 7 -73 112 -126 106 -61 11 98 -115 113 -111 28
3657B8j3r7J86k08K07j24KJ06j86K34k03J04mj10J86k01J30k8n6J64k37K58j91
$$ 28 15 -82 104 -104 103 -21 -19 87 -99 135 -68 36 32 -78 108 -93 37 9 -47 117 -120 138 -53
3680e3O5N3j68K24k15J59m4r5J66k12J70r2K9R2j81K32k25J33l2j05K14j96J51
$$ -53 12 65 -103 121 -94 65 21 -74 92 -120 50 -42 -13 79 -102 130 -95 38 6 -99 115 -81 70
3703G0q8k5J13j60J84j37M7N5j27J83j95J20l2k2J15j89J80j04j1R2j58J96j74
$$ 70 -18 -43 70 -90 94 -43 4 59 -68 115 -80 40 8 -14 101 -88 92 -12 -23 69 -89 107 -67
3726f7O8M7j22J52j85J75r1NR3j75J86j39P0L1j24J62j79J66r6OQ3j50J61j22
$$ -67 1 48 -74 78 -107 68 -23 -18 75 -100 86 -53 17 48 -76 86 -93 73 -23 -17 66 -84 77 -45
3750d5M9O4j32J57j49Q8j3p2J30j49J35r3M7L3j05J31j10K7K6q4J28j55J20k9
$$ -45 4 68 -64 93 -56 32 19 -53 77 -72 63 -30 17 50 -55 76 -34 -7 19 -65 63 -92 28 -1
3774aj4Q9j44J42j24N8%n8J14r4O9l0n3J06j01R0p2J6J4l0J08j16N1J4m6N7q5
$$ -1 -15 74 -70 72 -52 6 6 -52 62 -32 37 7 -46 60 -41 49 -23 -7 7 -23 85 -31 20 34 -12 45 -40
3801d0J06o4LL8j00R3p1N9%m7P2j02R0l3jM4j05J04p7oQ0o8M2o3N8oj2M3o5O4
$$ -40 66 2 5 43 -57 36 -35 24 24 -23 49 -53 37 4 3 47 -58 46 -31 -37 43 -25 17 -46 12 6 -6 37 -28 36
3831C6m1k4O2q5J09q8L9JrL9o5L5Kk7M1l1J3mj8L6l5O8o1L2j8K3j2l1L1m8M6j
$$ 36 -5 -29 33 -52 57 -31 8 9 0 39 -26 9 11 -16 25 -6 7 3 -15 21 -14 54 -7 25 7 30 18 -13 18 -30 16 15
3863A5m2K8l3K6Lk3L6k6M7k0lJ5l6M4l4j5M7k2J7m3M3j0m3L0J8j6k6L9K1j0m2
$$ 15 -27 1 -32 -6 -3 -26 10 -16 31 11 8 23 -13 31 -3 -18 29 7 24 -19 24 14 -29 1 19 3 -23 16 37 27 -15
3894a5K8k5J6j8%J6JL2m2J3oj6OLKmQJ0j9J3rj4K2ljJ0pjNK0k9K8m3K9oj2RJ3
$$ -15 13 -12 4 -14 -14 2 3 35 -7 6 0 -16 -10 -7 -5 -9 -1 9 -10 3 -6 -20 2 -1 -2 8 1 0 5 25 -4 24 -19 10 4 -8 1 14
3932A4k1K6k2L7m2J2J2m1M4o5N8mj7NJ6j7j0OK8k1K9m1Krj4P9q3N7k4lM1n7N4
$$ 14 -7 19 -3 34 -8 4 16 -25 19 -46 12 8 -9 -4 12 -5 -15 -9 19 -2 27 -14 -12 -21 -35 44 -39 18 -6 -9 32 -25 29
3965B9k8J7L8o9K3k8L1Pl2M0m1N7o4K7K4o0O3o2K8K5n4M7o4M8k9J3M0l9N1q0L1
$$ 29 1 18 56 -13 10 -18 13 20 -12 28 -13 44 -20 7 31 -29 34 -28 0 25 -29 18 -46 2 -27 -14 26 -13 38 -42 -11
3996a1Lk0P9r6M2J2l8Q1q9N6j4j9N4q9O7l3N1k6l4O1o4M0k3jO3q8P2p5K2L0p1
$$ -11 -8 -28 51 -45 -3 9 -29 52 -37 19 5 -14 40 -49 18 -15 36 10 -24 37 -27 13 -10 -11 52 -36 36 -39 -17 13 -58
4027e8R8q2N1k6nO7j10J03p4K4K3n7R7q3P1l5l9O5n6O8m7LM8r0J03p2J7K3p4Q7
$$ -58 40 -42 9 -17 -22 45 -65 38 -36 -12 11 -46 51 -32 39 4 -35 30 -26 42 -5 -2 46 -44 59 -13 4 27 -47 40
4057D0p8P7k5n2J17j16Q0m3j4N1r3J20r8N1l2l0Q0q1M1Qk5O2j22J57j10L4K0n7
$$ 40 -38 39 14 -38 79 -37 43 0 -14 37 -56 64 -34 17 -15 -45 35 -46 -5 3 -22 40 -82 75 -35 -1 19 -38
4085c8J02j13Q5rp0Q7r5J07q4M5K3p8J00r4P2l0m8J09j37J28q0J0N3r2J00r7N2
$$ -38 64 -49 36 27 -43 44 -51 56 -28 17 40 -38 62 -32 40 10 -38 71 -66 62 -18 -8 45 -47 53 -44 8
4112HPn5R4j13P0j1k4O8j14J13q1K4J4m4J01r2N4j9m1R5j10J06n9oO5p2O5p2N5
$$ 8 15 -40 54 -59 11 0 -24 44 -70 43 -38 -14 0 -44 57 -35 19 0 -41 54 -56 50 -9 -15 50 -22 43 -29 26
4141B6J2o4R9j05O6l9j1M1r0J09p7L9L5q0J03j01P1l7j1N8q4N9j7KL7j09R0n4
$$ 26 38 -26 73 -32 34 -5 -16 25 -65 44 -33 6 41 -39 64 -37 34 -3 -14 44 -40 19 2 4 41 -68 22 -32
4169c2N3k2l9Q8j17Q3k4ON4j12J28o9K6Mo2J03j15O1j0m9P2q7R8n1rN5p1J02j12
$$ -32 21 -1 -40 48 -69 14 -10 -4 50 -62 66 -3 23 27 -35 68 -47 14 4 -45 27 -60 38 -13 -22 33 -38 64 -48
4198d8N9j4l5P2q1O9o6J3O5r1J16q8M0J7o9Q1q1L6oKO8q7N6l0J1L5o4Q3q2L8j9
$$ -48 11 -3 -38 34 -47 22 -44 -31 34 -57 59 -29 11 28 -41 40 -41 -5 -11 -9 59 -28 28 -2 9 44 -20 63 -19 19 0
4229@j4M7q9J05m4oK3m8P2p1L9Nn6Q5j09Q7j7l0L8m4L8n0K1M5r5R3p8O3rl8N4
$$ 0 -14 33 -56 49 5 -1 22 -26 46 -25 14 19 -37 48 -61 26 9 -21 17 -27 11 -39 -18 27 -68 25 -53 10 1 -37 17
4260A7n5P2m3RJ8p3R4l9oN3o7N7o9N9k0l1M9n1M3l3%J5n1Q8o3K6K3n9M0m2O0l4
$$ 17 -38 34 -9 0 18 -55 39 0 -6 47 -20 37 -32 27 7 -24 25 -26 17 -16 -16 -1 -52 36 -27 -1 22 -37 3 -39 21 -13
4292a3k1K3nM6o2J9L9m8N6m4M2m4kN7q7P6l8J4J5l3L9l6K2k8k6M6k9N7m3RM1q0
$$ -13 -34 -11 -16 30 -32 -13 26 -22 34 -10 32 -12 -14 43 -44 32 -6 8 23 -10 29 -7 15 -13 -39 7 -22 35 -8 1 42 -38
4324c8N0o3M0J0k8M9m8N9k6l8N0l3M2l1j2K5k5M0m1J0kK1qk2M2k0lJ9m7P7m8J7
$$ -38 12 -51 -11 -1 -29 20 -28 31 5 -33 17 -16 26 -5 -17 8 -17 23 -18 -8 -10 11 3 -19 23 3 0 19 -28 49 1 18
4356A8k4k2N3k4J3Kk4Ok0N0l8nJ9l0N5n9J9npM3l6K3pj1J3l3L6k6K1Mj8L8m3J7
$$ 18 -6 -28 25 1 14 16 -8 -2 -22 28 -10 -15 4 -26 29 -30 -11 -16 -23 20 -16 7 0 -11 2 -31 5 -21 0 4 -14 24 -19 -2
4390bj1J1J1k8M6j8l9N3l3L7k6NrkJ2klj1K0Pl1OoMNkJ8l6L2j3lJ0%Mj7JKJ9j0
$$ -2 -13 -2 9 -19 27 9 -30 23 -10 27 1 6 -3 -5 7 5 2 -9 11 18 -13 -7 -13 -9 -4 -6 12 -24 8 -5 -8 2 2 6 -11 -10 -8 11 1
4429AlK1j1k0M9k9kK0k9jj2N1l8lM2l4kmL6m1j4L5qK8m2L1j9KJ%l6J9mK2k1NJ5
$$ 1 -2 19 8 -12 37 8 6 26 -3 -4 -16 35 -3 -6 36 2 0 -4 32 -9 -23 12 4 32 -10 21 2 4 5 5 -31 -12 -16 6 -15 -10 5
4466Ej5nJ5pK1j1k2J3J8l0K2MPj8J0Qpj6o%KMj8M5k3j5J9j3Qj6M0j3j6KJ1l0j
$$ 5 -10 -15 0 -7 14 3 -19 -6 12 -18 4 8 15 -3 7 15 8 -8 -14 -14 -12 -8 -26 19 -4 -19 0 -13 -5 -21 19 6 -10 -8 3 -27 -28
$$ [...]
8191d4
##END NTUPLES=NMR FID
##END=
