##TITLE=1H_Pr-urea
 CDCl3
 8 sc, 
 6.12.2021
##JCAMPDX= 6.0         $$ Bruker NMR JCAMP-DX V2.0
##DATA TYPE= NMR FID
##DATA CLASS= NTUPLES
##ORIGIN= UXNMR, Bruker Analytische Messtechnik GmbH
##OWNER= root
$$ XWIN-NMR		Version 3.5
$$ Mon Dec  6 12:59:23 2021 Russian Standard Time (UT+4h)  she@DPX200
##.OBSERVE FREQUENCY= 200.131346
##.OBSERVE NUCLEUS= ^1H
##.DELAY= (6, 6)
##.ACQUISITION MODE= SIMULTANEOUS
##.ACQUISITION SCHEME= undefined
##.AVERAGES= 8
##.DIGITISER RES= 18
##SPECTROMETER/DATA SYSTEM= spect
##.PULSE SEQUENCE= zg30
##.SOLVENT NAME= CDCl3
##.SHIFT REFERENCE= (INTERNAL, CDCl3, 0, 15.7039)
##AUDIT TRAIL= $$ (NUMBER, WHEN, WHO, WHERE, WHAT)
$$ ##TITLE= Audit trail, XWIN-NMR		Version 3.5
$$ ##JCAMPDX= 5.01
$$ ##ORIGIN= Bruker BioSpin GmbH
$$ ##OWNER= she
$$ F:/spectra/data/she/nmr/H-F/1/audita.txt
$$ ##AUDIT TRAIL=  $$ (NUMBER, WHEN, WHO, WHERE, WHAT)
(   1,<2021-12-06 12:57:26.53 +0400>,<she>,<DPX200>,
      <created by zg, POWCHK disabled, PULCHK disabled
       configuration hash MD5:
       00 E9 B6 7A A2 85 ED C7 34 08 36 98 17 FE 4E 26
       data hash MD5: 16K
       F0 65 35 5A 2B 2E CE 6F 64 BD 07 EC 1A D8 74 40>)
$$ ##END=
$$ 
$$ hash MD5
$$ AC 6D 6C 16 C0 DC 35 23 87 B7 E9 B2 51 3E 2F 5F
##$RELAX= 
##$RELAX= 
##$RELAX= 
##$RELAX= 
##$RELAX= 
##$RELAX= 
$$ Bruker specific parameters
$$ --------------------------
##$DU= <F:/spectra>
##$EXPNO= 1
##$NAME= <H-F>
##$PROCNO= 1
##$TYPE= <nmr>
##$USER= <she>
##$AMP= (0..31)
100 100 100 100 100 100 100 100 100 100 100 100 100 100 100 100 100 100 
100 100 100 100 100 100 100 100 100 100 100 100 100 100 
##$AQSEQ= 0
##$AQ_mod= 1
##$AUNM= <au_zg>
##$AUTOPOS= <>
##$BF1= 200.13
##$BF2= 200.13
##$BF3= 200.13
##$BF4= 200.13
##$BF5= 200.13
##$BF6= 200.13
##$BF7= 200.13
##$BF8= 200.13
##$BYTORDA= 1
##$CFDGTYP= 0
##$CFRGTYP= 5
##$CHEMSTR= <none>
##$CNST= (0..31)
1 1 145 1 1 1 1 1 1 1 1 1 1 1 1 1 1 1 1 1 1 1 1 1 1 1 1 1 1 1 1 1 
##$CPDPRG= <>
##$CPDPRG1= <>
##$CPDPRG2= <>
##$CPDPRG3= <>
##$CPDPRG4= <mlev>
##$CPDPRG5= <mlev>
##$CPDPRG6= <mlev>
##$CPDPRG7= <mlev>
##$CPDPRG8= <mlev>
##$CPDPRGB= <>
##$CPDPRGT= <>
##$D= (0..31)
0 1.2 0 0 0 0 0 0 0 0.06 0 0.03 0 0 0 0 0.0002 0 0 0 0 0 0 0 0 0 0 0 0 
0 0 0 
##$DATE= 1638781045
##$DBL= (0..7)
120 120 120 120 120 120 120 120 
##$DBP= (0..7)
150 150 150 150 150 150 150 150 
##$DBP07= 0
##$DBPNAM0= <>
##$DBPNAM1= <>
##$DBPNAM2= <>
##$DBPNAM3= <>
##$DBPNAM4= <>
##$DBPNAM5= <>
##$DBPNAM6= <>
##$DBPNAM7= <>
##$DBPOAL= (0..7)
0.5 0.5 0.5 0.5 0.5 0.5 0.5 0.5 
##$DBPOFFS= (0..7)
0 0 0 0 0 0 0 0 
##$DE= 6
##$DECBNUC= <off>
##$DECIM= 32
##$DECNUC= <off>
##$DECSTAT= 4
##$DIGMOD= 1
##$DIGTYP= 9
##$DL= (0..7)
0 120 120 120 120 120 120 120 
##$DP= (0..7)
150 150 150 150 150 150 150 150 
##$DP07= 0
##$DPNAME0= <>
##$DPNAME1= <>
##$DPNAME2= <>
##$DPNAME3= <>
##$DPNAME4= <>
##$DPNAME5= <>
##$DPNAME6= <>
##$DPNAME7= <>
##$DPOAL= (0..7)
0.5 0.5 0.5 0.5 0.5 0.5 0.5 0.5 
##$DPOFFS= (0..7)
0 0 0 0 0 0 0 0 
##$DQDMODE= 0
##$DR= 18
##$DS= 0
##$DSLIST= <SSSSSSSSSSSSSSS>
$$ [...]
##$SUBNAM2= <"">
##$SUBNAM3= <"">
##$SUBNAM4= <"">
##$SUBNAM5= <"">
##$SUBNAM6= <"">
##$SUBNAM7= <"">
##$SUBNAM8= <"">
##$SUBNAM9= <"">
##$SW= 18.0517287032376
##$SWIBOX= (0..15)
0 0 2 0 0 0 0 0 0 0 0 0 0 0 0 0 
##$SW_h= 3612.71676300578
##$TD= 16384
##$TD0= 1
##$TE= 0
##$TE2= 300
##$TE3= 300
##$TEG= 300
##$TL= (0..7)
0 120 120 120 120 120 120 120 
##$TP= (0..7)
150 150 150 150 150 150 150 150 
##$TP07= 0
##$TPNAME0= <>
##$TPNAME1= <>
##$TPNAME2= <>
##$TPNAME3= <>
##$TPNAME4= <>
##$TPNAME5= <>
##$TPNAME6= <>
##$TPNAME7= <>
##$TPOAL= (0..7)
0.5 0.5 0.5 0.5 0.5 0.5 0.5 0.5 
##$TPOFFS= (0..7)
0 0 0 0 0 0 0 0 
##$TUNHIN= 0
##$TUNHOUT= 0
##$TUNXOUT= 0
##$USERA1= <user>
##$USERA2= <user>
##$USERA3= <user>
##$USERA4= <user>
##$USERA5= <user>
##$V9= 5
##$VALIST= <valist>
##$VCLIST= <CCCCCCCCCCCCCCC>
##$VD= 0
##$VDLIST= <DDDDDDDDDDDDDDD>
##$VPLIST= <PPPPPPPPPPPPPPP>
##$VTLIST= <TTTTTTTTTTTTTTT>
##$WBST= 1024
##$WBSW= 4
##$XGAIN= (0..3)
0 0 0 0 
##$XL= 0
##$YL= 0
##$YMAX_a= 457597
##$YMIN_a= -515157
##$ZGOPTNS= <>
##$ZL1= 120
##$ZL2= 120
##$ZL3= 120
##$ZL4= 120
##$ABSF1= 10
##$ABSF2= 0
##$ABSG= 5
##$ABSL= 3
##$ALPHA= 0
##$AQORDER= 0
##$ASSFAC= 0
##$ASSFACI= 0
##$ASSFACX= 0
##$ASSWID= 0
##$AUNMP= <proc_1d>
##$AZFE= 0.1
##$AZFW= 0.1
##$BCFW= 1
##$BC_mod= 2
##$BYTORDP= 1
##$COROFFS= 0
##$CY= 11.3945322036743
##$DATMOD= 1
##$DC= 2
##$DFILT= <>
##$DTYPP= 0
##$F1P= 2.36226072786647
##$F2P= -0.459571619588291
##$FCOR= 0.5
##$FTSIZE= 0
##$FT_mod= 4
##$GAMMA= 1
##$GB= 0.15
##$INTBC= 1
##$INTSCL= 1
##$ISEN= 128
##$LB= 0.24
##$LEV0= 0
##$LPBIN= 0
##$MAXI= 10000
##$MC2= 0
##$MEAN= 0
##$ME_mod= 0
##$MI= 1.114404
##$NCOEF= 0
##$NC_proc= 0
##$NLEV= 6
##$NOISF1= 3.799351
##$NOISF2= 2.8
##$NSP= 1
##$NTH_PI= 0
##$NZP= 0
##$OFFSET= 15.70392
##$PC= 1
##$PHC0= -15520.58
##$PHC1= 21.4008
##$PH_mod= 1
##$PKNL= yes
##$PPARMOD= 0
##$PSCAL= 0
##$PSIGN= 0
##$REVERSE= no
##$SF= 200.130013532006
##$SI= 16384
##$SIGF1= 3
##$SIGF2= 2
##$SINO= 400
##$SIOLD= 16384
##$SREGLST= <1H.CDCl3>
##$SSB= 0
##$STSI= 0
##$STSR= 0
##$SW_p= 3612.71676300578
##$SYMM= 0
##$S_DEV= 0
##$TDeff= 0
##$TDoff= 0
##$TI= <>
##$TILT= no
##$TM1= 0
##$TM2= 0
##$TOPLEV= 0
##$USERP1= <user>
##$USERP2= <user>
##$USERP3= <user>
##$USERP4= <user>
##$USERP5= <user>
##$WDW= 1
##$XDIM= 8192
##$YMAX_p= 0
##$YMIN_p= 0
$$ End of Bruker specific parameters
$$ ---------------------------------
##NTUPLES= NMR FID
##VAR_NAME=  TIME,          FID/REAL,        FID/IMAG
##SYMBOL=    X,             R,               I
##VAR_TYPE=  INDEPENDENT,   DEPENDENT,       DEPENDENT
##VAR_FORM=  AFFN,          ASDF,            ASDF
##VAR_DIM=   8192,          8192,            8192
##UNITS=     SECONDS,       ARBITRARY UNITS, ARBITRARY UNITS
##FACTOR=    0.0002768,     1,               1
##FIRST=     0,             0,               0
##LAST=      2.2672688,     0,               0
##MIN=       0,             -515157,         0
##MAX=       2.2672688,     457597,          0
$$ Real data points
##PAGE= N=1
##DATA TABLE= (X++(R..R)), XYDATA
0 0 0 0 0 0 0 0 0 0 -8 8 -8 8 -16 16 -24 24 -32 40 -48 64 -72 88 -104 125 -144 168 -198 230 -263 302 -346
31 -346 394 -448 511 -575 648 -728 817 -913 1017 -1135 1259 -1399 1550 -1712 1893 -2089
47 -2089 2304 -2541 2799 -3081 3395 -3744 4128 -4558 5043 -5594 6226 -6958 7815 -8837
61 -8837 10085 -11645 13656 -16362 20205 -26138 36539 -59968 224118 -240132 -405010 455542
73 455542 -33953 -331833 328747 153978 -480060 119241 393271 -249600 -214889 245168
83 245168 -30097 -129662 192214 35847 -272500 3348 222320 -17766 -154116 41876
93 41876 64712 -73469 28573 104781 -150563 -104756 239940 67848 -217797 43211 86720
104 86720 -148757 104038 184291 -246429 -81204 285012 -79385 -177762 194045 -47139
114 -47139 -197248 267804 88623 -359634 61944 245026 -201106 -19656 233739 -203294
124 -203294 -150195 311078 -6653 -284067 134205 149265 -171087 36393 148680 -172063
134 -172063 -92892 223200 42994 -181227 21900 116710 -78933 -44268 125071 -37404
144 -37404 -151658 123856 139168 -190336 -77510 182425 -52539 -114595 176140 -7110
154 -7110 -232272 128172 169429 -209758 -31897 199617 -108370 -86420 196338 -60891 -187291
165 -187291 170275 101458 -174526 34117 106956 -129268 -763 149238 -87660 -97060 126058
176 126058 20169 -105862 38291 36541 -80402 23633 88040 -61548 -74808 65214 30654
187 30654 -64930 17119 53306 -59999 -20261 93908 -26341 -97086 76819 64959 -94229
198 -94229 16323 85281 -94692 -33966 136564 -37258 -111571 103216 38505 -125504 46694
209 46694 81988 -116603 -8582 128692 -67582 -89832 100336 6182 -96923 64577 54429
220 54429 -98679 4493 90927 -53427 -52511 78198 8308 -64501 42037 41655 -68582 -6983
232 -6983 75292 -24184 -52288 55270 16483 -69730 23095 54079 -62653 -20375 77269 -28305
244 -28305 -66309 60990 16598 -77722 36009 57956 -74646 -12268 79141 -40717 -49799
255 -49799 76226 4601 -70193 47472 41678 -70869 6287 67306 -41881 -30969 63729
266 63729 -8749 -57548 39634 28698 -55333 5033 48259 -36679 -31131 47027 -3193 -49140
278 -49140 28411 30552 -47255 -4053 47035 -27530 -31921 50546 6627 -50428 27914 35801 -47640
291 -47640 -1183 53895 -29344 -31163 54210 -42 -52930 32373 29151 -51269 5630 46132
303 46132 -39105 -25925 49372 -9499 -45185 33237 17874 -46131 9671 36207 -34808 -15791
315 -15791 43489 -7481 -33158 28970 15657 -34937 10507 33550 -25155 -14693 36997 -3253
327 -3253 -31446 22852 17003 -32830 3762 31146 -25464 -20679 33725 -3453 -34493 21451 16307
340 16307 -36354 3473 32051 -26691 -17630 36823 -4917 -31220 26584 14939 -33533 10604
352 10604 30639 -25750 -10212 35146 -8592 -25531 26574 9661 -29890 10455 22207 -25489
364 -25489 -8284 27292 -11277 -22975 20678 6090 -27108 7051 18041 -21824 -7345 25538
376 25538 -8007 -20834 20083 9586 -22256 8494 19697 -18926 -4597 27150 -6644 -20119
388 -20119 20019 8943 -21209 8244 15769 -20913 -4435 24135 -9653 -20735 15848 5367
400 5367 -19913 6442 11592 -20334 -3931 22530 -7322 -18527 13969 7449 -15275 8345 13961
413 13961 -18069 -3505 25285 -4068 -17976 14662 7154 -15529 10524 12671 -22519 -3113
425 -3113 24832 -8961 -17360 13689 -1128 -15803 14442 5956 -25203 1435 19587 -10085 -8659
438 -8659 10180 -6228 -6683 16906 2113 -17038 3908 13820 -2257 -2712 4102 -3108 -1876 11058
452 11058 5064 -12972 -5553 12973 3047 -10031 2254 791 -12143 8023 13347 -20638 -11766
465 -11766 21317 -1785 -15312 13919 -2346 -21462 19949 17199 -28032 -1681 24587 -11488
477 -11488 -5140 21444 -13143 -15071 27804 6317 -23303 5815 9316 -10989 7393 8396 -17389
490 -17389 -3945 13449 -1484 -7039 -2347 -3668 3949 4659 -5631 -3318 -2119 -1767 11171 2089
504 2089 -15457 3800 12092 -7118 2322 8446 -14036 2259 22147 -10151 -13263 15633 -3259
517 -3259 -8659 19172 -6171 -23152 18133 9461 -23177 6748 9775 -22536 7880 20165 -25840
530 -25840 -9294 25298 -8409 -11906 19181 -6571 -15894 21033 6801 -18978 5852 11080 -6038
543 -6038 3748 3789 -8275 2021 6391 -283 1197 -6967 -5216 12583 -1855 -14662 8956 2597
557 2597 -15386 11527 7579 -26079 4284 23961 -17439 -8345 20773 -11961 -10925 26005 -4412
570 -4412 -21665 19255 9368 -17451 9625 6809 -16749 10443 14834 -16796 -1952 11390 -9746
583 -9746 775 10282 -14252 -4382 15205 -6588 -9166 7311 -6378 -4146 13603 -3808 -12141
596 -12141 6767 3029 -3225 6637 -3140 -5911 11113 2464 -6981 5947 -2073 -5382 15792 1024
610 1024 -17988 7920 9259 -13714 5773 9581 -20182 537 20771 -14379 -13608 15580 -4056
623 -4056 -10779 15788 -2556 -19531 11317 11558 -11776 1295 6988 -7074 3903 9220 -7346
636 -7346 -3345 6944 1670 2099 156 -7525 1685 6538 -3366 -132 697 -7982 3045 7598 -10153
651 -10153 -5339 8010 -3304 -2259 7147 -8093 -7551 12389 2028 -8787 5795 1304 -7077
664 -7077 9083 4823 -11402 3824 10208 -5916 322 5980 -8415 -1098 11410 -3424 -7673
677 -7673 5136 -576 -4970 3839 -783 -7109 2652 3547 -4058 -2214 -668 -626 2347 1131 -1384 204
693 204 -781 850 4730 -1418 -2711 5718 1573 -3791 3588 928 -5687 4368 5403 -7194 -1273
708 -1273 5182 -5007 -2806 5544 -3636 -4982 5274 -908 -6495 2576 1525 -4255 2176 2727 -3393
723 -3393 215 3067 -1458 109 3164 751 249 1118 -74 452 1132 507 1079 -786 -1185 1499 -848
740 -848 -3184 899 776 -2817 1142 623 -5474 -331 4249 -3074 -2206 3110 -2083 -2291 4577 -500
756 -500 -4036 3998 3571 -2459 1259 1815 -2683 1924 4654 -1981 -2066 2012 568 -567 520 -1673
772 -1673 -1594 1325 592 -1683 -2434 -1835 1245 1269 -1932 -1078 -193 -1229 1799 2356 -2822 -719 4365 840
790 840 -1264 2049 -872 -1131 4879 1839 -4065 819 2683 -1450 672 1135 -3707 -888 3475 -1526
806 -1526 -3916 46 -723 -866 1850 -972 -3502 565 1721 -123 -221 -246 3 1778 1579 -221 -335
823 -335 25 1832 2639 -388 -1416 874 837 113 818 -1040 -2503 1150 1368 -3084 -1386 604 -1205
840 -1205 -183 1246 -2426 -2536 2231 638 -1388 998 286 -911 1786 1410 -1667 422 2303 733
856 733 508 775 -297 -268 1344 361 -832 -484 -133 -73 -794 -1084 -530 -485 -591 170 -969 -1824 69 752
876 752 -823 -83 859 -356 254 1686 -278 -162 1984 877 -454 1267 787 -416 1108 843 -860
893 -860 196 480 -631 -674 -288 -657 -351 -263 -770 -978 -542 -313 327 -780 -978 729 550 -593 694
912 694 408 -613 1602 1708 -740 217 2143 123 509 1683 -703 -742 2118 -91 -1691 295 -255
929 -255 -1090 678 -647 -2507 304 799 -1340 -334 -356 -1710 776 1522 -1429 -598 1394 233 1107
946 1107 1259 -863 110 2219 213 -122 921 -874 201 2468 -1041 -1801 1093 -265 -1382 1343
962 1343 -1326 -3228 1748 1255 -3269 -229 877 -2229 772 2390 -2551 -781 3446 -109 -697 1840
978 1840 -684 -351 3210 40 -1768 1643 418 -416 2117 -936 -2489 2146 630 -2321 777 -507
994 -507 -2872 1787 1439 -4025 -472 2270 -1917 -145 2001 -2600 -743 3701 -582 -1346 2149 -233
1010 -233 -94 3113 -588 -2113 2850 839 -1430 2369 -769 -2917 3083 1303 -4163 179 1240
1025 1240 -3227 1007 2034 -4379 -1355 3733 -1299 -2039 1742 -1184 -1032 3262 36 -2273 1759
1040 1759 785 -253 2457 -543 -1848 3138 1108 -1764 1784 93 -2845 2796 1496 -4854 131
1055 131 2647 -3018 -722 2511 -3806 -1661 3973 -1242 -2961 1911 -414 -1292 2886 -509 -2372
1070 -2372 2217 1343 -989 2286 -41 -1859 2976 1749 -2725 1218 1554 -2523 1705 2154 -4082 -581
1086 -581 3180 -2355 -1578 2056 -2274 -1837 3027 -1072 -2787 1533 -315 -1102 2091 -396 -2004 2631
1102 2631 1041 -1447 2163 501 -2105 3048 1811 -2928 1207 2306 -2453 667 2396 -3109 -1378
1117 -1378 2833 -1715 -2093 1757 -1426 -2204 2059 -469 -2331 1090 209 -1236 1515 179 -1836 1717
1133 1717 967 -1177 1615 883 -1616 2115 1692 -2034 582 1849 -1845 53 1771 -2215 -1318 1870
1149 1870 -1184 -1284 1369 -1329 -1495 1636 -522 -2060 890 253 -1144 1404 213 -1563 1161 1405
1165 1405 -905 1247 873 -1452 1257 1802 -935 -73 1348 -877 3 1453 -1337 -980 1029 -615
1181 -615 -1023 130 -1110 -863 1054 -628 -1344 465 -205 -567 1168 -11 -1121 977 1214 -344 838
1198 838 779 -990 954 1710 -909 137 974 -410 224 939 -1066 -815 912 -200 -821 -40 -904 -641
1216 -641 695 -506 -1346 47 69 -198 1063 -140 -787 1077 772 -172 559 82 -254 1209 918 -889
1234 -889 166 891 -206 616 380 -1168 -72 915 -464 -824 -20 -907 -392 895 -857 -1299 360
1251 360 63 -306 427 -567 -541 1023 629 -279 707 401 355 980 335 -571 528 652 97 144 -416 -767
1271 -767 176 519 -856 -533 -232 -703 271 111 -1201 -572 570 -69 -765 554 -555 -57 1049 60
1289 60 -627 758 560 -222 805 553 -295 749 969 -429 384 269 -370 301 324 -730 -584 167 -658
1308 -658 -669 -320 -837 -235 547 -509 -469 113 -130 38 456 -377 -205 828 391 -15 344 -2 32 950
1328 950 442 -434 130 583 -205 126 -68 -713 -148 389 -606 -567 -20 -531 -164 108 -617 -777 284 297
1348 297 -243 110 20 -102 1143 426 -99 452 367 229 483 -45 -163 228 495 40 -93 -339 -621 115
1368 115 -81 -696 -505 -200 -360 134 -390 -652 -405 271 -164 -107 -57 11 443 894 18 6 357 613 279
1389 279 410 -27 -83 589 320 -130 27 -267 -281 -31 -383 -586 -303 -271 -390 -52 -587 -643 348 -99 -640
1410 -640 403 312 -427 900 687 -639 526 952 -115 114 403 -15 216 1162 -123 -689 633 -220
1428 -220 -414 495 -458 -597 288 -182 -885 -147 -364 -612 537 -20 -824 323 627 -485 263 368 -551
1447 -551 845 1309 -666 -277 1047 -343 136 1013 -922 -484 1447 -290 -747 596 -465 -1045 1277
1464 1277 -69 -1806 309 609 -1049 457 390 -1530 134 1430 -551 -195 976 -249 499 1493
1480 1493 -838 -776 1605 221 -272 993 -776 -792 1679 -59 -1534 394 -72 -1329 580 31 -2128
1497 -2128 261 1092 -1021 -196 493 -1470 254 1409 -993 -604 1478 -414 52 1719 -887 -1132
1513 -1132 2140 375 -1226 1186 -104 -1376 2011 550 -2024 361 834 -1393 504 649 -2059
1528 -2059 -474 1471 -1068 -915 792 -756 -169 1192 -891 -961 1594 -59 -376 1561 -466 -897
1544 -897 1894 165 -1420 1317 468 -1536 1330 1005 -2344 190 1515 -1828 56 994 -1703 -346
1560 -346 1609 -1174 -1336 1105 -481 -676 1490 -513 -1233 1816 176 -930 1469 422 -1471 1521
1576 1521 1048 -1606 950 1523 -1332 510 1365 -1774 -311 1376 -915 -909 950 -1072 -840 1369 -511
1593 -511 -1278 1120 -577 -749 1193 -287 -985 1433 302 -1297 1574 671 -1475 1423 1351 -1598 356
1610 356 1527 -1187 -163 1529 -1169 -840 1209 -856 -1154 1308 -717 -1111 1015 -325 -1291 546
1626 546 -271 -888 885 -86 -1173 823 571 -826 663 613 -841 521 1336 -856 277 1099 -601
1643 -601 -110 1055 -745 -607 797 -618 -666 491 -688 -1106 1057 -371 -1120 502 -154 -955 681
1660 681 117 -1125 422 833 -643 414 845 -665 292 1060 -380 -365 869 -217 -275 922 -529
1677 -529 -591 672 -98 -533 21 -308 -434 229 -154 -677 184 109 -544 239 134 -791 399 388 -531 342
1697 342 417 -362 581 685 -582 105 1053 -95 201 689 -255 -191 904 -107 -632 377 -223 -315 229
1716 229 -136 -716 92 125 -280 -81 -39 -479 402 150 -430 -63 299 57 636 540 -425 348 699 103 198
1737 198 404 -369 -87 519 -619 -625 94 -392 -272 454 -477 -564 526 151 -697 49 -177 -294 406 364 -668
1758 -668 187 538 86 491 467 -312 417 727 -46 31 310 1 183 428 -439 -327 139 -300 -500 40 -760
1779 -760 -407 288 -132 -517 7 -132 -266 295 81 -508 158 416 -65 470 228 -287 208 637 -166 223
1799 223 248 68 68 394 -343 -409 112 -315 -370 108 -539 -400 -12 -263 -542 -130 -53 -159 188 125 -279 205
1821 205 61 69 93 543 -379 310 305 194 215 122 -62 168 492 -149 -317 61 -209 -257 -106 -126 -335 -31 -191
1844 -191 -229 -102 -64 -420 230 134 16 -38 71 104 237 175 -37 56 374 225 346 49 -131 134 380 -20
1866 -20 -291 -48 -305 -191 120 -93 -420 0 -101 -46 -226 -241 -278 313 -66 -111 -19 57 181 359 -109 -72 417
1889 417 350 100 334 -105 -115 261 379 -44 79 -331 -257 167 -198 -513 -413 -226 -180 -160 71 -547 281 441
1911 441 -218 -137 133 -148 76 629 81 -186 563 415 194 372 -98 -80 531 275 -240 203 -229 -284 265
1932 265 96 -866 -321 24 -305 -183 32 -641 86 512 -276 -167 314 117 -178 564 -215 -189 510 175
1952 175 -249 535 304 -186 521 262 -700 383 388 -132 219 209 -1097 -178 572 -401 -432 181 -315 -87 647
1973 647 -183 -286 232 176 -241 455 -3 -289 498 318 -451 224 467 -272 649 284 -975 292 731 -399
1993 -399 -252 250 -790 -274 446 -458 -343 358 -185 -206 352 -293 -760 454 214 -552 469 409 -244 679
2013 679 343 -609 86 400 -519 64 455 -760 -106 554 -495 -440 167 -182 -410 407 -523 -848 565
2032 565 -67 -653 197 -264 -825 475 279 -729 344 575 -188 481 701 -580 61 645 -328 -68 431
2051 431 -194 -231 653 -105 -621 197 145 -299 467 -354 -612 417 -37 -734 106 201 -876 431 514 -559
2071 -559 178 710 -142 328 697 -433 -178 946 -115 -281 736 -296 -87 721 -159 -499 536 -36
2089 -36 -643 -68 -401 -386 252 27 -669 47 223 -479 153 429 -565 40 633 -126 -96 419 -27 -200 585
2110 585 -35 -210 498 -206 -422 315 100 -617 190 -138 -504 -41 59 -431 149 239 -632 -30 350 -376
2130 -376 -88 520 -619 -16 634 53 -412 642 -52 -227 415 296 -70 300 433 -113 636 103 -380
2149 -380 312 355 -285 -144 56 -535 -170 111 -475 78 152 -405 -148 425 -342 -43 468 -80 -309 384 65
2170 65 113 446 5 -152 200 211 -92 305 -52 -279 108 -75 -313 -114 205 -424 -152 135 -319 7 -1 -411
2192 -411 -109 106 -133 -171 130 -77 92 133 84 -131 39 135 -12 12 117 66 179 323 -261 -164 -59 -164
2214 -164 -175 -89 -276 -74 185 -423 -171 -13 -131 -87 87 -238 -18 123 169 179 194 -31 13 332 25 209
2236 209 27 -7 281 306 185 46 45 122 -206 -100 -64 -355 51 211 -132 -194 156 -191 184 161 -91 -190 57
2259 57 161 -54 239 4 228 234 -46 272 363 84 52 227 -65 -113 170 105 -120 -183 46 22 -138 110 -293
2282 -293 -28 -191 -192 267 62 1 -131 376 -145 -61 9 149 183 -64 126 148 162 47 201 185 80 -302 119
2305 119 205 50 -217 -17 -217 -46 63 11 -137 45 -301 -53 173 -324 -195 65 55 -85 268 8 -100
2326 -100 65 248 195 12 188 152 14 -90 -23 -175 -114 148 44 -80 35 164 -516 21 -242 -90 -141 35
2348 35 -219 -53 -272 16 138 198 -1 124 -133 239 180 9 326 78 -86 173 69 32 9 -86 -140 -33
2370 -33 -120 -63 -210 -251 -242 -200 18 -238 -92 -25 104 23 -60 57 165 116 -204 99 133 176 277 64 -104 180
2394 180 -12 34 86 -27 198 -242 -72 -36 13 219 -43 -191 -123 -422 -219 -181 0 -95 -138 214 -133 225 196
2417 196 -169 88 258 19 199 -69 -185 76 96 -118 -84 165 87 147 35 -144 -166 -87 56 -247 -45 -62
2439 -62 -203 -64 -29 -112 -114 16 -94 67 -113 -333 -36 246 48 229 379 -48 260 288 -200 -11 89 -78
2461 -78 -165 143 117 -354 219 -162 -182 -48 -58 -134 -138 -128 -104 -155 94 -119 9 164 -22 53 127 -58 139 210 -6
2486 -6 2 177 -78 335 123 22 58 -9 -229 -55 23 -295 -337 -1 35 -227 -94 -174 -232 -257 96 -199 69 241
2510 241 100 11 307 53 20 250 82 -36 316 73 127 33 -208 82 -27 -127 75 159 -3 -130 131 185
2532 185 -202 -296 -83 -398 -138 111 -184 -20 139 -146 -89 123 -184 121 256 95 -169 152 300 62 175
2553 175 -103 -28 123 262 -364 -74 -104 -167 -142 23 31 -3 107 -101 45 72 109 -149 224 -111 -60 1 -61 10
2577 10 321 123 -7 -37 7 -65 69 202 -132 123 -72 -283 104 -181 -131 98 -19 -163 -86 120 -250 205
2599 205 96 -81 48 294 74 54 480 -197 -26 231 -144 -27 158 -77 207 184 33 185 197 87 -53
2620 -53 348 -140 19 -126 -215 -236 -82 -32 3 32 219 76 -3 111 -112 -3 178 185 -2 219 82 -199 186
2643 186 39 103 25 0 -175 -354 24 -345 -87 -244 159 -185 40 16 0 -113 4 -76 149 143 -283 61 -49
2666 -49 305 -80 -10 -250 406 225 -79 157 23 138 53 139 48 -73 156 -144 -108 -101 -124 -125 -167 -91 -71 -265 -182
2691 -182 -260 -89 258 -71 95 -58 -210 -13 253 -44 290 110 93 -22 35 83 4 41 -164 182 -117 -100
2713 -100 -109 -208 46 -246 -58 -56 -271 -127 128 -150 70 5 -72 125 -83 -242 106 -159 241 30 28 -74 93
2736 93 137 12 121 131 -55 -26 193 -162 -106 -146 33 -130 -31 95 -96 -9 -161 -116 317 41 80 103 -21 -109
2760 -109 3 8 -134 229 148 99 408 129 276 -155 -68 95 -22 -20 -335 -226 -241 -228 -124 -60 -22 267 178 -120
2784 -120 -195 -103 -198 106 34 199 41 -88 125 -36 90 91 60 -192 123 48 50 188 9 12 4 180 -36 -329 -135
2809 -135 155 -78 -115 3 140 -279 -312 -52 -13 133 59 -2 198 219 28 -224 78 56 47 -149 -2 -39 106
2832 106 213 -267 108 51 -136 168 67 -127 -130 26 -76 -147 151 159 83 -8 131 -115 75 -10 -290 -17 -45
2855 -45 -1 -152 -66 -138 -65 249 59 -38 41 52 210 -84 200 79 -155 -157 106 -67 -52 -13 233 186 -281 30
2879 30 -123 116 -138 98 -93 21 -110 -191 242 6 124 98 184 -174 113 23 133 -94 69 186 79 -19
2901 -19 59 41 111 105 -3 -75 -140 -18 -319 16 -3 38 -151 221 -14 -178 -72 43 57 182 51 232 152 -28
2925 -28 182 -184 262 358 49 -28 -25 -146 194 -107 3 -39 137 139 86 4 -224 -43 -170 71 -14 120 -73 -93
2949 -93 -20 50 72 -233 239 -9 28 91 -83 106 3 207 34 -15 -108 -154 128 -32 27 -154 -307 261 -77
2972 -77 117 -48 -125 -86 -56 -225 -32 8 -93 188 -111 63 52 174 64 -152 324 15 228 65 103 29 -230
2995 -230 354 -29 -197 -76 -217 -26 -154 8 -116 -83 -118 94 232 293 28 140 189 129 -2 255 48 127
3017 127 28 66 4 202 -122 -91 -174 -92 -199 -173 -251 -287 -94 -232 -201 142 -27 -20 -18 -9 -152 -93 103 -145 86 -55
3043 -55 39 87 -129 -117 68 -197 0 164 70 -89 23 57 -80 57 -265 57 -165 13 51 -202 -200 4 -255
3066 -255 -26 153 52 5 154 59 -131 87 2 40 32 167 199 65 87 -35 240 -31 -295 232 330 -140 -97
3089 -97 23 -198 -184 46 -320 165 44 -64 -227 -201 -110 42 -90 14 -32 -44 90 -65 243 73 -20 333
3111 333 -208 -135 120 279 270 63 -153 -153 -18 107 149 -65 -88 -51 96 -196 -123 67 139 20 -228 -131 65 34
3135 34 -132 70 93 76 117 -167 46 -34 91 163 33 -21 65 -137 -175 168 114 -148 -231 -21 -134 -101 127 45
3159 45 116 -160 -58 5 -96 -79 -63 69 196 -89 -37 -57 125 269 142 303 7 59 -3 39 35 137 143 -25 -70
3184 -70 -119 -127 -55 -41 -85 -195 -129 236 56 -67 -74 14 105 46 -45 -47 125 21 -153 22 31 223 -44 -181 132 86
3210 86 -174 -9 -46 115 68 7 -40 60 -130 123 -194 -106 120 33 55 7 7 -50 130 245 -166 -43 -89 -1 82
3235 82 64 117 -145 65 -65 293 76 -9 25 174 59 217 159 -136 -79 -52 67 272 -34 -128 25 42 299
3258 299 -136 69 2 -60 -123 227 300 156 229 93 -65 34 299 267 21 -10 -17 -66 144 27 -205 112 -161 -9
3282 -9 -103 -332 199 134 -146 -14 -61 14 -42 -103 41 -98 5 160 109 -107 63 -113 37 259 -66 -191 -11
3305 -11 44 19 45 -78 163 -208 -110 -125 -81 -57 -91 39 -200 -116 -142 -56 34 86 45 -55 84 -43 -335 -95 -44
3330 -44 221 -146 126 189 -82 53 -168 54 -38 -192 106 -27 -93 -126 155 -126 -140 129 -2 76 57 -118 69
3353 69 61 -45 -52 -233 -133 164 13 -50 -200 87 236 109 109 -147 -27 281 -57 11 -201 -231 -86 -27 72 82
3377 82 -117 -119 -40 -99 -78 159 -253 74 137 212 -115 143 45 164 38 -131 -125 -113 4 197 -172 -46 53 -66
3401 -66 70 17 -154 -9 -16 -145 166 157 13 -77 -192 -22 -260 173 165 122 48 -16 143 53 -4 120 47 36 160
3426 160 -139 51 12 -47 -214 156 50 15 -25 -114 -52 -113 111 -119 126 38 76 -93 -85 -86 -264 80 8 -108 6
3451 6 192 -9 -22 1 166 -96 181 -106 -218 68 -67 -123 34 118 95 55 -127 -192 138 119 300 -123 76
3474 76 166 133 -188 -64 -63 -78 380 -79 246 9 -144 196 115 -142 66 34 -107 -296 54 -189 166 167 18
3497 18 -220 -122 -242 162 -91 -291 19 -193 -59 -60 8 26 31 30 -165 -293 212 85 -155 -84 291 120 -65 -26
3521 -26 210 14 316 180 100 104 -107 -148 102 -112 141 8 -297 265 -450 -30 -89 107 -90 -220 -195 189
3543 189 -108 -60 5 27 -141 -155 113 101 313 -281 20 -74 -65 194 -28 191 118 127 86 -23 52 145 -260 17 -290
3568 -290 -180 144 -1 -125 4 -6 17 15 -93 -135 -72 -37 -67 410 -9 54 -146 -33 -91 -63 -84 13 -93 -148 111
3593 111 -101 111 -132 -301 35 -55 7 -113 66 25 227 23 -63 -187 -19 -66 109 86 50 -121 -196 178 -96
3616 -96 -21 143 -53 128 -131 -130 -1 123 -101 -84 70 239 -12 154 -13 -325 6 -140 13 -137 -163 4
3638 4 -96 155 -106 -24 -112 34 -87 -185 -11 -53 42 -6 13 100 -179 71 147 89 -112 -43 -218 -167 91 40 97
3663 97 -31 -5 87 98 19 60 -1 -169 -146 -59 237 76 46 99 60 269 163 -135 41 95 -14 -241 -1 -70 187
3688 187 -24 69 -131 -104 -18 229 23 -163 -39 9 20 -256 -108 64 -187 -70 -98 61 -214 124 17 -406
3710 -406 96 1 92 -296 -288 -282 -280 32 18 173 339 -3 95 37 9 -132 -213 16 147 -75 -79 -59 -86 -102 88 97 80
3737 80 69 35 22 -133 -117 67 -47 -130 -115 -215 -180 18 18 -40 -156 -338 -51 20 -87 81 29 173 -96 29
3761 29 -79 237 14 139 91 170 -14 130 122 70 202 -180 -31 294 -87 -27 -267 234 32 309 243 186 -24
3784 -24 -56 -38 -10 -155 -266 33 10 -84 102 -77 128 259 89 98 -60 135 98 76 175 49 79 72 2 44 121 18
3810 18 -283 -382 114 47 -25 106 164 -146 -34 -127 -70 -116 -159 -140 -12 45 303 -59 3 -125 -175 -220 4 184 -28
3835 -28 -164 0 -249 143 116 6 -120 68 -278 35 36 -46 49 -69 -180 -10 -154 251 -140 -24 86 -149
3857 -149 14 60 -113 146 73 94 -90 -62 76 81 255 -60 124 -124 39 96 40 -210 -184 -97 -160 -17 237 42
3881 42 65 170 -126 -81 108 161 107 66 35 93 10 158 63 -91 143 290 189 81 -98 231 -63 -90 82 265
3905 265 -186 -101 16 160 -9 205 -34 2 217 -186 -238 -6 -118 -27 108 49 -100 115 101 156 43 288
3927 288 -17 334 -100 -230 60 -50 38 -197 32 -227 -56 72 100 3 -71 -17 155 -184 43 -204 62 93
3949 93 -313 8 -218 192 5 41 -48 -11 27 24 -133 -29 -48 -9 127 112 -108 -24 -84 -271 159 69 -7 -77 62
3974 62 -106 58 -22 -13 236 -136 -207 127 -8 86 257 37 263 -75 -6 105 347 3 331 -9 -237 141
3996 141 -54 266 104 99 57 -3 -105 -170 117 158 -38 87 80 -155 -147 18 -123 78 -35 102 27 100 38 4 -111
4021 -111 65 -62 329 -77 92 -63 178 115 37 35 132 -14 96 66 -109 117 180 59 3 -2 142 195 -25 200
4045 200 135 -150 -115 149 155 -51 200 62 239 189 -191 130 95 -64 -76 213 -13 -104 127 55 -189 -33 48
4068 48 68 27 -124 14 211 -236 158 -72 -134 -103 -130 143 56 3 10 154 0 -96 -12 136 -94 31 110 74 -149
4093 -149 -94 -87 102 -48 -48 -115 97 85 1 -24 -159 7 42 -124 -25 218 -101 118 -37 200 120 -192 84 46
4117 46 140 71 126 -43 37 64 241 -76 -95 -119 109 189 -66 -165 124 -190 -55 -10 -99 -109 -101 -4 -53 8 -184 -139
4143 -139 33 -19 42 132 45 -229 18 186 9 -46 -2 -134 -182 12 -225 -15 89 23 36 37 -4 42 -15 -121 -106
4168 -106 -45 -136 -63 -144 -34 71 109 -157 89 -297 188 -25 77 -184 190 171 39 66 -191 21 -54 -109 -310
4191 -310 -55 -99 -117 -35 167 134 94 -154 -265 28 18 116 65 -163 63 20 242 12 37 -81 61 55 29 8 106
4216 106 -398 -173 49 170 -1 -100 -303 -43 342 71 -11 -32 -40 34 97 37 -126 187 135 18 145 132 -271
4239 -271 2 -22 70 -241 105 -9 207 -85 131 -210 65 -19 167 -98 -74 -108 -114 -124 2 233 5 58 13
4262 13 -141 -94 46 -243 37 -54 108 78 -36 -45 87 120 -33 192 -12 44 -56 28 -224 -11 -1 -71 143 -48
4286 -48 87 69 19 -124 -11 -134 -67 169 253 107 132 101 -163 66 34 -97 238 58 -223 30 -30 -26 99 109
4310 109 -21 80 193 98 56 145 106 152 25 39 -5 -233 -109 145 -93 148 -70 56 -114 122 60 -75 225
4333 225 6 -26 31 -35 234 32 -9 -104 -30 137 -62 104 -3 -134 -22 -108 24 70 -160 -22 94 -10 -102
4356 -102 28 -157 -282 -84 -311 8 94 -12 -179 -85 86 -335 -180 93 11 18 96 138 26 83 257 82 80
4379 80 92 178 92 56 -105 271 -122 -235 -187 98 -16 -146 -87 -37 -54 209 -143 -120 179 76 111 -9 -32 25
4403 25 -103 -101 135 33 -25 5 370 -145 -40 -160 -94 -169 112 -39 -5 121 218 177 -81 111 -248 -48 330
4426 330 13 114 0 86 -81 -18 -43 71 2 238 -57 -186 141 144 57 -43 474 -126 315 190 -170 88
4448 88 190 -104 155 279 214 -34 259 -13 -95 224 -55 -91 -44 -13 -157 -41 -53 -111 -26 45 -101 -27 -23 96
4472 96 -93 66 275 -106 -210 42 -67 35 6 -168 -105 60 -149 221 -27 -147 -224 6 -60 76 168 -2
4494 -2 -74 88 54 87 -100 -120 9 244 -145 -109 -175 -89 52 -157 -7 -103 57 -137 -276 112 21 110 265 -90
4518 -90 50 114 -94 20 -100 -80 264 -95 199 -101 89 48 116 -196 -185 -155 57 251 -66 -96 145 70 -286
4541 -286 54 222 -27 54 120 -33 154 94 46 15 69 94 135 85 -209 5 -239 14 -43 -145 -30 159 37
4564 37 -108 40 21 6 59 94 100 72 -22 -26 -22 255 43 112 192 154 56 70 -128 90 -224 -117 29 5 236 -331
4590 -331 125 23 -160 241 110 218 -160 -66 -195 75 13 -105 40 11 -67 119 -5 -23 195 -52 127 -58
4612 -58 2 7 -168 154 180 -274 100 133 -105 67 31 128 284 -172 -122 -33 -86 190 151 -104 -48 -161 110 -40
4636 -40 26 250 17 17 -2 -63 -67 145 170 243 -148 107 -169 -267 -116 122 -22 -41 -178 68 45 -101 -36 174 -134
4661 -134 -118 -14 275 287 205 129 -105 -114 45 -148 134 93 -205 11 230 -170 106 -89 181 133 33 86 258
4684 258 -140 1 99 26 -69 62 74 11 -121 59 -104 -192 -384 38 -70 -193 -273 -173 116 121 -95 174 -172
4707 -172 -229 134 -158 -99 -34 81 12 58 -23 -48 39 34 157 233 -122 41 -90 14 -80 -52 -64 4 69 141 -304 -131
4733 -131 -145 134 56 -175 -247 189 17 -160 144 -20 22 -108 212 -48 168 -57 69 -146 -18 94 55 43
4755 43 -119 83 -120 25 344 71 101 -97 -18 -192 185 -32 2 140 -91 -114 -75 112 224 218 156 -1 -33
4778 -33 151 96 188 -24 161 34 -95 5 17 148 -143 -64 -124 -155 -117 154 159 -31 235 -71 65 99 -99 -55
4802 -55 246 122 14 82 -2 -43 -291 -77 -174 309 -130 -75 -35 -144 120 -269 88 225 -43 134 -66 257
4824 257 263 -61 -251 0 -95 -53 -127 198 -72 50 -276 122 177 -14 146 147 -47 53 -121 -199 -226 38 118 -131
4848 -131 -232 69 -28 -69 -50 -97 4 32 133 -59 -103 57 54 88 -108 12 240 82 -76 -130 -5 -105 -25 173
4872 173 68 42 -162 -275 -99 46 -70 -24 -210 315 -320 3 -146 -155 -62 -92 45 -151 121 40 -194 -32
4894 -32 235 -135 -26 301 44 -101 94 32 -26 172 -22 -176 23 125 -71 191 -173 66 75 -60 54 -261
4916 -261 36 97 -40 -1 -111 -30 -189 22 -109 74 48 -44 135 -21 -90 -115 201 188 51 -258 69 -213 163
4939 163 169 154 -5 -43 -105 309 142 59 -119 -3 -150 -211 -74 -18 -85 -62 -188 73 55 31 16 -18 -289 67 154
4964 154 36 -31 92 99 135 -127 -170 1 4 182 268 189 -146 -56 -29 -147 -35 75 25 98 -114 -134 128 287 -266
4989 -266 45 -84 -17 88 321 -42 -1 62 -203 249 -68 -147 65 -280 -158 156 -83 97 0 -41 -62 -10 -106
5012 -106 166 189 -52 -120 69 -149 98 -54 -90 -195 36 -241 114 34 -113 60 262 -265 7 -89 -32 -139
5034 -139 86 -116 216 6 19 -30 -208 8 58 178 -153 225 35 -210 -90 136 -133 143 75 8 14 -19 -263
5057 -263 -132 -260 1 123 -159 -49 -79 -11 -87 -70 -126 -3 117 -128 254 -26 -213 -142 -98 17 -45 -63 149
5080 149 75 -156 178 5 32 229 27 -68 -152 9 -98 40 94 -1 -27 -209 248 33 -245 232 172 33 -25
5103 -25 -191 43 -58 73 69 19 15 181 10 -269 209 -7 -52 -83 -4 -40 -23 16 70 133 37 -135 -53 22 -16 -135
5129 -135 -53 258 -73 248 -178 232 -77 -203 19 -19 -64 -54 -75 177 -22 -119 -53 -146 72 -166 -142 -172 -132 127
5153 127 205 124 171 18 58 4 33 73 -25 -116 10 20 -111 24 112 -39 -46 19 -86 91 170 -111 97 -130 -56
5178 -56 22 291 -49 -191 -101 -30 104 -60 137 -2 135 -32 -85 27 83 -170 -209 42 -22 -130 41 -181 -40
5201 -40 21 -27 45 155 -70 -211 125 -106 37 -81 -230 32 -25 -98 -46 -48 253 -15 -137 209 98 -20 -5
5224 -5 98 192 103 -65 123 -71 -26 15 -49 -54 155 93 163 104 54 -41 85 -56 97 -230 191 190 58 -224 67
5249 67 78 46 -149 21 95 -27 209 10 -130 147 -75 -1 21 258 -79 -293 -115 212 -237 88 -13 90
5271 90 38 -274 -158 -52 -187 35 84 141 -38 153 40 172 49 106 297 -80 165 -87 38 37 -119 -90 -108
5294 -108 -129 -99 -2 5 64 -71 -288 -138 327 -116 -109 -79 -149 217 193 245 274 74 66 17 -279 -118 157 87 -8 -257
5320 -257 53 5 -20 112 -22 -1 -59 294 51 140 129 33 -49 -53 237 -61 49 -100 -31 104 -39 -20 1 -312
5344 -312 -38 -125 -132 -111 -34 185 26 173 110 -15 193 -54 139 12 -152 4 -72 125 96 -141 37 -132 217
5367 217 125 -15 79 27 210 31 118 -148 -115 -185 161 207 70 -68 168 -84 103 73 -172 0 179 108 177
5390 177 150 22 -38 -38 264 -109 -176 170 119 -75 217 39 101 17 285 91 -31 -99 100 -15 104 7 -60 67
5414 67 -79 -27 98 -88 -76 -67 168 53 106 192 71 213 -53 32 60 -263 -251 -121 80 -92 -15 99 134 -2
5438 -2 -22 -91 -184 137 -26 25 -131 64 -211 121 50 51 258 218 60 -88 127 83 277 13 109 14 193 296
5462 296 16 143 68 77 -29 123 -82 135 76 353 177 -27 -48 -75 91 62 -154 75 -19 -231 -73 -100 -19
5485 -19 119 112 -21 78 -82 -175 134 -51 -96 29 79 -22 57 21 -89 165 -88 15 127 -71 306 -63 -153
5508 -153 27 -169 25 106 81 159 -7 159 -158 -101 -155 -69 -102 76 111 48 -143 -152 23 91 54 98 61 -114 -109 22
5534 22 85 -64 90 -17 22 68 -1 -93 -41 106 159 151 126 -80 3 -76 -114 -132 38 -145 -3 -127 -216 -147 162 -133
5560 -133 -134 -216 -170 -101 -81 75 -139 107 205 -114 -97 -18 -161 68 80 81 -133 0 134 93 87 -78 130 19 -32
5585 -32 -3 22 -49 -52 200 -49 -199 168 97 64 39 143 -144 87 -132 58 110 -73 70 -51 65 -215 -5
5608 -5 -100 -162 347 139 98 -46 109 -155 99 -73 -84 -6 66 -140 -146 -74 -74 197 -15 34 170 1 105 9 -17
5633 -17 17 43 91 24 232 44 29 -18 -68 -30 121 -163 -132 243 88 -137 4 5 -140 -65 -185 -167 -256 86 -17
5658 -17 26 140 84 11 44 60 -68 103 105 154 12 208 -8 -47 29 -19 -152 -143 49 -14 -67 153 -381 98 58 -298
5684 -298 -149 34 -302 -1 13 -91 -62 177 146 -53 121 93 -52 39 -79 118 34 -149 -26 84 31 -33 5
5707 5 105 30 197 201 -479 -15 150 -12 83 -44 -26 93 114 61 32 176 56 90 79 -111 -147 -262 162 -164
5731 -164 82 -7 18 214 -281 7 78 170 -47 -84 -210 -185 52 -87 -82 -34 7 -85 46 210 78 -115 138 -86
5755 -86 -85 29 32 -79 15 98 33 -4 73 40 -38 253 21 -120 103 53 -21 77 98 123 -66 -24 18 -162 140 68 223
5782 223 -53 -80 -212 -21 58 -14 146 147 -185 -11 169 -133 155 -4 -126 31 -147 -197 215 -95 -128 -6
5804 -6 -208 60 73 -27 -107 -54 121 18 80 149 220 96 85 -44 -124 -21 -84 29 48 -93 143 77 47 124 100
5829 100 -90 -71 -121 117 -153 -30 -67 56 258 -152 246 -97 71 19 147 334 -106 -276 -91 -10 23 -87
5851 -87 88 88 98 56 -270 157 28 77 1 5 -66 225 75 -147 -79 124 -107 106 -233 162 85 -106 -96 -15 24
5876 24 -160 34 69 194 4 -21 161 58 134 132 262 -116 33 196 -96 -67 -133 -3 -67 83 -188 -122 271
5899 271 -3 186 -183 90 14 -74 193 -112 81 94 -87 -109 77 158 106 -87 -335 15 69 6 -137 -82 179
5922 179 281 -3 330 -3 4 -22 93 53 154 207 52 9 -39 62 244 -76 -120 30 -29 167 69 -71 -112 245
5946 245 27 -51 -128 -3 -47 -20 -257 -63 -133 -66 -150 -221 -48 108 -18 -3 184 -332 -208 28 81 -3 -73 16
5970 16 -28 153 69 -74 174 34 -41 -58 -37 6 70 -119 32 96 12 124 9 137 338 58 -169 148 -130
5993 -130 87 31 81 135 -188 96 137 106 -45 -134 14 -97 -214 -37 184 98 117 81 -121 -104 186 217 -4 -54
6017 -54 165 -350 68 52 17 135 -151 -70 49 215 226 223 -33 -75 39 -166 179 -19 -151 -56 -68 341 290 177
6041 177 -41 156 36 -73 -35 -212 48 5 -82 -84 -14 -133 -33 82 15 -76 -72 -104 -80 333 101 204 34 60
6065 60 -95 33 -97 76 -195 155 -65 13 212 -172 227 77 -83 169 211 287 -30 333 123 -136 -268
6086 -268 -1 -4 145 67 -138 161 -26 2 -140 -27 5 -37 102 57 213 -210 78 191 102 -58 -107 -6 -26
6109 -26 198 -179 -88 98 19 147 197 220 -9 253 187 -94 161 113 156 2 -122 226 -21 171 35 -14 256
6132 256 -34 -140 137 77 -83 44 -18 37 66 -5 90 35 96 297 196 -64 -204 131 77 -85 168 -23 -62
6155 -62 136 170 -67 -127 -78 43 26 -132 168 -27 209 -163 109 42 120 -113 167 -49 -47 -276 -71 -72 -71 -90 23
6180 23 181 111 72 120 -87 -167 -70 45 60 -148 -75 -23 157 -81 114 -72 36 -186 -197 -20 -141 62 166
6203 166 22 184 205 -99 -8 -133 15 -228 -157 -41 -23 47 34 105 74 173 -59 35 42 -71 81 -74 -28 337
6227 337 -114 -158 119 -129 112 9 -115 -234 -32 -120 -135 115 32 44 -193 8 70 -154 -131 -47 -53 -54 -62 51 -61
6252 -61 -161 6 141 -31 -16 125 -66 -41 56 -43 -12 -58 1 263 -7 217 46 -175 106 -271 -121 -76 108
6275 108 150 2 -5 80 123 -3 -33 -74 155 27 -129 -48 143 -6 122 -162 -110 40 -159 138 35 115 -2
6298 -2 7 -122 -130 77 -31 173 -173 -76 102 111 -77 36 123 205 55 110 -74 -65 -145 -6 7 -31 96 146 9 127
6324 127 273 107 -83 -85 -193 -131 4 -329 -225 -51 -57 -229 -56 -45 -48 -246 6 4 126 -173 44 18 161 38
6348 38 258 100 27 46 90 -151 35 321 60 -56 52 -205 -35 129 131 -60 -16 103 221 185 -57 -89 52
6371 52 31 244 154 3 -16 -74 128 -90 -113 179 -6 -32 -71 121 -141 115 61 11 -28 111 -23 172 -13 44
6395 44 -57 -191 -37 31 -38 147 -47 134 55 61 138 50 101 118 -61 196 -23 87 -66 97 6 41 40 -35 171
6420 171 -118 -198 -168 -138 -200 -118 -123 196 -160 -177 114 -49 -193 -95 69 -57 -191 36 -111 43 -60 -46 104
6443 104 19 157 47 -167 143 141 51 -27 61 -27 109 32 -115 -133 -130 232 117 206 55 -15 -240 9 75 -155 -18
6468 -18 114 137 -42 -260 -232 54 76 -55 115 -158 -312 166 -105 -83 -119 150 -89 243 21 -263 -80 102
6490 102 305 -144 -3 117 -167 -122 -78 27 -76 73 184 -20 -30 388 -53 13 -110 -10 -70 -164 -8 -74
6512 -74 17 -159 11 -75 147 9 -94 -70 107 35 6 -12 128 -78 -66 -85 70 17 93 185 131 -74 201 69
6536 69 -63 -12 98 126 20 33 163 36 -253 88 52 -246 -102 115 299 -54 -127 -124 -214 -135 37 -229 -99
6559 -99 36 40 170 23 16 301 124 -1 -81 -48 -68 59 -99 32 55 -90 111 -232 242 -39 44 -137 49
6582 49 30 -56 46 107 -63 1 131 97 -79 -76 13 152 -107 -93 96 70 -25 117 -80 -204 -44 -63 -13 166 23
6607 23 91 85 -156 170 -48 -111 -26 -207 238 102 115 55 28 -233 -96 58 120 167 0 -261 -93 -261 -270 127
6631 127 40 60 13 1 -139 -129 -30 -50 -194 -108 -140 -116 115 -101 -103 -97 73 52 -136 -96 138 78 87 71 -182 -56 150
6658 150 87 80 95 -3 -101 159 -25 256 78 249 -33 -194 -41 -156 217 78 -29 -47 43 15 -30 135 108 104
6682 104 -152 321 289 19 62 187 -72 -129 -100 -64 147 -15 -62 118 -21 64 160 182 -113 -58 -57 -40 62 141 -51
6707 -51 19 -57 104 -122 54 263 -72 -23 -183 278 -65 -48 95 25 -80 86 -282 -15 -28 101 166 -161 -233
6730 -233 -9 45 -61 -53 -169 18 90 11 141 -275 -40 -224 -203 62 17 -185 -13 -128 -86 125 196 106 -144
6753 -144 -44 -80 -11 -145 92 -125 -231 65 6 -151 -149 -269 108 140 0 46 166 -23 -14 -110 88 120 -43 -96
6777 -96 136 45 -31 -34 -20 -101 -2 59 -20 -86 -107 101 92 -13 -80 -70 145 304 5 -92 -126 39 -290 50 -171 -144
6803 -144 64 43 -92 141 212 13 -102 -24 -237 41 -78 -85 105 -132 126 73 31 -99 205 -16 53 58 62 113
6827 113 39 41 0 -246 -151 -161 -69 -85 -272 -56 27 244 155 -166 -113 182 -126 72 146 -152 84 -247 -35 182
6851 182 -118 10 98 -185 -14 142 -25 -4 134 102 95 86 -31 -25 -56 -145 -147 -41 93 262 -139 -112 150 100 109 78
6877 78 10 2 -199 -252 -181 -36 96 27 107 -233 -114 -56 155 -99 -18 24 249 32 -48 -131 -156 -217 256 -128 -159
6902 -159 102 -134 214 -217 -132 136 186 203 51 58 -43 15 -161 -41 42 32 28 13 -240 162 -65 -85 123 -276
6926 -276 36 94 -202 56 111 -199 188 -39 -68 -209 -126 112 6 -30 18 -158 109 60 -120 -35 -125 1 146
6949 146 -194 -21 1 -3 84 -179 -61 111 -92 97 -230 -28 70 53 154 -65 105 112 30 166 155 270 -148
6972 -148 14 145 -52 106 111 50 -143 -64 116 -85 -61 -152 -7 -113 -89 -164 -218 26 23 20 39 32 82 69 -70 -176
6998 -176 -4 -3 -188 -42 145 -16 -24 -67 -63 132 -89 37 172 35 -16 13 -99 135 206 5 33 -200 -140 173
7022 173 -108 252 -114 -28 85 170 153 29 -94 -18 -160 -11 191 116 -24 -175 123 175 170 -58 40 -197 82
7045 82 -73 -124 48 -126 157 -50 -7 -84 22 -63 -103 19 -172 -8 271 -99 -134 -103 -59 -215 -218 -18 -53 -72
7069 -72 -15 -69 -67 25 24 122 153 -77 -51 -62 -233 54 30 27 -73 146 -31 -5 -134 70 43 -43 -24 -1 88 94 -20 -129
7097 -129 -83 88 88 50 167 55 -118 -289 -21 -195 177 -138 198 86 -218 0 -181 -39 29 122 19 54
7119 54 -184 46 182 79 -48 66 -26 -33 125 109 256 -36 85 54 -100 -18 -33 27 -58 -49 -226 -87 85 -242
7143 -242 -85 -14 -28 645 239 1 -14 82 168 -66 4 120 -2 -63 -47 -62 124 -48 82 -115 79 -28 -12
7166 -12 -234 -131 44 -111 52 -43 -33 -53 -57 146 -59 -8 -51 432 57 -99 37 32 31 -194 22 232 -102 93
7190 93 -138 -31 -109 -140 5 -169 39 -163 231 94 -112 -13 46 -247 132 210 -130 -171 224 6 255 -303
7212 -303 -145 36 134 300 102 218 220 -62 -102 118 -69 205 -202 71 78 -37 -241 108 -97 -70 -247 -31
7234 -31 -200 41 -137 -106 -38 -262 -43 -40 7 -102 105 88 -41 -103 223 -24 -37 -7 132 102 17 -3 -157 17
7258 17 224 -125 -120 294 -197 -28 39 -155 -57 -7 -204 20 0 -19 -141 -77 -66 78 -58 60 -28 -15 158 -233
7282 -233 80 209 -14 -50 -111 69 18 304 -184 -69 -20 178 59 40 -45 -224 -131 -96 -117 9 99 -138 129
7305 129 109 163 91 17 -62 64 -59 -173 -145 205 -157 212 167 -92 -31 -86 -26 118 8 241 -41 -33 39 -90
7329 -90 -91 -227 66 -19 -108 2 -235 -62 -204 17 286 -32 -36 -77 -66 -27 479 185 -61 62 98 340 20 -71
7353 -71 29 119 -4 -101 -1 -54 -119 -142 -12 -122 49 108 -33 109 -164 -444 -83 2 -79 30 67 -57 112
7376 112 103 -72 -12 98 185 84 89 -48 29 0 79 170 -107 198 -44 -37 12 22 -200 59 -71 -24 -55 141 71 111
7402 111 -240 58 161 -199 -61 118 -231 -73 27 -18 39 -83 -12 146 218 91 52 -87 -40 -112 -54 -15 -28
7425 -28 102 -130 78 -239 39 227 -137 -177 -155 253 141 -20 97 -113 -140 -17 -214 -20 7 20 61 -24 -83
7448 -83 41 84 88 258 64 27 -62 139 -126 -109 19 66 -27 -64 160 -73 -118 -73 -71 125 185 77 10 114 -90
7473 -90 24 33 -90 -47 -15 100 146 53 150 -50 -100 118 116 20 22 13 -79 -88 29 203 145 -73 154 41 -41 -87 -97 154
7501 154 -42 -35 -155 200 213 -170 -50 223 -123 90 54 50 20 82 24 -108 -181 -87 -249 87 10 45 -99 -146 139
7526 139 -37 104 28 -117 -56 47 -56 -113 -16 81 31 -125 80 100 -332 13 40 13 -65 156 -76 -211 -33
7549 -33 15 -173 -221 118 -229 -100 48 -143 -52 169 -317 9 -103 190 81 10 261 -292 34 135 36 318
7571 318 2 -107 190 -12 99 -147 27 -41 114 174 64 13 101 -167 -267 16 -304 125 103 -46 -67 -70 135
7594 135 72 -3 -176 -146 221 -15 -6 -186 146 -85 -4 157 82 46 15 -76 121 -110 -192 37 -89 49 -186 30
7618 30 -9 -3 114 -115 -97 16 -130 44 84 17 -137 -33 13 21 -71 -164 -30 104 -2 -64 -57 19 21 126 132 -146 -247
7645 -247 43 -86 -31 -293 46 115 95 69 170 59 122 2 4 40 -59 -157 -182 53 -40 -41 175 122 79 13 -102 -176
7671 -176 42 154 -93 -66 -60 219 -117 94 78 78 -88 61 143 -172 71 144 81 -4 -70 37 -67 -57 22 -57 91
7696 91 152 138 68 -224 -55 52 -106 -11 17 84 -88 34 337 14 -43 -148 73 150 -15 -266 -185 22 88 64
7720 64 3 116 -107 75 -167 -254 -164 -68 16 -38 -108 17 138 -32 -178 44 -154 -5 -4 -32 55 35 -76 -88 257
7745 257 -14 -5 -109 32 -11 86 157 -105 23 50 144 218 157 -47 136 12 304 -98 23 -123 -102 -146 -224 -57
7769 -57 69 118 22 -36 -159 100 1 62 26 137 342 53 -299 -38 -129 50 -64 -77 -52 65 85 179 -188 33
7793 33 -72 -128 100 49 55 -35 25 -409 -24 -112 -116 204 158 -9 -290 -135 18 -5 6 -94 -40 -62 -2 71 216 162
7819 162 60 -138 -119 -42 -34 -53 97 -104 -81 287 -1 -142 188 56 17 -15 -44 191 31 -11 -139 -208 63 -14
7843 -14 291 118 -97 160 25 0 215 101 89 204 268 197 90 126 -224 188 -100 54 -109 122 64 -173
7865 -173 -103 -22 -10 -48 -19 -96 -126 -270 -44 -61 201 -60 204 -250 -42 37 57 135 -43 -175 -23 113 142 -94
7889 -94 199 19 -21 180 -10 -112 -205 54 -178 30 -16 -80 -268 -308 -50 -33 24 230 -80 58 219 229 48
7912 48 137 173 243 220 -91 -80 212 6 -51 226 60 64 -70 8 -32 51 3 -132 56 -67 -94 195 283 273 376
7937 376 44 8 -255 65 -4 -6 66 -68 142 44 -265 -146 -136 -302 92 -140 89 91 -116 53 88 255 -62
7960 -62 25 100 -56 -86 114 24 -116 17 21 -65 5 98 131 101 271 -165 41 104 20 -178 -12 181 -210 18 96
7985 96 -128 -311 -46 -288 62 -25 233 123 -259 135 103 -113 -74 43 399 126 -33 57 -132 -28 -87 27
8007 27 -229 -185 -195 -161 -50 62 302 148 -190 86 -126 88 -144 -135 -120 -7 -46 -124 19 25 161 -1 -123 54
8031 54 -6 64 -137 18 -92 -40 163 -166 84 186 -11 6 164 -27 14 60 -41 -9 13 -4 46 21 100 215
8055 215 63 -139 -25 40 107 -206 -169 20 223 88 -270 90 100 -98 -75 81 -55 45 15 119 0 281
8077 281 -151 45 8 202 178 -126 -41 12 147 -95 107 -341 -128 9 163 -8 -265 -149 -76 110 53 -228
8099 -228 -42 171 72 -57 34 350 158 -144 -72 -33 55 69 -50 32 -196 21 207 -51 -7 33 174 14 -95
8122 -95 -102 187 -33 244 -217 -98 -1 -148 35 80 -107 -93 43 132 -1 -55 -267 98 8 20 197 -13 -180
8145 -180 123 160 -87 -68 -33 82 61 -70 -52 84 81 87 -114 67 -182 -124 -56 -188 -233 12 142 97 -181 -13
8169 -13 191 -200 56 -123 -105 78 175 -220 -257 2 -175 44 -127 -274 -111 -39 155 -84 47 46 23 206
8191B06
$$ Imaginary data points
##PAGE= N=2
##DATA TABLE= (X++(I..I)), XYDATA
0 0 0 0 0 0 0 0 0 0 0 0 0 -8 8 -8 8 -16 16 -24 24 -32 33 -40 48 -56 65 -78 91 -104 118 -134 155 -175 199
33 199 -224 254 -283 317 -355 395 -439 488 -542 598 -662 730 -806 888 -979 1075 -1185 1306
51 1306 -1441 1589 -1755 1944 -2158 2404 -2692 3029 -3434 3930 -4558 5370 -6464 8023 -10411
66 -10411 14456 -22537 44418 -215849 -515157 397164 176862 -403062 194874 265237 -433744
77 -433744 -4407 457597 -196136 -312717 272844 92133 -186862 123166 79147 -248525
87 -248525 -9175 254666 -11316 -193048 25855 105705 -60615 -26380 87549 -93248
97 -93248 -112122 201125 92069 -247234 -19123 163184 -100088 9314 184567 -183055
107 -183055 -143844 285853 5947 -245928 152547 77788 -207679 169012 155744 -336306
117 -336306 -14483 324809 -140044 -140522 231022 -103451 -208742 270964 70947 -317497
127 -317497 76034 223742 -166633 -59287 163457 -115264 -122333 210462 69107 -208018
137 -208018 -9295 152703 -48671 -77808 107561 8498 -138340 83934 153479 -161441
147 -161441 -115257 196586 17783 -156559 117938 55244 -219954 67106 211215 -181009
157 -181009 -108672 215112 -44965 -155621 160165 10617 -205070 125713 153086 -184409
167 -184409 -32826 149825 -87997 -52194 152716 -44673 -126244 117206 61002 -120964
177 -120964 13889 75180 -61310 -3091 87505 -47700 -86325 63968 52599 -68223 -9406
188 -9406 58161 -42682 -42205 76690 -3915 -101622 52573 86565 -89733 -27405 95140 -56788
200 -56788 -61671 125352 2516 -129224 76559 81573 -119588 6817 112689 -84814 -46374
211 -46374 130704 -32723 -116481 88274 48505 -105473 30188 76933 -89663 -28528 97035
222 97035 -33904 -76018 68786 29864 -75266 17558 54672 -57495 -23379 77157 -6645
233 -6645 -64061 43203 37697 -62854 5400 67428 -42470 -37795 74457 -3599 -76289 45958
245 45958 43331 -74263 8944 69987 -60939 -39811 78835 -17438 -70222 60246 27390
256 27390 -78812 22077 58125 -62933 -17542 74179 -24334 -50031 57608 12966 -61652
267 -61652 28182 47077 -47728 -10012 55608 -21422 -40904 44164 14344 -50671 15361 40298
279 40298 -41437 -20353 46980 -14309 -43369 39111 18551 -54735 9620 44428 -40222 -19639
291 -19639 54084 -13958 -43744 45454 17953 -54836 19342 45602 -42114 -10291 53102 -22661
303 -22661 -36971 47570 8863 -49753 22392 32255 -43187 -5468 41380 -25893 -28924 39500
315 39500 2150 -42118 17856 24186 -34445 -2956 35547 -18543 -24299 33723 6881 -34191
327 -34191 15445 27330 -27084 -4851 35485 -13864 -25831 32258 9781 -35402 13022 26464
339 26464 -31266 -7861 34281 -17663 -28048 31721 4602 -37974 15120 22870 -33058 -3360
351 -3360 33328 -19567 -21406 32567 1370 -30970 19961 19928 -27960 2435 29539 -17179 -14381
364 -14381 29105 -645 -25813 16938 15497 -25039 112 22603 -16494 -14820 23264 -2493
376 -2493 -26321 13048 14299 -23706 -1962 21064 -14857 -12945 24201 -899 -24254 15157 16535
389 16535 -20062 1505 21251 -13338 -8999 25304 -1308 -22628 14569 13868 -18574 970 15839
402 15839 -15172 -9101 21599 -3132 -23300 9458 12064 -17067 -1002 13983 -14651 -9690 22205
415 22205 -582 -22662 10509 14260 -14949 3116 16547 -15812 -6584 26633 -1434 -21027
427 -21027 13320 9725 -15182 8514 11337 -21283 -2782 22736 -7344 -16322 9172 -373 -10586
440 -10586 10740 2928 -19004 145 15308 -4123 -8644 3365 -137 -2109 8297 4532 -10806
453 -10806 -4134 14754 6601 -10379 746 7041 -6500 3941 13941 -14591 -13966 21923 5095
466 5095 -21005 6881 5760 -20575 10081 19193 -27124 -11572 27252 -6273 -16618 17366 -4352
479 -4352 -19251 22631 12070 -26492 1626 18766 -7883 949 11923 -12128 -5144 17584 1686
492 1686 -10096 163 1072 2923 4420 -6274 -5717 894 -826 5362 1224 -15648 -701 13794
506 13794 -6635 -6263 8361 -8656 -3462 20340 -5855 -18640 15176 7137 -11566 13331 3393
519 3393 -21723 14009 19000 -21590 -1103 18352 -15881 -1612 22578 -18823 -17026 26429 -796
532 -796 -21544 13451 1122 -20304 14254 11328 -22168 -474 15761 -7136 -2801 6026 -6373
545 -6373 587 9580 -790 -1206 -1329 -2842 11275 3459 -14062 6163 10078 -13302 4102 11935
559 11935 -20674 -2647 26121 -12811 -18872 19243 -3411 -18330 19580 2619 -26412 12578
571 12578 16422 -20207 1034 14017 -14042 3222 18502 -13757 -7675 16817 -3319 -4511 12398
584 12398 -7407 -7470 16572 -1367 -13579 7604 1182 -7393 9951 -903 -15624 4937 6675
597 6675 -6929 1511 -821 -8134 7225 4589 -10639 2567 3787 -5750 10057 4892 -17336 4691
611 4691 16416 -10511 -771 13969 -13015 -4366 22498 -7993 -18544 16434 4730 -15352 9809
624 9809 3308 -20367 6019 15295 -13641 -6109 9276 -5598 -2209 8414 -6652 -6279 8549
637 8549 2779 -1771 434 -4642 1648 9044 -1424 -2498 3501 -3346 1353 9012 -6803 -7055 9893
652 9893 858 -6371 4805 -4009 -9272 9635 4201 -12468 1031 4355 -8122 3671 6111 -11372
666 -11372 -271 11924 -4735 -4805 7185 -3750 -2731 12057 92 -8996 5632 4312 -4875
679 -4875 3391 2461 -5874 2063 5438 -4291 -3663 892 -405 681 39 -3367 -1274 -786 -996 2565
695 2565 -1362 -4143 3844 2640 -5138 1497 3850 -4250 2647 7138 -4982 -2500 7380 -1361 -3574
710 -3574 6391 110 -5463 4825 1926 -6933 1581 3460 -4655 -502 2612 -4348 -2304 2515 -2045
725 -2045 -2341 1635 77 -1412 621 42 124 1565 963 923 182 -424 2107 1424 -1906 1542 2870 -1709
743 -1709 68 2053 -3538 -1116 4672 -1800 -4104 2296 -706 -4023 2133 171 -5551 1781 3815
758 3815 -3943 -1474 2428 -1966 458 4266 -1496 -2817 3003 1954 -622 1174 208 -177 2211 1679
774 1679 -1158 -1664 -388 1525 1454 -2237 -2056 -83 -979 -27 548 -3148 -2442 3079 80 -3522 293
791 293 176 -1620 3179 2388 -4382 -43 4491 -380 -322 2472 -1609 -763 4514 205 -3673 1155 1460
808 1460 -597 1062 -767 -3665 159 1903 -1266 -2150 -809 -542 223 288 -1713 -990 253 1160 1295
825 1295 -616 -1897 1388 2219 114 873 444 -1053 1557 2617 -1673 -1255 2161 -31 -650 1441
841 1441 -1826 -2644 1798 740 -2809 -749 351 -1854 338 887 -2287 -982 2129 211 -861 233
857 233 -52 191 1723 1189 -270 390 1251 1019 335 27 352 693 58 -36 -510 -1550 137 736 -1332
876 -1332 -1256 90 -836 -1163 302 -696 -1394 781 360 -1376 360 800 -254 804 1094 -156 364 1429
894 1429 554 102 854 425 576 430 -129 -346 -61 -179 -110 -569 -1355 164 320 -1497 -542 27 -1156
913 -1156 110 1223 -1558 -954 1632 -127 -401 1255 -140 -734 2059 1059 -1453 1031 1527 -422
929 -422 1051 798 -1805 192 1633 -1224 -760 174 -1346 -179 904 -1735 -1975 850 -364 -802 434
946 434 -1091 -823 1707 255 -1015 694 198 -55 2147 197 -1572 2042 1603 -840 1378 413 -2111
963 -2111 1469 2086 -2796 -1067 2020 -1940 -898 1826 -2564 -2501 2595 -449 -2793 884 -231 -1223
979 -1223 2078 472 -2427 1264 1591 -364 1411 280 -1648 2473 2316 -1861 496 1439 -1921 1230
995 1230 2407 -3534 -1215 3021 -1514 -1946 1706 -2042 -2135 2901 -562 -3380 1076 305 -1482 1682
1011 1682 134 -2688 2138 2184 -1700 1266 1105 -2302 2589 2877 -3104 -132 3448 -1736 -134 2814
1027 2814 -2836 -2079 3863 -422 -3518 1328 -333 -2300 1952 -364 -3618 773 1200 -1482 872
1042 872 -100 -2277 2213 1730 -2690 1095 1801 -2130 2071 3224 -3680 -393 4442 -1578 -1367 3132
1058 3132 -1830 -2589 3686 -423 -4353 1596 422 -2774 1084 -126 -3531 892 1582 -2301 211
1073 211 417 -2236 1831 2316 -2681 519 3087 -1408 704 3168 -2321 -1143 4273 -577 -2369 2171
1089 2171 -568 -2023 2538 32 -3648 995 841 -2412 751 24 -2919 1230 1185 -2734 462 795
1105 795 -2229 1356 2441 -2718 36 3454 -1319 -65 3402 -1419 -1388 3580 -3 -2450 2031 254
1121 254 -2082 1602 300 -2658 426 495 -1861 227 233 -2350 380 1258 -1927 131 1161 -1846 685
1138 685 2409 -1927 -386 2433 -713 -281 2549 -759 -1033 2775 189 -1550 1688 217 -1574 1491
1154 1491 479 -2307 87 550 -1873 134 296 -2188 292 1158 -1636 -364 1017 -1410 318 1910
1170 1910 -1158 -738 1850 16 -276 1712 -486 -603 1984 607 -971 839 -115 -743 1091 14
1186 14 -1712 200 330 -1103 321 -57 -1881 115 780 -1122 -386 438 -839 467 1448 -590 -387
1203 -387 1321 206 348 1117 -542 -534 1718 494 -747 413 155 -390 881 -312 -1621 -32 302
1220 302 -908 -199 -602 -1338 418 609 -1097 -476 83 -491 681 648 -1063 -50 999 216 357 652
1238 652 -608 302 1637 209 -402 803 -4 60 1041 -561 -1215 188 255 -778 -100 -533 -990 388
1256 388 161 -1020 -354 267 -160 105 214 -1003 277 1037 84 237 529 -284 489 1177 -336 -232 916
1275 916 -3 32 315 -600 -411 918 -311 -1309 -39 -531 -886 141 -254 -1389 164 209 -565 301 235
1294 235 -465 527 954 -358 35 684 60 527 865 -346 79 1024 394 -249 3 -480 -162 467 -523
1313 -523 -948 0 -278 -592 -255 -432 -697 282 476 -1094 -60 190 -60 523 517 -642 303 723 367 218
1333 218 545 -342 260 829 110 -305 167 -75 -46 35 -499 -782 -62 81 -576 -441 -449 -282 -70 -138 -573 -141
1355 -141 316 187 280 160 -247 570 602 354 395 335 176 831 596 -338 -9 535 -143 19 -129 -732 -276
1376 -276 223 -342 -712 -423 -630 -274 91 -367 -529 98 -13 -112 158 -23 96 606 432 27 125 142 419
1397 419 637 143 -308 495 305 -213 -49 -89 -469 384 -11 -891 -378 -28 -817 -200 131 -1112 -386 689
1417 689 -400 -489 764 -165 -91 760 315 -613 949 578 -129 487 239 -186 700 584 -910 74 352
1436 352 -441 204 237 -1235 -128 879 -894 -597 196 -770 -1 1041 -888 -766 1109 145 -288 912
1454 912 -74 -660 1488 428 -987 1061 475 -644 980 675 -1466 106 1346 -1150 -258 535 -1231
1471 -1231 -237 806 -934 -1379 604 -481 -510 868 -881 -1072 1180 733 -772 798 -41 -495 1690
1488 1690 1040 -1319 758 1086 -885 955 731 -1534 279 1705 -923 -731 574 -1030 -442 1213
1504 1213 -1218 -1555 1022 -9 -947 906 -681 -1208 1848 717 -1661 691 817 -940 1094 1535
1520 1535 -1860 205 1930 -795 -105 1421 -974 -592 2078 -643 -1444 853 -166 -1006 876 -749
1536 -749 -1837 876 44 -1393 437 -192 -1484 1141 920 -1854 593 1426 -1010 600 1429 -1411
1552 -1411 -40 2430 -826 -683 1622 -856 -979 1823 -735 -1613 986 -99 -1253 912 -146 -1903
1568 -1903 892 561 -1828 283 543 -1354 693 1305 -1538 297 1921 -1106 -39 1791 -859 -344
1584 -344 1971 -312 -1005 1412 -25 -1270 1510 -32 -1354 883 216 -1245 685 -100 -1593 554
1600 554 296 -1602 268 999 -1671 248 1662 -1164 -344 2104 -657 -524 1877 -165 -1031 1810
1616 1810 222 -1067 1293 304 -974 950 643 -1229 579 590 -1499 434 369 -1292 -69 497 -1122
1633 -1122 -281 715 -1101 -387 909 -646 -393 1109 -364 -410 1036 -356 -546 1372 381 -700 1084
1650 1084 331 -831 1044 412 -1095 412 666 -982 44 345 -1450 -177 656 -1260 -528 747
1666 747 -790 -640 1120 -410 -719 991 114 -555 829 200 -458 721 636 -611 168 28 -105 570
1684 570 364 -744 234 275 -567 18 71 -832 54 549 -806 -361 378 -531 -63 648 -580 -480 722
1703 722 -122 -337 524 32 -235 1025 359 -334 523 349 -287 370 242 -668 25 650 -396 -239 146
1722 146 -416 -13 113 -500 -487 131 -298 -24 -199 -472 -100 497 -302 -197 301 -4 277 740 -108 -269
1742 -269 662 301 -19 187 -68 -841 328 326 -680 -288 91 -453 -128 -34 -805 -553 174 -245 -286 -37 -144
1763 -144 -168 526 224 -112 438 75 278 562 156 -184 568 399 -174 93 -188 -217 287 -122 -638 -153 69
1784 69 -513 -18 -134 -674 -147 104 -494 -328 155 -435 208 613 -105 -18 262 109 88 556 19 70 498
1805 498 411 -23 243 189 76 165 67 -235 -2 48 -324 6 -53 -777 -29 -106 -440 -9 -86 -188 -274 369 93
1828 93 -104 124 -28 121 600 -109 -265 472 373 62 523 280 -187 325 1 -311 -111 -112 -487 -25 129
1849 129 -336 -358 -77 -157 -23 250 -293 14 180 26 190 21 -36 263 530 121 -264 402 346 300 566 114
1871 114 70 250 112 -129 -63 -157 -290 74 -168 -403 -189 -233 -291 -15 -46 -703 132 261 -240 67 165 -11
1893 -11 172 440 -156 -21 273 144 485 176 -147 -221 285 114 -61 115 -605 -473 499 -272 -517 59 -298
1914 -298 -342 299 -79 -388 144 431 0 -103 -166 -170 477 575 -128 23 345 -121 322 338 -521 -158 381 -10
1936 -10 -173 222 -251 -242 283 -327 -456 174 226 -313 129 68 -606 227 358 -400 -151 278 -337 400 712 -322
1958 -322 93 589 -193 39 520 -308 114 635 68 -634 239 98 -118 430 -156 -703 197 48 -568 61
1978 61 -202 -753 266 128 -446 171 307 -348 279 292 -514 211 1020 -72 -476 530 -90 -109 814 41
1998 41 -750 216 -12 -974 185 214 -726 176 182 -592 -188 317 -549 196 282 -788 20 518 -344 -99 483
2019 483 -545 -230 1074 79 -215 663 113 -359 606 -12 -894 523 96 -571 73 268 -740 165 372
2038 372 -814 -392 278 -539 -155 387 -439 -159 543 -106 -468 570 -187 -217 879 31 -377 317 470
2057 470 -406 361 188 -586 419 356 -785 -6 305 -644 113 244 -684 -198 568 -506 -500 454 -398 -305
2077 -305 549 -228 -476 530 169 -373 683 295 -476 583 445 -412 104 494 -348 -96 310 -645 -542
2096 -542 243 -310 -244 154 -612 -296 776 -135 -429 286 -197 -276 625 116 -505 221 393 -161 487 77
2116 77 -330 272 372 -250 136 328 -267 -112 540 -305 -253 460 -294 -235 214 -218 -514 402 -6 -513 157
2137 157 130 -387 304 183 -356 287 330 -138 480 558 -489 -33 464 -110 146 375 69 -199 364 -402 -371
2158 -371 272 -272 -398 130 -316 -625 11 -71 -376 115 136 -245 -67 220 -107 163 192 -44 173 410 -20
2179 -20 37 469 -95 252 170 -97 -265 291 -191 -352 160 -217 47 1 -81 -644 1 -304 -243 -63 92 -526
2201 -526 83 65 -67 -152 192 -194 109 260 22 94 310 235 -38 -18 -17 109 118 -365 -340 -161 -73 57 -66 -25
2225 -25 -313 -65 -180 -314 255 173 -156 63 51 -322 -12 11 -18 -113 21 -98 192 165 78 -26 100 44 -9
2248 -9 -49 -37 -138 89 -183 -96 55 -147 -455 47 -338 -277 -125 -273 -62 158 -80 -72 -75 185 27 75 318 130
2272 130 31 166 236 191 76 -39 116 530 -116 -254 -84 125 -156 -78 -232 -282 -17 -223 -165 62 22 -66 -4
2295 -4 11 -344 177 161 40 12 184 -98 126 101 74 228 68 105 7 170 -184 -174 42 -168 -152 105 -210 1
2319 1 -110 -134 -116 -61 -75 -242 139 10 21 -166 119 124 173 -2 -68 186 287 103 229 131 -153 -104 -95 59 194
2344 194 -29 -126 41 23 20 -141 -34 -279 -178 -3 -319 -248 -31 -243 -8 50 -40 20 83 165 45 202 99
2367 99 217 203 -53 -107 -233 142 50 82 151 122 -95 117 -305 74 -32 -93 -198 -189 -53 -258 178 -169 -36
2390 -36 135 10 79 271 146 9 434 379 341 99 106 -92 203 -131 117 10 77 -228 -19 114 -179 -326
2412 -326 -3 41 -56 -105 -176 -271 119 -166 -175 69 25 -2 -287 -204 120 128 71 116 265 -43 -189 141 -53 -143 -135 -207
2438 -207 126 7 19 -306 -101 -185 -161 -36 -312 -140 -57 -4 -44 -239 -35 146 -141 110 187 -165 276 -59
2460 -59 46 334 -32 54 97 206 -131 103 192 37 -51 172 -92 -39 -40 -58 -106 -23 -325 234 -2 -251 24 216
2484 216 -168 -44 131 151 37 275 118 88 191 24 -31 161 49 -301 145 133 -233 -98 254 -127 249
2505 249 99 32 -331 -40 -247 -33 130 -66 -185 34 109 -104 152 111 -101 147 146 9 324 258 -57 126
2527 126 11 -101 253 105 -123 -15 -4 -153 -40 194 -84 -213 -157 -71 -194 -28 241 -242 121 -110 -61
2548 -61 59 42 -20 81 259 24 49 187 -271 123 -229 3 -89 93 -151 -181 -3 -75 -404 -1 -67 37 107
2571 107 -74 -9 101 -59 -50 51 -82 -94 -179 178 -155 97 233 -29 44 214 25 24 267 41 0 103 -101
2594 -101 -172 82 23 -116 132 -76 -11 14 -15 -155 -40 12 -194 -19 137 -106 13 177 -166 38 340 167
2616 167 51 175 254 153 208 -9 -56 -106 28 46 146 -126 -154 108 43 -282 -183 3 65 248 5 -18 86
2639 86 157 -127 349 423 117 114 125 -115 168 190 79 -83 219 63 14 248 11 210 30 -22 -215 70 -17
2662 -17 -135 -169 -82 -140 -80 -108 -165 -11 21 -129 -180 -180 -80 -122 219 -272 210 181 187 228 312 -4 -14 104 47 15 111
2689 111 -65 -73 67 -251 79 -145 6 -169 -276 -27 45 -55 -37 -279 -152 -13 154 -62 -73 15 -89 34
2711 34 157 54 -164 77 -44 105 114 268 11 -163 -71 -19 57 -85 -67 -20 -86 -156 -60 -46 97 -25 60 -59
2735 -59 -117 -16 -34 21 180 240 101 127 114 118 142 43 -11 -89 189 -14 -94 -19 -108 -28 -7 16 -59 -123 -238 -76 36
2762 36 -2 -331 -104 -4 12 41 -165 218 -43 244 235 232 125 61 217 167 227 -86 -86 96 -28 2 -48 73 7
2787 7 -192 -165 53 -268 -8 -150 -70 -14 -101 41 -137 -125 104 -86 29 -106 -33 130 68 -110 124 174 -78
2810 -78 184 40 -191 127 37 129 86 -194 48 -252 -185 -6 10 -38 -238 -69 77 54 145 242 -62 -171 185
2833 185 -139 -9 181 244 157 146 160 240 249 115 116 -87 -99 17 -230 85 3 -89 72 -122 20 -133 -33 102
2857 102 40 176 -33 -147 87 -141 291 100 -52 132 1 257 -16 184 87 85 205 -94 97 159 -76 106
2879 106 -325 73 85 -37 -177 163 -23 -175 -128 -129 83 -5 -116 48 27 93 -131 29 43 126 97 87 223 362
2903 362 166 92 -59 -101 71 50 -29 63 -43 7 -48 56 71 15 -211 12 103 82 -55 143 92 79 73 -172 -238
2928 -238 -57 -56 106 -8 41 29 38 15 47 237 265 -94 211 21 -109 64 -78 -159 -102 37 -109 -244 53 99
2952 99 154 -147 -4 -35 105 56 41 103 74 -61 261 -40 -106 200 40 88 259 -93 58 146 -59 56 14 -90
2976 -90 97 -102 -137 -36 -163 -182 58 -99 5 -173 25 38 93 34 113 -7 -57 90 -80 88 -108 -51 -179
2999 -179 -9 103 69 -109 -126 -44 -173 -68 -51 -18 34 -40 -209 -122 9 -21 -226 -39 71 -70 -2 84 -21 -39
3023 -39 259 -66 -21 105 153 63 117 1 52 -83 33 -38 -111 -118 -156 -193 -7 4 17 205 -106 9 -269 -82 45
3048 45 -145 24 20 52 36 -93 -48 -14 -47 149 -36 292 40 93 164 80 -180 19 -94 111 -36 30 -131 -247
3072 -247 -215 7 -191 -43 40 6 -49 -84 -25 174 11 257 33 -22 -141 -125 49 -67 136 -127 -163 54 20
3095 20 22 -138 -169 184 -152 54 -224 -26 38 -118 -222 101 -34 -314 -1 119 41 -69 -33 71 216 53
3117 53 -241 122 57 241 214 42 26 24 194 -83 -279 -24 -160 -44 156 -49 -274 -49 -206 -8 19 122
3139 122 -188 199 178 -63 40 6 -18 -141 156 85 172 -15 203 27 186 -22 67 56 -71 105 -107 -244
3161 -244 -81 -122 190 -13 -47 -37 -3 124 -192 -57 264 -180 73 -23 8 -305 -114 86 114 -35 -30 40 62 157
3185 157 -12 42 -66 -412 -197 -8 -56 57 -46 126 -78 -90 174 -204 -71 -9 -396 -110 180 -99 197
3206 197 -99 48 189 -95 89 34 -173 128 75 199 165 -72 226 141 -12 -28 -113 -95 -227 150 -143 -80 -280
3229 -280 -20 -112 65 -205 83 -108 -13 -54 20 123 90 18 -22 35 118 -51 -24 8 -170 -29 -110 12 -74 -12 -134
3254 -134 -219 -221 -105 136 -130 275 -15 5 12 -148 -249 53 114 -176 67 135 46 332 -117 96 54 151 -15 -261
3278 -261 305 107 162 116 270 65 120 -45 -44 118 56 187 155 -46 171 -5 97 185 91 77 117 -88 -1 0 -80
3303 -80 78 195 -174 -169 -127 84 160 -89 -216 -68 -43 -28 -229 56 46 26 -177 14 -150 -207 -38 -26 -9 -223
3327 -223 -102 -74 2 -185 66 -175 -46 138 97 5 -155 107 27 57 153 62 59 4 -120 91 -158 -143 91 -310
3351 -310 -36 -49 -36 149 -152 37 193 -65 28 -238 -128 97 49 40 -186 259 -8 -104 25 -12 194 92 -8
3374 -8 -82 173 18 -122 50 -6 -42 -58 -163 -38 -131 -155 -114 78 17 61 115 56 -34 -100 28 77 285 108 41 -2
3400 -2 -39 192 85 -22 308 46 72 208 21 160 -88 21 -226 -60 -63 -148 212 -97 -71 52 -73 -181 186
3423 186 122 -298 6 182 -76 17 25 92 -176 71 -253 -19 64 -27 -31 131 -111 -47 146 -72 20 -71 18 17 186
3448 186 -69 -106 51 -84 -198 117 -52 138 -52 -23 -144 166 166 134 -13 148 90 170 -15 97 66 57 -27 174
3472 174 103 -144 -274 -27 -69 -3 31 -67 -211 -67 -162 1 4 -54 44 162 -49 -29 -8 26 207 -13 -34 35 168
3497 168 226 134 101 -44 -101 65 -54 -12 -109 -137 85 -228 -188 34 130 72 8 114 60 -179 -301 -146 -212 -92
3521 -92 -46 10 177 1 -65 237 -105 156 202 -68 315 -128 7 127 94 -8 209 66 -22 -3 139 137 235 88
3545 88 -146 -127 44 -188 -50 -12 -89 -13 -15 115 4 -97 -15 -62 49 63 -36 -190 -47 43 -242 33 16 -162
3569 -162 -216 -19 13 -34 -123 212 -144 71 -6 -45 171 86 120 180 -68 299 169 -136 -155 -105 48 310 25 -17
3593 -17 -95 -97 -86 113 4 140 -6 139 -72 1 75 107 -188 -28 -193 35 3 -210 -47 25 128 24 -89
3616 -89 -33 -47 86 21 132 -9 -38 70 200 2 -170 21 -89 -109 -39 76 -122 -217 84 -88 -9 103 -157
3639 -157 -64 50 23 -172 -69 158 135 -329 14 -85 63 175 36 43 -62 -103 -188 60 -91 -143 120 -26 5
3662 5 165 -70 -20 -197 -31 -185 -62 -160 -177 95 62 -138 -65 105 36 -89 127 131 -30 -11 -158 240 164 28
3686 28 -200 -24 19 -13 43 -131 113 -71 262 97 284 -14 174 42 82 -39 23 112 -114 175 101 -145 -187
3709 -187 7 129 -61 -117 36 156 -12 -7 -95 0 -150 17 -54 59 264 34 140 108 137 -176 23 -427 -59
3732 -59 -22 -57 -159 -200 15 -10 64 -5 45 -259 -48 -190 78 -215 107 -81 170 81 34 319 103 85 -180 98
3756 98 70 -9 -28 -120 -302 285 -117 65 200 -174 6 -127 -107 -112 269 74 32 -68 153 -142 131 136 -228 68
3780 68 112 13 -151 -29 87 188 129 -103 -259 21 56 176 75 -65 40 35 22 -183 -222 34 -118 -18 -88
3803 -88 -246 -57 140 5 -39 -4 119 28 150 5 -11 -3 -45 -187 109 -73 1 -173 -22 -178 -16 -55 74
3826 74 85 68 -100 148 202 106 -43 -19 156 -87 87 -52 -38 112 -86 -216 61 77 71 -4 -102 -136 144 -81
3850 -81 -249 -101 54 -177 -34 14 126 -45 68 -38 -215 63 53 -6 58 96 -99 -340 140 206 100 26 -99
3873 -99 -70 -2 62 -235 -326 -191 99 72 138 234 -132 36 261 61 -191 143 -287 -204 60 -112 52 222 14
3896 14 -248 25 -44 -46 25 155 -7 -85 -148 -82 26 -62 160 -108 -163 198 109 -187 -110 -8 164 -20 -51 -68 -21
3921 -21 169 -28 99 -175 296 -165 -85 13 40 -32 -42 -88 -103 106 151 -175 -247 -164 -154 -20 -163 119 -74 171
3945 171 -50 -90 -56 153 149 -55 -81 -107 -47 -302 74 -81 15 -53 -223 -113 -53 120 5 9 -258 -60 171 52
3969 52 -7 -267 30 12 -140 242 -74 126 -158 -115 14 -63 51 206 -129 59 -121 82 -54 89 44 -261
3991 -261 59 -20 69 83 -45 167 130 -49 -133 22 -19 -331 200 110 -186 10 188 47 143 -100 -14 -104 -135 53
4015 53 -167 -54 -69 -57 -202 59 -166 -83 -27 -158 68 -250 -28 -145 53 -130 1 55 -36 -55 19 -72 35
4038 35 -204 15 71 54 127 -1 200 -107 -94 -36 -8 -98 125 60 59 18 -109 54 152 88 3 35 237 124 270
4063 270 12 29 -40 -44 -53 -139 -172 -75 58 -59 -219 155 -27 151 -2 -14 193 220 110 62 -152 103 45 -55
4087 -55 -4 -144 39 -167 192 174 103 200 175 13 40 32 -28 -98 -255 119 -75 -67 -139 -66 -76 -119 161 41 -90 33
4113 33 160 -180 -111 96 -14 95 -104 173 203 99 -170 94 0 -86 93 -124 -87 -244 -51 -167 -10 -8 -186
4136 -186 -44 193 26 -176 138 48 139 -75 -150 95 242 301 -64 -51 17 146 -46 -8 112 24 46 239 78
4159 78 1 33 -238 -116 108 236 -35 -39 -100 27 4 -62 -159 -172 -171 84 -24 -89 -60 -8 36 -127 45 -232 -13
4184 -13 129 37 92 -64 207 74 -136 -3 114 -96 11 12 127 -203 22 -14 -100 -59 -335 146 114 3 -221
4207 -221 162 102 150 -241 -179 -197 51 -9 203 -137 8 4 -34 0 -49 -47 -211 1 -137 -193 147 -246 -110 -78 -87
4232 -87 -251 74 -3 62 54 170 -92 -46 -158 22 -95 -49 -16 51 -127 -146 -244 93 -112 -5 49 -159 -28 75
4256 75 11 -87 113 59 -64 -60 -175 14 -214 -77 114 94 55 85 297 -1 -41 -325 147 105 -119 150 -16 42
4280 42 -41 -34 77 -110 203 156 -160 -78 121 37 321 -16 -47 59 -62 -85 110 237 -126 -49 -83 56 38 97
4304 97 -6 -140 69 57 -206 -12 71 -174 -63 140 20 84 90 -291 -100 -47 -181 -183 -154 38 55 -197 -68 268
4328 268 11 -117 -53 -25 332 12 109 -31 -66 16 -91 -235 39 -51 219 157 -278 -77 -375 163 -16 -49 -96
4351 -96 129 -90 -13 174 -73 86 -114 -236 107 -148 132 155 -163 171 15 -198 103 72 -159 66 207
4372 207 84 80 -104 -42 -228 262 -108 -92 -230 131 0 39 281 -50 38 53 -209 -127 -230 -17 -107 -90 -125 -72
4396 -72 3 -336 -196 147 108 -23 -183 57 201 -61 79 63 -36 -38 -64 -6 2 -71 -25 13 -75 96 -166 -273 138
4421 138 9 -167 -23 -118 -277 75 -157 -130 -87 -27 29 111 -106 46 -34 234 155 190 218 7 21 -172 42 -94
4445 -94 -31 -38 -104 -148 -134 -66 -185 -125 53 -75 33 91 63 299 95 64 45 158 86 -35 194 18 -58 -2 69 -77
4471 -77 12 12 70 140 -23 -41 106 70 32 -79 -62 31 99 61 -42 -8 -168 -5 -43 147 -40 -95 130 58 -29 21
4497 21 46 280 -28 79 -250 202 86 -176 114 -50 54 151 -28 -116 -98 24 154 -248 -9 105 134 49
4519 49 128 -157 -70 173 188 -35 164 -5 107 -105 -63 138 -72 -234 -184 38 -274 -97 78 74 136 76 -78
4542 -78 141 77 81 79 -97 110 112 31 -119 -49 -83 -11 -65 -280 -66 59 -141 58 71 -50 -10 -37 179 39 -197
4567 -197 -2 75 -183 94 258 -39 41 128 -9 -184 -9 99 -197 128 45 -142 -93 -112 -89 -71 -204 117 -37
4590 -37 69 26 -1 -66 96 -189 -89 -128 3 71 -69 -104 -78 50 122 274 -62 128 3 -61 -21 -281 60 -10
4614 -10 -11 -22 22 210 85 -23 224 -104 176 54 163 -57 39 227 -14 48 -69 194 -128 -50 87 -29 140
4637 140 -61 -119 -21 140 124 -203 43 181 113 -137 -14 6 100 89 -180 95 -10 -51 213 63 185 8 -148
4660 -148 -149 234 -105 -88 72 -13 -111 -64 -16 -86 67 6 44 -209 134 -19 28 14 4 -87 -202 -37 59 -56 47
4685 47 -24 57 -168 -72 12 255 169 -3 187 -167 347 170 327 58 -101 -170 -58 -105 28 -106 -83 87 -5
4708 -5 -36 13 -309 -179 106 -123 -143 -215 -44 -224 178 41 -70 -233 1 190 -17 95 78 191 194 -134 -104
4731 -104 -14 -64 121 -180 -185 41 334 176 67 -154 -33 -132 162 -21 -67 -49 78 -66 -154 182 -17 -16 -104 -63
4755 -63 -62 246 -3 -147 215 -1 14 157 -19 77 56 82 214 121 -4 -85 16 -130 196 185 8 -90 -71 -69 -133
4780 -133 -113 -138 -53 94 -90 163 187 -241 99 -108 307 92 -48 -4 -257 -31 61 86 -206 -111 -17 113 111 -75
4804 -75 115 64 180 -28 -43 -241 -86 -104 -98 103 104 231 -98 -187 -192 152 -70 -163 -227 81 -11 37 -34 164 85 -77
4830 -77 -30 -82 -159 -191 -261 -85 34 -89 160 -8 24 -112 -214 127 -339 -72 109 147 72 -149 -84 335 -65
4853 -65 -268 -73 135 170 -95 -90 -52 -221 54 233 205 203 17 84 -222 -81 91 21 -133 45 27 -115 167 -222
4877 -222 131 -54 -123 109 183 129 -80 -87 -144 -83 -94 74 -140 37 -120 -120 -128 -37 172 181 43 -183 53 58 -83 61
4903 61 24 -169 162 96 48 -25 69 -166 350 -84 -73 84 -15 59 -163 -11 -60 -87 99 230 -234 292 -133 160
4927 160 -132 -237 150 156 63 -47 14 31 148 -41 146 78 -192 -314 45 -14 73 -149 -20 162 -33 -49 -52 -66
4951 -66 99 110 -81 33 198 -344 -75 16 217 65 112 338 -68 -21 76 158 -152 -159 -96 148 16 93 307 76
4975 76 -292 170 27 -123 -120 -47 -70 -253 6 86 -129 -21 63 -22 43 196 -16 -57 70 31 164 8 12 84 -276
5000 -276 -46 33 -168 392 111 -71 310 30 286 63 121 -159 148 89 5 188 -235 124 -93 -52 -82 -245
5022 -245 21 12 -75 -124 -146 -93 94 233 178 93 149 -40 211 -186 -84 -54 61 216 -193 -29 58 -122 -109 -64
5046 -64 233 33 -120 139 58 -203 -11 33 -360 70 38 11 -94 -71 22 185 26 12 -41 -90 -10 -18 -151 113
5070 113 96 -40 -205 83 111 -301 -88 227 -49 28 -217 96 39 -100 -81 -1 105 -103 135 104 37 63 -27
5093 -27 -161 -117 266 83 -111 43 219 59 108 -53 9 47 -86 78 -74 -34 -247 53 81 -154 -105 108 -81
5116 -81 114 -34 67 131 -87 -48 -13 65 42 -107 8 -24 -83 249 -203 -24 -183 -233 52 128 -95 -158 -148 6
5140 6 -33 -141 -8 -141 92 75 85 84 201 -121 180 59 -54 -67 69 -246 249 196 110 78 -97 -28 -86 57
5164 57 88 47 163 64 241 111 -58 57 251 51 3 49 -58 128 58 26 101 8 152 -246 91 77 -95 -74
5188 -74 59 -102 -201 -138 -32 -96 -66 77 112 115 -78 -182 103 -144 -155 158 -83 118 -33 15 -2 -245 72 -95
5212 -95 121 -146 -62 167 -55 -78 -118 -79 -119 3 13 56 95 -41 -35 -122 -71 -82 56 -99 -38 -167 14 221 129
5237 129 84 -177 34 -129 -104 174 -281 219 54 12 -27 -135 233 -5 86 -120 49 294 4 152 69 177
5259 177 16 37 11 183 10 -80 181 -37 -91 -49 -55 25 172 -81 -28 141 -340 -119 9 -131 2 -392 -98
5282 -98 194 -5 -153 -72 82 -24 -35 113 -113 10 125 -105 -33 37 -109 15 -23 -51 -57 -95 64 86 -61 75
5306 75 139 61 3 118 -105 73 -172 28 -112 -221 -26 49 33 67 114 -159 -63 -103 -355 -48 100 -84 -50 44
5330 44 258 -35 -63 64 -14 82 72 123 94 13 63 -115 98 -57 210 73 30 56 88 38 -98 160 13 -7 -302
5355 -302 58 -195 34 166 141 -244 55 -81 -10 -89 -124 102 -20 121 31 -286 95 -220 205 127 -10 14
5377 14 -144 65 8 67 106 31 40 -142 -34 -50 59 -10 -101 -129 -258 112 -56 168 -74 235 -149 -137 91 37
5401 37 -88 193 -203 -118 0 155 145 -25 -62 56 -125 108 34 -17 -6 -196 71 311 115 30 -181 -76 -35
5424 -35 195 -30 7 -238 172 -92 -31 27 109 -114 121 199 -155 8 2 191 -93 42 65 -57 -143 -185 -43 -263
5448 -263 -188 -97 -91 -89 74 -31 81 76 59 -23 -25 25 -147 152 98 -68 16 112 120 260 12 77 92 -17 56 -142 12
5475 12 -96 152 -43 -202 7 22 82 88 9 111 -88 -87 -142 116 34 69 255 144 -207 -5 -131 184 -12 -126
5499 -126 -47 -116 116 133 -97 4 118 98 -54 -155 -11 70 -62 -43 -31 -5 -211 -64 15 -54 -9 -87 124 -60
5523 -60 20 95 74 -19 9 -149 20 -273 202 19 -106 -17 -239 -14 82 -10 228 -57 -69 -95 44 3 -10 -42 -112
5548 -112 62 -248 20 81 -84 -32 91 -39 87 50 0 -234 188 -153 -165 204 -23 19 -87 28 5 -39 -48
5571 -48 -60 -109 -41 134 226 118 -74 112 -28 35 -250 -171 -169 -115 106 -125 -108 149 -110 50 -278 -7 87 66
5595 66 81 -11 -80 -57 205 108 -32 -164 228 6 -34 -27 90 -81 -300 80 -15 -176 -6 -9 93 -98 62 -161
5619 -161 -72 -216 44 -34 -138 189 121 -84 165 -21 338 257 43 -2 95 -16 25 207 -129 121 16 -15 89
5642 89 184 112 101 -117 100 35 209 -23 58 99 163 39 17 89 -14 84 -65 -20 168 315 201 -1 192 64
5666 64 -17 68 149 191 -137 -65 -107 74 51 -4 158 159 82 27 -46 128 -99 146 -151 -20 -75 -102 -252 123 93 131
5692 131 -11 -23 67 11 70 62 -2 195 111 -52 159 116 -97 -160 -4 63 -47 13 40 -149 14 163 63 16 -45
5717 -45 151 223 -100 92 9 85 -128 17 97 -68 -25 87 -19 111 -71 54 -100 28 -56 -252 107 -162
5739 -162 -96 -2 15 -280 89 -56 -102 41 76 2 -64 -143 -82 -67 52 -232 228 41 46 -48 28 -28 53 -89 -109 -76
5765 -76 14 195 -29 -44 86 -233 250 227 -86 33 -14 72 -399 -68 67 44 -137 192 -121 -97 92 -13 -193
5788 -193 -144 156 144 -53 112 136 142 106 -165 -88 119 -24 23 -85 -194 71 32 211 133 138 2 -218 63 54 -14
5813 -14 -153 -200 -125 38 230 81 83 -191 -45 110 -38 -152 236 -197 70 -17 -48 5 -241 10 127 -37 -208
5836 -208 133 47 114 56 103 -84 -43 10 74 208 -169 87 -60 -67 -236 -186 90 37 29 170 -6 -198 67 -167
5860 -167 101 132 6 -241 -110 179 107 -179 128 -236 28 100 -77 311 2 -131 57 -8 -77 101 80 -111
5882 -111 182 80 -75 90 46 125 -133 169 117 -79 -172 -14 67 273 75 -207 -2 317 -4 -185 90 132
5904 132 -77 23 -138 120 -209 117 43 -14 -100 127 132 -196 280 -80 -28 -111 129 -7 28 127 15 -148 62
5927 62 4 -24 235 97 -142 56 95 79 -4 159 -244 -127 187 30 182 178 134 111 -169 -61 197 50 -145
5950 -145 120 -91 322 -11 259 -111 -14 -20 36 -222 -281 62 282 51 -224 -15 207 -27 48 -37 44 -401 115
5973 115 115 60 34 37 218 -185 -154 16 -111 -41 39 -15 43 -173 39 -8 -86 -55 -105 193 39 -83 7 110 -123
5998 -123 -262 -16 -79 -28 254 38 -149 -34 -178 -14 -153 -24 173 104 -9 -19 138 -59 -95 84 196 3
6020 3 -158 -115 -72 -69 134 138 148 -56 -18 -33 -29 93 182 -240 -184 24 -197 -139 -78 -42 -95 0 25 203 -75 65 58 157
6048 157 68 -68 74 -66 -133 28 -63 -31 134 -38 -165 -21 -4 113 164 76 71 69 -176 142 -29 152 146 16
6072 16 -94 96 126 75 -99 -63 22 155 -87 -90 -127 95 91 -67 -109 -158 -247 73 138 -42 74 223 63 224 -8
6097 -8 225 42 -89 175 -16 -61 -35 45 114 83 -29 -30 -339 -59 -6 77 134 60 -162 149 -10 -194 50 97 -238
6122 -238 62 -27 -137 54 -102 112 -48 -126 146 6 -15 -20 28 127 73 9 25 11 -159 242 135 -64 30 58
6146 58 -32 10 -58 -68 44 29 -56 -50 -104 91 302 -152 236 -54 -50 -160 -121 28 -86 102 20 44 -109 -221 173
6171 173 -195 57 145 -162 37 -31 10 97 109 -183 160 -20 -136 -152 78 -70 59 -69 -131 351 -7 -162
6193 -162 -20 -19 109 -66 100 -4 9 -93 -16 177 -72 94 54 -116 -309 -55 195 -80 19 23 225 228 -64
6216 -64 -51 -110 65 109 -206 -59 139 -21 -110 -130 113 157 -240 253 50 92 73 12 131 15 287 -83 24
6239 24 -37 66 -80 -117 191 202 75 91 247 -28 -204 93 -43 -236 -95 125 -16 -172 48 191 -55 133
6261 133 130 81 129 -26 -38 -89 140 108 4 -277 -43 -167 -278 59 72 -62 -133 161 24 26 -191 -143 22 -175
6285 -175 -161 -78 84 -175 69 -7 140 51 71 22 -32 -48 40 -24 57 203 -72 70 54 54 -78 -68 167 -50 42
6310 42 -37 -53 175 -189 32 37 14 180 98 7 50 95 -76 30 170 174 13 238 10 -65 45 71 144 213 -204
6335 -204 -55 289 88 -149 14 -14 -110 -36 351 2 39 82 -4 -85 -100 -139 -22 -53 28 267 38 28 4 76 107
6360 107 -108 -98 83 -84 -77 73 -223 98 92 -125 -58 115 42 36 -151 -9 -23 119 -111 -22 181 -69 95 28
6384 28 -48 1 -112 -186 -98 -73 -207 61 -70 154 -232 84 -77 12 13 -65 -52 105 -55 -98 -144 102 31 -99 -60
6409 -60 23 -19 -50 -210 -9 269 -86 -81 228 -40 -227 -68 109 42 -319 92 172 -83 118 -66 -62 149 68 9
6433 9 -73 -107 -54 -35 28 59 -242 256 -53 -113 -147 -190 -19 115 -58 135 246 -24 -260 45 247 -204 -109 -302
6457 -302 140 -353 22 -81 128 198 102 46 -9 78 150 -243 112 20 75 -46 50 223 -1 152 54 131 -78 125
6481 125 -318 24 -203 126 45 -162 149 16 -86 -116 111 -28 -29 23 86 108 -56 -75 22 -87 -162 136 -21
6504 -21 154 155 -1 158 63 -95 -15 -73 111 127 34 52 -66 -40 -81 -66 -49 113 242 -137 -12 -179 92 200
6528 200 -155 -10 -66 -46 -59 64 30 -47 -77 -135 144 -86 -65 -191 55 139 136 -59 -180 93 78 271 5 -166
6552 -166 5 123 227 -3 179 43 -136 101 -3 31 12 -127 55 161 70 -37 14 -62 -137 -52 297 -265
6574 -265 -74 171 67 -117 -271 212 -2 -135 121 -82 -148 -74 -150 -160 -71 408 -268 168 103 22 -34 47 -173
6597 -173 -338 107 -172 -149 -142 -127 124 4 130 -57 2 -29 -20 31 164 318 55 52 83 -141 -164 -214 -84 -7 -141
6622 -141 -169 150 -40 -66 -47 -44 -22 -174 -42 -107 136 56 -154 0 134 -258 41 90 -12 -72 242 6 143
6645 143 -144 147 81 24 94 -40 2 -105 -35 30 72 -139 -64 192 111 369 -66 -127 -88 55 203 -37 -154 -210
6669 -210 -88 104 91 205 22 -61 -13 146 229 -22 -54 -184 249 20 -240 78 -61 221 -91 123 60 -118
6691 -118 201 158 -83 134 -25 25 180 -68 195 117 45 81 32 117 52 55 125 1 285 -206 146 -36 -110 145
6715 145 109 -150 -84 45 -32 33 161 -113 -165 111 128 202 68 -7 49 -135 -26 59 -12 132 -10 -62 -30 -32 82
6740 82 -227 221 -15 -48 -100 48 -42 45 177 9 -61 26 249 -1 151 -70 98 14 81 -9 -109 -175 249 50
6764 50 -119 132 -333 -106 -147 95 217 169 89 -46 -103 -77 22 -118 -60 40 -25 -123 -96 -127 -57 102 -23 -29 -54
6789 -54 -50 -80 202 -17 60 -118 49 -83 27 269 -186 289 175 37 18 71 -41 56 10 -17 -85 10 -40 84
6813 84 -148 17 97 168 50 22 -197 -133 40 -38 10 -109 -86 50 -13 123 -13 -29 -248 -169 -227 61 70 184 -9
6838 -9 18 -106 261 -15 45 -140 -205 64 -252 88 -102 113 49 151 -158 -57 30 158 63 -57 119 -6 -75
6861 -75 -115 -193 128 -159 114 6 158 -7 272 53 7 -36 35 -204 -112 -80 -46 -121 6 -56 65 0 192 105
6885 105 175 -94 -153 257 111 46 -250 157 78 47 -76 -330 -93 -144 -85 -55 -31 57 150 -45 -51 -218 -17 93
6909 93 -101 -56 -79 9 -8 7 -78 -64 95 215 99 -86 -62 -4 -98 -175 113 169 46 104 93 241 193 -23 -75 62
6935 62 -111 186 85 -29 88 -156 -114 -15 128 -48 -131 40 -136 29 -73 -128 -141 -91 39 -51 4 -100 76
6958 76 -99 -60 -47 -175 -272 10 -51 -182 31 54 195 277 113 -40 -75 -105 -154 45 47 98 2 -69 78 30 169
6983 169 -64 -15 -376 78 166 65 -95 238 -18 -251 160 -29 263 10 -85 -97 -179 19 -231 -150 -4 163
7005 163 168 86 4 -13 116 1 -70 8 128 -39 15 75 -119 27 -45 -63 -79 -63 -125 -55 -106 81 -223 44 82 104
7031 104 83 77 49 -73 196 -47 -17 55 -121 -232 63 20 -228 139 -132 338 -77 97 114 176 123 -138 -114 17
7055 17 -12 69 176 124 -116 -11 -19 -48 51 -363 -31 -127 44 215 -19 114 17 40 60 78 -126 -54 97 -138 -144
7080 -144 120 87 90 -51 99 -55 75 -35 -123 49 -142 -96 123 -149 234 -4 -11 37 -28 208 -62 -9 115
7103 115 -94 33 -65 233 105 161 -216 -159 68 -14 -212 -23 62 -98 -111 9 94 44 225 -122 -27 -24 31 138
7127 138 5 -57 -189 70 150 26 405 313 207 47 -1 229 67 104 -245 157 -170 16 -137 40 -39 -20
7149 -20 185 -117 151 -155 -121 36 -28 -28 -30 -5 60 -222 -25 238 -9 48 126 70 -13 -166 53 -118 63 263
7173 263 -93 187 -62 -309 159 170 68 37 -241 23 15 156 189 -59 -130 133 52 115 57 170 174 67 10 -31
7197 -31 -62 -117 33 -166 -200 60 -104 -94 -6 -217 158 -159 -87 184 250 46 -70 -143 84 145 34 124 121 -33
7221 -33 -339 -27 61 -53 94 -107 -121 -289 25 45 -87 -81 64 36 -34 113 64 53 104 63 -16 257 -153 127
7245 127 3 -19 170 -13 -135 89 -9 -18 -57 -72 61 14 171 192 85 -62 12 -66 -28 -108 -31 -120 227 338 47
7270 47 88 -6 155 100 95 -97 -283 -182 154 222 -392 -149 219 207 -308 -5 -211 -42 -142 -114 -17 17 159 -78
7294 -78 -63 -41 216 145 199 4 142 -109 -10 152 255 -133 68 26 -35 44 -58 -57 -28 32 -233 44 -47 159 133
7319 133 -4 -234 176 -51 3 -66 193 -84 -223 162 168 216 -175 -177 -63 -6 65 50 -113 18 -19 -123 -75 30
7343 30 65 -165 148 -110 -38 -101 -120 196 80 -4 101 -69 102 -84 -22 -68 -12 11 -47 -154 -133 58 -37 42 -29
7368 -29 -17 -152 174 -15 191 32 -67 187 -103 54 92 107 -89 -47 42 93 -108 210 86 78 -17 -113 67 128
7392 128 19 22 263 39 5 -93 -27 -28 73 -99 31 131 -86 41 49 47 59 -199 -172 -227 -96 -211 -98 64 67
7417 67 -66 296 -127 96 293 108 -95 -34 251 140 -109 44 -178 187 104 -2 121 60 -76 67 -7 83
7439 83 -1 89 333 5 -95 127 49 70 231 -101 105 16 -52 92 -128 -8 49 -22 80 298 50 59 113 251
7463 251 58 82 -113 -278 114 -109 38 -17 82 95 34 100 63 108 87 165 -171 -52 -62 224 10 -202 15 81
7487 81 -49 -124 102 -70 172 263 -54 -10 59 -46 28 51 27 -27 -51 -67 -84 40 18 -15 155 7 12 65 -69 -86
7513 -86 248 -125 105 31 -2 -103 3 31 336 142 33 180 327 112 203 -58 125 20 -92 11 40 -36
7535 -36 -17 107 -62 216 -100 141 -393 -31 -63 -130 54 -8 -41 139 71 23 -201 40 -123 163 -84 -94 246
7558 246 173 8 -174 -200 30 82 -136 -76 17 134 88 168 140 54 14 -231 -49 63 106 149 -23 97 -54 -60 -170
7583 -170 -63 -227 -80 187 320 202 -66 -72 -88 56 -47 21 40 78 80 -176 -140 -89 18 -78 68 371 212 252
7607 252 115 58 159 -90 261 -297 32 -10 -1 -122 -33 41 -86 -144 4 -157 -76 10 -228 95 -77 390 -97
7630 -97 37 105 -11 48 75 124 371 -10 -101 -122 14 -67 201 26 70 70 -116 264 127 -45 -126 -164 -78 81 20
7655 20 -51 -66 -12 209 -138 0 16 78 106 -97 -91 180 -188 -143 -70 100 -134 175 -104 103 190 -38 163 -57
7679 -57 -19 -91 -57 221 -4 -63 -71 55 -68 12 -30 -53 -160 -12 -86 -316 37 158 -83 -91 -138 59 25 56 -19 70
7705 70 178 51 25 -57 -136 -60 210 -110 -6 -26 -105 -148 122 208 -75 164 -146 21 -217 -82 154 -203 -91
7728 -91 215 -161 184 -30 -162 -51 121 -2 66 144 168 162 -22 131 37 -191 69 -5 -64 -11 -78 -174 75 25
7752 25 21 40 12 -63 97 0 -161 18 -92 113 -147 -113 10 -94 113 -115 -32 66 1 -291 -16 -159 74 114
7776 114 -49 -194 -135 135 27 129 17 203 114 169 -185 184 -47 94 -208 -90 115 124 -29 -160 -180 -48
7798 -48 -68 -5 18 43 234 360 -315 -93 -31 -122 -71 -110 -22 -17 22 18 -39 -88 36 -222 48 228 -204 -217 181 118
7824 118 -5 -24 137 22 -84 2 -410 149 -147 -90 160 -183 -142 26 -114 144 111 108 -58 -52 93 -24 6
7847 6 99 43 27 -35 93 -68 132 -107 -116 178 -143 83 105 -38 96 -86 -146 20 -10 -105 12 -105 -350 -45
7871 -45 -126 -151 -109 -189 22 -113 39 -20 98 72 -40 25 -5 67 4 -63 163 22 89 65 1 -81 33 -35 54 -34
7897 -34 -117 -65 241 127 -54 -115 -171 -140 51 7 -79 55 -20 39 -126 94 -10 64 -194 100 -43 67 21 58
7921 58 44 65 15 95 13 24 169 -180 -82 72 -58 22 -2 -120 -14 60 -200 10 143 105 251 -15 149 -3
7945 -3 115 -134 179 93 294 -60 -100 -69 5 -3 6 -75 328 -64 -57 0 -137 35 129 106 -64 45 92 -90 -88 37
7971 37 -119 83 188 202 69 -29 168 -5 119 -73 44 -4 99 -26 -104 380 48 -2 -61 193 20 -40 -138
7994 -138 -176 28 102 139 110 25 -44 -58 119 96 60 137 -95 -83 -141 273 -83 -77 -92 42 349 205 -4 87 56 -196
8020 -196 -33 124 75 65 -79 19 -80 224 96 -100 276 37 41 -296 -233 -49 -310 104 -46 99 43 102 -18
8043 -18 -127 111 75 -69 63 -17 11 113 -62 -50 -31 77 66 -107 -46 -103 160 -105 -196 -211 101 6 -242 190
8067 190 -34 129 -101 67 -259 -38 100 -38 -42 32 -199 240 -188 136 -34 -63 13 90 -126 64 -2 65 -72
8090 -72 58 -11 -122 93 -138 -91 55 15 -176 -65 -90 0 93 76 -76 103 111 166 -165 -75 5 145 25 108 -77
8115 -77 -16 9 115 -43 -160 120 154 -4 138 53 -27 -75 78 -34 -20 -191 -94 -186 -259 89 -183 -96 139 -129
8139 -129 169 84 -41 42 69 105 114 -101 -82 -78 25 -168 -115 180 -23 326 205 397 -6 -13 205 177 -139 187
8163 187 23 -124 -36 -17 48 175 -31 109 199 110 15 35 25 113 125 -21 83 45 128 -177 -51 -93 -60 -32 176
8188 176 -83 -92 -12
8191a2
##END NTUPLES=NMR FID
##END=
